<?xml version="1.0" encoding="UTF-8" standalone="no"?>
<!-- Created with Inkscape (http://www.inkscape.org/) -->
<svg
   xmlns:dc="http://purl.org/dc/elements/1.1/"
   xmlns:cc="http://web.resource.org/cc/"
   xmlns:rdf="http://www.w3.org/1999/02/22-rdf-syntax-ns#"
   xmlns:svg="http://www.w3.org/2000/svg"
   xmlns="http://www.w3.org/2000/svg"
   xmlns:xlink="http://www.w3.org/1999/xlink"
   xmlns:sodipodi="http://inkscape.sourceforge.net/DTD/sodipodi-0.dtd"
   xmlns:inkscape="http://www.inkscape.org/namespaces/inkscape"
   height="60.0000000"
   id="svg1"
   inkscape:version="0.43"
   sodipodi:docbase="/home/krawek/Proyectos/yamf/data/icons"
   sodipodi:docname="object-group.svg"
   sodipodi:version="0.32"
   version="1.0"
   width="60.0000000"
   x="0"
   y="0">
  <metadata
     id="metadata3">
    <rdf:RDF>
      <cc:Work
         rdf:about="">
        <dc:title>Part of the Flat Icon Collection (Wed Aug 25 23:29:46 2004)</dc:title>
        <dc:description />
        <dc:subject>
          <rdf:Bag>
            <rdf:li>hash</rdf:li>
            <rdf:li />
            <rdf:li>action</rdf:li>
            <rdf:li>computer</rdf:li>
            <rdf:li>icons</rdf:li>
            <rdf:li>theme</rdf:li>
          </rdf:Bag>
        </dc:subject>
        <dc:publisher>
          <cc:Agent
             rdf:about="http://www.openclipart.org">
            <dc:title>Danny Allen</dc:title>
          </cc:Agent>
        </dc:publisher>
        <dc:creator>
          <cc:Agent>
            <dc:title>Danny Allen</dc:title>
          </cc:Agent>
        </dc:creator>
        <dc:rights>
          <cc:Agent>
            <dc:title>Danny Allen</dc:title>
          </cc:Agent>
        </dc:rights>
        <dc:date />
        <dc:format>image/svg+xml</dc:format>
        <dc:type
           rdf:resource="http://purl.org/dc/dcmitype/StillImage" />
        <cc:license
           rdf:resource="http://web.resource.org/cc/PublicDomain" />
        <dc:language>en</dc:language>
      </cc:Work>
      <cc:License
         rdf:about="http://web.resource.org/cc/PublicDomain">
        <cc:permits
           rdf:resource="http://web.resource.org/cc/Reproduction" />
        <cc:permits
           rdf:resource="http://web.resource.org/cc/Distribution" />
        <cc:permits
           rdf:resource="http://web.resource.org/cc/DerivativeWorks" />
      </cc:License>
    </rdf:RDF>
  </metadata>
  <sodipodi:namedview
     bordercolor="#666666"
     borderopacity="1.0"
     id="base"
     inkscape:cx="33.307957"
     inkscape:cy="23.184732"
     inkscape:pageopacity="0.0"
     inkscape:pageshadow="2"
     inkscape:window-height="683"
     inkscape:window-width="1016"
     inkscape:window-x="0"
     inkscape:window-y="25"
     inkscape:zoom="6.9465338"
     pagecolor="#ffffff"
     inkscape:current-layer="svg1" />
  <defs
     id="defs3">
    <linearGradient
       id="linearGradient772">
      <stop
         id="stop773"
         offset="0"
         style="stop-color:#000;stop-opacity:1;" />
      <stop
         id="stop774"
         offset="1"
         style="stop-color:#fff;stop-opacity:1;" />
    </linearGradient>
    <linearGradient
       id="linearGradient775"
       xlink:href="#linearGradient772" />
  </defs>
  <path
     d="M 57.762619 28.599447 A 19.704071 19.704071 0 1 0 18.354477,28.599447 A 19.704071 19.704071 0 1 0 57.762619 28.599447 z"
     id="path834"
     sodipodi:cx="38.058548"
     sodipodi:cy="28.599447"
     sodipodi:rx="19.704071"
     sodipodi:ry="19.704071"
     sodipodi:stroke-cmyk="(0.0000000 0.0000000 0.0000000 0.80000001)"
     sodipodi:type="arc"
     style="fill:#4c79ec;fill-rule:evenodd;stroke:#333333;stroke-width:3.3410668;stroke-linecap:round;stroke-linejoin:round;stroke-dasharray:none;fill-opacity:0.77348065"
     transform="matrix(0.935330,0.000000,0.000000,0.935330,0.766356,-3.430587)" />
  <rect
     height="26.452042"
     id="rect835"
     sodipodi:stroke-cmyk="(0.0000000 0.0000000 0.0000000 0.80000001)"
     style="fill:#f83b3b;fill-rule:evenodd;stroke:#333333;stroke-width:3.3410668;stroke-linecap:round;stroke-linejoin:round;stroke-dasharray:none;fill-opacity:1"
     transform="matrix(0.935330,0.000000,0.000000,0.935330,1.271283,1.955297)"
     width="26.452042"
     x="4.3187008"
     y="13.753914" />
  <polygon
     id="polygon833"
     inkscape:flatsided="true"
     points="36.091867,31.658217 -9.0999877,31.658217 13.495940,-7.4790775 36.091867,31.658217 "
     sodipodi:arg1="0.52359878"
     sodipodi:arg2="1.5707963"
     sodipodi:cx="13.495940"
     sodipodi:cy="18.612452"
     sodipodi:r1="26.091529"
     sodipodi:r2="13.045765"
     sodipodi:sides="3"
     sodipodi:stroke-cmyk="(0.0000000 0.0000000 0.0000000 0.80000001)"
     sodipodi:type="star"
     style="fill:#b3aa16;fill-rule:evenodd;stroke:#333333;stroke-width:3.5326941;stroke-linecap:round;stroke-linejoin:round;stroke-dasharray:none;fill-opacity:1"
     transform="matrix(0.884594,0.000000,0.000000,0.884594,13.23271,26.98818)" />
  <rect
     style="fill:#8c6fc9;fill-opacity:0.18723407;fill-rule:nonzero;stroke:#005793;stroke-linejoin:round;stroke-opacity:1;stroke-width:1;stroke-miterlimit:4;stroke-dasharray:4,1;stroke-dashoffset:0"
     id="rect1310"
     width="58.158501"
     height="57.726631"
     x="1.0076969"
     y="1.4096279"
     ry="4.1747441" />
</svg>
