<?xml version="1.0" encoding="UTF-8" standalone="no"?>
<svg
   xmlns:dc="http://purl.org/dc/elements/1.1/"
   xmlns:cc="http://web.resource.org/cc/"
   xmlns:rdf="http://www.w3.org/1999/02/22-rdf-syntax-ns#"
   xmlns:svg="http://www.w3.org/2000/svg"
   xmlns="http://www.w3.org/2000/svg"
   xmlns:sodipodi="http://inkscape.sourceforge.net/DTD/sodipodi-0.dtd"
   xmlns:inkscape="http://www.inkscape.org/namespaces/inkscape"
   height="60"
   width="60"
   _SVGFile__filename="oldscale/actions/align_objs.svg"
   version="1.0"
   y="0"
   x="0"
   id="svg1"
   sodipodi:version="0.32"
   inkscape:version="0.43"
   sodipodi:docname="object-send-to-back.svg"
   sodipodi:docbase="/home/krawek/Proyectos/yamf/data/icons">
  <sodipodi:namedview
     id="base"
     pagecolor="#ffffff"
     bordercolor="#666666"
     borderopacity="1.0"
     inkscape:pageopacity="0.0000000"
     inkscape:pageshadow="2"
     inkscape:zoom="5.5729167"
     inkscape:cx="48.121951"
     inkscape:cy="24"
     inkscape:window-width="1016"
     inkscape:window-height="683"
     inkscape:window-x="0"
     inkscape:window-y="25"
     inkscape:current-layer="svg1" />
  <defs
     id="defs3" />
  <metadata
     id="metadata8">
    <RDF
       id="RDF9">
      <Work
         about=""
         id="Work10">
        <title
           id="title11">Part of the Flat Icon Collection (Thu Aug 26 14:38:01 2004)</title>
        <description
           id="description13" />
        <subject
           id="subject14">
          <Bag
             id="Bag15">
            <li
               id="li16" />
          </Bag>
        </subject>
        <publisher
           id="publisher17">
          <Agent
             about=""
             id="Agent18">
            <title
               id="title19" />
          </Agent>
        </publisher>
        <creator
           id="creator20">
          <Agent
             about=""
             id="Agent21">
            <title
               id="title22">Danny Allen</title>
          </Agent>
        </creator>
        <rights
           id="rights24">
          <Agent
             about=""
             id="Agent25">
            <title
               id="title26">Danny Allen</title>
          </Agent>
        </rights>
        <date
           id="date28" />
        <format
           id="format29">image/svg+xml</format>
        <type
           id="type31"
           resource="http://purl.org/dc/dcmitype/StillImage" />
        <license
           id="license32"
           resource="http://creativecommons.org/licenses/LGPL/2.1/">
          <date
             id="date33" />
        </license>
        <language
           id="language34">en</language>
      </Work>
    </RDF>
    <rdf:RDF>
      <cc:Work
         rdf:about="">
        <dc:format>image/svg+xml</dc:format>
        <dc:type
           rdf:resource="http://purl.org/dc/dcmitype/StillImage" />
      </cc:Work>
    </rdf:RDF>
  </metadata>
  <path
     style="color:#000000;fill:#f41414;fill-opacity:0.70588237;fill-rule:evenodd;stroke:#000000;stroke-width:6.2819500;stroke-linecap:round;stroke-linejoin:round;stroke-miterlimit:4.0000000;stroke-dasharray:none;stroke-dashoffset:0.0000000;stroke-opacity:1.0000000;marker:none;marker-start:none;marker-mid:none;marker-end:none"
     d="M 23.411767,19.411252 L 44.213530,19.411252 C 45.720972,19.411252 46.934544,20.624824 46.934544,22.132266 L 46.934544,42.934029 C 46.934544,44.441470 45.720972,45.655042 44.213530,45.655042 L 23.411767,45.655042 C 21.904326,45.655042 20.690754,44.441470 20.690754,42.934029 L 20.690754,22.132266 C 20.690754,20.624824 21.904326,19.411252 23.411767,19.411252 z "
     id="path1718"
     transform="matrix(0.795932,0.000000,0.000000,0.795932,3.087431,4.105827)" />
  <path
     id="path1722"
     d="M 38.687271,36.872588 L 52.560279,36.872588 C 53.565615,36.872588 54.374964,37.681937 54.374964,38.687273 L 54.374964,52.56028 C 54.374964,53.565615 53.565615,54.374965 52.560279,54.374965 L 38.687271,54.374965 C 37.681936,54.374965 36.872587,53.565615 36.872587,52.56028 L 36.872587,38.687273 C 36.872587,37.681937 37.681936,36.872588 38.687271,36.872588 z "
     style="color:#000000;fill:none;fill-opacity:1;fill-rule:evenodd;stroke:#ffffff;stroke-width:10.00000954;stroke-linecap:round;stroke-linejoin:round;marker:none;marker-start:none;marker-mid:none;marker-end:none;stroke-miterlimit:4;stroke-dashoffset:0;stroke-opacity:1" />
  <path
     id="path1719"
     d="M 38.687271,36.872588 L 52.560279,36.872588 C 53.565615,36.872588 54.374964,37.681937 54.374964,38.687273 L 54.374964,52.56028 C 54.374964,53.565615 53.565615,54.374965 52.560279,54.374965 L 38.687271,54.374965 C 37.681936,54.374965 36.872587,53.565615 36.872587,52.56028 L 36.872587,38.687273 C 36.872587,37.681937 37.681936,36.872588 38.687271,36.872588 z "
     style="color:#000000;fill:#605dec;fill-opacity:0.70588237;fill-rule:evenodd;stroke:#000000;stroke-width:5.00000572;stroke-linecap:round;stroke-linejoin:round;marker:none;marker-start:none;marker-mid:none;marker-end:none;stroke-miterlimit:4;stroke-dashoffset:0;stroke-opacity:1" />
  <path
     id="path1727"
     d="M 7.4396711,5.6249876 L 21.312679,5.6249876 C 22.318015,5.6249876 23.127364,6.434337 23.127364,7.4396727 L 23.127364,21.31268 C 23.127364,22.318015 22.318015,23.127365 21.312679,23.127365 L 7.4396711,23.127365 C 6.4343361,23.127365 5.6249867,22.318015 5.6249867,21.31268 L 5.6249867,7.4396727 C 5.6249867,6.434337 6.4343361,5.6249876 7.4396711,5.6249876 z "
     style="color:#000000;fill:none;fill-opacity:1;fill-rule:evenodd;stroke:#ffffff;stroke-width:10.00000954;stroke-linecap:round;stroke-linejoin:round;marker:none;marker-start:none;marker-mid:none;marker-end:none;stroke-miterlimit:4;stroke-dashoffset:0;stroke-opacity:1" />
  <path
     id="path1728"
     d="M 7.4396711,5.6249876 L 21.312679,5.6249876 C 22.318015,5.6249876 23.127364,6.434337 23.127364,7.4396727 L 23.127364,21.31268 C 23.127364,22.318015 22.318015,23.127365 21.312679,23.127365 L 7.4396711,23.127365 C 6.4343361,23.127365 5.6249867,22.318015 5.6249867,21.31268 L 5.6249867,7.4396727 C 5.6249867,6.434337 6.4343361,5.6249876 7.4396711,5.6249876 z "
     style="color:#000000;fill:#03ff1b;fill-opacity:0.70588237;fill-rule:evenodd;stroke:#000000;stroke-width:5.00000572;stroke-linecap:round;stroke-linejoin:round;marker:none;marker-start:none;marker-mid:none;marker-end:none;stroke-miterlimit:4;stroke-dashoffset:0;stroke-opacity:1" />
</svg>
