<?xml version="1.0" encoding="UTF-8" standalone="no"?>
<!-- Created using Karbon14, part of koffice: http://www.koffice.org/karbon -->
<svg
   xmlns:dc="http://purl.org/dc/elements/1.1/"
   xmlns:cc="http://web.resource.org/cc/"
   xmlns:rdf="http://www.w3.org/1999/02/22-rdf-syntax-ns#"
   xmlns:svg="http://www.w3.org/2000/svg"
   xmlns="http://www.w3.org/2000/svg"
   xmlns:sodipodi="http://inkscape.sourceforge.net/DTD/sodipodi-0.dtd"
   xmlns:inkscape="http://www.inkscape.org/namespaces/inkscape"
   width="25.6pt"
   height="25.6pt"
   id="svg4016"
   sodipodi:version="0.32"
   inkscape:version="0.43"
   sodipodi:docname="draw-polygon.svg"
   sodipodi:docbase="/home/kuadrosx/artwork"
   version="1.0">
  <metadata
     id="metadata4039">
    <rdf:RDF>
      <cc:Work
         rdf:about="">
        <dc:format>image/svg+xml</dc:format>
        <dc:type
           rdf:resource="http://purl.org/dc/dcmitype/StillImage" />
      </cc:Work>
    </rdf:RDF>
  </metadata>
  <sodipodi:namedview
     inkscape:window-height="538"
     inkscape:window-width="731"
     inkscape:pageshadow="2"
     inkscape:pageopacity="0.0"
     borderopacity="1.0"
     bordercolor="#666666"
     pagecolor="#ffffff"
     id="base"
     inkscape:zoom="2.5129898"
     inkscape:cx="73.253113"
     inkscape:cy="12.451789"
     inkscape:window-x="100"
     inkscape:window-y="105"
     inkscape:current-layer="svg4016" />
  <defs
     id="defs4018">
    <radialGradient
       id="defitem0"
       gradientUnits="userSpaceOnUse"
       cx="-13"
       cy="810.39099"
       fx="-13"
       fy="810.39099"
       r="9">
      <stop
         stop-color="#000000"
         offset="0"
         stop-opacity="1"
         id="stop4021" />
      <stop
         stop-color="#000000"
         offset="1"
         stop-opacity="0"
         id="stop4023" />
    </radialGradient>
    <linearGradient
       id="defitem1"
       gradientUnits="userSpaceOnUse"
       x1="-12.9453"
       y1="802.33197"
       x2="-7.4797001"
       y2="807.61798">
      <stop
         stop-color="#ededeb"
         offset="0"
         stop-opacity="1"
         id="stop4026" />
      <stop
         stop-color="#dfdfdd"
         offset="1"
         stop-opacity="1"
         id="stop4028" />
    </linearGradient>
  </defs>
  <g
     id="Layer"
     transform="translate(29,-786.891)">
    <g
       id="draw_rect">
      <path
         id="path6970"
         d="M -25,814.891 L -25,790.891 L -1,790.891 L -1,814.891 L -25,814.891 z "
         style="fill:#000000;fill-opacity:0;stroke-linecap:round;stroke-linejoin:round" />
      <g
         id="g7067">
        <path
           id="path7039"
           d="M -4,810.391 C -4,811.219 -8.0294,811.891 -13,811.891 C -17.9706,811.891 -22,811.219 -22,810.391"
           style="fill:url(#defitem0);fill-rule:evenodd;stroke-width:0.45770299" />
        <path
           id="path5134"
           d="M -21.5,810.391 L -21.5,795.391 L -4.5,795.391 L -4.5,810.391 L -21.5,810.391 z "
           style="fill:url(#defitem1);stroke:#878985;stroke-linecap:round;stroke-linejoin:round" />
        <path
           id="path4036"
           d="M -20.5,809.391 L -20.5,796.391 L -5.5,796.391 L -5.5,809.391 L -20.5,809.391 z "
           style="fill:none;stroke:#fdfdfb" />
      </g>
    </g>
  </g>
</svg>
