<?xml version="1.0" encoding="UTF-8" standalone="no"?>
<!-- Created using Karbon14, part of koffice: http://www.koffice.org/karbon -->
<svg
   xmlns:dc="http://purl.org/dc/elements/1.1/"
   xmlns:cc="http://web.resource.org/cc/"
   xmlns:rdf="http://www.w3.org/1999/02/22-rdf-syntax-ns#"
   xmlns:svg="http://www.w3.org/2000/svg"
   xmlns="http://www.w3.org/2000/svg"
   xmlns:sodipodi="http://inkscape.sourceforge.net/DTD/sodipodi-0.dtd"
   xmlns:inkscape="http://www.inkscape.org/namespaces/inkscape"
   width="25.6pt"
   height="25.6pt"
   id="svg2"
   sodipodi:version="0.32"
   inkscape:version="0.43"
   sodipodi:docname="add-layer.svg"
   sodipodi:docbase="/home/krawek/Proyectos/yamf/data/icons"
   version="1.0">
  <metadata
     id="metadata16">
    <rdf:RDF>
      <cc:Work
         rdf:about="">
        <dc:format>image/svg+xml</dc:format>
        <dc:type
           rdf:resource="http://purl.org/dc/dcmitype/StillImage" />
      </cc:Work>
    </rdf:RDF>
  </metadata>
  <sodipodi:namedview
     inkscape:window-height="538"
     inkscape:window-width="735"
     inkscape:pageshadow="2"
     inkscape:pageopacity="0.0"
     borderopacity="1.0"
     bordercolor="#666666"
     pagecolor="#ffffff"
     id="base"
     inkscape:zoom="3.5539043"
     inkscape:cx="17.274472"
     inkscape:cy="24.595494"
     inkscape:window-x="281"
     inkscape:window-y="25"
     inkscape:current-layer="svg2" />
  <defs
     id="defs4">
    <linearGradient
       id="defitem19"
       gradientUnits="userSpaceOnUse"
       x1="9.099"
       y1="16.507999"
       x2="37.752998"
       y2="16.507999">
      <stop
         stop-color="#cdcdcd"
         offset="0"
         stop-opacity="1"
         id="stop7" />
      <stop
         stop-color="#fffdf8"
         offset="1"
         stop-opacity="1"
         id="stop9" />
    </linearGradient>
  </defs>
  <g
     id="Layer"
     transform="translate(-7.426,5.5385)">
    <g
       id="new_layer">
      <path
         id="path7697"
         d="M 9.724,10.91 L 31.128,10.508 L 37.128,20.508 L 14.128,22.508 L 9.724,10.91 z "
         style="fill:url(#defitem19);stroke:#000000;stroke-width:1.25" />
      <path
         id="path4312"
         d="M 21.23,-1.585 L 21.23,3.588 L 16.057,3.588 L 16.057,8.61 L 21.23,8.61 L 21.23,13.984 L 26.252,13.984 L 26.252,8.61 L 31.625,8.61 L 31.625,3.588 L 26.252,3.588 L 26.252,-1.585 L 21.23,-1.585 z "
         style="fill:#00ff00;stroke:#000000;stroke-width:1.25" />
    </g>
  </g>
</svg>
