/* XPM */
static char * maximize_toggled_active_xpm[] = {
"18 31 3 1",
" 	c None",
"+	c #D0D0FF s active_hilight_1",
".	c #C0C0FF s active_color_1",
"                  ",
"                  ",
"                  ",
"                  ",
"                  ",
"                  ",
"..................",
"..................",
"..................",
"..................",
"..................",
"..................",
"..................",
"..................",
"..................",
"..................",
"..................",
"..................",
"..................",
"..................",
"..................",
"..................",
"..................",
"..................",
"..................",
"..................",
"..................",
"                  ",
"                  ",
"                  ",
"                  "};
