<?xml version="1.0" encoding="UTF-8" standalone="no"?>
<!-- Created with Inkscape (http://www.inkscape.org/) -->
<svg
   xmlns:dc="http://purl.org/dc/elements/1.1/"
   xmlns:cc="http://web.resource.org/cc/"
   xmlns:rdf="http://www.w3.org/1999/02/22-rdf-syntax-ns#"
   xmlns:svg="http://www.w3.org/2000/svg"
   xmlns="http://www.w3.org/2000/svg"
   xmlns:xlink="http://www.w3.org/1999/xlink"
   xmlns:sodipodi="http://sodipodi.sourceforge.net/DTD/sodipodi-0.dtd"
   xmlns:inkscape="http://www.inkscape.org/namespaces/inkscape"
   width="18"
   height="29"
   id="svg2"
   sodipodi:version="0.32"
   inkscape:version="0.44.1"
   version="1.0"
   sodipodi:docbase="default"
   sodipodi:docname="maximize-toggled-pressed.svg"
   inkscape:output_extension="org.inkscape.output.svg.inkscape">
  <defs
     id="defs4">
    <linearGradient
       id="linearGradient1886">
      <stop
         style="stop-color:white;stop-opacity:1;"
         offset="0"
         id="stop1888" />
      <stop
         style="stop-color:white;stop-opacity:0.25;"
         offset="1"
         id="stop1890" />
    </linearGradient>
    <linearGradient
       id="linearGradient5873">
      <stop
         id="stop5875"
         offset="0"
         style="stop-color:white;stop-opacity:1;" />
      <stop
         id="stop5877"
         offset="0.5"
         style="stop-color:white;stop-opacity:0.90;" />
      <stop
         id="stop5879"
         offset="1"
         style="stop-color:white;stop-opacity:0;" />
    </linearGradient>
    <linearGradient
       id="linearGradient5847">
      <stop
         id="stop5849"
         offset="0"
         style="stop-color:black;stop-opacity:0;" />
      <stop
         id="stop2776"
         offset="0.4"
         style="stop-color:black;stop-opacity:0;" />
      <stop
         id="stop2779"
         offset="0.6"
         style="stop-color:black;stop-opacity:0.05;" />
      <stop
         id="stop5851"
         offset="1"
         style="stop-color:white;stop-opacity:0.20;" />
    </linearGradient>
    <linearGradient
       inkscape:collect="always"
       xlink:href="#linearGradient5847"
       id="linearGradient6945"
       gradientUnits="userSpaceOnUse"
       x1="0"
       y1="0.5"
       x2="0"
       y2="28.5"
       gradientTransform="matrix(1,0,0,1,0,0)" />
    <linearGradient
       inkscape:collect="always"
       xlink:href="#linearGradient5873"
       id="linearGradient6962"
       x1="0"
       y1="1"
       x2="0"
       y2="8"
       gradientUnits="userSpaceOnUse"
       gradientTransform="matrix(1,0,0,0.2,0,1)" />
    <radialGradient
       inkscape:collect="always"
       xlink:href="#linearGradient5873"
       id="radialGradient3087"
       cx="9"
       cy="9"
       fx="9"
       fy="9"
       r="9"
       gradientTransform="matrix(1,0,0,1,0,0.5)"
       gradientUnits="userSpaceOnUse" />
    <linearGradient
       inkscape:collect="always"
       xlink:href="#linearGradient1886"
       id="linearGradient1892"
       x1="0"
       y1="1"
       x2="0"
       y2="14"
       gradientUnits="userSpaceOnUse"
       gradientTransform="matrix(0.75,0,0,1,0.75,0)" />
  </defs>
  <sodipodi:namedview
     id="base"
     pagecolor="white"
     bordercolor="#666666"
     borderopacity="1.0"
     inkscape:pageopacity="0.0"
     inkscape:pageshadow="2"
     inkscape:zoom="10"
     inkscape:cx="0"
     inkscape:cy="0"
     inkscape:document-units="px"
     inkscape:current-layer="layer1"
     showgrid="true"
     inkscape:grid-bbox="true"
     inkscape:grid-points="true"
     gridoriginx="0px"
     gridtolerance="0.5px"
     guidetolerance="1px"
     inkscape:window-width="640"
     inkscape:window-height="400"
     inkscape:window-x="0"
     inkscape:window-y="0"
     inkscape:guide-bbox="true"
     inkscape:guide-points="false"
     showguides="true" />
  <metadata
     id="metadata7">
    <rdf:RDF>
      <cc:Work
         rdf:about="">
        <dc:format>image/svg+xml</dc:format>
        <dc:type
           rdf:resource="http://purl.org/dc/dcmitype/StillImage" />
        <dc:title>Title</dc:title>
        <dc:creator>
          <cc:Agent>
            <dc:title>Olivier Fourdan</dc:title>
          </cc:Agent>
        </dc:creator>
      </cc:Work>
    </rdf:RDF>
  </metadata>
  <g
     inkscape:groupmode="layer"
     id="layer1"
     inkscape:label="pressed">
    <g
       id="g1789"
       transform="translate(0,6)">
      <rect
         style="opacity:0.5;fill:url(#radialGradient3087);fill-opacity:1.0;stroke:url(#radialGradient3087);stroke-width:1;stroke-linecap:square;stroke-miterlimit:4;stroke-dasharray:none;stroke-opacity:1"
         id="rect3079"
         width="18"
         height="29"
         x="0"
         y="0" />
    </g>
  </g>
  <g
     inkscape:groupmode="layer"
     id="layer2"
     inkscape:label="Grad"
     style="display:inline">
    <path
       style="fill:url(#linearGradient6945);fill-opacity:1;fill-rule:evenodd;stroke:none;stroke-width:1;stroke-linecap:square;stroke-linejoin:miter;stroke-miterlimit:4;stroke-dasharray:none;stroke-opacity:1"
       d="M 0,0.5 L 18,0.5 C 18,0.5 18,28 18,28 L 0,28 L 0,0.5 z "
       id="path6057" />
  </g>
  <g
     inkscape:groupmode="layer"
     id="layer3"
     inkscape:label="hilight">
    <path
       style="fill:url(#linearGradient6962);fill-opacity:0.60;fill-rule:evenodd;stroke:none;stroke-width:1px;stroke-linecap:square;stroke-linejoin:miter;stroke-opacity:1"
       d="M 0,1 L 18,1 C 18,1 18,4 18,4 L 0,4 L 0,3 z "
       id="path6061" />
    <rect
       style="opacity:0.5;fill:url(#linearGradient1892);fill-opacity:1;stroke:none;stroke-width:0;stroke-linecap:round;stroke-linejoin:round;stroke-miterlimit:4;stroke-dasharray:none;stroke-opacity:1"
       id="rect1884"
       width="18"
       height="14"
       x="0"
       y="1" />
  </g>
  <g
     inkscape:label="Border"
     inkscape:groupmode="layer"
     id="g31"
     style="display:inline">
    <path
       style="fill:none;fill-opacity:0.50;fill-rule:evenodd;stroke:black;stroke-width:1px;stroke-linecap:square;stroke-linejoin:miter;stroke-opacity:0.50"
       d="M 0.5,0.5 L 17.5,0.5"
       id="path6059" />
  </g>
  <g
     inkscape:groupmode="layer"
     id="g3722"
     inkscape:label="Button">
    <g
       style="display:inline"
       id="g1626"
       transform="translate(3,10)">
      <path
         id="rect2318"
         d="M 3,0 L 3,3 L 0,3 L 0,12 L 9,12 L 9,9 L 12,9 L 12,0 L 3,0 z M 3,7 L 6,7 L 6,9 L 3,9 L 3,7 z "
         style="opacity:0.33;fill:black;fill-opacity:1;stroke:black;stroke-width:0;stroke-linecap:butt;stroke-miterlimit:4;stroke-dasharray:none;stroke-opacity:1;display:inline" />
      <path
         id="rect2331"
         d="M 4,1 L 4,3 L 5,3 L 9,3 L 10,3 L 10,7 L 9,7 L 9,8 L 11,8 L 11,1 L 4,1 z "
         style="opacity:1;fill:white;fill-opacity:1;stroke:black;stroke-width:0;stroke-linecap:butt;stroke-miterlimit:4;stroke-dasharray:none;stroke-opacity:1" />
      <path
         id="rect2371"
         d="M 1,4 L 1,11 L 8,11 L 8,4 L 1,4 z M 2,6 L 7,6 L 7,10 L 2,10 L 2,6 z "
         style="opacity:1;fill:white;fill-opacity:1;stroke:black;stroke-width:0;stroke-linecap:butt;stroke-miterlimit:4;stroke-dasharray:none;stroke-opacity:1" />
    </g>
  </g>
  <g
     inkscape:groupmode="layer"
     id="layer5"
     inkscape:label="Shadow">
    <path
       style="fill:none;fill-opacity:0.50;fill-rule:evenodd;stroke:black;stroke-width:1px;stroke-linecap:square;stroke-linejoin:miter;stroke-opacity:0.05"
       d="M 0.5,28.5 L 17.5,28.5"
       id="path6989" />
  </g>
</svg>
