/* XPM */
static char * bottom_right_inactive_xpm[] = {
"16 16 4 1",
" 	c None",
"+	c #D0D0FF s inactive_hilight_1",
"#	c #C0C0C0 s inactive_color_2",
"@	c #C0C0FF s inactive_color_1",
"        ####@@+@",
"        ####@@+@",
"        ####@@+@",
"        ####@@+@",
"        ####@@+@",
"        ####@@+@",
"        ####@@+@",
"        ####@@+@",
"############@@+@",
"############@@+@",
"############@@+@",
"############@@+@",
"@@@@@@@@@@@@@@+@",
"@@@@@@@@@@@@@@+@",
"+++++++++++++++@",
"@@@@@@@@@@@@@@@ "};
