<?xml version="1.0"?>
<root xmlns:AST="http://www.phpcompiler.org/phc-1.1" xmlns:past="http://www.parrotcode.org/PAST-0.1">
  <Statement_list>
    <ClassDef>Parser<Method>__construct<MethodStmtList/></Method><Method>__destruct<MethodStmtList/></Method><Method>firstCallInit<MethodStmtList/></Method><Method>clearState<MethodStmtList/></Method><Method>setOutputType<MethodStmtList/></Method><Method>setTitle<MethodStmtList/></Method><Method>uniqPrefix<MethodStmtList/></Method><Method>parse<MethodStmtList/></Method><Method>recursiveTagParse<MethodStmtList/></Method><Method>preprocess<MethodStmtList/></Method><Method>getRandomString<MethodStmtList/></Method><Method>getTitle<MethodStmtList/></Method><Method>getOptions<MethodStmtList/></Method><Method>getRevisionId<MethodStmtList/></Method><Method>getOutput<MethodStmtList/></Method><Method>nextLinkID<MethodStmtList/></Method><Method>getFunctionLang<MethodStmtList/></Method><Method>getPreprocessor<MethodStmtList/></Method><Method>extractTagsAndParams<MethodStmtList><Bin_op><attrs/><OP/><past:Op pirop="" name="infix:!="><past:Val returns="PhpString" encoding="" value=""/><past:Var scope="package" name="$text"/></past:Op></Bin_op></MethodStmtList></Method><Method>getStripList<MethodStmtList/></Method><Method>strip<MethodStmtList/></Method><Method>unstrip<MethodStmtList/></Method><Method>unstripNoWiki<MethodStmtList/></Method><Method>unstripForHTML<MethodStmtList/></Method><Method>insertStripItem<MethodStmtList/></Method><Method>tidy<MethodStmtList/></Method><Method>doTableStuff<MethodStmtList><Bin_op><attrs/><OP/><past:Op pirop="" name="infix:&gt;"><past:Val returns="PhpInteger" value="0"/></past:Op></Bin_op></MethodStmtList></Method><Method>internalParse<MethodStmtList/></Method><Method>doMagicLinks<MethodStmtList/></Method><Method>magicLinkCallback<MethodStmtList/></Method><Method>makeFreeExternalLink<MethodStmtList/></Method><Method>doHeadings<MethodStmtList/></Method><Method>doAllQuotes<MethodStmtList/></Method><Method>doQuotes<MethodStmtList/></Method><Method>replaceExternalLinks<MethodStmtList><Bin_op><attrs/><OP/><past:Op pirop="" name="infix:&lt;"><past:Var scope="package" name="$i"/></past:Op></Bin_op></MethodStmtList></Method><Method>getExternalLinkAttribs<MethodStmtList/></Method><Method>replaceUnusualEscapes<MethodStmtList/></Method><Method>replaceUnusualEscapesCallback<MethodStmtList/></Method><Method>maybeMakeExternalImage<MethodStmtList/></Method><Method>replaceInternalLinks<MethodStmtList/></Method><Method>replaceInternalLinks2<MethodStmtList/></Method><Method>makeLinkHolder<MethodStmtList/></Method><Method>makeKnownLinkHolder<MethodStmtList/></Method><Method>armorLinks<MethodStmtList/></Method><Method>areSubpagesAllowed<MethodStmtList/></Method><Method>maybeDoSubpageLink<MethodStmtList/></Method><Method>closeParagraph<MethodStmtList/></Method><Method>getCommon<MethodStmtList/></Method><Method>openList<MethodStmtList/></Method><Method>nextItem<MethodStmtList/></Method><Method>closeList<MethodStmtList/></Method><Method>doBlockLevels<MethodStmtList><past:Var scope="package" name="$prefixLength"/></MethodStmtList></Method><Method>findColonNoLinks<MethodStmtList/></Method><Method>getVariableValue<MethodStmtList/></Method><Method>initialiseVariables<MethodStmtList/></Method><Method>preprocessToDom<MethodStmtList/></Method><Method>splitWhitespace<MethodStmtList/></Method><Method>replaceVariables<MethodStmtList/></Method><Method>createAssocArgs<MethodStmtList/></Method><Method>limitationWarn<MethodStmtList/></Method><Method>braceSubstitution<MethodStmtList/></Method><Method>getTemplateDom<MethodStmtList/></Method><Method>fetchTemplateAndTitle<MethodStmtList/></Method><Method>fetchTemplate<MethodStmtList/></Method><Method>statelessFetchTemplate<MethodStmtList/></Method><Method>interwikiTransclude<MethodStmtList/></Method><Method>fetchScaryTemplateMaybeFromCache<MethodStmtList/></Method><Method>argSubstitution<MethodStmtList/></Method><Method>extensionSubstitution<MethodStmtList/></Method><Method>incrementIncludeSize<MethodStmtList/></Method><Method>incrementExpensiveFunctionCount<MethodStmtList/></Method><Method>doDoubleUnderscore<MethodStmtList/></Method><Method>formatHeadings<MethodStmtList/></Method><Method>preSaveTransform<MethodStmtList/></Method><Method>pstPass2<MethodStmtList/></Method><Method>getUserSig<MethodStmtList/></Method><Method>validateSig<MethodStmtList/></Method><Method>cleanSig<MethodStmtList/></Method><Method>cleanSigInSig<MethodStmtList/></Method><Method>startExternalParse<MethodStmtList/></Method><Method>transformMsg<MethodStmtList/></Method><Method>setHook<MethodStmtList/></Method><Method>setTransparentTagHook<MethodStmtList/></Method><Method>clearTagHooks<MethodStmtList/></Method><Method>setFunctionHook<MethodStmtList/></Method><Method>getFunctionHooks<MethodStmtList/></Method><Method>replaceLinkHolders<MethodStmtList/></Method><Method>replaceLinkHoldersText<MethodStmtList/></Method><Method>renderPreTag<MethodStmtList/></Method><Method>renderImageGallery<MethodStmtList/></Method><Method>getImageParams<MethodStmtList/></Method><Method>makeImage<MethodStmtList/></Method><Method>stripAltText<MethodStmtList/></Method><Method>disableCache<MethodStmtList/></Method><Method>attributeStripCallback<MethodStmtList/></Method><Method>Title<MethodStmtList/></Method><Method>Options<MethodStmtList/></Method><Method>OutputType<MethodStmtList/></Method><Method>getTags<MethodStmtList/></Method><Method>extractSections<MethodStmtList/></Method><Method>getSection<MethodStmtList/></Method><Method>replaceSection<MethodStmtList/></Method><Method>getRevisionTimestamp<MethodStmtList/></Method><Method>setDefaultSort<MethodStmtList/></Method><Method>getDefaultSort<MethodStmtList/></Method><Method>getCustomDefaultSort<MethodStmtList/></Method><Method>guessSectionNameFromWikiText<MethodStmtList/></Method><Method>stripSectionName<MethodStmtList/></Method><Method>srvus<MethodStmtList/></Method><Method>testSrvus<MethodStmtList/></Method><Method>testPst<MethodStmtList/></Method><Method>testPreprocess<MethodStmtList/></Method><Method>markerSkipCallback<MethodStmtList><Bin_op><attrs/><OP/><past:Op pirop="" name="infix:&lt;"><past:Var scope="package" name="$i"/></past:Op></Bin_op></MethodStmtList></Method><Method>serialiseHalfParsedText<MethodStmtList><Bin_op><attrs/><OP/><past:Op pirop="" name=""/></Bin_op><past:Var scope="package" name="$start_pos"/><Method_invocation><past:Op name="strpos"/></Method_invocation><past:Var scope="package" name="$start_pos"/><Method_invocation><past:Op name="strpos"/></Method_invocation></MethodStmtList></Method><Method>unserialiseHalfParsedText<MethodStmtList/></Method></ClassDef>
    <ClassDef>StripState<Method>__construct<MethodStmtList/></Method><Method>unstripGeneral<MethodStmtList/></Method><Method>unstripNoWiki<MethodStmtList/></Method><Method>unstripBoth<MethodStmtList/></Method></ClassDef>
    <ClassDef>OnlyIncludeReplacer<Method>replace<MethodStmtList/></Method></ClassDef>
    <past:Stmts/>
  </Statement_list>
</root>
