The tests in this directory were imported from the W3C repository.
Do NOT modify these tests directly in WebKit.
Instead, create a pull request on the WPT github:
	https://github.com/web-platform-tests/wpt

Then run the Tools/Scripts/import-w3c-tests in WebKit to reimport

Do NOT modify or remove this file.

------------------------------------------------------------------------
Properties requiring vendor prefixes:
None
Property values requiring vendor prefixes:
None
------------------------------------------------------------------------
List of files:
/LayoutTests/imported/w3c/web-platform-tests/css/css-text/text-align/text-align-006-expected.html
/LayoutTests/imported/w3c/web-platform-tests/css/css-text/text-align/text-align-006-ref.html
/LayoutTests/imported/w3c/web-platform-tests/css/css-text/text-align/text-align-006.html
/LayoutTests/imported/w3c/web-platform-tests/css/css-text/text-align/text-align-007-expected.html
/LayoutTests/imported/w3c/web-platform-tests/css/css-text/text-align/text-align-007-ref.html
/LayoutTests/imported/w3c/web-platform-tests/css/css-text/text-align/text-align-007.html
/LayoutTests/imported/w3c/web-platform-tests/css/css-text/text-align/text-align-008-expected.html
/LayoutTests/imported/w3c/web-platform-tests/css/css-text/text-align/text-align-008.html
/LayoutTests/imported/w3c/web-platform-tests/css/css-text/text-align/text-align-center-last-center-expected-mismatch.html
/LayoutTests/imported/w3c/web-platform-tests/css/css-text/text-align/text-align-center-last-center.html
/LayoutTests/imported/w3c/web-platform-tests/css/css-text/text-align/text-align-center-last-default-expected.html
/LayoutTests/imported/w3c/web-platform-tests/css/css-text/text-align/text-align-center-last-default.html
/LayoutTests/imported/w3c/web-platform-tests/css/css-text/text-align/text-align-center-last-end-expected-mismatch.html
/LayoutTests/imported/w3c/web-platform-tests/css/css-text/text-align/text-align-center-last-end.html
/LayoutTests/imported/w3c/web-platform-tests/css/css-text/text-align/text-align-center-last-justify-expected-mismatch.html
/LayoutTests/imported/w3c/web-platform-tests/css/css-text/text-align/text-align-center-last-justify.html
/LayoutTests/imported/w3c/web-platform-tests/css/css-text/text-align/text-align-center-last-start-expected-mismatch.html
/LayoutTests/imported/w3c/web-platform-tests/css/css-text/text-align/text-align-center-last-start.html
/LayoutTests/imported/w3c/web-platform-tests/css/css-text/text-align/text-align-default-last-default-expected.html
/LayoutTests/imported/w3c/web-platform-tests/css/css-text/text-align/text-align-default-last-default.html
/LayoutTests/imported/w3c/web-platform-tests/css/css-text/text-align/text-align-end-001-expected.html
/LayoutTests/imported/w3c/web-platform-tests/css/css-text/text-align/text-align-end-001.html
/LayoutTests/imported/w3c/web-platform-tests/css/css-text/text-align/text-align-end-002-expected.html
/LayoutTests/imported/w3c/web-platform-tests/css/css-text/text-align/text-align-end-002.html
/LayoutTests/imported/w3c/web-platform-tests/css/css-text/text-align/text-align-end-003-expected.html
/LayoutTests/imported/w3c/web-platform-tests/css/css-text/text-align/text-align-end-003.html
/LayoutTests/imported/w3c/web-platform-tests/css/css-text/text-align/text-align-end-004-expected.html
/LayoutTests/imported/w3c/web-platform-tests/css/css-text/text-align/text-align-end-004.html
/LayoutTests/imported/w3c/web-platform-tests/css/css-text/text-align/text-align-end-005-expected.html
/LayoutTests/imported/w3c/web-platform-tests/css/css-text/text-align/text-align-end-005.html
/LayoutTests/imported/w3c/web-platform-tests/css/css-text/text-align/text-align-end-006-expected.html
/LayoutTests/imported/w3c/web-platform-tests/css/css-text/text-align/text-align-end-006.html
/LayoutTests/imported/w3c/web-platform-tests/css/css-text/text-align/text-align-end-007-expected.html
/LayoutTests/imported/w3c/web-platform-tests/css/css-text/text-align/text-align-end-007.html
/LayoutTests/imported/w3c/web-platform-tests/css/css-text/text-align/text-align-end-008-expected.html
/LayoutTests/imported/w3c/web-platform-tests/css/css-text/text-align/text-align-end-008.html
/LayoutTests/imported/w3c/web-platform-tests/css/css-text/text-align/text-align-end-009-expected.html
/LayoutTests/imported/w3c/web-platform-tests/css/css-text/text-align/text-align-end-009.html
/LayoutTests/imported/w3c/web-platform-tests/css/css-text/text-align/text-align-end-010-expected.html
/LayoutTests/imported/w3c/web-platform-tests/css/css-text/text-align/text-align-end-010.html
/LayoutTests/imported/w3c/web-platform-tests/css/css-text/text-align/text-align-end-014-expected.html
/LayoutTests/imported/w3c/web-platform-tests/css/css-text/text-align/text-align-end-014.html
/LayoutTests/imported/w3c/web-platform-tests/css/css-text/text-align/text-align-end-015-expected.html
/LayoutTests/imported/w3c/web-platform-tests/css/css-text/text-align/text-align-end-015.html
/LayoutTests/imported/w3c/web-platform-tests/css/css-text/text-align/text-align-end-016-expected.html
/LayoutTests/imported/w3c/web-platform-tests/css/css-text/text-align/text-align-end-016.html
/LayoutTests/imported/w3c/web-platform-tests/css/css-text/text-align/text-align-end-017-expected.html
/LayoutTests/imported/w3c/web-platform-tests/css/css-text/text-align/text-align-end-017.html
/LayoutTests/imported/w3c/web-platform-tests/css/css-text/text-align/text-align-end-018.html
/LayoutTests/imported/w3c/web-platform-tests/css/css-text/text-align/text-align-end-019.html
/LayoutTests/imported/w3c/web-platform-tests/css/css-text/text-align/text-align-end-020.html
/LayoutTests/imported/w3c/web-platform-tests/css/css-text/text-align/text-align-end-021.html
/LayoutTests/imported/w3c/web-platform-tests/css/css-text/text-align/text-align-end-last-center-expected-mismatch.html
/LayoutTests/imported/w3c/web-platform-tests/css/css-text/text-align/text-align-end-last-center.html
/LayoutTests/imported/w3c/web-platform-tests/css/css-text/text-align/text-align-end-last-default-expected.html
/LayoutTests/imported/w3c/web-platform-tests/css/css-text/text-align/text-align-end-last-default.html
/LayoutTests/imported/w3c/web-platform-tests/css/css-text/text-align/text-align-end-last-end-expected-mismatch.html
/LayoutTests/imported/w3c/web-platform-tests/css/css-text/text-align/text-align-end-last-end.html
/LayoutTests/imported/w3c/web-platform-tests/css/css-text/text-align/text-align-end-last-justify-expected-mismatch.html
/LayoutTests/imported/w3c/web-platform-tests/css/css-text/text-align/text-align-end-last-justify.html
/LayoutTests/imported/w3c/web-platform-tests/css/css-text/text-align/text-align-end-last-start-expected-mismatch.html
/LayoutTests/imported/w3c/web-platform-tests/css/css-text/text-align/text-align-end-last-start.html
/LayoutTests/imported/w3c/web-platform-tests/css/css-text/text-align/text-align-inline-end-crash.html
/LayoutTests/imported/w3c/web-platform-tests/css/css-text/text-align/text-align-justify-001-expected.html
/LayoutTests/imported/w3c/web-platform-tests/css/css-text/text-align/text-align-justify-001.html
/LayoutTests/imported/w3c/web-platform-tests/css/css-text/text-align/text-align-justify-002-expected.html
/LayoutTests/imported/w3c/web-platform-tests/css/css-text/text-align/text-align-justify-002.html
/LayoutTests/imported/w3c/web-platform-tests/css/css-text/text-align/text-align-justify-003-expected.html
/LayoutTests/imported/w3c/web-platform-tests/css/css-text/text-align/text-align-justify-003.html
/LayoutTests/imported/w3c/web-platform-tests/css/css-text/text-align/text-align-justify-004-expected.html
/LayoutTests/imported/w3c/web-platform-tests/css/css-text/text-align/text-align-justify-004.html
/LayoutTests/imported/w3c/web-platform-tests/css/css-text/text-align/text-align-justify-005-expected.html
/LayoutTests/imported/w3c/web-platform-tests/css/css-text/text-align/text-align-justify-005.html
/LayoutTests/imported/w3c/web-platform-tests/css/css-text/text-align/text-align-justify-006-expected.html
/LayoutTests/imported/w3c/web-platform-tests/css/css-text/text-align/text-align-justify-006.html
/LayoutTests/imported/w3c/web-platform-tests/css/css-text/text-align/text-align-justify-last-center-expected-mismatch.html
/LayoutTests/imported/w3c/web-platform-tests/css/css-text/text-align/text-align-justify-last-center.html
/LayoutTests/imported/w3c/web-platform-tests/css/css-text/text-align/text-align-justify-last-default-expected.html
/LayoutTests/imported/w3c/web-platform-tests/css/css-text/text-align/text-align-justify-last-default.html
/LayoutTests/imported/w3c/web-platform-tests/css/css-text/text-align/text-align-justify-last-end-expected-mismatch.html
/LayoutTests/imported/w3c/web-platform-tests/css/css-text/text-align/text-align-justify-last-end.html
/LayoutTests/imported/w3c/web-platform-tests/css/css-text/text-align/text-align-justify-last-justify-expected-mismatch.html
/LayoutTests/imported/w3c/web-platform-tests/css/css-text/text-align/text-align-justify-last-justify.html
/LayoutTests/imported/w3c/web-platform-tests/css/css-text/text-align/text-align-justify-last-start-expected-mismatch.html
/LayoutTests/imported/w3c/web-platform-tests/css/css-text/text-align/text-align-justify-last-start.html
/LayoutTests/imported/w3c/web-platform-tests/css/css-text/text-align/text-align-justify-shy-001-expected.html
/LayoutTests/imported/w3c/web-platform-tests/css/css-text/text-align/text-align-justify-shy-001.html
/LayoutTests/imported/w3c/web-platform-tests/css/css-text/text-align/text-align-justifyall-001-expected.html
/LayoutTests/imported/w3c/web-platform-tests/css/css-text/text-align/text-align-justifyall-001.html
/LayoutTests/imported/w3c/web-platform-tests/css/css-text/text-align/text-align-justifyall-002-expected.html
/LayoutTests/imported/w3c/web-platform-tests/css/css-text/text-align/text-align-justifyall-002.html
/LayoutTests/imported/w3c/web-platform-tests/css/css-text/text-align/text-align-justifyall-003-expected.html
/LayoutTests/imported/w3c/web-platform-tests/css/css-text/text-align/text-align-justifyall-003.html
/LayoutTests/imported/w3c/web-platform-tests/css/css-text/text-align/text-align-justifyall-004-expected.html
/LayoutTests/imported/w3c/web-platform-tests/css/css-text/text-align/text-align-justifyall-004.html
/LayoutTests/imported/w3c/web-platform-tests/css/css-text/text-align/text-align-justifyall-005-expected.html
/LayoutTests/imported/w3c/web-platform-tests/css/css-text/text-align/text-align-justifyall-005.html
/LayoutTests/imported/w3c/web-platform-tests/css/css-text/text-align/text-align-justifyall-006-expected.html
/LayoutTests/imported/w3c/web-platform-tests/css/css-text/text-align/text-align-justifyall-006.html
/LayoutTests/imported/w3c/web-platform-tests/css/css-text/text-align/text-align-last-001.html
/LayoutTests/imported/w3c/web-platform-tests/css/css-text/text-align/text-align-last-002.html
/LayoutTests/imported/w3c/web-platform-tests/css/css-text/text-align/text-align-last-003.html
/LayoutTests/imported/w3c/web-platform-tests/css/css-text/text-align/text-align-last-004.html
/LayoutTests/imported/w3c/web-platform-tests/css/css-text/text-align/text-align-last-005.html
/LayoutTests/imported/w3c/web-platform-tests/css/css-text/text-align/text-align-last-006.html
/LayoutTests/imported/w3c/web-platform-tests/css/css-text/text-align/text-align-last-007.html
/LayoutTests/imported/w3c/web-platform-tests/css/css-text/text-align/text-align-last-008.html
/LayoutTests/imported/w3c/web-platform-tests/css/css-text/text-align/text-align-last-009.html
/LayoutTests/imported/w3c/web-platform-tests/css/css-text/text-align/text-align-last-010-expected.html
/LayoutTests/imported/w3c/web-platform-tests/css/css-text/text-align/text-align-last-010-ref.html
/LayoutTests/imported/w3c/web-platform-tests/css/css-text/text-align/text-align-last-010.html
/LayoutTests/imported/w3c/web-platform-tests/css/css-text/text-align/text-align-last-011-expected.html
/LayoutTests/imported/w3c/web-platform-tests/css/css-text/text-align/text-align-last-011.html
/LayoutTests/imported/w3c/web-platform-tests/css/css-text/text-align/text-align-last-012.html
/LayoutTests/imported/w3c/web-platform-tests/css/css-text/text-align/text-align-last-013.html
/LayoutTests/imported/w3c/web-platform-tests/css/css-text/text-align/text-align-last-014.html
/LayoutTests/imported/w3c/web-platform-tests/css/css-text/text-align/text-align-last-center-expected.html
/LayoutTests/imported/w3c/web-platform-tests/css/css-text/text-align/text-align-last-center-ref.html
/LayoutTests/imported/w3c/web-platform-tests/css/css-text/text-align/text-align-last-center.html
/LayoutTests/imported/w3c/web-platform-tests/css/css-text/text-align/text-align-last-empty-inline.html
/LayoutTests/imported/w3c/web-platform-tests/css/css-text/text-align/text-align-last-end-expected.html
/LayoutTests/imported/w3c/web-platform-tests/css/css-text/text-align/text-align-last-end-ref.html
/LayoutTests/imported/w3c/web-platform-tests/css/css-text/text-align/text-align-last-end.html
/LayoutTests/imported/w3c/web-platform-tests/css/css-text/text-align/text-align-last-interpolation.html
/LayoutTests/imported/w3c/web-platform-tests/css/css-text/text-align/text-align-last-justify-expected.html
/LayoutTests/imported/w3c/web-platform-tests/css/css-text/text-align/text-align-last-justify-ref.html
/LayoutTests/imported/w3c/web-platform-tests/css/css-text/text-align/text-align-last-justify-rtl-expected.html
/LayoutTests/imported/w3c/web-platform-tests/css/css-text/text-align/text-align-last-justify-rtl-ref.html
/LayoutTests/imported/w3c/web-platform-tests/css/css-text/text-align/text-align-last-justify-rtl.html
/LayoutTests/imported/w3c/web-platform-tests/css/css-text/text-align/text-align-last-justify.html
/LayoutTests/imported/w3c/web-platform-tests/css/css-text/text-align/text-align-last-simple-expected.html
/LayoutTests/imported/w3c/web-platform-tests/css/css-text/text-align/text-align-last-simple-ref.html
/LayoutTests/imported/w3c/web-platform-tests/css/css-text/text-align/text-align-last-simple.html
/LayoutTests/imported/w3c/web-platform-tests/css/css-text/text-align/text-align-last-start-expected.html
/LayoutTests/imported/w3c/web-platform-tests/css/css-text/text-align/text-align-last-start-ref.html
/LayoutTests/imported/w3c/web-platform-tests/css/css-text/text-align/text-align-last-start.html
/LayoutTests/imported/w3c/web-platform-tests/css/css-text/text-align/text-align-last-wins-001-expected.html
/LayoutTests/imported/w3c/web-platform-tests/css/css-text/text-align/text-align-last-wins-001.html
/LayoutTests/imported/w3c/web-platform-tests/css/css-text/text-align/text-align-match-parent-01-expected.html
/LayoutTests/imported/w3c/web-platform-tests/css/css-text/text-align/text-align-match-parent-01.html
/LayoutTests/imported/w3c/web-platform-tests/css/css-text/text-align/text-align-match-parent-02-expected.html
/LayoutTests/imported/w3c/web-platform-tests/css/css-text/text-align/text-align-match-parent-02.html
/LayoutTests/imported/w3c/web-platform-tests/css/css-text/text-align/text-align-match-parent-03-expected.html
/LayoutTests/imported/w3c/web-platform-tests/css/css-text/text-align/text-align-match-parent-03.html
/LayoutTests/imported/w3c/web-platform-tests/css/css-text/text-align/text-align-match-parent-04-expected.html
/LayoutTests/imported/w3c/web-platform-tests/css/css-text/text-align/text-align-match-parent-04.html
/LayoutTests/imported/w3c/web-platform-tests/css/css-text/text-align/text-align-match-parent-ref.html
/LayoutTests/imported/w3c/web-platform-tests/css/css-text/text-align/text-align-match-parent-root-ltr-expected.html
/LayoutTests/imported/w3c/web-platform-tests/css/css-text/text-align/text-align-match-parent-root-ltr-ref.html
/LayoutTests/imported/w3c/web-platform-tests/css/css-text/text-align/text-align-match-parent-root-ltr.html
/LayoutTests/imported/w3c/web-platform-tests/css/css-text/text-align/text-align-match-parent-root-rtl-expected.html
/LayoutTests/imported/w3c/web-platform-tests/css/css-text/text-align/text-align-match-parent-root-rtl-ref.html
/LayoutTests/imported/w3c/web-platform-tests/css/css-text/text-align/text-align-match-parent-root-rtl.html
/LayoutTests/imported/w3c/web-platform-tests/css/css-text/text-align/text-align-start-001-expected.html
/LayoutTests/imported/w3c/web-platform-tests/css/css-text/text-align/text-align-start-001.html
/LayoutTests/imported/w3c/web-platform-tests/css/css-text/text-align/text-align-start-002-expected.html
/LayoutTests/imported/w3c/web-platform-tests/css/css-text/text-align/text-align-start-002.html
/LayoutTests/imported/w3c/web-platform-tests/css/css-text/text-align/text-align-start-003-expected.html
/LayoutTests/imported/w3c/web-platform-tests/css/css-text/text-align/text-align-start-003.html
/LayoutTests/imported/w3c/web-platform-tests/css/css-text/text-align/text-align-start-004-expected.html
/LayoutTests/imported/w3c/web-platform-tests/css/css-text/text-align/text-align-start-004.html
/LayoutTests/imported/w3c/web-platform-tests/css/css-text/text-align/text-align-start-005-expected.html
/LayoutTests/imported/w3c/web-platform-tests/css/css-text/text-align/text-align-start-005.html
/LayoutTests/imported/w3c/web-platform-tests/css/css-text/text-align/text-align-start-006-expected.html
/LayoutTests/imported/w3c/web-platform-tests/css/css-text/text-align/text-align-start-006.html
/LayoutTests/imported/w3c/web-platform-tests/css/css-text/text-align/text-align-start-007-expected.html
/LayoutTests/imported/w3c/web-platform-tests/css/css-text/text-align/text-align-start-007.html
/LayoutTests/imported/w3c/web-platform-tests/css/css-text/text-align/text-align-start-008-expected.html
/LayoutTests/imported/w3c/web-platform-tests/css/css-text/text-align/text-align-start-008.html
/LayoutTests/imported/w3c/web-platform-tests/css/css-text/text-align/text-align-start-009-expected.html
/LayoutTests/imported/w3c/web-platform-tests/css/css-text/text-align/text-align-start-009.html
/LayoutTests/imported/w3c/web-platform-tests/css/css-text/text-align/text-align-start-010-expected.html
/LayoutTests/imported/w3c/web-platform-tests/css/css-text/text-align/text-align-start-010.html
/LayoutTests/imported/w3c/web-platform-tests/css/css-text/text-align/text-align-start-014-expected.html
/LayoutTests/imported/w3c/web-platform-tests/css/css-text/text-align/text-align-start-014.html
/LayoutTests/imported/w3c/web-platform-tests/css/css-text/text-align/text-align-start-015-expected.html
/LayoutTests/imported/w3c/web-platform-tests/css/css-text/text-align/text-align-start-015.html
/LayoutTests/imported/w3c/web-platform-tests/css/css-text/text-align/text-align-start-016-expected.html
/LayoutTests/imported/w3c/web-platform-tests/css/css-text/text-align/text-align-start-016.html
/LayoutTests/imported/w3c/web-platform-tests/css/css-text/text-align/text-align-start-017-expected.html
/LayoutTests/imported/w3c/web-platform-tests/css/css-text/text-align/text-align-start-017.html
/LayoutTests/imported/w3c/web-platform-tests/css/css-text/text-align/text-align-start-018.html
/LayoutTests/imported/w3c/web-platform-tests/css/css-text/text-align/text-align-start-019.html
/LayoutTests/imported/w3c/web-platform-tests/css/css-text/text-align/text-align-start-020.html
/LayoutTests/imported/w3c/web-platform-tests/css/css-text/text-align/text-align-start-021.html
/LayoutTests/imported/w3c/web-platform-tests/css/css-text/text-align/text-align-start-last-center-expected-mismatch.html
/LayoutTests/imported/w3c/web-platform-tests/css/css-text/text-align/text-align-start-last-center.html
/LayoutTests/imported/w3c/web-platform-tests/css/css-text/text-align/text-align-start-last-default-expected.html
/LayoutTests/imported/w3c/web-platform-tests/css/css-text/text-align/text-align-start-last-default.html
/LayoutTests/imported/w3c/web-platform-tests/css/css-text/text-align/text-align-start-last-end-expected-mismatch.html
/LayoutTests/imported/w3c/web-platform-tests/css/css-text/text-align/text-align-start-last-end.html
/LayoutTests/imported/w3c/web-platform-tests/css/css-text/text-align/text-align-start-last-justify-expected-mismatch.html
/LayoutTests/imported/w3c/web-platform-tests/css/css-text/text-align/text-align-start-last-justify.html
/LayoutTests/imported/w3c/web-platform-tests/css/css-text/text-align/text-align-start-last-start-expected-mismatch.html
/LayoutTests/imported/w3c/web-platform-tests/css/css-text/text-align/text-align-start-last-start.html
/LayoutTests/imported/w3c/web-platform-tests/css/css-text/text-align/text-align-webkit-match-parent.html
