The tests in this directory were imported from the W3C repository.
Do NOT modify these tests directly in WebKit.
Instead, create a pull request on the WPT github:
	https://github.com/web-platform-tests/wpt

Then run the Tools/Scripts/import-w3c-tests in WebKit to reimport

Do NOT modify or remove this file.

------------------------------------------------------------------------
Properties requiring vendor prefixes:
None
Property values requiring vendor prefixes:
None
------------------------------------------------------------------------
List of files:
/LayoutTests/imported/w3c/web-platform-tests/css/css-color/LICENSE
/LayoutTests/imported/w3c/web-platform-tests/css/css-color/META.yml
/LayoutTests/imported/w3c/web-platform-tests/css/css-color/a98rgb-001-expected.html
/LayoutTests/imported/w3c/web-platform-tests/css/css-color/a98rgb-001.html
/LayoutTests/imported/w3c/web-platform-tests/css/css-color/a98rgb-002-expected.html
/LayoutTests/imported/w3c/web-platform-tests/css/css-color/a98rgb-002.html
/LayoutTests/imported/w3c/web-platform-tests/css/css-color/a98rgb-003-expected.html
/LayoutTests/imported/w3c/web-platform-tests/css/css-color/a98rgb-003.html
/LayoutTests/imported/w3c/web-platform-tests/css/css-color/a98rgb-004-expected.html
/LayoutTests/imported/w3c/web-platform-tests/css/css-color/a98rgb-004.html
/LayoutTests/imported/w3c/web-platform-tests/css/css-color/background-color-hsl-001-expected.html
/LayoutTests/imported/w3c/web-platform-tests/css/css-color/background-color-hsl-001.html
/LayoutTests/imported/w3c/web-platform-tests/css/css-color/background-color-hsl-002-expected.html
/LayoutTests/imported/w3c/web-platform-tests/css/css-color/background-color-hsl-002.html
/LayoutTests/imported/w3c/web-platform-tests/css/css-color/background-color-hsl-003-expected.html
/LayoutTests/imported/w3c/web-platform-tests/css/css-color/background-color-hsl-003.html
/LayoutTests/imported/w3c/web-platform-tests/css/css-color/background-color-hsl-004-expected.html
/LayoutTests/imported/w3c/web-platform-tests/css/css-color/background-color-hsl-004.html
/LayoutTests/imported/w3c/web-platform-tests/css/css-color/background-color-rgb-001-expected.html
/LayoutTests/imported/w3c/web-platform-tests/css/css-color/background-color-rgb-001.html
/LayoutTests/imported/w3c/web-platform-tests/css/css-color/background-color-rgb-002-expected.html
/LayoutTests/imported/w3c/web-platform-tests/css/css-color/background-color-rgb-002.html
/LayoutTests/imported/w3c/web-platform-tests/css/css-color/background-color-rgb-003-expected.html
/LayoutTests/imported/w3c/web-platform-tests/css/css-color/background-color-rgb-003.html
/LayoutTests/imported/w3c/web-platform-tests/css/css-color/body-opacity-0-to-1-stacking-context-expected.html
/LayoutTests/imported/w3c/web-platform-tests/css/css-color/body-opacity-0-to-1-stacking-context.html
/LayoutTests/imported/w3c/web-platform-tests/css/css-color/border-bottom-color-expected.xht
/LayoutTests/imported/w3c/web-platform-tests/css/css-color/border-bottom-color.xht
/LayoutTests/imported/w3c/web-platform-tests/css/css-color/border-left-color-expected.xht
/LayoutTests/imported/w3c/web-platform-tests/css/css-color/border-left-color.xht
/LayoutTests/imported/w3c/web-platform-tests/css/css-color/border-right-color-expected.xht
/LayoutTests/imported/w3c/web-platform-tests/css/css-color/border-right-color.xht
/LayoutTests/imported/w3c/web-platform-tests/css/css-color/border-top-color-expected.xht
/LayoutTests/imported/w3c/web-platform-tests/css/css-color/border-top-color.xht
/LayoutTests/imported/w3c/web-platform-tests/css/css-color/color-001-expected.html
/LayoutTests/imported/w3c/web-platform-tests/css/css-color/color-001.html
/LayoutTests/imported/w3c/web-platform-tests/css/css-color/color-002-expected.html
/LayoutTests/imported/w3c/web-platform-tests/css/css-color/color-002.html
/LayoutTests/imported/w3c/web-platform-tests/css/css-color/color-003-expected.html
/LayoutTests/imported/w3c/web-platform-tests/css/css-color/color-003.html
/LayoutTests/imported/w3c/web-platform-tests/css/css-color/color-contrast-001-expected.html
/LayoutTests/imported/w3c/web-platform-tests/css/css-color/color-contrast-001.html
/LayoutTests/imported/w3c/web-platform-tests/css/css-color/color-function-parsing.html
/LayoutTests/imported/w3c/web-platform-tests/css/css-color/color-initial-canvastext.html
/LayoutTests/imported/w3c/web-platform-tests/css/css-color/color-mix-basic-001.html
/LayoutTests/imported/w3c/web-platform-tests/css/css-color/color-mix-non-srgb-001.html
/LayoutTests/imported/w3c/web-platform-tests/css/css-color/color-mix-percents-01-expected.html
/LayoutTests/imported/w3c/web-platform-tests/css/css-color/color-mix-percents-01.html
/LayoutTests/imported/w3c/web-platform-tests/css/css-color/color-mix-percents-02-expected.html
/LayoutTests/imported/w3c/web-platform-tests/css/css-color/color-mix-percents-02.html
/LayoutTests/imported/w3c/web-platform-tests/css/css-color/color-resolving-hsl.html
/LayoutTests/imported/w3c/web-platform-tests/css/css-color/color-resolving-hwb.html
/LayoutTests/imported/w3c/web-platform-tests/css/css-color/color-resolving-keywords.html
/LayoutTests/imported/w3c/web-platform-tests/css/css-color/color-resolving.html
/LayoutTests/imported/w3c/web-platform-tests/css/css-color/composited-filters-under-opacity-expected.html
/LayoutTests/imported/w3c/web-platform-tests/css/css-color/composited-filters-under-opacity.html
/LayoutTests/imported/w3c/web-platform-tests/css/css-color/currentcolor-001-expected.html
/LayoutTests/imported/w3c/web-platform-tests/css/css-color/currentcolor-001.html
/LayoutTests/imported/w3c/web-platform-tests/css/css-color/currentcolor-002-expected.html
/LayoutTests/imported/w3c/web-platform-tests/css/css-color/currentcolor-002.html
/LayoutTests/imported/w3c/web-platform-tests/css/css-color/display-p3-001-expected.html
/LayoutTests/imported/w3c/web-platform-tests/css/css-color/display-p3-001.html
/LayoutTests/imported/w3c/web-platform-tests/css/css-color/display-p3-002-expected.html
/LayoutTests/imported/w3c/web-platform-tests/css/css-color/display-p3-002.html
/LayoutTests/imported/w3c/web-platform-tests/css/css-color/display-p3-003-expected.html
/LayoutTests/imported/w3c/web-platform-tests/css/css-color/display-p3-003.html
/LayoutTests/imported/w3c/web-platform-tests/css/css-color/display-p3-004-expected.html
/LayoutTests/imported/w3c/web-platform-tests/css/css-color/display-p3-004.html
/LayoutTests/imported/w3c/web-platform-tests/css/css-color/display-p3-005-expected.html
/LayoutTests/imported/w3c/web-platform-tests/css/css-color/display-p3-005.html
/LayoutTests/imported/w3c/web-platform-tests/css/css-color/display-p3-006-expected.html
/LayoutTests/imported/w3c/web-platform-tests/css/css-color/display-p3-006.html
/LayoutTests/imported/w3c/web-platform-tests/css/css-color/hex-001-expected.html
/LayoutTests/imported/w3c/web-platform-tests/css/css-color/hex-001.html
/LayoutTests/imported/w3c/web-platform-tests/css/css-color/hex-002-expected.html
/LayoutTests/imported/w3c/web-platform-tests/css/css-color/hex-002.html
/LayoutTests/imported/w3c/web-platform-tests/css/css-color/hex-003-expected.html
/LayoutTests/imported/w3c/web-platform-tests/css/css-color/hex-003.html
/LayoutTests/imported/w3c/web-platform-tests/css/css-color/hex-004-expected.html
/LayoutTests/imported/w3c/web-platform-tests/css/css-color/hex-004.html
/LayoutTests/imported/w3c/web-platform-tests/css/css-color/hsl-001-expected.html
/LayoutTests/imported/w3c/web-platform-tests/css/css-color/hsl-001.html
/LayoutTests/imported/w3c/web-platform-tests/css/css-color/hsl-002-expected.html
/LayoutTests/imported/w3c/web-platform-tests/css/css-color/hsl-002.html
/LayoutTests/imported/w3c/web-platform-tests/css/css-color/hsl-003-expected.html
/LayoutTests/imported/w3c/web-platform-tests/css/css-color/hsl-003.html
/LayoutTests/imported/w3c/web-platform-tests/css/css-color/hsl-004-expected.html
/LayoutTests/imported/w3c/web-platform-tests/css/css-color/hsl-004.html
/LayoutTests/imported/w3c/web-platform-tests/css/css-color/hsl-005-expected.html
/LayoutTests/imported/w3c/web-platform-tests/css/css-color/hsl-005.html
/LayoutTests/imported/w3c/web-platform-tests/css/css-color/hsl-006-expected.html
/LayoutTests/imported/w3c/web-platform-tests/css/css-color/hsl-006.html
/LayoutTests/imported/w3c/web-platform-tests/css/css-color/hsl-007-expected.html
/LayoutTests/imported/w3c/web-platform-tests/css/css-color/hsl-007.html
/LayoutTests/imported/w3c/web-platform-tests/css/css-color/hsl-008-expected.html
/LayoutTests/imported/w3c/web-platform-tests/css/css-color/hsl-008.html
/LayoutTests/imported/w3c/web-platform-tests/css/css-color/hsla-001-expected.html
/LayoutTests/imported/w3c/web-platform-tests/css/css-color/hsla-001.html
/LayoutTests/imported/w3c/web-platform-tests/css/css-color/hsla-002-expected.html
/LayoutTests/imported/w3c/web-platform-tests/css/css-color/hsla-002.html
/LayoutTests/imported/w3c/web-platform-tests/css/css-color/hsla-003-expected.html
/LayoutTests/imported/w3c/web-platform-tests/css/css-color/hsla-003.html
/LayoutTests/imported/w3c/web-platform-tests/css/css-color/hsla-004-expected.html
/LayoutTests/imported/w3c/web-platform-tests/css/css-color/hsla-004.html
/LayoutTests/imported/w3c/web-platform-tests/css/css-color/hsla-005-expected.html
/LayoutTests/imported/w3c/web-platform-tests/css/css-color/hsla-005.html
/LayoutTests/imported/w3c/web-platform-tests/css/css-color/hsla-006-expected.html
/LayoutTests/imported/w3c/web-platform-tests/css/css-color/hsla-006.html
/LayoutTests/imported/w3c/web-platform-tests/css/css-color/hsla-007-expected.html
/LayoutTests/imported/w3c/web-platform-tests/css/css-color/hsla-007.html
/LayoutTests/imported/w3c/web-platform-tests/css/css-color/hsla-008-expected.html
/LayoutTests/imported/w3c/web-platform-tests/css/css-color/hsla-008.html
/LayoutTests/imported/w3c/web-platform-tests/css/css-color/htaccess
/LayoutTests/imported/w3c/web-platform-tests/css/css-color/hwb-001-expected.html
/LayoutTests/imported/w3c/web-platform-tests/css/css-color/hwb-001.html
/LayoutTests/imported/w3c/web-platform-tests/css/css-color/hwb-002-expected.html
/LayoutTests/imported/w3c/web-platform-tests/css/css-color/hwb-002.html
/LayoutTests/imported/w3c/web-platform-tests/css/css-color/hwb-003-expected.html
/LayoutTests/imported/w3c/web-platform-tests/css/css-color/hwb-003.html
/LayoutTests/imported/w3c/web-platform-tests/css/css-color/hwb-004-expected.html
/LayoutTests/imported/w3c/web-platform-tests/css/css-color/hwb-004.html
/LayoutTests/imported/w3c/web-platform-tests/css/css-color/hwb-005-expected.html
/LayoutTests/imported/w3c/web-platform-tests/css/css-color/hwb-005.html
/LayoutTests/imported/w3c/web-platform-tests/css/css-color/inheritance.html
/LayoutTests/imported/w3c/web-platform-tests/css/css-color/inline-opacity-float-child-expected.xht
/LayoutTests/imported/w3c/web-platform-tests/css/css-color/inline-opacity-float-child.html
/LayoutTests/imported/w3c/web-platform-tests/css/css-color/lab-001-expected.html
/LayoutTests/imported/w3c/web-platform-tests/css/css-color/lab-001.html
/LayoutTests/imported/w3c/web-platform-tests/css/css-color/lab-002-expected.html
/LayoutTests/imported/w3c/web-platform-tests/css/css-color/lab-002.html
/LayoutTests/imported/w3c/web-platform-tests/css/css-color/lab-003-expected.html
/LayoutTests/imported/w3c/web-platform-tests/css/css-color/lab-003.html
/LayoutTests/imported/w3c/web-platform-tests/css/css-color/lab-004-expected.html
/LayoutTests/imported/w3c/web-platform-tests/css/css-color/lab-004.html
/LayoutTests/imported/w3c/web-platform-tests/css/css-color/lab-005-expected.html
/LayoutTests/imported/w3c/web-platform-tests/css/css-color/lab-005.html
/LayoutTests/imported/w3c/web-platform-tests/css/css-color/lab-006-expected.html
/LayoutTests/imported/w3c/web-platform-tests/css/css-color/lab-006.html
/LayoutTests/imported/w3c/web-platform-tests/css/css-color/lab-007-expected.html
/LayoutTests/imported/w3c/web-platform-tests/css/css-color/lab-007.html
/LayoutTests/imported/w3c/web-platform-tests/css/css-color/lab-008-expected.html
/LayoutTests/imported/w3c/web-platform-tests/css/css-color/lab-008.html
/LayoutTests/imported/w3c/web-platform-tests/css/css-color/lch-001-expected.html
/LayoutTests/imported/w3c/web-platform-tests/css/css-color/lch-001.html
/LayoutTests/imported/w3c/web-platform-tests/css/css-color/lch-002-expected.html
/LayoutTests/imported/w3c/web-platform-tests/css/css-color/lch-002.html
/LayoutTests/imported/w3c/web-platform-tests/css/css-color/lch-003-expected.html
/LayoutTests/imported/w3c/web-platform-tests/css/css-color/lch-003.html
/LayoutTests/imported/w3c/web-platform-tests/css/css-color/lch-004-expected.html
/LayoutTests/imported/w3c/web-platform-tests/css/css-color/lch-004.html
/LayoutTests/imported/w3c/web-platform-tests/css/css-color/lch-005-expected.html
/LayoutTests/imported/w3c/web-platform-tests/css/css-color/lch-005.html
/LayoutTests/imported/w3c/web-platform-tests/css/css-color/lch-006-expected.html
/LayoutTests/imported/w3c/web-platform-tests/css/css-color/lch-006.html
/LayoutTests/imported/w3c/web-platform-tests/css/css-color/lch-007-expected.html
/LayoutTests/imported/w3c/web-platform-tests/css/css-color/lch-007.html
/LayoutTests/imported/w3c/web-platform-tests/css/css-color/lch-008-expected.html
/LayoutTests/imported/w3c/web-platform-tests/css/css-color/lch-008.html
/LayoutTests/imported/w3c/web-platform-tests/css/css-color/named-001-expected.html
/LayoutTests/imported/w3c/web-platform-tests/css/css-color/named-001.html
/LayoutTests/imported/w3c/web-platform-tests/css/css-color/oklab-001-expected.html
/LayoutTests/imported/w3c/web-platform-tests/css/css-color/oklab-001.html
/LayoutTests/imported/w3c/web-platform-tests/css/css-color/oklab-002-expected.html
/LayoutTests/imported/w3c/web-platform-tests/css/css-color/oklab-002.html
/LayoutTests/imported/w3c/web-platform-tests/css/css-color/oklab-003-expected.html
/LayoutTests/imported/w3c/web-platform-tests/css/css-color/oklab-003.html
/LayoutTests/imported/w3c/web-platform-tests/css/css-color/oklab-004-expected.html
/LayoutTests/imported/w3c/web-platform-tests/css/css-color/oklab-004.html
/LayoutTests/imported/w3c/web-platform-tests/css/css-color/oklab-005-expected.html
/LayoutTests/imported/w3c/web-platform-tests/css/css-color/oklab-005.html
/LayoutTests/imported/w3c/web-platform-tests/css/css-color/oklab-006-expected.html
/LayoutTests/imported/w3c/web-platform-tests/css/css-color/oklab-006.html
/LayoutTests/imported/w3c/web-platform-tests/css/css-color/oklab-007-expected.html
/LayoutTests/imported/w3c/web-platform-tests/css/css-color/oklab-007.html
/LayoutTests/imported/w3c/web-platform-tests/css/css-color/oklab-008-expected.html
/LayoutTests/imported/w3c/web-platform-tests/css/css-color/oklab-008.html
/LayoutTests/imported/w3c/web-platform-tests/css/css-color/oklch-001-expected.html
/LayoutTests/imported/w3c/web-platform-tests/css/css-color/oklch-001.html
/LayoutTests/imported/w3c/web-platform-tests/css/css-color/oklch-002-expected.html
/LayoutTests/imported/w3c/web-platform-tests/css/css-color/oklch-002.html
/LayoutTests/imported/w3c/web-platform-tests/css/css-color/oklch-003-expected.html
/LayoutTests/imported/w3c/web-platform-tests/css/css-color/oklch-003.html
/LayoutTests/imported/w3c/web-platform-tests/css/css-color/oklch-004-expected.html
/LayoutTests/imported/w3c/web-platform-tests/css/css-color/oklch-004.html
/LayoutTests/imported/w3c/web-platform-tests/css/css-color/oklch-005-expected.html
/LayoutTests/imported/w3c/web-platform-tests/css/css-color/oklch-005.html
/LayoutTests/imported/w3c/web-platform-tests/css/css-color/oklch-006-expected.html
/LayoutTests/imported/w3c/web-platform-tests/css/css-color/oklch-006.html
/LayoutTests/imported/w3c/web-platform-tests/css/css-color/oklch-007-expected.html
/LayoutTests/imported/w3c/web-platform-tests/css/css-color/oklch-007.html
/LayoutTests/imported/w3c/web-platform-tests/css/css-color/oklch-008-expected.html
/LayoutTests/imported/w3c/web-platform-tests/css/css-color/oklch-008.html
/LayoutTests/imported/w3c/web-platform-tests/css/css-color/opacity-overlapping-letters-expected.html
/LayoutTests/imported/w3c/web-platform-tests/css/css-color/opacity-overlapping-letters.html
/LayoutTests/imported/w3c/web-platform-tests/css/css-color/predefined-001-expected.html
/LayoutTests/imported/w3c/web-platform-tests/css/css-color/predefined-001.html
/LayoutTests/imported/w3c/web-platform-tests/css/css-color/predefined-002-expected.html
/LayoutTests/imported/w3c/web-platform-tests/css/css-color/predefined-002.html
/LayoutTests/imported/w3c/web-platform-tests/css/css-color/predefined-005-expected.html
/LayoutTests/imported/w3c/web-platform-tests/css/css-color/predefined-005.html
/LayoutTests/imported/w3c/web-platform-tests/css/css-color/predefined-006-expected.html
/LayoutTests/imported/w3c/web-platform-tests/css/css-color/predefined-006.html
/LayoutTests/imported/w3c/web-platform-tests/css/css-color/predefined-007-expected.html
/LayoutTests/imported/w3c/web-platform-tests/css/css-color/predefined-007.html
/LayoutTests/imported/w3c/web-platform-tests/css/css-color/predefined-008-expected.html
/LayoutTests/imported/w3c/web-platform-tests/css/css-color/predefined-008.html
/LayoutTests/imported/w3c/web-platform-tests/css/css-color/predefined-009-expected.html
/LayoutTests/imported/w3c/web-platform-tests/css/css-color/predefined-009.html
/LayoutTests/imported/w3c/web-platform-tests/css/css-color/predefined-010-expected.html
/LayoutTests/imported/w3c/web-platform-tests/css/css-color/predefined-010.html
/LayoutTests/imported/w3c/web-platform-tests/css/css-color/predefined-011-expected.html
/LayoutTests/imported/w3c/web-platform-tests/css/css-color/predefined-011.html
/LayoutTests/imported/w3c/web-platform-tests/css/css-color/predefined-012-expected.html
/LayoutTests/imported/w3c/web-platform-tests/css/css-color/predefined-012.html
/LayoutTests/imported/w3c/web-platform-tests/css/css-color/predefined-016-expected.html
/LayoutTests/imported/w3c/web-platform-tests/css/css-color/predefined-016.html
/LayoutTests/imported/w3c/web-platform-tests/css/css-color/prophoto-rgb-001-expected.html
/LayoutTests/imported/w3c/web-platform-tests/css/css-color/prophoto-rgb-001.html
/LayoutTests/imported/w3c/web-platform-tests/css/css-color/prophoto-rgb-002-expected.html
/LayoutTests/imported/w3c/web-platform-tests/css/css-color/prophoto-rgb-002.html
/LayoutTests/imported/w3c/web-platform-tests/css/css-color/prophoto-rgb-003-expected.html
/LayoutTests/imported/w3c/web-platform-tests/css/css-color/prophoto-rgb-003.html
/LayoutTests/imported/w3c/web-platform-tests/css/css-color/prophoto-rgb-004-expected.html
/LayoutTests/imported/w3c/web-platform-tests/css/css-color/prophoto-rgb-004.html
/LayoutTests/imported/w3c/web-platform-tests/css/css-color/prophoto-rgb-005-expected.html
/LayoutTests/imported/w3c/web-platform-tests/css/css-color/prophoto-rgb-005.html
/LayoutTests/imported/w3c/web-platform-tests/css/css-color/rec2020-001-expected.html
/LayoutTests/imported/w3c/web-platform-tests/css/css-color/rec2020-001.html
/LayoutTests/imported/w3c/web-platform-tests/css/css-color/rec2020-002-expected.html
/LayoutTests/imported/w3c/web-platform-tests/css/css-color/rec2020-002.html
/LayoutTests/imported/w3c/web-platform-tests/css/css-color/rec2020-003-expected.html
/LayoutTests/imported/w3c/web-platform-tests/css/css-color/rec2020-003.html
/LayoutTests/imported/w3c/web-platform-tests/css/css-color/rec2020-004-expected.html
/LayoutTests/imported/w3c/web-platform-tests/css/css-color/rec2020-004.html
/LayoutTests/imported/w3c/web-platform-tests/css/css-color/rec2020-005-expected.html
/LayoutTests/imported/w3c/web-platform-tests/css/css-color/rec2020-005.html
/LayoutTests/imported/w3c/web-platform-tests/css/css-color/rgb-001-expected.html
/LayoutTests/imported/w3c/web-platform-tests/css/css-color/rgb-001.html
/LayoutTests/imported/w3c/web-platform-tests/css/css-color/rgb-002-expected.html
/LayoutTests/imported/w3c/web-platform-tests/css/css-color/rgb-002.html
/LayoutTests/imported/w3c/web-platform-tests/css/css-color/rgb-003-expected.html
/LayoutTests/imported/w3c/web-platform-tests/css/css-color/rgb-003.html
/LayoutTests/imported/w3c/web-platform-tests/css/css-color/rgb-004-expected.html
/LayoutTests/imported/w3c/web-platform-tests/css/css-color/rgb-004.html
/LayoutTests/imported/w3c/web-platform-tests/css/css-color/rgb-005-expected.html
/LayoutTests/imported/w3c/web-platform-tests/css/css-color/rgb-005.html
/LayoutTests/imported/w3c/web-platform-tests/css/css-color/rgb-006-expected.html
/LayoutTests/imported/w3c/web-platform-tests/css/css-color/rgb-006.html
/LayoutTests/imported/w3c/web-platform-tests/css/css-color/rgb-007-expected.html
/LayoutTests/imported/w3c/web-platform-tests/css/css-color/rgb-007.html
/LayoutTests/imported/w3c/web-platform-tests/css/css-color/rgb-008-expected.html
/LayoutTests/imported/w3c/web-platform-tests/css/css-color/rgb-008.html
/LayoutTests/imported/w3c/web-platform-tests/css/css-color/rgb-rounding-001.html
/LayoutTests/imported/w3c/web-platform-tests/css/css-color/rgba-001-expected.html
/LayoutTests/imported/w3c/web-platform-tests/css/css-color/rgba-001.html
/LayoutTests/imported/w3c/web-platform-tests/css/css-color/rgba-002-expected.html
/LayoutTests/imported/w3c/web-platform-tests/css/css-color/rgba-002.html
/LayoutTests/imported/w3c/web-platform-tests/css/css-color/rgba-003-expected.html
/LayoutTests/imported/w3c/web-platform-tests/css/css-color/rgba-003.html
/LayoutTests/imported/w3c/web-platform-tests/css/css-color/rgba-004-expected.html
/LayoutTests/imported/w3c/web-platform-tests/css/css-color/rgba-004.html
/LayoutTests/imported/w3c/web-platform-tests/css/css-color/rgba-005-expected.html
/LayoutTests/imported/w3c/web-platform-tests/css/css-color/rgba-005.html
/LayoutTests/imported/w3c/web-platform-tests/css/css-color/rgba-006-expected.html
/LayoutTests/imported/w3c/web-platform-tests/css/css-color/rgba-006.html
/LayoutTests/imported/w3c/web-platform-tests/css/css-color/rgba-007-expected.html
/LayoutTests/imported/w3c/web-platform-tests/css/css-color/rgba-007.html
/LayoutTests/imported/w3c/web-platform-tests/css/css-color/rgba-008-expected.html
/LayoutTests/imported/w3c/web-platform-tests/css/css-color/rgba-008.html
/LayoutTests/imported/w3c/web-platform-tests/css/css-color/srgb-linear-001-expected.html
/LayoutTests/imported/w3c/web-platform-tests/css/css-color/srgb-linear-001.html
/LayoutTests/imported/w3c/web-platform-tests/css/css-color/srgb-linear-002-expected.html
/LayoutTests/imported/w3c/web-platform-tests/css/css-color/srgb-linear-002.html
/LayoutTests/imported/w3c/web-platform-tests/css/css-color/srgb-linear-003-expected.html
/LayoutTests/imported/w3c/web-platform-tests/css/css-color/srgb-linear-003.html
/LayoutTests/imported/w3c/web-platform-tests/css/css-color/srgb-linear-004-expected.html
/LayoutTests/imported/w3c/web-platform-tests/css/css-color/srgb-linear-004.html
/LayoutTests/imported/w3c/web-platform-tests/css/css-color/system-color-compute.html
/LayoutTests/imported/w3c/web-platform-tests/css/css-color/t31-color-currentColor-b-expected.html
/LayoutTests/imported/w3c/web-platform-tests/css/css-color/t31-color-currentColor-b.xht
/LayoutTests/imported/w3c/web-platform-tests/css/css-color/t31-color-text-a-expected-mismatch.xht
/LayoutTests/imported/w3c/web-platform-tests/css/css-color/t31-color-text-a.xht
/LayoutTests/imported/w3c/web-platform-tests/css/css-color/t32-opacity-basic-0.0-a-expected.html
/LayoutTests/imported/w3c/web-platform-tests/css/css-color/t32-opacity-basic-0.0-a.xht
/LayoutTests/imported/w3c/web-platform-tests/css/css-color/t32-opacity-basic-0.6-a-expected.html
/LayoutTests/imported/w3c/web-platform-tests/css/css-color/t32-opacity-basic-0.6-a.xht
/LayoutTests/imported/w3c/web-platform-tests/css/css-color/t32-opacity-basic-1.0-a-expected.html
/LayoutTests/imported/w3c/web-platform-tests/css/css-color/t32-opacity-basic-1.0-a.xht
/LayoutTests/imported/w3c/web-platform-tests/css/css-color/t32-opacity-clamping-0.0-b-expected.html
/LayoutTests/imported/w3c/web-platform-tests/css/css-color/t32-opacity-clamping-0.0-b.xht
/LayoutTests/imported/w3c/web-platform-tests/css/css-color/t32-opacity-clamping-1.0-b-expected.html
/LayoutTests/imported/w3c/web-platform-tests/css/css-color/t32-opacity-clamping-1.0-b.xht
/LayoutTests/imported/w3c/web-platform-tests/css/css-color/t32-opacity-offscreen-b-expected.html
/LayoutTests/imported/w3c/web-platform-tests/css/css-color/t32-opacity-offscreen-b.xht
/LayoutTests/imported/w3c/web-platform-tests/css/css-color/t32-opacity-offscreen-multiple-boxes-1-c-expected.html
/LayoutTests/imported/w3c/web-platform-tests/css/css-color/t32-opacity-offscreen-multiple-boxes-1-c.xht
/LayoutTests/imported/w3c/web-platform-tests/css/css-color/t32-opacity-offscreen-multiple-boxes-2-c-expected.html
/LayoutTests/imported/w3c/web-platform-tests/css/css-color/t32-opacity-offscreen-multiple-boxes-2-c.xht
/LayoutTests/imported/w3c/web-platform-tests/css/css-color/t32-opacity-offscreen-with-alpha-c-expected.html
/LayoutTests/imported/w3c/web-platform-tests/css/css-color/t32-opacity-offscreen-with-alpha-c.xht
/LayoutTests/imported/w3c/web-platform-tests/css/css-color/t32-opacity-zorder-c-expected.html
/LayoutTests/imported/w3c/web-platform-tests/css/css-color/t32-opacity-zorder-c.xht
/LayoutTests/imported/w3c/web-platform-tests/css/css-color/t41-html4-keywords-a-expected.html
/LayoutTests/imported/w3c/web-platform-tests/css/css-color/t41-html4-keywords-a.xht
/LayoutTests/imported/w3c/web-platform-tests/css/css-color/t421-rgb-clip-outside-gamut-b-expected.html
/LayoutTests/imported/w3c/web-platform-tests/css/css-color/t421-rgb-clip-outside-gamut-b.xht
/LayoutTests/imported/w3c/web-platform-tests/css/css-color/t421-rgb-func-int-a-expected.html
/LayoutTests/imported/w3c/web-platform-tests/css/css-color/t421-rgb-func-int-a.xht
/LayoutTests/imported/w3c/web-platform-tests/css/css-color/t421-rgb-func-no-mixed-f-expected.html
/LayoutTests/imported/w3c/web-platform-tests/css/css-color/t421-rgb-func-no-mixed-f.xht
/LayoutTests/imported/w3c/web-platform-tests/css/css-color/t421-rgb-func-pct-a-expected.html
/LayoutTests/imported/w3c/web-platform-tests/css/css-color/t421-rgb-func-pct-a.xht
/LayoutTests/imported/w3c/web-platform-tests/css/css-color/t421-rgb-func-whitespace-b-expected.html
/LayoutTests/imported/w3c/web-platform-tests/css/css-color/t421-rgb-func-whitespace-b.xht
/LayoutTests/imported/w3c/web-platform-tests/css/css-color/t421-rgb-hex-parsing-f-expected.html
/LayoutTests/imported/w3c/web-platform-tests/css/css-color/t421-rgb-hex-parsing-f.xht
/LayoutTests/imported/w3c/web-platform-tests/css/css-color/t421-rgb-hex3-a-expected.html
/LayoutTests/imported/w3c/web-platform-tests/css/css-color/t421-rgb-hex3-a.xht
/LayoutTests/imported/w3c/web-platform-tests/css/css-color/t421-rgb-hex3-expand-b-expected.html
/LayoutTests/imported/w3c/web-platform-tests/css/css-color/t421-rgb-hex3-expand-b.xht
/LayoutTests/imported/w3c/web-platform-tests/css/css-color/t421-rgb-hex6-a-expected.html
/LayoutTests/imported/w3c/web-platform-tests/css/css-color/t421-rgb-hex6-a.xht
/LayoutTests/imported/w3c/web-platform-tests/css/css-color/t421-rgb-values-meaning-b-expected.html
/LayoutTests/imported/w3c/web-platform-tests/css/css-color/t421-rgb-values-meaning-b.xht
/LayoutTests/imported/w3c/web-platform-tests/css/css-color/t422-rgba-a0.0-a-expected.html
/LayoutTests/imported/w3c/web-platform-tests/css/css-color/t422-rgba-a0.0-a.xht
/LayoutTests/imported/w3c/web-platform-tests/css/css-color/t422-rgba-a0.6-a-expected.html
/LayoutTests/imported/w3c/web-platform-tests/css/css-color/t422-rgba-a0.6-a.xht
/LayoutTests/imported/w3c/web-platform-tests/css/css-color/t422-rgba-a1.0-a-expected.html
/LayoutTests/imported/w3c/web-platform-tests/css/css-color/t422-rgba-a1.0-a.xht
/LayoutTests/imported/w3c/web-platform-tests/css/css-color/t422-rgba-clamping-a0.0-b-expected.html
/LayoutTests/imported/w3c/web-platform-tests/css/css-color/t422-rgba-clamping-a0.0-b.xht
/LayoutTests/imported/w3c/web-platform-tests/css/css-color/t422-rgba-clamping-a1.0-b-expected.html
/LayoutTests/imported/w3c/web-platform-tests/css/css-color/t422-rgba-clamping-a1.0-b.xht
/LayoutTests/imported/w3c/web-platform-tests/css/css-color/t422-rgba-clip-outside-device-gamut-b-expected.html
/LayoutTests/imported/w3c/web-platform-tests/css/css-color/t422-rgba-clip-outside-device-gamut-b.xht
/LayoutTests/imported/w3c/web-platform-tests/css/css-color/t422-rgba-func-int-a-expected.html
/LayoutTests/imported/w3c/web-platform-tests/css/css-color/t422-rgba-func-int-a.xht
/LayoutTests/imported/w3c/web-platform-tests/css/css-color/t422-rgba-func-no-mixed-f-expected.html
/LayoutTests/imported/w3c/web-platform-tests/css/css-color/t422-rgba-func-no-mixed-f.xht
/LayoutTests/imported/w3c/web-platform-tests/css/css-color/t422-rgba-func-pct-a-expected.html
/LayoutTests/imported/w3c/web-platform-tests/css/css-color/t422-rgba-func-pct-a.xht
/LayoutTests/imported/w3c/web-platform-tests/css/css-color/t422-rgba-func-whitespace-b-expected.html
/LayoutTests/imported/w3c/web-platform-tests/css/css-color/t422-rgba-func-whitespace-b.xht
/LayoutTests/imported/w3c/web-platform-tests/css/css-color/t422-rgba-onscreen-b-expected.html
/LayoutTests/imported/w3c/web-platform-tests/css/css-color/t422-rgba-onscreen-b.xht
/LayoutTests/imported/w3c/web-platform-tests/css/css-color/t422-rgba-onscreen-multiple-boxes-c-expected.html
/LayoutTests/imported/w3c/web-platform-tests/css/css-color/t422-rgba-onscreen-multiple-boxes-c.xht
/LayoutTests/imported/w3c/web-platform-tests/css/css-color/t422-rgba-values-meaning-b-expected.html
/LayoutTests/imported/w3c/web-platform-tests/css/css-color/t422-rgba-values-meaning-b.xht
/LayoutTests/imported/w3c/web-platform-tests/css/css-color/t423-transparent-1-a-expected.html
/LayoutTests/imported/w3c/web-platform-tests/css/css-color/t423-transparent-1-a.xht
/LayoutTests/imported/w3c/web-platform-tests/css/css-color/t423-transparent-2-a-expected.html
/LayoutTests/imported/w3c/web-platform-tests/css/css-color/t423-transparent-2-a.xht
/LayoutTests/imported/w3c/web-platform-tests/css/css-color/t424-hsl-basic-a-expected.html
/LayoutTests/imported/w3c/web-platform-tests/css/css-color/t424-hsl-basic-a.xht
/LayoutTests/imported/w3c/web-platform-tests/css/css-color/t424-hsl-clip-outside-gamut-b-expected.html
/LayoutTests/imported/w3c/web-platform-tests/css/css-color/t424-hsl-clip-outside-gamut-b.xht
/LayoutTests/imported/w3c/web-platform-tests/css/css-color/t424-hsl-h-rotating-b-expected.html
/LayoutTests/imported/w3c/web-platform-tests/css/css-color/t424-hsl-h-rotating-b.xht
/LayoutTests/imported/w3c/web-platform-tests/css/css-color/t424-hsl-parsing-f-expected.html
/LayoutTests/imported/w3c/web-platform-tests/css/css-color/t424-hsl-parsing-f.xht
/LayoutTests/imported/w3c/web-platform-tests/css/css-color/t424-hsl-values-b-1-expected.html
/LayoutTests/imported/w3c/web-platform-tests/css/css-color/t424-hsl-values-b-1.html
/LayoutTests/imported/w3c/web-platform-tests/css/css-color/t424-hsl-values-b-10-expected.html
/LayoutTests/imported/w3c/web-platform-tests/css/css-color/t424-hsl-values-b-10.html
/LayoutTests/imported/w3c/web-platform-tests/css/css-color/t424-hsl-values-b-11-expected.html
/LayoutTests/imported/w3c/web-platform-tests/css/css-color/t424-hsl-values-b-11.html
/LayoutTests/imported/w3c/web-platform-tests/css/css-color/t424-hsl-values-b-12-expected.html
/LayoutTests/imported/w3c/web-platform-tests/css/css-color/t424-hsl-values-b-12.html
/LayoutTests/imported/w3c/web-platform-tests/css/css-color/t424-hsl-values-b-13-expected.html
/LayoutTests/imported/w3c/web-platform-tests/css/css-color/t424-hsl-values-b-13.html
/LayoutTests/imported/w3c/web-platform-tests/css/css-color/t424-hsl-values-b-14-expected.html
/LayoutTests/imported/w3c/web-platform-tests/css/css-color/t424-hsl-values-b-14.html
/LayoutTests/imported/w3c/web-platform-tests/css/css-color/t424-hsl-values-b-15-expected.html
/LayoutTests/imported/w3c/web-platform-tests/css/css-color/t424-hsl-values-b-15.html
/LayoutTests/imported/w3c/web-platform-tests/css/css-color/t424-hsl-values-b-2-expected.html
/LayoutTests/imported/w3c/web-platform-tests/css/css-color/t424-hsl-values-b-2.html
/LayoutTests/imported/w3c/web-platform-tests/css/css-color/t424-hsl-values-b-3-expected.html
/LayoutTests/imported/w3c/web-platform-tests/css/css-color/t424-hsl-values-b-3.html
/LayoutTests/imported/w3c/web-platform-tests/css/css-color/t424-hsl-values-b-4-expected.html
/LayoutTests/imported/w3c/web-platform-tests/css/css-color/t424-hsl-values-b-4.html
/LayoutTests/imported/w3c/web-platform-tests/css/css-color/t424-hsl-values-b-5-expected.html
/LayoutTests/imported/w3c/web-platform-tests/css/css-color/t424-hsl-values-b-5.html
/LayoutTests/imported/w3c/web-platform-tests/css/css-color/t424-hsl-values-b-6-expected.html
/LayoutTests/imported/w3c/web-platform-tests/css/css-color/t424-hsl-values-b-6.html
/LayoutTests/imported/w3c/web-platform-tests/css/css-color/t424-hsl-values-b-7-expected.html
/LayoutTests/imported/w3c/web-platform-tests/css/css-color/t424-hsl-values-b-7.html
/LayoutTests/imported/w3c/web-platform-tests/css/css-color/t424-hsl-values-b-8-expected.html
/LayoutTests/imported/w3c/web-platform-tests/css/css-color/t424-hsl-values-b-8.html
/LayoutTests/imported/w3c/web-platform-tests/css/css-color/t424-hsl-values-b-9-expected.html
/LayoutTests/imported/w3c/web-platform-tests/css/css-color/t424-hsl-values-b-9.html
/LayoutTests/imported/w3c/web-platform-tests/css/css-color/t425-hsla-basic-a-expected.html
/LayoutTests/imported/w3c/web-platform-tests/css/css-color/t425-hsla-basic-a.xht
/LayoutTests/imported/w3c/web-platform-tests/css/css-color/t425-hsla-clip-outside-device-gamut-b-expected.html
/LayoutTests/imported/w3c/web-platform-tests/css/css-color/t425-hsla-clip-outside-device-gamut-b.xht
/LayoutTests/imported/w3c/web-platform-tests/css/css-color/t425-hsla-h-rotating-b-expected.html
/LayoutTests/imported/w3c/web-platform-tests/css/css-color/t425-hsla-h-rotating-b.xht
/LayoutTests/imported/w3c/web-platform-tests/css/css-color/t425-hsla-onscreen-b-expected.html
/LayoutTests/imported/w3c/web-platform-tests/css/css-color/t425-hsla-onscreen-b.xht
/LayoutTests/imported/w3c/web-platform-tests/css/css-color/t425-hsla-onscreen-multiple-boxes-c-expected.html
/LayoutTests/imported/w3c/web-platform-tests/css/css-color/t425-hsla-onscreen-multiple-boxes-c.xht
/LayoutTests/imported/w3c/web-platform-tests/css/css-color/t425-hsla-parsing-f-expected.html
/LayoutTests/imported/w3c/web-platform-tests/css/css-color/t425-hsla-parsing-f.xht
/LayoutTests/imported/w3c/web-platform-tests/css/css-color/t425-hsla-values-b-expected.html
/LayoutTests/imported/w3c/web-platform-tests/css/css-color/t425-hsla-values-b.xht
/LayoutTests/imported/w3c/web-platform-tests/css/css-color/t43-svg-keywords-a-expected.html
/LayoutTests/imported/w3c/web-platform-tests/css/css-color/t43-svg-keywords-a.xht
/LayoutTests/imported/w3c/web-platform-tests/css/css-color/t44-currentcolor-background-b-expected.html
/LayoutTests/imported/w3c/web-platform-tests/css/css-color/t44-currentcolor-background-b.xht
/LayoutTests/imported/w3c/web-platform-tests/css/css-color/t44-currentcolor-border-b-expected.html
/LayoutTests/imported/w3c/web-platform-tests/css/css-color/t44-currentcolor-border-b.xht
/LayoutTests/imported/w3c/web-platform-tests/css/css-color/t44-currentcolor-inherited-c-expected.xht
/LayoutTests/imported/w3c/web-platform-tests/css/css-color/t44-currentcolor-inherited-c.xht
/LayoutTests/imported/w3c/web-platform-tests/css/css-color/xyz-001-expected.html
/LayoutTests/imported/w3c/web-platform-tests/css/css-color/xyz-001.html
/LayoutTests/imported/w3c/web-platform-tests/css/css-color/xyz-002-expected.html
/LayoutTests/imported/w3c/web-platform-tests/css/css-color/xyz-002.html
/LayoutTests/imported/w3c/web-platform-tests/css/css-color/xyz-003-expected.html
/LayoutTests/imported/w3c/web-platform-tests/css/css-color/xyz-003.html
/LayoutTests/imported/w3c/web-platform-tests/css/css-color/xyz-004-expected.html
/LayoutTests/imported/w3c/web-platform-tests/css/css-color/xyz-004.html
/LayoutTests/imported/w3c/web-platform-tests/css/css-color/xyz-005-expected.html
/LayoutTests/imported/w3c/web-platform-tests/css/css-color/xyz-005.html
/LayoutTests/imported/w3c/web-platform-tests/css/css-color/xyz-d50-001-expected.html
/LayoutTests/imported/w3c/web-platform-tests/css/css-color/xyz-d50-001.html
/LayoutTests/imported/w3c/web-platform-tests/css/css-color/xyz-d50-002-expected.html
/LayoutTests/imported/w3c/web-platform-tests/css/css-color/xyz-d50-002.html
/LayoutTests/imported/w3c/web-platform-tests/css/css-color/xyz-d50-003-expected.html
/LayoutTests/imported/w3c/web-platform-tests/css/css-color/xyz-d50-003.html
/LayoutTests/imported/w3c/web-platform-tests/css/css-color/xyz-d50-004-expected.html
/LayoutTests/imported/w3c/web-platform-tests/css/css-color/xyz-d50-004.html
/LayoutTests/imported/w3c/web-platform-tests/css/css-color/xyz-d50-005-expected.html
/LayoutTests/imported/w3c/web-platform-tests/css/css-color/xyz-d50-005.html
/LayoutTests/imported/w3c/web-platform-tests/css/css-color/xyz-d65-001-expected.html
/LayoutTests/imported/w3c/web-platform-tests/css/css-color/xyz-d65-001.html
/LayoutTests/imported/w3c/web-platform-tests/css/css-color/xyz-d65-002-expected.html
/LayoutTests/imported/w3c/web-platform-tests/css/css-color/xyz-d65-002.html
/LayoutTests/imported/w3c/web-platform-tests/css/css-color/xyz-d65-003-expected.html
/LayoutTests/imported/w3c/web-platform-tests/css/css-color/xyz-d65-003.html
/LayoutTests/imported/w3c/web-platform-tests/css/css-color/xyz-d65-004-expected.html
/LayoutTests/imported/w3c/web-platform-tests/css/css-color/xyz-d65-004.html
/LayoutTests/imported/w3c/web-platform-tests/css/css-color/xyz-d65-005-expected.html
/LayoutTests/imported/w3c/web-platform-tests/css/css-color/xyz-d65-005.html
