layer at (0,0) size 480x360
  RenderView at (0,0) size 480x360
layer at (0,0) size 480x360
  RenderSVGRoot {svg} at (0.50,0.50) size 479x359
    RenderSVGContainer {g} at (30,20) size 420x270
      RenderSVGContainer {switch} at (30,20) size 420x130
        RenderSVGContainer {g} at (30,20) size 420x130
          RenderPath {rect} at (30,20) size 420x130 [fill={[type=SOLID] [color=#FF0000]}] [data="M30.00,20.00 L450.00,20.00 L450.00,150.00 L30.00,150.00 Z"]
          RenderSVGText {text} at (84,100) size 312x23 contains 1 chunk(s)
            RenderSVGInlineText {#text} at (0,-18) size 312x23
              chunk 1 (middle anchor) text run 1 at (84.00,100.00) startOffset 0 endOffset 35 width 312.00: "This viewer does more than SVG Tiny"
      RenderSVGContainer {switch} at (30,160) size 420x130 [transform={m=((1.00,0.00)(0.00,1.00)) t=(0.00,140.00)}]
        RenderSVGContainer {g} at (30,160) size 420x130
          RenderPath {rect} at (30,160) size 420x130 [fill={[type=SOLID] [color=#00FF00]}] [data="M30.00,20.00 L450.00,20.00 L450.00,150.00 L30.00,150.00 Z"]
    RenderSVGText {text} at (10,340) size 264x46 contains 1 chunk(s)
      RenderSVGInlineText {#text} at (0,-36) size 264x46
        chunk 1 text run 1 at (10.00,340.00) startOffset 0 endOffset 16 width 264.00: "$Revision: 1.9 $"
    RenderPath {rect} at (0.50,0.50) size 479x359 [stroke={[type=SOLID] [color=#000000]}] [data="M1.00,1.00 L479.00,1.00 L479.00,359.00 L1.00,359.00 Z"]
