layer at (0,0) size 800x600
  RenderView at (0,0) size 800x600
layer at (0,0) size 800x120
  RenderBlock {html} at (0,0) size 800x120
    RenderBlock {body} at (8,8) size 784x104
      RenderSVGRoot {svg} at (18,18) size 100x60
        RenderSVGImage {image} at (18,18) size 100x60
      RenderText {#text} at (0,0) size 0x0
