KCanvasResource {id="filter" [type=FILTER]  [bounding box=at (-50.00%,-50.00%) size 160.00%x160.00%] [effect bounding box mode=1]}
layer at (0,0) size 800x600
  RenderView at (0,0) size 800x600
layer at (0,0) size 800x600
  RenderSVGRoot {svg} at (200,200) size 300x300
    RenderSVGHiddenContainer {defs} at (0,0) size 0x0
    RenderPath {rect} at (200,200) size 300x300 [fill={[type=SOLID] [color=#008000]}] [filter=filter] [data="M200.00,200.00 L500.00,200.00 L500.00,500.00 L200.00,500.00 Z"]
