KCanvasResource {id="over" [type=FILTER] }
KCanvasResource {id="over50" [type=FILTER] }
KCanvasResource {id="in" [type=FILTER] }
KCanvasResource {id="in50" [type=FILTER] }
KCanvasResource {id="out" [type=FILTER] }
KCanvasResource {id="out50" [type=FILTER] }
KCanvasResource {id="atop" [type=FILTER] }
KCanvasResource {id="atop50" [type=FILTER] }
KCanvasResource {id="xor" [type=FILTER] }
KCanvasResource {id="xor50" [type=FILTER] }
KCanvasResource {id="arithmetic" [type=FILTER] }
KCanvasResource {id="arithmetic50" [type=FILTER] }
layer at (0,0) size 480x360
  RenderView at (0,0) size 480x360
layer at (0,0) size 480x360
  RenderSVGRoot {svg} at (0.50,0.50) size 479x359
    RenderSVGContainer {g} at (20.20,10.20) size 439.60x289.60 [transform={m=((1.00,0.00)(0.00,1.00)) t=(15.00,-60.00)}]
      RenderSVGHiddenContainer {defs} at (0,0) size 0x0
        RenderPath {path} at (0,0) size 150x150 [fill={[type=SOLID] [color=#00FFFF]}] [data="M0.00,0.00 L150.00,0.00 L150.00,150.00 Z"]
        RenderPath {path} at (0,0) size 150x150 [fill={[type=SOLID] [color=#FF00FF]}] [data="M0.00,0.00 L0.00,150.00 L150.00,0.00 Z"]
        RenderPath {path} at (0,0) size 150x150 [fill={[type=SOLID] [color=#00FFFF] [opacity=0.50]}] [data="M0.00,0.00 L150.00,0.00 L150.00,150.00 Z"]
        RenderPath {path} at (0,0) size 150x150 [fill={[type=SOLID] [color=#FF00FF] [opacity=0.50]}] [data="M0.00,0.00 L0.00,150.00 L150.00,0.00 Z"]
      RenderSVGContainer {g} at (20.20,10.20) size 439.60x289.60 [transform={m=((0.40,0.00)(0.00,0.40)) t=(5.00,70.00)}]
        RenderPath {rect} at (20.20,10.20) size 439.60x289.60 [stroke={[type=SOLID] [color=#0000FF]}] [data="M1.00,1.00 L1099.00,1.00 L1099.00,724.00 L1.00,724.00 Z"]
        RenderSVGText {text} at (100,75) size 765x73 contains 1 chunk(s)
          RenderSVGInlineText {#text} at (0,-60) size 765x73
            chunk 1 text run 1 at (100.00,75.00) startOffset 0 endOffset 26 width 765.00: "on first Row : opacity 1.0"
        RenderSVGText {text} at (100,180) size 792x73 contains 1 chunk(s)
          RenderSVGInlineText {#text} at (0,-60) size 792x73
            chunk 1 text run 1 at (100.00,180.00) startOffset 0 endOffset 25 width 792.00: "on second row opacity 0.5"
        RenderSVGContainer {g} at (26,102) size 60x165.20 [transform={m=((1.00,0.00)(0.00,1.00)) t=(15.00,230.00)}]
          RenderPath {rect} at (26,102) size 60x60 [fill={[type=SOLID] [color=#000000]}] [filter=over] [data="M0.00,0.00 L150.00,0.00 L150.00,150.00 L0.00,150.00 Z"]
          RenderSVGText {text} at (10,400) size 134x73 contains 1 chunk(s)
            RenderSVGInlineText {#text} at (0,-60) size 134x73
              chunk 1 text run 1 at (10.00,400.00) startOffset 0 endOffset 4 width 134.00: "over"
        RenderSVGContainer {g} at (26,182) size 60x60 [transform={m=((1.00,0.00)(0.00,1.00)) t=(15.00,430.00)}]
          RenderPath {rect} at (26,182) size 60x60 [fill={[type=SOLID] [color=#000000]}] [filter=over50] [data="M0.00,0.00 L150.00,0.00 L150.00,150.00 L0.00,150.00 Z"]
        RenderSVGContainer {g} at (98,102) size 60x165.20 [transform={m=((1.00,0.00)(0.00,1.00)) t=(195.00,230.00)}]
          RenderPath {rect} at (98,102) size 60x60 [fill={[type=SOLID] [color=#000000]}] [filter=in] [data="M0.00,0.00 L150.00,0.00 L150.00,150.00 L0.00,150.00 Z"]
          RenderSVGText {text} at (10,400) size 54x73 contains 1 chunk(s)
            RenderSVGInlineText {#text} at (0,-60) size 54x73
              chunk 1 text run 1 at (10.00,400.00) startOffset 0 endOffset 2 width 54.00: "in"
        RenderSVGContainer {g} at (98,182) size 60x60 [transform={m=((1.00,0.00)(0.00,1.00)) t=(195.00,430.00)}]
          RenderPath {rect} at (98,182) size 60x60 [fill={[type=SOLID] [color=#000000]}] [filter=in50] [data="M0.00,0.00 L150.00,0.00 L150.00,150.00 L0.00,150.00 Z"]
        RenderSVGContainer {g} at (170,102) size 60x165.20 [transform={m=((1.00,0.00)(0.00,1.00)) t=(375.00,230.00)}]
          RenderPath {rect} at (170,102) size 60x60 [fill={[type=SOLID] [color=#000000]}] [filter=out] [data="M0.00,0.00 L150.00,0.00 L150.00,150.00 L0.00,150.00 Z"]
          RenderSVGText {text} at (10,400) size 98x73 contains 1 chunk(s)
            RenderSVGInlineText {#text} at (0,-60) size 98x73
              chunk 1 text run 1 at (10.00,400.00) startOffset 0 endOffset 3 width 98.00: "out"
        RenderSVGContainer {g} at (170,182) size 60x60 [transform={m=((1.00,0.00)(0.00,1.00)) t=(375.00,430.00)}]
          RenderPath {rect} at (170,182) size 60x60 [fill={[type=SOLID] [color=#000000]}] [filter=out50] [data="M0.00,0.00 L150.00,0.00 L150.00,150.00 L0.00,150.00 Z"]
        RenderSVGContainer {g} at (242,102) size 60x165.20 [transform={m=((1.00,0.00)(0.00,1.00)) t=(555.00,230.00)}]
          RenderPath {rect} at (242,102) size 60x60 [fill={[type=SOLID] [color=#000000]}] [filter=atop] [data="M0.00,0.00 L150.00,0.00 L150.00,150.00 L0.00,150.00 Z"]
          RenderSVGText {text} at (10,400) size 133x73 contains 1 chunk(s)
            RenderSVGInlineText {#text} at (0,-60) size 133x73
              chunk 1 text run 1 at (10.00,400.00) startOffset 0 endOffset 4 width 133.00: "atop"
        RenderSVGContainer {g} at (242,182) size 60x60 [transform={m=((1.00,0.00)(0.00,1.00)) t=(555.00,430.00)}]
          RenderPath {rect} at (242,182) size 60x60 [fill={[type=SOLID] [color=#000000]}] [filter=atop50] [data="M0.00,0.00 L150.00,0.00 L150.00,150.00 L0.00,150.00 Z"]
        RenderSVGContainer {g} at (314,102) size 60x165.20 [transform={m=((1.00,0.00)(0.00,1.00)) t=(735.00,230.00)}]
          RenderPath {rect} at (314,102) size 60x60 [fill={[type=SOLID] [color=#000000]}] [filter=xor] [data="M0.00,0.00 L150.00,0.00 L150.00,150.00 L0.00,150.00 Z"]
          RenderSVGText {text} at (10,400) size 98x73 contains 1 chunk(s)
            RenderSVGInlineText {#text} at (0,-60) size 98x73
              chunk 1 text run 1 at (10.00,400.00) startOffset 0 endOffset 3 width 98.00: "xor"
        RenderSVGContainer {g} at (314,182) size 60x60 [transform={m=((1.00,0.00)(0.00,1.00)) t=(735.00,430.00)}]
          RenderPath {rect} at (314,182) size 60x60 [fill={[type=SOLID] [color=#000000]}] [filter=xor50] [data="M0.00,0.00 L150.00,0.00 L150.00,150.00 L0.00,150.00 Z"]
        RenderSVGContainer {g} at (376,102) size 70x193.20 [transform={m=((1.00,0.00)(0.00,1.00)) t=(915.00,230.00)}]
          RenderPath {rect} at (386,102) size 60x60 [fill={[type=SOLID] [color=#000000]}] [filter=arithmetic] [data="M0.00,0.00 L150.00,0.00 L150.00,150.00 L0.00,150.00 Z"]
          RenderSVGText {text} at (-25,400) size 167x73 contains 1 chunk(s)
            RenderSVGInlineText {#text} at (0,-60) size 167x73
              chunk 1 text run 1 at (-25.00,400.00) startOffset 0 endOffset 6 width 167.00: "arith-"
          RenderSVGText {text} at (-25,470) size 165x73 contains 1 chunk(s)
            RenderSVGInlineText {#text} at (0,-60) size 165x73
              chunk 1 text run 1 at (-25.00,470.00) startOffset 0 endOffset 5 width 165.00: "metic"
        RenderSVGContainer {g} at (386,182) size 60x60 [transform={m=((1.00,0.00)(0.00,1.00)) t=(915.00,430.00)}]
          RenderPath {rect} at (386,182) size 60x60 [fill={[type=SOLID] [color=#000000]}] [filter=arithmetic50] [data="M0.00,0.00 L150.00,0.00 L150.00,150.00 L0.00,150.00 Z"]
    RenderSVGText {text} at (10,340) size 264x46 contains 1 chunk(s)
      RenderSVGInlineText {#text} at (0,-36) size 264x46
        chunk 1 text run 1 at (10.00,340.00) startOffset 0 endOffset 16 width 264.00: "$Revision: 1.5 $"
    RenderPath {rect} at (0.50,0.50) size 479x359 [stroke={[type=SOLID] [color=#000000]}] [data="M1.00,1.00 L479.00,1.00 L479.00,359.00 L1.00,359.00 Z"]
