GPLCVER_2.12a of 05/16/07 (Linux-elf).
Copyright (c) 1991-2007 Pragmatic C Software Corp.
  All Rights reserved.  Licensed under the GNU General Public License (GPL).
  See the 'COPYING' file for details.  NO WARRANTY provided.
Today is Wed May  7 22:49:40 2008.
Compiling source file "register8b.v"
Compiling source file "vut_register8b.v"
Highest level modules:
vut_register8b

|VUT INFO| > Load memories... 
|VUT INFO| > Init Simulation.
|VUT OK| > All the signals are right-right!

 By Rodrigo Peixoto

Halted at location **vut_register8b.v(80) time 500160 from call to $finish.
  There were 0 error(s), 0 warning(s), and 5 inform(s).
