/* XPM */
static char *bmp00169[] = {
/* columns rows colors chars-per-pixel */
"16 42 256 2",
"   c #370304",
".  c #5D1516",
"X  c #5F1617",
"o  c #5D1617",
"O  c #591516",
"+  c #5E1718",
"@  c #5D1718",
"#  c #5B1718",
"$  c #481314",
"%  c #210304",
"&  c #5E1517",
"*  c #2E0D0E",
"=  c #FCF2E6",
"-  c #FAEFE3",
";  c #FBF0E5",
":  c #FAEFE4",
">  c #F9EEE3",
",  c #FDF1E6",
"<  c #FCF0E5",
"1  c #F9EDE2",
"2  c #F8ECE1",
"3  c #FCEEE2",
"4  c #F3E6DB",
"5  c #F7EADF",
"6  c #F6E8DD",
"7  c #F9EBE0",
"8  c #F7E9DE",
"9  c #ADA8A4",
"0  c #F5E5DA",
"q  c #FDEDE2",
"w  c #FCECE1",
"e  c #F7E7DC",
"r  c #FDE9DE",
"t  c #F4E1D6",
"y  c #FEEBE0",
"u  c #FDEADF",
"i  c #F4E3D9",
"p  c #B3ACA8",
"a  c #B2ABA7",
"s  c #F2DED4",
"d  c #B5ABA6",
"f  c #FDE5DA",
"g  c #B7ACA7",
"h  c #FDE2D7",
"j  c #EED6CC",
"k  c #F0D9CF",
"l  c #FDDBCF",
"z  c #F4D7CC",
"x  c #B6ABA7",
"c  c #9B9390",
"v  c #ECD1C8",
"b  c #FED6CB",
"n  c #E9CBC2",
"m  c #FED0C5",
"M  c #E3BEB5",
"N  c #DFB5AC",
"B  c #E0B8AF",
"V  c #7C6D6A",
"C  c #827370",
"Z  c #90827F",
"A  c #857875",
"S  c #FFB9AD",
"D  c #FEBFB3",
"F  c #FAC7BD",
"G  c #DCAFA7",
"H  c #FFA295",
"J  c #FFAA9E",
"K  c #FBADA2",
"L  c #D09890",
"P  c #D8A79F",
"I  c #FF897C",
"U  c #FE968A",
"Y  c #FF9F93",
"T  c #FDA59B",
"R  c #F3A399",
"E  c #BC817A",
"W  c #CD928B",
"Q  c #D39C95",
"!  c #7B6B69",
"~  c #7F6F6D",
"^  c #1A0402",
"/  c #1C0503",
"(  c #1D0604",
")  c #FD776C",
"_  c #FF8073",
"`  c #C16058",
"'  c #F67E74",
"]  c #F6847A",
"[  c #F6887F",
"{  c #F68A80",
"}  c #C27973",
"|  c #C27B74",
" . c #C47D77",
".. c #C6807A",
"X. c #C7847E",
"o. c #C98781",
"O. c #7A211C",
"+. c #6E1D19",
"@. c #DB3C34",
"#. c #C53F38",
"$. c #B63B34",
"%. c #FF584C",
"&. c #5A1E1B",
"*. c #4C1A17",
"=. c #4A1A17",
"-. c #D84C44",
";. c #E1534B",
":. c #FB645A",
">. c #C4544D",
",. c #CA5751",
"<. c #CB5852",
"1. c #CC5953",
"2. c #D15E58",
"3. c #D6645D",
"4. c #F07269",
"5. c #B35752",
"6. c #BB6B65",
"7. c #BF726D",
"8. c #170201",
"9. c #4D0806",
"0. c #190302",
"q. c #2C0908",
"w. c #7C1B17",
"e. c #2C0A09",
"r. c #350C0B",
"t. c #8E221F",
"y. c #B02D29",
"u. c #E13E36",
"i. c #A82D29",
"p. c #B9342E",
"a. c #CC3933",
"s. c #CA3933",
"d. c #C93933",
"f. c #9B2C27",
"g. c #5B1A17",
"h. c #C23732",
"j. c #CB3B35",
"k. c #C43833",
"l. c #9D2C29",
"z. c #9F2D2A",
"x. c #DD423B",
"c. c #EE4A42",
"v. c #B83733",
"b. c #B13631",
"n. c #9F312C",
"m. c #9D302B",
"M. c #611E1B",
"N. c #A7332F",
"B. c #98302B",
"V. c #631F1C",
"C. c #CC413B",
"Z. c #942E2B",
"A. c #6B211F",
"S. c #9A312E",
"D. c #8F2F2B",
"F. c #872E2A",
"G. c #A23733",
"H. c #6C2422",
"J. c #62221F",
"K. c #B9403B",
"L. c #9E3532",
"P. c #9D3532",
"I. c #642320",
"U. c #9F3633",
"Y. c #953430",
"T. c #A03734",
"R. c #531D1B",
"E. c #612320",
"W. c #A53B37",
"Q. c #A23936",
"!. c #451917",
"~. c #A83C39",
"^. c #762B28",
"/. c #5C211F",
"(. c #AE413D",
"). c #AC3F3C",
"_. c #AC403C",
"`. c #AB3F3C",
"'. c #B0433E",
"]. c #B44540",
"[. c #AE423E",
"{. c #B74743",
"}. c #B54642",
"|. c #A9413E",
" X c #A23E3B",
".X c #602523",
"XX c #D0534D",
"oX c #BD4C47",
"OX c #481D1B",
"+X c #D45751",
"@X c #B04743",
"#X c #A84440",
"$X c #D55752",
"%X c #D65853",
"&X c #B34B47",
"*X c #512220",
"=X c #DA5F59",
"-X c #B34D49",
";X c #AD4D49",
":X c #AF4F4B",
">X c #B1524E",
",X c #1C0000",
"<X c #060000",
"1X c #260101",
"2X c #230101",
"3X c #200101",
"4X c #300202",
"5X c #360303",
"6X c #330303",
"7X c #470605",
"8X c #380404",
"9X c #370404",
"0X c #4C0706",
"qX c #4E0807",
"wX c #200303",
"eX c #240404",
"rX c #220404",
"tX c #620D0C",
"yX c #210404",
"uX c #570D0D",
"iX c #540D0D",
"pX c #4D0D0C",
"aX c #530D0D",
"sX c #821A18",
"dX c #2B0808",
"fX c #831B19",
"gX c #851C1A",
"hX c #841B1A",
"jX c #831B1A",
"kX c #5F1313",
"lX c #2D0909",
"zX c #6B1716",
"xX c #300A0A",
"cX c #681716",
"vX c #641716",
"bX c #912321",
"nX c #571514",
"mX c #882624",
"MX c #9D2C2A",
"NX c #9A2C2A",
"BX c #8B2826",
"VX c #812523",
"CX c #942B29",
"ZX c #8D2927",
"AX c #912B29",
"SX c #8E2A28",
"DX c #8F2B29",
"FX c #8C2928",
"GX c #230A0A",
"HX c #902B2A",
"JX c #952F2D",
"KX c #381111",
"LX c #9C3331",
"PX c #421616",
"IX c #461A19",
"UX c #1B0B0B",
/* pixels */
"<X1X0X9.qXqX0X9.9.9.9.9.0X0X7X2X",
",Xt.=X=X%X+X+X+X+X+X+X$X+XXXK.tX",
"4XbX3.2.1.<.,.<.<.<.,.<.,.>.`.kX",
"4XgXoX}.[.(.[.&X-X&X@X(.).W.JX. ",
"6XfX{._.~.|.6.P N G ..;XW.U.HXo ",
"9XfX{.(.|...n 1 t - s P ;XU.HX. ",
"  fX}._.:Xn ; e Q v ; 0 6.P.SX+ ",
"9XjX{.(.5.v ; t | N 7 6 ..L.DXo ",
"9XgX}.`.5.k ; s } N 2 8 o.L.DXo ",
"9XhX{.(.>Xj ; t } B 2 6 o.U.HXo ",
"  fX}._.>Xn : 2 B j : 8 o.L.DXo ",
"  sX].`.|.W 0 > 6 i : 6 X.P.SX+ ",
"8XfX}._.W.>X .L X.B 7 6 X.L.DX+ ",
"9XfX{._.:XG M B 7.B 2 e ..L.SXo ",
"  fX{._.;XM - i Q n : s 6.L.SX+ ",
"9XjX}._.|.} n 5 k 6 j P ;XL.DX. ",
"5XfX].`.W.Q.5.o.L L 6.#XQ.LXSX+ ",
"5XsX'.W.U.L.U.Q. X XT.P.P.S.FX@ ",
"6Xw.T.Z.SXZXZXZXZXZXSXSXZXBXVX# ",
"GXpXuXiXiXiXiXiXiXaXaXiXiXiXaXPX",
"9 9 Z ~ C ~ C V C ! C V C V A c ",
"<X<X8.0.^ ^ / / ( / / ^ ^ 0.8.<X",
"8.e.OXIXIX=.*.*.*.*.*.=.!.PXKXeX",
"3XxX*X*XR.&.M.V.M.V.M.&.R.OXPX* ",
"3XxX.XH.A.+.w.O.O.O.O.+.g.*.PXKX",
"% r.^.Y.N.p.>.| E E ` $.f.VXA.$ ",
"yXxX^.G.C.' F 0 k 4 z R -.b.AXO ",
"yXlXI.S.-.F < r J b , f 4.h.NXX ",
"yXlXI.n.;.m < h _ S q r ] s.MX. ",
"yXq.I.n.;.b , h _ S 3 r [ s.z.X ",
"rXq.I.n.;.b = h _ S 3 r { a.z.X ",
"yXdXJ.n.;.m < w S b , u { d.z.& ",
"yXdXJ.m.x.U f < y f < u [ s.MX& ",
"% q.J.m.@.%.I H U D w u { a.z.. ",
"% q.I.m.-.J D S ) D 3 r ] d.z.& ",
"yXq.E.B.-.D 3 f Y m < h 4.k.NXo ",
"% q.E.D.#.' m w l y l K ;.v.NXX ",
"wXq./.F.b.u.:.U T T ) c.j.b.CX+ ",
"wXlX/.^.n.h.@.x.x.x.@.a.v.N.AX. ",
"wXdXR.H.mXz.y.y.y.y.y.i.l.CXmX# ",
"UXGXKX$ nXvXzXzXzXzXzXcXvXX o IX",
"9 9 a a d d g g g g d d x x d p "
};
