/* XPM */
static char *bmp00154[] = {
/* columns rows colors chars-per-pixel */
"16 42 256 2",
"   c #FFF27B",
".  c #FFF4A9",
"X  c #FFEE88",
"o  c #FFF8D2",
"O  c #FFE352",
"+  c #FFF3BB",
"@  c #FFE573",
"#  c #FFF4C4",
"$  c #FFF5CC",
"%  c #FFD44A",
"&  c #FFD855",
"*  c #FFEAA5",
"=  c #FFF7DD",
"-  c #FFF7DE",
";  c #FFF8E1",
":  c #FFF5D9",
">  c #FFE7AE",
",  c #FFF2D2",
"<  c #FFC33A",
"1  c #FED988",
"2  c #FFF4DA",
"3  c #FFF5DF",
"4  c #FFF6E1",
"5  c #FFF7E5",
"6  c #FEBE42",
"7  c #FDC858",
"8  c #FCD179",
"9  c #FFF3DC",
"0  c #FFF4DD",
"q  c #FFF7E7",
"w  c #FEBA3F",
"e  c #FEBC45",
"r  c #FFC04A",
"t  c #FBBD4B",
"y  c #F9CD80",
"u  c #FFEDCB",
"i  c #FEB945",
"p  c #FCB748",
"a  c #EEB65C",
"s  c #ECB75D",
"d  c #F0BA5F",
"f  c #FFF5E4",
"g  c #FFF7EA",
"h  c #FFF8EC",
"j  c #EAAD54",
"k  c #E7AD53",
"l  c #EEB35A",
"z  c #F7BD68",
"x  c #F3BA66",
"c  c #FFF6E9",
"v  c #E79B39",
"b  c #F3A63D",
"n  c #FAAC41",
"m  c #EBA240",
"M  c #F7AA46",
"N  c #FBAF48",
"B  c #F6AC4B",
"V  c #EAAD5B",
"C  c #EFB05E",
"Z  c #F6B663",
"A  c #F1B461",
"S  c #F8BA66",
"D  c #281703",
"F  c #261603",
"G  c #180E02",
"H  c #472B0A",
"J  c #201405",
"K  c #462C0D",
"L  c #E89737",
"P  c #DD9137",
"I  c #E2953A",
"U  c #C07F32",
"Y  c #AB712D",
"T  c #E89A3E",
"R  c #F6A745",
"E  c #EC9E42",
"W  c #5E411F",
"Q  c #F7B055",
"!  c #E7A756",
"~  c #FDEFDE",
"^  c #FBEDDC",
"/  c #FFF4E7",
"(  c #FFF5E9",
")  c #1B0F02",
"_  c #2A1804",
"`  c #1F1203",
"'  c #563109",
"]  c #261604",
"[  c #130B02",
"{  c #1C1003",
"}  c #2D1A05",
"|  c #60370B",
" . c #844C10",
".. c #7B470F",
"X. c #301C06",
"o. c #2E1B06",
"O. c #341F07",
"+. c #885013",
"@. c #784712",
"#. c #3C2409",
"$. c #8F5516",
"%. c #1F1305",
"&. c #764714",
"*. c #965C1A",
"=. c #794915",
"-. c #442A0C",
";. c #7A4A16",
":. c #462B0D",
">. c #804E18",
",. c #7E4D18",
"<. c #432A0D",
"1. c #AB6A22",
"2. c #E28F30",
"3. c #2C1C0A",
"4. c #9F6525",
"5. c #E59436",
"6. c #A16626",
"7. c #BF7C2E",
"8. c #F09C3B",
"9. c #9C6326",
"0. c #986125",
"q. c #E59539",
"w. c #9D6427",
"e. c #996226",
"r. c #E19339",
"t. c #9B6327",
"y. c #A46A2A",
"u. c #956026",
"i. c #E6963C",
"p. c #D68C38",
"a. c #CB8535",
"s. c #C58133",
"d. c #B6752F",
"f. c #BD7B32",
"g. c #E0923C",
"h. c #DA8E3A",
"j. c #69441C",
"k. c #CE8739",
"l. c #C07D35",
"z. c #BE7C34",
"x. c #B47732",
"c. c #7E5423",
"v. c #5A3B19",
"b. c #C58138",
"n. c #714A20",
"m. c #B97A35",
"M. c #9A652C",
"N. c #DE9341",
"B. c #D48C3E",
"V. c #C7843A",
"C. c #BA7C36",
"Z. c #7B5224",
"A. c #C8843B",
"S. c #BD7E38",
"D. c #764E23",
"F. c #5C3D1B",
"G. c #513618",
"H. c #4E3417",
"J. c #CC883D",
"K. c #CC873D",
"L. c #CA863C",
"P. c #CF8A3F",
"I. c #CE893E",
"U. c #9B682F",
"Y. c #885B29",
"T. c #774F24",
"R. c #714C22",
"E. c #5D3E1C",
"W. c #DA9143",
"Q. c #D08B40",
"!. c #A97134",
"~. c #DB9244",
"^. c #94632E",
"/. c #DE9546",
"(. c #DC9345",
"). c #D79044",
"_. c #D58F43",
"`. c #D38D42",
"'. c #C3833D",
"]. c #E19748",
"[. c #D99245",
"{. c #D89145",
"}. c #C5853F",
"|. c #785126",
" X c #583B1C",
".X c #553A1B",
"XX c #DB9447",
"oX c #DA9346",
"OX c #B47A3A",
"+X c #DD9648",
"@X c #BD813E",
"#X c #E1994A",
"$X c #CC8A43",
"%X c #DE984A",
"&X c #D89348",
"*X c #906230",
"=X c #E69D4E",
"-X c #E39C4E",
";X c #E29A4D",
":X c #664623",
">X c #E9A151",
",X c #D18F48",
"<X c #EDA353",
"1X c #E79F51",
"2X c #D4924A",
"3X c #F4A958",
"4X c #DD9A52",
"5X c #D99750",
"6X c #D59550",
"7X c #DC9B55",
"8X c #DA9A54",
"9X c #E4A96A",
"0X c #DCA972",
"qX c #E5B27B",
"wX c #DEAF7B",
"eX c #E9BC8A",
"rX c #F0C494",
"tX c #F0CDA7",
"yX c #EECDA8",
"uX c #EFD1B0",
"iX c #F4DABD",
"pX c #F9E0C5",
"aX c #F5DDC2",
"sX c #FAE5CE",
"dX c #FDEDDB",
"fX c #FAEAD8",
"gX c #FFF1E2",
"hX c #FFF3E5",
"jX c #040200",
"kX c #4D2A06",
"lX c #5D3409",
"zX c #5B3309",
"xX c #261504",
"cX c #5E350A",
"vX c #251504",
"bX c #864D11",
"nX c #874E12",
"mX c #864D12",
"MX c #2D1A06",
"NX c #653B0F",
"BX c #0C0702",
"VX c #45290C",
"CX c #8A5319",
"ZX c #7E4C17",
"AX c #C8833A",
"SX c #5B3C1B",
"DX c #DA9144",
"FX c #DA944A",
"GX c #DB9851",
"HX c #DE9C56",
"JX c #DFA15F",
"KX c #F1D1AF",
"LX c #F7E2CC",
"PX c #FAE9D7",
"IX c #201103",
"UX c #080401",
/* pixels */
"G ' | | cXcXcX| | lXcXcXcXzX#.UX",
"..k d d s a a a l j s s l j 1.O.",
"$.V S Z x x z Z S C A A Z ! y.H ",
"bX].3X>X=X1XXX1X>X>X=X;X=XP.w.:.",
"+.].+X_.oX;X9XrXeXrXwXXXQ.b.e.-.",
"+.#X#X[.{.4XtXdXhXgXiXHX).P.t.-.",
"+.W.+XQ.#XJXsX( g c pX5XP.AXw.-.",
"nXB.#XQ.FXqXdX~ ( ( aXHX[.l.0.:.",
"nX~.).`.,XyX^ uXhXhXiX2X[.J.9.:.",
"+.].%X{.JXsXPXwX^ / aX6X`.V.e.:.",
"+./.<X-XqXdXsXeXgX/ aX7X{.L.t.:.",
"bX(.+XGXKX~ yXqX~ / aX6XP.A.w.:.",
"mXDX+XHXsX/ LXiX/ ( dXeX&XK.0.:.",
"bX/.>XJXsXfXhXfXg ( hXtX2XV.e.K ",
"+./.#XV.0XJX0XwX^ hXsX9X`.b.w.:.",
"bX~.<XL.`.Q.`.0XPXdXiX8XI.b.9.K ",
" .~.>XQ.`.K.I.8XwXqXqXFXb.z.0.-.",
" .B.[.).`.).XX_.$X&X2X_.I.V.e.K ",
"..s.A.f.b.b.P.b.d.l.l.z.P.l.u.<.",
"kX@.;.&.;.;.,.ZX=.&.;.=.>.&.j.3.",
"BXIXxXvXvXvXvXxXvXvXvXvXxXvX%.BX",
"UXG { { ) ) { { { { { { { ) [ jX",
"vXH..X.X XSXE.F.SXv.F. X.XG.#.G ",
"MX X:X:XR.Z.c.c.c.c.Z.R.:XW H.3.",
"X.R.*XU.y.U 7.s.s.a.7.Y M.Y.j.O.",
"#.^.'.h.m t 7 1 y 1 8 B E f.u.#.",
"O.Y.}.E i % * 2 f 0 > 7 N p.w.-.",
"o.T.m.v % O $ g h g # & n i.y.-.",
"o.R.S.b %   = ; g g # O e P 4.:.",
"X.T.x.b % . - + 5 q + % e I 6.-.",
"X.|.C.b & $ : X - q # & w q.6.-.",
"o.D.}.N @ : o X ; c # O r T y.-.",
"} n.m.R > 3 .   = c # O w i.6.-.",
"} n.m.B u 5 # + q c : X r T 6.-.",
"} T.$XQ , 0 q 3 g g q * t r.6.-.",
"o.T.}.v 8 @   X 3 c , @ i r.y.-.",
"o.D.@XP 6 % O @ 2 9 + 7 n h.6.:.",
"} R.OXp.n w < & 1 1 1 t q.a.9.-.",
"o.n.!.B.E p e i p r p M g.k.w.:.",
"_ j.M.d.h.q.R 8.2.L 5.p.N.b.t.<.",
") VXNX&.CX$.*.*.$.$.$.CXCXZXj.3.",
"jX[ ` vXD _ F _ D _ D ] ] F J BX"
};
