/* XPM */
static char *bmp00175[] = {
/* columns rows colors chars-per-pixel */
"27 14 256 2",
"   c gray100",
".  c #F9FBFB",
"X  c #F8FAFA",
"o  c #F7FAFA",
"O  c #F6F9F9",
"+  c #F5F8F8",
"@  c #F4F7F7",
"#  c #F4F6F5",
"$  c #F3F6F6",
"%  c #F3F5F4",
"&  c #F2F5F5",
"*  c #F0F2F1",
"=  c #EFF2F3",
"-  c #EEF0F0",
";  c #ECEEED",
":  c #E8EAE9",
">  c #E1E2E0",
",  c #E1E2E1",
"<  c #DFE0DE",
"1  c #DDDFDE",
"2  c #D7D8D7",
"3  c #D5D6D5",
"4  c #D4D5D5",
"5  c #D3D4D4",
"6  c #D2D3D2",
"7  c #D1D2D1",
"8  c #CFD0CF",
"9  c #CDCECD",
"0  c #8C9092",
"q  c #8C9093",
"w  c #8B8F92",
"e  c #8A8F93",
"r  c #8A8E91",
"t  c #8A8D91",
"y  c #85898E",
"u  c #858687",
"i  c #828588",
"p  c #818385",
"a  c #797B7D",
"s  c #797A7D",
"d  c gray47",
"f  c #77797B",
"g  c #77787A",
"h  c #777779",
"j  c #76787A",
"k  c #74777C",
"l  c #757678",
"z  c #747578",
"x  c #747577",
"c  c #747476",
"v  c #707478",
"b  c #737375",
"n  c #717478",
"m  c #6F7377",
"M  c #717275",
"N  c #717375",
"B  c #707377",
"V  c #6F7274",
"C  c #707275",
"Z  c #717173",
"A  c #6E7174",
"S  c #6F6F70",
"D  c #6E7073",
"F  c #6B7074",
"G  c #6D6E71",
"H  c #6C6D6F",
"J  c #6C6C6D",
"K  c #6B6D6F",
"L  c #6A6A6B",
"P  c #696B6F",
"I  c #696A6D",
"U  c #676768",
"Y  c #676769",
"T  c #66686A",
"R  c #666667",
"E  c #656669",
"W  c #63676C",
"Q  c #646568",
"!  c #646465",
"~  c #626569",
"^  c #636569",
"/  c #616569",
"(  c #636465",
")  c #626467",
"_  c #636365",
"`  c #616468",
"'  c #606468",
"]  c #626263",
"[  c #616265",
"{  c #626365",
"}  c #616264",
"|  c #5E6267",
" . c #616163",
".. c #5F6164",
"X. c #5F6063",
"o. c #5F6165",
"O. c #5E6063",
"+. c #5E5F62",
"@. c #5C6065",
"#. c #5E5E60",
"$. c #5D5E61",
"%. c #5E5F61",
"&. c #5D5E60",
"*. c #5C5C5D",
"=. c #5C5D5F",
"-. c gray36",
";. c #5B5C5E",
":. c #5A5B5D",
">. c #595A5D",
",. c #59595A",
"<. c #585A5D",
"1. c #58595C",
"2. c #565A5F",
"3. c #54595E",
"4. c #57585B",
"5. c #57585A",
"6. c #56575A",
"7. c #565656",
"8. c #555659",
"9. c #555556",
"0. c #545455",
"q. c #545456",
"w. c #535558",
"e. c #525253",
"r. c #535253",
"t. c #515356",
"y. c #515254",
"u. c #505255",
"i. c #505051",
"p. c #4F5154",
"a. c #4F4F50",
"s. c #4E5053",
"d. c #4C4D51",
"f. c #4D4D4E",
"g. c #4C4C4D",
"h. c #4B4D51",
"j. c #4B4D50",
"k. c #4B4C4F",
"l. c #4A4C50",
"z. c #4A4C4F",
"x. c #4A4C4E",
"c. c #494A4D",
"v. c #494B4F",
"b. c #494B4E",
"n. c #494B4D",
"m. c #49494A",
"M. c #484A4E",
"N. c #484A4C",
"B. c #464A4F",
"V. c #47494B",
"C. c #45484C",
"Z. c #46484C",
"A. c #46484A",
"S. c #45474B",
"D. c #44474B",
"F. c #454546",
"G. c #444648",
"H. c #43464A",
"J. c #42464A",
"K. c #434548",
"L. c #444445",
"P. c #434547",
"I. c #41454A",
"U. c #434344",
"Y. c #414348",
"T. c #414347",
"R. c #404244",
"E. c #414142",
"W. c #404246",
"Q. c #3F4145",
"!. c #3D4045",
"~. c #3E3E3F",
"^. c #3D3F42",
"/. c #3D3D3E",
"(. c #3C3E41",
"). c #3A3E43",
"_. c #3C3D3F",
"`. c #3C3C3D",
"'. c #3A3D42",
"]. c #3B3B3C",
"[. c #393C42",
"{. c #393C41",
"}. c #383B40",
"|. c #373A3F",
" X c #39393A",
".X c #383839",
"XX c #37393D",
"oX c #36393E",
"OX c #373738",
"+X c #35383C",
"@X c #363637",
"#X c #35373C",
"$X c #35373B",
"%X c #34373B",
"&X c #353537",
"*X c #33363A",
"=X c #34363A",
"-X c #333539",
";X c #343435",
":X c #33353A",
">X c #343436",
",X c #313337",
"<X c #2F3032",
"1X c #2E2F31",
"2X c #2E2E2F",
"3X c #2D2E30",
"4X c #2B2D31",
"5X c #2C2D2F",
"6X c #2C2C2D",
"7X c #2B2D30",
"8X c #2B2C2F",
"9X c #2B2C2E",
"0X c #2A2B2E",
"qX c #292A2C",
"wX c #28292B",
"eX c #282829",
"rX c #27282A",
"tX c #272728",
"yX c #26282C",
"uX c #25272A",
"iX c #232629",
"pX c #252527",
"aX c #24262A",
"sX c #242425",
"dX c #222528",
"fX c #232324",
"gX c #212427",
"hX c #222224",
"jX c #212327",
"kX c #212325",
"lX c #212123",
"zX c #1E2124",
"xX c #17181B",
"cX c #0C0D0F",
"vX c #0B0C0E",
"bX c #090A0B",
"nX c #060607",
"mX c #050506",
"MX c #010101",
"NX c black",
"BX c black",
"VX c black",
"CX c black",
"ZX c black",
"AX c black",
"SX c black",
"DX c black",
"FX c black",
"GX c black",
"HX c black",
"JX c black",
"KX c black",
"LX c black",
"PX c black",
"IX c black",
"UX c black",
/* pixels */
"6 1 8 8 8 5 5 5 5 2 2 8 8 8 2 , : - - % % * ; > > % 7 ",
"J = . . . . . + + + & & & & & & & & & & & & & & & & ! ",
"2Xq.t t t t t t t y k o.t.<.....) I I N z f f f i X.NX",
"-.R `..X.X.X].].].~.F.m.m.g.a.a.0.,.*.] U L L L d e.nX",
"6XwXH.H.H.H.H.H.H.!.%X4XyXyXyXyXyXyXyXiXiXiXiXiXiXzXcX",
"U._ j D D D D D D P ^ 1.k.8.>.6.$.Q Q H M x x g p =.NX",
"r.r.pXlXlXlXsXsXsXtX2X;X;X;X;XOXOX`.`.`.E.E.L.L.f. XbX",
"eX1X` ` ` ` ` ` @.3.B.+X,X-X-X-X-X-X-X-X-X-X-X-X-X7XbX",
"7.S { 5.:.:.:.&.&.&.&.y.g.q.5.:. . .Y Z Z c h h u #.MX",
"U./.wXwXrXrXrXrXrXrXrX5X5X5X5X5X5X5X5X5X1X1X1X1X>XqXvX",
"2X_.n n n n n n F W 2.Y.XXQ.Q.Q.S.S.M.M.M.M.M.M.h.(.mX",
"9.} 4.p.p.p.p.u.u.u.u.j.c.d.d.u.w.w.>.+.+.[ E E G 6.bX",
"8X[.[.'.'.'.'.'.'.'.{.{.{.{.{.{.{.oXoXoX*X*X:X:X:X|.yX",
"^.c.c.c.c.c.c.c.c.c.c.c.R.G.N.N.N.N.N.0XxXkXG.G.G.G.G."
};
