/* XPM */
static char *bmp00165[] = {
/* columns rows colors chars-per-pixel */
"16 42 256 2",
"   c #3D0809",
".  c #3A0A0B",
"X  c #3C0B0C",
"o  c #3B0B0C",
"O  c #3A0C0D",
"+  c #4E1314",
"@  c #7D2122",
"#  c #7E2223",
"$  c #571A1B",
"%  c #24090A",
"&  c #2F1112",
"*  c #AFADA8",
"=  c #B0ACA7",
"-  c #A8A49F",
";  c #B2AEA9",
":  c #FFF4E8",
">  c #FEF3E7",
",  c #FDF2E6",
"<  c #FCF1E5",
"1  c #FFF2E6",
"2  c #FDF1E6",
"3  c #FFF0E4",
"4  c #FBEDE2",
"5  c #FFEFE4",
"6  c #F9E9DE",
"7  c #F7E7DC",
"8  c #FFECE0",
"9  c #F6E4D9",
"0  c #F7E6DB",
"q  c #F7E1D5",
"w  c #F5E1D6",
"e  c #F4E0D5",
"r  c #FFEBE0",
"t  c #F6E3D8",
"y  c #F5E2D7",
"u  c #B7AEA9",
"i  c #FFE8DC",
"p  c #F4DED3",
"a  c #FFE9DE",
"s  c #F4DFD4",
"d  c #F7DCD0",
"f  c #FFE5D9",
"g  c #F1D8CD",
"h  c #B9AEA9",
"j  c #FFE1D5",
"k  c #FFE2D6",
"l  c #FFE3D7",
"z  c #F2DAD0",
"x  c #FFDDD1",
"c  c #B8ADA9",
"v  c #F7D4C9",
"b  c #EED1C7",
"n  c #9D918D",
"m  c #FFD5C9",
"M  c #FEDACF",
"N  c #EAC9C0",
"B  c #8D827F",
"V  c #FFD1C5",
"C  c #E0B4AB",
"Z  c #FECEC3",
"A  c #E3B9B0",
"S  c #877875",
"D  c #FFB4A7",
"F  c #FFBFB3",
"G  c #DDAEA5",
"H  c #837370",
"J  c #FF9F92",
"K  c #FFA699",
"L  c #FEACA0",
"P  c #D3978F",
"I  c #D59B93",
"U  c #D8A49C",
"Y  c #7A6B69",
"T  c #FF9488",
"R  c #CB8881",
"E  c #CF8F88",
"W  c #D1948C",
"Q  c #D0928B",
"!  c #7D6D6B",
"~  c #1B0503",
"^  c #1D0604",
"/  c #FF5B4D",
"(  c #FA6A5F",
")  c #FA776D",
"_  c #FD7D70",
"`  c #FC8478",
"'  c #C5736B",
"]  c #C5746C",
"[  c #C1726C",
"{  c #C3756F",
"}  c #C47771",
"|  c #C57973",
" . c #C8827B",
".. c #150201",
"X. c #7B221D",
"o. c #FA4B40",
"O. c #E0453D",
"+. c #63201C",
"@. c #EB4E46",
"#. c #B43C36",
"$. c #91322D",
"%. c #4E1C19",
"&. c #E4544C",
"*. c #AA3F39",
"=. c #FC6156",
"-. c #491D1A",
";. c #BF4F49",
":. c #E8625A",
">. c #562522",
",. c #DC5F58",
"<. c #F97066",
"1. c #D8635D",
"2. c #EA6F66",
"3. c #B45752",
"4. c #BA625D",
"5. c #BC6963",
"6. c #C1706A",
"7. c #390402",
"8. c #1D0201",
"9. c #4E0806",
"0. c #190302",
"q. c #771D19",
"w. c #621715",
"e. c #310C0B",
"r. c #B42F2A",
"t. c #B4302B",
"y. c #AB2E2A",
"u. c #D23B34",
"i. c #CA3932",
"p. c #E44139",
"a. c #641C19",
"s. c #691E1B",
"d. c #DE413A",
"f. c #D83F38",
"g. c #CC3D36",
"h. c #9C2C29",
"j. c #B73631",
"k. c #CE3F38",
"l. c #C33B35",
"z. c #BB3833",
"x. c #B83632",
"c. c #B63632",
"v. c #C83E38",
"b. c #B13632",
"n. c #952D2A",
"m. c #8D2C28",
"M. c #511917",
"N. c #AD3532",
"B. c #882A27",
"V. c #792623",
"C. c #C23F39",
"Z. c #A73531",
"A. c #511A18",
"S. c #4E1917",
"D. c #DE4942",
"F. c #60201D",
"G. c #491816",
"H. c #A63733",
"J. c #9A322F",
"K. c #8F302C",
"L. c #AA3A35",
"P. c #A43633",
"I. c #A23532",
"U. c #9D3431",
"Y. c #A63834",
"T. c #A53734",
"R. c #8C302C",
"E. c #9E3532",
"W. c #521C1A",
"Q. c #A13734",
"!. c #6C2623",
"~. c #A23935",
"^. c #7A2B28",
"/. c #3D1514",
"(. c #A63A37",
"). c #A43936",
"_. c #4C1B19",
"`. c #A53B37",
"'. c #842F2C",
"]. c #4A1B19",
"[. c #441917",
"{. c #AA3E3A",
"}. c #A73D39",
"|. c #A33B38",
" X c #993834",
".X c #551F1D",
"XX c #AB3F3B",
"oX c #913632",
"OX c #AC3F3C",
"+X c #A83E3B",
"@X c #A33C39",
"#X c #AD413D",
"$X c #471B19",
"%X c #B34540",
"&X c #B1443F",
"*X c #AE423E",
"=X c #AD423E",
"-X c #AD413E",
";X c #B54742",
":X c #B24641",
">X c #B34642",
",X c #AA433F",
"<X c #D3554F",
"1X c #C34E4A",
"2X c #BB4B47",
"3X c #AB4441",
"4X c #A6433F",
"5X c #DA5C56",
"6X c #D75A54",
"7X c #D95C56",
"8X c #B64C48",
"9X c #AE4945",
"0X c #CC5853",
"qX c #D05C57",
"wX c #AF4E4A",
"eX c #B0504C",
"rX c #AF504C",
"tX c #090000",
"yX c #340202",
"uX c #4D0504",
"iX c #530505",
"pX c #510505",
"aX c #400504",
"sX c #1F0202",
"dX c #530706",
"fX c #1C0202",
"gX c #580807",
"hX c #540707",
"jX c #4C0807",
"kX c #540D0C",
"lX c #530D0D",
"zX c #6B1716",
"xX c #6C1817",
"cX c #671817",
"vX c #5F1616",
"bX c #942523",
"nX c #561515",
"mX c #822121",
"MX c #832222",
"NX c #842323",
"BX c #7E2121",
"VX c #7D2121",
"CX c #792020",
"ZX c #481413",
"AX c #802222",
"SX c #8B2726",
"DX c #7D2222",
"FX c #932B29",
"GX c #8F2A28",
"HX c #902B29",
"JX c #8B2928",
"KX c #A13230",
"LX c #5D1D1C",
"PX c #9C3331",
"IX c #9D3432",
"UX c #160707",
/* pixels */
"tXaX9.9.9.9.9.9.9.9.9.9.9.jX7.tX",
"jX1X1.,.5X5X7X5X7X5X5X5X6X<XbXyX",
"gX;.1.1.qXqXqXqXqXqXqXqX0X1XJX  ",
"iXL.2X;X%X8X;X8X>X8X:X:XOX(.AXX ",
"dXY.>X#XwXW P I P I E 3.}.E.VXX ",
"dXY.;X#X4.g 4 0 0 e g 6.+XE.VXX ",
"dXP.%XXX5.t < N I E W 3.`.PX@ X ",
"hXH.%X#X6.0 6 G R  .} 3X).E.VXX ",
"dXT.%X=X} 9 , p s 6 e E +XU.# o ",
"dXY.%X*X{ w 4 p A 4 , b wXU.VXX ",
"dXP.%XOX3.Q P  .[ w , g wXU.VXX ",
"dXI.&X{.3X3.eXeX4.e , g rXPXDXX ",
"hXT.%X*X} b g C { w < z rXU.VXX ",
"dXH.%X-X{ 9 < N | y 2 z rXU.VXX ",
"dXY.%XOX4.s , w W 9 < N wXE.# X ",
"dXH.%XXX9XU s 6 z 7 b | }.IXVXX ",
"dXP.%X{.}.,X6.E U R 4.+X~.PXVXX ",
"pXI.OX(.Q.Q.|.|.4X@X~.Q.E.J.CXo ",
"uXn.J.n.GXHXHXGXGXHXGXGXGXSXCXO ",
"e.kXkXkXkXkXkXkXkXkXkXkXkXlX+ & ",
"= n S ! H ! H ! H ! H ! H Y B - ",
"tX..0.0.0.~ ~ ^ ^ ^ ~ 0.0.0...tX",
"../.-.-.]._.%.%.%.%._.].$X[.e...",
"sX-.>..X.XF.+.+.+.+.F..X%.$X/.% ",
"sXW.!.!.s.CXq.X.q.X.q.a.M.G./.% ",
"sXF.oXH.#.6.] ' 6.' 5.*.m.V.LXe.",
"sXLX XC.:.v 6 q q d v 2.v.Z.CX. ",
"8.A.$.v.( f 1 V L J J =.f.b.MXo ",
"fXA.$.g.) i 8 D ` ` _ o.p.j.MXo ",
"fXA.$.g.) f > x j a j T p.x.NX. ",
"fXA.$.g._ f 3 j F 5 > m &.x.MXo ",
"8.S.K.g.=.J K T _ l : M &.j.MX. ",
"fXS.R.i.o./ / / ( k > M &.x.MXo ",
"fXS.K.k._ m m D _ l > x &.j.mX. ",
"8.A.K.g.` i 1 V ` l , x &.j.NXo ",
"8.S.R.l.( j : j T f > Z &.c.MX. ",
"sXS.'.#.@.L l r x a m ` k.N.AX. ",
"8.S.'.L.f.o._ J L T <.O.l.Z.AXo ",
"8.S.^.J.z.u.d.d.D.d.f.l.b.KXBX. ",
"fXZX!.B.h.y.t.r.r.r.y.y.h.FXCXO ",
"UXe.ZXnXw.zXzXxXzXxXzXcXw.vX$ & ",
"* ; u u u h h c h c c u u u u = "
};
