/* XPM */
static char *bmp00160[] = {
/* columns rows colors chars-per-pixel */
"16 42 256 2",
"   c #FFF6EA",
".  c #FFF5E9",
"X  c #3C0304",
"o  c #410405",
"O  c #621314",
"+  c #5F1516",
"@  c #601617",
"#  c #5F1617",
"$  c #601517",
"%  c #5C1618",
"&  c #300D0E",
"*  c #340F10",
"=  c #FFF7EA",
"-  c #FFF6E9",
";  c #FFF4E8",
":  c #B2AEAA",
">  c #FFF2E6",
",  c #B7B1AC",
"<  c #F9EADE",
"1  c #FEF0E5",
"2  c #FFECDF",
"3  c #F9E8DC",
"4  c #FFEADD",
"5  c #F9E6DA",
"6  c #F7E1D5",
"7  c #F8E3D7",
"8  c #F9E5DA",
"9  c #F8E4D9",
"0  c #B9B0AB",
"q  c #A49D99",
"w  c #FFE7DB",
"e  c #F8E3D8",
"r  c #FFE5D9",
"t  c #F7DED2",
"y  c #FFE6DA",
"u  c #F4DCD1",
"i  c #BBB0AB",
"p  c #ABA29E",
"a  c #FFDED1",
"s  c #FFE2D6",
"d  c #F3D8CD",
"f  c #F2D7CC",
"g  c #F4DACF",
"h  c #FFDDD1",
"j  c #FFDFD3",
"k  c #FFE0D4",
"l  c #BBB0AC",
"z  c #FFD8CC",
"x  c #FFDBCF",
"c  c #EDCDC2",
"v  c #F0D3C9",
"b  c #BCB0AC",
"n  c #FCD1C6",
"m  c #897A77",
"M  c #887976",
"N  c #877976",
"B  c #8F817E",
"V  c #8E817E",
"C  c #E2B2A9",
"Z  c #C07D74",
"A  c #FFAB9F",
"S  c #BD867E",
"D  c #D69B93",
"F  c #D9A199",
"G  c #FF8072",
"H  c #FE958A",
"J  c #FFA094",
"K  c #D08D86",
"L  c #D2928A",
"P  c #1A0402",
"I  c #1C0503",
"U  c #1D0604",
"Y  c #FE796D",
"T  c #F98A80",
"R  c #C4766F",
"E  c #C67872",
"W  c #C87B74",
"Q  c #CB817B",
"!  c #6C1D19",
"~  c #7B221D",
"^  c #E0423A",
"/  c #BA3730",
"(  c #EB473E",
")  c #C23F38",
"_  c #65211D",
"`  c #E24A42",
"'  c #511E1B",
"]  c #4E1D1A",
"[  c #F35C53",
"{  c #ED5B52",
"}  c #481C19",
"|  c #F1645B",
" . c #4A1F1C",
".. c #F7685E",
"X. c #FB6B61",
"o. c #F4695F",
"O. c #F46A60",
"+. c #F76C62",
"@. c #F26A60",
"#. c #C75850",
"$. c #CE5B55",
"%. c #DF645D",
"&. c #DE635C",
"*. c #DF655E",
"=. c #D6615B",
"-. c #E26961",
";. c #D7635C",
":. c #D5615B",
">. c #D8665F",
",. c #DD6862",
"<. c #B75752",
"1. c #BD625D",
"2. c #BA605B",
"3. c #BB625D",
"4. c #BE645F",
"5. c #BF6661",
"6. c #BD6761",
"7. c #BE6862",
"8. c #BD6762",
"9. c #C5736D",
"0. c #C5756F",
"q. c #170201",
"w. c #480705",
"e. c #1A0302",
"r. c #190302",
"t. c #500907",
"y. c #7B1C19",
"u. c #300C0B",
"i. c #B5302B",
"p. c #B6302C",
"a. c #992926",
"s. c #932825",
"d. c #AC302C",
"f. c #D03D36",
"g. c #CF3D37",
"h. c #CD3D37",
"j. c #A02E2B",
"k. c #5A1B18",
"l. c #C83C36",
"z. c #A12F2C",
"x. c #9E2E2B",
"c. c #9A2E2A",
"v. c #CF3F39",
"b. c #C53C36",
"n. c #922C29",
"m. c #641F1C",
"M. c #BE3C37",
"N. c #BF3E38",
"B. c #B73B36",
"V. c #8F2D2A",
"C. c #97302D",
"Z. c #832A27",
"A. c #65211E",
"S. c #4D1917",
"D. c #D94942",
"F. c #AB3A36",
"G. c #B43E39",
"H. c #A03633",
"J. c #712624",
"K. c #AE3D38",
"L. c #A43835",
"P. c #8E322E",
"I. c #A53936",
"U. c #A03834",
"Y. c #842F2B",
"T. c #A63A37",
"R. c #852F2C",
"E. c #822E2B",
"W. c #A53A37",
"Q. c #86302D",
"!. c #602320",
"~. c #C14641",
"^. c #A63C38",
"/. c #85302D",
"(. c #7C2D2A",
"). c #5C211F",
"_. c #AA3E3A",
"`. c #AD403C",
"'. c #802F2C",
"]. c #AF423D",
"[. c #AF413D",
"{. c #B2433F",
"}. c #B2443F",
"|. c #B0423E",
" X c #B54641",
".X c #B34440",
"XX c #B1433F",
"oX c #B64742",
"OX c #B44541",
"+X c #AC423E",
"@X c #A8413D",
"#X c #4B1D1B",
"$X c #B74843",
"%X c #B54642",
"&X c #54211F",
"*X c #BB4B46",
"=X c #B74844",
"-X c #B04642",
";X c #B34945",
":X c #AE4743",
">X c #DC5F59",
",X c #BC524D",
"<X c #532422",
"1X c #310101",
"2X c #2A0101",
"3X c #3F0303",
"4X c #3C0303",
"5X c #3B0303",
"6X c #390303",
"7X c #420404",
"8X c #3F0404",
"9X c #3D0404",
"0X c #230303",
"qX c #0C0101",
"wX c #4F0807",
"eX c #510908",
"rX c #610A0A",
"tX c #540C0C",
"yX c #490B0B",
"uX c #550D0D",
"iX c #520F0F",
"pX c #3B0C0B",
"aX c #3A0B0B",
"sX c #6B1715",
"dX c #3D0D0C",
"fX c #811C1A",
"gX c #6D1816",
"hX c #831D1B",
"jX c #360C0B",
"kX c #641615",
"lX c #841D1C",
"zX c #841E1C",
"xX c #831E1C",
"cX c #681716",
"vX c #3D0E0D",
"bX c #851F1D",
"nX c #611615",
"mX c #5A1616",
"MX c #290A0A",
"NX c #8B2625",
"BX c #872524",
"VX c #471313",
"CX c #9E2F2D",
"ZX c #952B2A",
"AX c #912B29",
"SX c #9A2E2C",
"DX c #952D2B",
"FX c #932D2B",
"GX c #902B2A",
"HX c #942E2C",
"JX c #942D2C",
"KX c #932D2C",
"LX c #9A3230",
"PX c #411515",
"IX c #451919",
"UX c black",
/* pixels */
"2Xt.eXt.t.t.t.t.wXt.wXt.wXw.0XUX",
"a.,.-.*.%.%.%.%.%.&.%.&.>X~.rX1X",
"s.>.>.;.;.:.;.=.=.=.:.:.$.XXO 7X",
"bX*X*X$X=X=X,X,X,X*X$X%X|.LX$ 8X",
"bXoX.X[.-X9.C C C 9.;X`.T.DX+ 9X",
"zXoXOX;XK f > 8 > f L -XT.JX+ 9X",
"hXOXXX<.d . < F 3 . g <.I.FX@ X ",
"lXoX{.1.9   7 W u . 8 4.I.FX$ X ",
"zXOXXX5.8 - 6 0.u . 5 7.W.JX+ X ",
"bXoX.X4.7   e 0.g . 8 7.T.HX+ 4X",
"hX X}.5.9 . e E u . 8 7.I.KX+ 9X",
"fXOX|.4.9 . 9 R u ; 5 7.I.FX+ X ",
"zX X}.5.9 . 6 0.g . 8 6.I.HX$ 9X",
"xX X}.4.9 . 6 E u . e 3.W.JX# 4X",
"zX X}.<.c . 3 D 9 ; v <.I.FX+ 4X",
"hX%XXX-XQ v 1 u 1 v K :XI.HX+ 4X",
"fX.X]._._.2.L D D 8.+X_.L.FX+ 4X",
"fX]._.W.L.^.@X@X@XW.I.L.H.GX# 5X",
"y.H.C.FXFXn.n.n.n.n.n.AXAXBX% 6X",
"yXuXuXtXuXtXuXtXuXtXtXtXtXiXPXMX",
"p B M N M M N m m m m m m V q : ",
"qXr.e.e.P U I U U U P e.r.q.qXUX",
"u. . .#X] ' ' ' ' ] ] #X} PX0X2X",
"* <X&X&X).A.A._ A.A.).&X .IX& 5X",
"jX).!.m.! y.~ ~ ~ y.! k.S.PX* 6X",
"vXJ.P.z./ #.Z S Z #./ c.Z.J.VX5X",
"vX'.K.D.T n < t < n T D.B.ZXmX8X",
"dXE.B.{ z . 2 A 2 = x { b.CX+ 3X",
"dXR.N.| r   r G j   w ..g.j.$ o ",
"dXR.M.o.w   s Y a   w ..g.z.+ o ",
"dXR.) o.r = r G h = w +.g.z.+ o ",
"vXY.) o.w   r G a   w +.g.j.+ o ",
"pXY.N.@.w   y G j - w +.h.j.+ 3X",
"dXQ.N.O.y   s G h - w +.g.z.$ 8X",
"dXQ.) o.r   s G a   r ..h.j.+ 8X",
"vX/.M.{ n   4 J r   z [ l.x.$ 8X",
"dX/.G.` T z > k ; z H ` M.CX$ 8X",
"dX'.F.v.( X.J A J Y ( v.B.SX+ 8X",
"dX(.U.B.f.^ ^ ` ^ ^ f.M.F.ZX# 3X",
"aXJ.V.x.d.i.p.p.p.i.d.j.c.NX% X ",
"MXVXmXnXcXsXgXgXgXsXcXkXnX% IXMX",
": 0 0 l l i i b i b l 0 l 0 , : "
};
