/* XPM */
static char *bmp00163[] = {
/* columns rows colors chars-per-pixel */
"16 42 256 2",
"   c #300405",
".  c #300506",
"X  c #6E1A1B",
"o  c #701B1C",
"O  c #6D1A1B",
"+  c #6E1B1C",
"@  c #711C1D",
"#  c #2F0506",
"$  c #300607",
"%  c #6B1A1C",
"&  c #6D1B1D",
"*  c #4E191B",
"=  c #381213",
"-  c #B1AEA9",
";  c #FFF4E8",
":  c #FDF2E6",
">  c #FFF3E7",
",  c #FDF1E5",
"<  c #FBEDE1",
"1  c #F7EADF",
"2  c #FFEFE3",
"3  c #F9E9DD",
"4  c #FFF0E4",
"5  c #AEA9A5",
"6  c #FFEDE1",
"7  c #FAEADF",
"8  c #B6AFAA",
"9  c #F9E7DC",
"0  c #F8E6DB",
"q  c #FFEBDF",
"w  c #F6E2D7",
"e  c #F8E4D9",
"r  c #FFE8DC",
"t  c #FFE5D9",
"y  c #F2DACF",
"u  c #FFE7DC",
"i  c #F4DDD2",
"p  c #BAAFAA",
"a  c #FFE2D6",
"s  c #F6DBD0",
"d  c #B8AEAA",
"f  c #F2D5CA",
"g  c #F1D7CD",
"h  c #FFD5C8",
"j  c #FFDACE",
"k  c #ECCCC2",
"l  c #EFD2C8",
"z  c #9A8F8C",
"x  c #FFCDC1",
"c  c #FFD0C4",
"v  c #E9C5BC",
"b  c #FFC7BB",
"n  c #E2B6AD",
"m  c #E2B8AF",
"M  c #E4BCB3",
"N  c #8A7B78",
"B  c #8E7F7C",
"V  c #8D7E7B",
"C  c #8C7D7A",
"Z  c #FFB0A3",
"A  c #FFBEB2",
"S  c #E0B1A8",
"D  c #FDA99D",
"F  c #BE847C",
"G  c #FEB5AA",
"H  c #D59C94",
"J  c #DCA9A1",
"K  c #FF796B",
"L  c #FF8B7D",
"P  c #FC968B",
"I  c #CE8C85",
"U  c #D08F88",
"Y  c #D1938C",
"T  c #1C0503",
"R  c #1D0604",
"E  c #FF6E61",
"W  c #FF7B6E",
"Q  c #FB7A70",
"!  c #FB7E73",
"~  c #FE8579",
"^  c #FC8E83",
"/  c #C3756F",
"(  c #C47771",
")  c #C77D77",
"_  c #C9827B",
"`  c #CC8881",
"'  c #0F0100",
"]  c #7A1F1A",
"[  c #6D1D19",
"{  c #FF483C",
"}  c #7B221D",
"|  c #E0453D",
" . c #FC5347",
".. c #62201C",
"X. c #CF433C",
"o. c #AB3832",
"O. c #64211D",
"+. c #BC4039",
"@. c #5C201D",
"#. c #D64B44",
"$. c #E6524A",
"%. c #4E1C19",
"&. c #DF5149",
"*. c #4C1D1A",
"=. c #EA5B52",
"-. c #4A1D1A",
";. c #FC685D",
":. c #DD615A",
">. c #CC5953",
",. c #D65F58",
"<. c #D15D57",
"1. c #F77268",
"2. c #DE645D",
"3. c #D35F59",
"4. c #D25E58",
"5. c #D4605A",
"6. c #B5534E",
"7. c #D8645E",
"8. c #C3655E",
"9. c #B75D58",
"0. c #BC655F",
"q. c #BE6A65",
"w. c #C06E69",
"e. c #C1716B",
"r. c #C2726C",
"t. c #4B0806",
"y. c #180302",
"u. c #500907",
"i. c #1B0403",
"p. c #2A0605",
"a. c #290605",
"s. c #240706",
"d. c #B5302B",
"f. c #B42F2B",
"g. c #E54139",
"h. c #DC3E37",
"j. c #AA2F2B",
"k. c #D73E37",
"l. c #D43C36",
"z. c #A12E29",
"x. c #E8443C",
"c. c #E7443C",
"v. c #E0413A",
"b. c #D53E37",
"n. c #D53F39",
"m. c #CF3D37",
"M. c #CA3C36",
"N. c #972C29",
"B. c #5E1C1A",
"V. c #AC3330",
"C. c #AB3430",
"Z. c #892926",
"A. c #BF3C36",
"S. c #AA3330",
"D. c #A7322F",
"F. c #E14841",
"G. c #A93631",
"H. c #A63430",
"J. c #6A221F",
"K. c #B73B36",
"L. c #AA3732",
"P. c #A93732",
"I. c #732422",
"U. c #4E1917",
"Y. c #AD3834",
"T. c #99312E",
"R. c #A63732",
"E. c #9A322F",
"W. c #A03633",
"Q. c #9E3632",
"!. c #7A2A27",
"~. c #A23734",
"^. c #6D2523",
"/. c #692522",
"(. c #A23835",
"). c #973531",
"_. c #8D312E",
"`. c #AD3E39",
"'. c #A63A37",
"]. c #A43936",
"[. c #9A3733",
"{. c #4F1C1A",
"}. c #A73C38",
"|. c #A53A37",
" X c #AF403C",
".X c #AA3D3A",
"XX c #AA3E3A",
"oX c #6C2825",
"OX c #642422",
"+X c #B1423D",
"@X c #B0413D",
"#X c #B1423E",
"$X c #AC403C",
"%X c #B2443F",
"&X c #B2433F",
"*X c #AD413D",
"=X c #A73E3B",
"-X c #CC4F4A",
";X c #B44541",
":X c #B24440",
">X c #AE433F",
",X c #B84743",
"<X c #A7413E",
"1X c #461C1A",
"2X c #542220",
"3X c #BC4C48",
"4X c #AE4743",
"5X c #B24945",
"6X c #D95C56",
"7X c #B84E4A",
"8X c #DC5F59",
"9X c #DB5F59",
"0X c #B14C48",
"qX c #BA514D",
"wX c #B24F4B",
"eX c #1F0000",
"rX c #080000",
"tX c #030000",
"yX c #2C0201",
"uX c #210101",
"iX c #4C0706",
"pX c #4F0807",
"aX c #510908",
"sX c #680D0C",
"dX c #6C0E0D",
"fX c #6F0F0E",
"gX c #2F0606",
"hX c #270505",
"jX c #70100F",
"kX c #6F100F",
"lX c #2C0606",
"zX c #540C0C",
"xX c #2A0606",
"cX c #290606",
"vX c #220505",
"bX c #410B0A",
"nX c #791513",
"mX c #530D0D",
"MX c #741413",
"NX c #6B1715",
"BX c #6D1816",
"VX c #661716",
"CX c #5E1615",
"ZX c #731B1B",
"AX c #4F1313",
"SX c #3C100F",
"DX c #1E0808",
"FX c #902A29",
"GX c #922C2A",
"HX c #962E2C",
"JX c #9E312F",
"KX c #451615",
"LX c #9A312F",
"PX c #9B3230",
"IX c #541C1B",
"UX c #220D0D",
/* pixels */
"eXiXaXpXu.pXpXu.u.u.u.pXpXt.yXtX",
"MX,.2.:.9X8X9X8X9X8X8X9X6X-XnXuX",
"nX4.7.5.3.3.3.3.3.3.4.<.>.3XZX  ",
"jX,X3X;X;X5X7XqX7X7X;X:X*XW.o . ",
"fX&X;X*X0X` n M n I 6.XX'.PXX $ ",
"jX&X;X5XU s > e > w J wX|.E.O . ",
"fX@X#XwXv > 7 J l > 0 w.].T.X # ",
"jX#X%X6.M w g _ v : 9 ( |.PXX gX",
"jX+X&X>X9.q.e.( f > i q.].LX+ gX",
"jX#X:X$X$X4X_ l , 3 S wX|.E.+ # ",
"jX@X:X$XXX5X) v , : f 0.].PX+ # ",
"fX X#X>Xq.) ( e.l > 3 ) (.T.O gX",
"kX#X&X6.M 0 g _ v : 7 ` |.E.+ # ",
"jX+X:X6.k : 0 Y k > 7 ` |.E.X gX",
"jX#X&X0XS < < m y : 0 / ].LX+ # ",
"jX#X%X>Xr.k < w < i n 6.].E.+ $ ",
"fX X#X.X=X9.I H H e.0X}.~.T.O $ ",
"dX`.XX].~.].=X<X<X|.(.(.Q.HXO $ ",
"sXJXT.GXGXFXFXGXFXFXFXGXFXZ.% lX",
"bXzXzXzXzXzXzXmXzXzXzXzXmXmXKXUX",
"5 z B V C V C C N V N C N V z 5 ",
"rXy.y.i.i.T T R T R i.i.y.y.' tX",
"s.1X-.-.*.%.{.{.{.{.%.-.1XKXlX' ",
"cX2X2X2X@...O.O.O.O.@.IX*.1X= vX",
"lXOXoXJ.[ ] } } } } [ B.U.KX= vX",
"$ !.[.H.K.8.F F F 8.+.z.Z.I.IXhX",
"gX!.`.#.P f 1 i 1 s D &.K.JX% lX",
"p.^.P.&.b > 6 Z h ; r 1.M.D.o gX",
"a.^.P.$.A a j L b > r Q k.V.@ $ ",
"xX^.L.x.;.E K W h ; j ;.b.S.@ . ",
"p.^.o.g.{  .L h > q D  .k.C.@ . ",
"cX^.P.g.{  .~ x ; > c ;.k.V.o $ ",
"a.^.G.c.E ! W K h ; q ~ l.S.o . ",
"cX^.P.$.A t j ~ b > q ^ k.V.o . ",
"xX^.o.$.x > r P c > 6 ^ b.V.o $ ",
"xX^.R.#.G 4 2 A j > u ! m.S.o $ ",
"a./.Q.X.Q c 2 t 2 a A =.A.H.o gX",
"cX/.).A.c.;.P D D !  .n.K.JXo gX",
"hXOX_.Y.M.h.| F.F.v.l.A.o.JXo gX",
"hXB.!.N.j.f.d.d.f.f.j.z.N.FX& lX",
"DXSXAXCXVXNXBXNXBXNXNXVXCXCX* UX",
"- 8 8 d p p p p p p d p d d 8 - "
};
