/* XPM */
static char *bmp00153[] = {
/* columns rows colors chars-per-pixel */
"16 42 256 2",
"   c #FFF771",
".  c #FFF984",
"X  c #FFFA8A",
"o  c #FFEE4C",
"O  c #FFF26E",
"+  c #FFF6A9",
"@  c #FFF8C4",
"#  c #FFF6BE",
"$  c #FFF7CB",
"%  c #FFF8CC",
"&  c #FFF8D2",
"*  c #FFF8DA",
"=  c #FFF2C5",
"-  c #FFDC65",
";  c #FFDF85",
":  c #FFF7E1",
">  c #FFF8E4",
",  c #FFDA79",
"<  c #FFDD8B",
"1  c #FFEBB7",
"2  c #FFF4D8",
"3  c #FFCD58",
"4  c #FFCF67",
"5  c #FFD373",
"6  c #FFE29F",
"7  c #FFE5AC",
"8  c #FFF1D2",
"9  c #FFF7E5",
"0  c #FED47B",
"q  c #FFEECA",
"w  c #FFF4DD",
"e  c #FFF6E3",
"r  c #FFF8EA",
"t  c #FBCB78",
"y  c #FAD89D",
"u  c #FFF7E8",
"i  c #FEBA47",
"p  c #FDBB50",
"a  c #F5B44E",
"s  c #EFB75D",
"d  c #EDB55C",
"f  c #F1BA63",
"g  c #FFF7EA",
"h  c #F7AC41",
"j  c #FDB444",
"k  c #FBB44A",
"l  c #ECB057",
"z  c #FBA83D",
"x  c #FCAE42",
"c  c #E7A74F",
"v  c #EFB25F",
"b  c #F2B663",
"n  c #FBBF6B",
"m  c #FFF5E8",
"M  c #261603",
"N  c #160D02",
"B  c #1E1203",
"V  c #251604",
"C  c #231504",
"Z  c #1D1205",
"A  c #261807",
"S  c #EA9838",
"D  c #B2742B",
"F  c #FAA540",
"G  c #F0A03E",
"H  c #C48334",
"J  c #F5A643",
"K  c #805624",
"L  c #F6AA49",
"P  c #FAAC4C",
"I  c #E4A454",
"U  c #EEAE5C",
"Y  c #F7E0C5",
"T  c #FDECD8",
"R  c #FDF0E0",
"E  c #FEF2E3",
"W  c #FFF4E7",
"Q  c #281704",
"!  c #5F360A",
"~  c #5D350A",
"^  c #1C1003",
"/  c #62380B",
"(  c #5B340A",
")  c #1A0F03",
"_  c #351F07",
"`  c #422709",
"'  c #2C1A06",
"]  c #412709",
"[  c #3F2609",
"{  c #382108",
"}  c #3E2509",
"|  c #3D2509",
" . c #42280A",
".. c #8D5416",
"X. c #7A4913",
"o. c #41270A",
"O. c #45290B",
"+. c #3F260A",
"@. c #392209",
"#. c #9B5D19",
"$. c #754613",
"%. c #3D250A",
"&. c #A4621B",
"*. c #925819",
"=. c #7B4A15",
"-. c #845017",
";. c #794915",
":. c #7C4B16",
">. c #7B4B16",
",. c #965B1B",
"<. c #7D4C17",
"1. c #7F4E18",
"2. c #6C4215",
"3. c #985F22",
"4. c #E59335",
"5. c #955E23",
"6. c #935E23",
"7. c #915C22",
"8. c #905B22",
"9. c #955F24",
"0. c #925D23",
"q. c #915D24",
"w. c #D18735",
"e. c #C68132",
"r. c #8B5A23",
"t. c #D68B37",
"y. c #DE923A",
"u. c #D78C38",
"i. c #C07E32",
"p. c #D58B38",
"a. c #62401A",
"s. c #D28938",
"d. c #CB8536",
"f. c #BC7A32",
"g. c #E4963E",
"h. c #B07430",
"j. c #DF923D",
"k. c #C07E35",
"l. c #C07D35",
"z. c #D98F3D",
"x. c #7D5323",
"c. c #DB913E",
"v. c #C58138",
"b. c #C38037",
"n. c #C27F37",
"m. c #C07E36",
"M. c #472F14",
"N. c #E29541",
"B. c #CE893B",
"V. c #C68239",
"C. c #D68E3E",
"Z. c #D28B3D",
"A. c #C58239",
"S. c #CB863C",
"D. c #C9853B",
"F. c #855827",
"G. c #5C3E1B",
"H. c #AD7434",
"J. c #895B29",
"K. c #D99242",
"L. c #D38D41",
"P. c #CE8A3F",
"I. c #B37837",
"U. c #90602C",
"Y. c #8C5E2B",
"T. c #835828",
"R. c #583B1B",
"E. c #D48E42",
"W. c #BF803B",
"Q. c #8A5C2B",
"!. c #714D23",
"~. c #DC9345",
"^. c #D58F43",
"/. c #7F5628",
"(. c #DD9646",
"). c #D28D43",
"_. c #52371A",
"`. c #DB9447",
"'. c #D99246",
"]. c #D69045",
"[. c #D08D43",
"{. c #A16D34",
"}. c #E2994A",
"|. c #E19849",
" X c #DF9749",
".X c #D18D44",
"XX c #E49A4B",
"oX c #E0984A",
"OX c #CD8B44",
"+X c #E89F4E",
"@X c #E49B4D",
"#X c #E39C4D",
"$X c #E59D4E",
"%X c #E19A4E",
"&X c #DC974C",
"*X c #EBA152",
"=X c #674724",
"-X c #ECA353",
";X c #DF9A4F",
":X c #5D4021",
">X c #EDA455",
",X c #D5934C",
"<X c #DB9951",
"1X c #E49F55",
"2X c #F7B05E",
"3X c #E09F58",
"4X c #D3995A",
"5X c #DEA466",
"6X c #E3AA6C",
"7X c #E1AC72",
"8X c #F5BE82",
"9X c #E2B07A",
"0X c #E9B780",
"qX c #EABA85",
"wX c #F1C18C",
"eX c #E9BC8A",
"rX c #F3C695",
"tX c #EDC599",
"yX c #F7D2A9",
"uX c #EDCAA3",
"iX c #F2CFA9",
"pX c #EFD0AE",
"aX c #F2D6B6",
"sX c #F6DCBF",
"dX c #F9E3CA",
"fX c #FBE7D1",
"gX c #FCE9D3",
"hX c #FCECDA",
"jX c #FFF0DF",
"kX c #FDEEDD",
"lX c #FFF3E5",
"zX c #040200",
"xX c #221202",
"cX c #0F0801",
"vX c #593209",
"bX c #5F350A",
"nX c #271604",
"mX c #241404",
"MX c #090501",
"NX c #965816",
"BX c #995A17",
"VX c #935616",
"CX c #3A2209",
"ZX c #995A18",
"AX c #9C5C19",
"SX c #362009",
"DX c #784815",
"FX c #4E2F0E",
"GX c #8F5A22",
"HX c #5B3C1B",
"JX c #CD873D",
"KX c #563A1D",
"LX c #E99F51",
"PX c #D08F4A",
"IX c #D79651",
"UX c #E8B987",
/* pixels */
"xXvX/ / ! ! bX/ / ! ! ! ~ ( _ zX",
"*.d f f d s s s s d d s l c #.' ",
"&.b n n f f n n n b v v U I 3.` ",
"BX+X2X-XLXLX>X1X$X%XoX+X XJX7.o.",
"#.}.#XE.1X0XyXiXiXqXIX XL.l.q.o.",
"ZX+X>X&XrXfXu kXW T uX3X`.n.8.] ",
"#. XoX,XsXm E iXdXg kX7XL.b.7.o.",
"ZX~.}.IXaXT gXqXsXu R 9XL.f.GXo.",
"ZX|.`.).4X6X8X7XdXm gX6X'.P.7.+.",
"AX$X$X@X'.;XwXY W R uX<XJXS.8.o.",
"BX|.LX$X`.IXUXY m W Y 5XS.V.7.[ ",
"ZX}.*X&X5X7X7X7XdXu R 9XD.S.6.+.",
"NX X'.3XaXhXfXqXsXm R UXP.D.8.o.",
"NXXX}.3XY m jXrXdXm R eXJXV.7.o.",
"#.}.`.PXpXlXE pXfXm jX9Xl.l.0. .",
"ZXXX>X.X9XdXlXhXlXhXaX4Xv.A.0.o.",
"BX(.@XP.].5XtXuXuX9X3X^.V.b.7.+.",
"VXK.'.E.L.].,X,XOXOXE.^.L.JXq.o.",
"..JX^.l.S.l.D.D.f.l.v.k.JXm.r.%.",
"vXX.>.$.<.;.:.1.=.=.:.;.<.DXa.A ",
"cXxXmXmXV V C V V V mXmXmXmXZ MX",
"MX) ^ ^ ^ ^ ^ ^ ^ ^ ^ ^ ) ) cXzX",
"' _.KXR.R.G.G.G.G.HXHXR._._.@.N ",
"SX:X=X=X!.x.K K K x.!.!.=X:XM.' ",
"CX/.{.{.h.e.H e.i.e.D H.U.F.a._ ",
"O.{.'.g.a t y y y 0 a J z.f.r.| ",
"} {.+XP < 8 u w u 2 6 p L d.0.o.",
"CXY.B.L 1 r > + & g w 5 F p.5.[ ",
"@.J.C.k 1 * & . @ u : , h w.7.o.",
"CXY.C.j -   .   $ r 2 - j j.5.o.",
"@.U.(.i o o X @ 9 : + 3 z j.6.o.",
"{ Y.K.i o o X $ u u = - z y.6.o.",
"{ J.C.j - O     % g e 0 z j.5.o.",
"{ J.d.p 1 * % . # u e ; x y.6.o.",
"{ U.K.p = u : X @ r e ; x u.9. .",
"@.Q.B.L 1 u : + & g w 5 J w.5. .",
"@.Q.[.G 0 q u 2 e w 1 3 G s.5.o.",
"{ T.W.y.i 4 6 7 7 ; 3 k y.d.0.o.",
"_ /.I.c.J i p p k i x J N.Z.0. .",
"_ x.H.i.g.4.G G 4.S 4.t.C.v.GX+.",
"xXFX2.DX....,.,.VX*...-.-.1.a.A ",
"zXN B C nXQ M Q M Q M Q M V Z MX"
};
