/* XPM */
static char *bmp00151[] = {
/* columns rows colors chars-per-pixel */
"16 42 256 2",
"   c #FFF951",
".  c #FFF962",
"X  c #FFF54E",
"o  c #FFFA96",
"O  c #FFFA9A",
"+  c #FFFAA4",
"@  c #FFEB46",
"#  c #FFEC4B",
"$  c #FFEE4F",
"%  c #FFF494",
"&  c #FFF6A1",
"*  c #FFF8B1",
"=  c #FFEB4A",
"-  c #FFE94E",
";  c #FFEC52",
":  c #FFF18E",
">  c #FFE546",
",  c #FFF6C3",
"<  c #FFE97C",
"1  c #FFEE9F",
"2  c #FFDC52",
"3  c #FFDF6C",
"4  c #FFD548",
"5  c #FFE38C",
"6  c #FFF8E2",
"7  c #FFF9E5",
"8  c #FFCE49",
"9  c #FFD971",
"0  c #FFE494",
"q  c #FFF5D9",
"w  c #FFF9E8",
"e  c #FFCA44",
"r  c #FFC844",
"t  c #FDC845",
"y  c #FECA46",
"u  c #FDCA46",
"i  c #FFF9EA",
"p  c #FFC542",
"a  c #FEC647",
"s  c #FFF9EC",
"d  c #FEC44B",
"f  c #F0C266",
"g  c #FEBC42",
"h  c #FEBC4A",
"j  c #FCC865",
"k  c #EEBB60",
"l  c #FCCF80",
"z  c #FEB53E",
"x  c #FBB545",
"c  c #EEB85D",
"v  c #0A0600",
"b  c #F6AB3E",
"n  c #EEB45A",
"m  c #F0B662",
"M  c #FABF6A",
"N  c #F6BE69",
"B  c #FAC16C",
"V  c #FEC670",
"C  c #FFF5E6",
"Z  c #FFF6E9",
"A  c #FFF7EB",
"S  c #FDB14A",
"D  c #D99741",
"F  c #EFB15E",
"G  c #F8B965",
"H  c #FEF1E0",
"J  c #271703",
"K  c #251604",
"L  c #231504",
"P  c #2A1905",
"I  c #2B1A06",
"U  c #C3802F",
"Y  c #F6A13D",
"T  c #FBA740",
"R  c #F09E3D",
"E  c #D08935",
"W  c #CB8734",
"Q  c #F3A13F",
"!  c #DE933A",
"~  c #E89C3F",
"^  c #7B5324",
"/  c #F1A347",
"(  c #D39346",
")  c #F7DFC2",
"_  c #FCEBD7",
"`  c #FFF3E4",
"'  c #FEF2E3",
"]  c #361E04",
"[  c #291703",
"{  c #1B0F02",
"}  c #3E2305",
"|  c #190E02",
" . c #221303",
".. c #553008",
"X. c #482907",
"o. c #462807",
"O. c #452707",
"+. c #5F360A",
"@. c #432607",
"#. c #1C1003",
"$. c #60370B",
"%. c #291805",
"&. c #271705",
"*. c #2D1B06",
"=. c #160D03",
"-. c #2A1906",
";. c #905618",
":. c #784814",
">. c #945A19",
",. c #804D16",
"<. c #7B4B16",
"1. c #744715",
"2. c #472C0E",
"3. c #573612",
"4. c #774A19",
"5. c #4C2F10",
"6. c #4A2E10",
"7. c #DE8E31",
"8. c #7B4D1B",
"9. c #E59233",
"0. c #7D4F1C",
"q. c #794C1B",
"w. c #784B1B",
"e. c #7B4D1C",
"r. c #B8742B",
"t. c #784C1C",
"y. c #4D3112",
"u. c #70471B",
"i. c #3E280F",
"p. c #AF722C",
"a. c #774D1E",
"s. c #C88133",
"d. c #CA8335",
"f. c #C27E33",
"g. c #BD7A32",
"h. c #B77630",
"j. c #533616",
"k. c #E9983E",
"l. c #E3963D",
"z. c #D58B39",
"x. c #CE8637",
"c. c #C58135",
"v. c #B87731",
"b. c #BB7A33",
"n. c #D28A3A",
"m. c #CF8939",
"M. c #CF8739",
"N. c #BC7B34",
"B. c #ED9E42",
"V. c #BD7C35",
"C. c #B77A34",
"Z. c #D78F3E",
"A. c #C78339",
"S. c #845826",
"D. c #E69A43",
"F. c #DE9341",
"G. c #D28B3D",
"H. c #C7833A",
"J. c #C58239",
"K. c #BD7D37",
"L. c #805625",
"P. c #5D3E1B",
"I. c #CB863C",
"U. c #C9853B",
"Y. c #A66F31",
"T. c #98662D",
"R. c #704B21",
"E. c #CD883D",
"W. c #CC873D",
"Q. c #9D682F",
"!. c #94632C",
"~. c #D08A3F",
"^. c #CF8A3F",
"/. c #CE893E",
"(. c #5D3F1C",
"). c #593C1B",
"_. c #D48D41",
"`. c #D38D41",
"'. c #D18B40",
"]. c #9F6B31",
"[. c #D48E42",
"{. c #D79044",
"}. c #D69043",
"|. c #D68F43",
" X c #D89145",
".X c #AF7638",
"XX c #553A1B",
"oX c #DC9447",
"OX c #DB9447",
"+X c #DA9346",
"@X c #D99246",
"#X c #B3793A",
"$X c #956530",
"%X c #5A3D1D",
"&X c #DF9749",
"*X c #DC9548",
"=X c #E2994B",
"-X c #E0984A",
";X c #D28E45",
":X c #DA9449",
">X c #D59147",
",X c #875C2D",
"<X c #E69D4E",
"1X c #E49C4D",
"2X c #E49B4D",
"3X c #E29A4C",
"4X c #E99F50",
"5X c #E79E4F",
"6X c #E59C4E",
"7X c #D69249",
"8X c #EBA151",
"9X c #6B4A25",
"0X c #DA964C",
"qX c #ECA353",
"wX c #DC984E",
"eX c #EEA555",
"rX c #E39E51",
"tX c #E19B50",
"yX c #E8A154",
"uX c #F4AA59",
"iX c #634524",
"pX c #DE9B52",
"aX c #DDA05E",
"sX c #E5AB6C",
"dX c #EAB77E",
"fX c #EABD8C",
"gX c #F0C495",
"hX c #F2C89A",
"jX c #F2CCA2",
"kX c #EDC89F",
"lX c #F4D1AB",
"zX c #020100",
"xX c #0F0801",
"cX c #1C0F02",
"vX c #261504",
"bX c #77440E",
"nX c #693C0D",
"mX c #855018",
"MX c #7E4C17",
"NX c #7C4B17",
"BX c #A5641F",
"VX c #7E4D19",
"CX c #AE6B24",
"ZX c #B26E26",
"AX c #B57027",
"SX c #B57028",
"DX c #B77229",
"FX c #B67129",
"GX c #B6722A",
"HX c #5E3B16",
"JX c #B47430",
"KX c #BF7C35",
"LX c #8D5E2C",
"PX c #CE8A42",
"IX c #583B1D",
"UX c #251404",
/* pixels */
"] $.$.$.+.+.$.$.+.$.+.$.+... .zX",
"U f k c c c k c c k n n n D bX| ",
"f.B V M M m M M M N F G F ( VX[ ",
"AXeXrXqXqX*XqXuXeX4X&XqX4XN.w.%.",
"FX4X X{.&X|.=XsXfXsX[.+X[.N.t.P ",
"DX8X&X+X*XpXdX) H kXrX&XI.V.4.P ",
"AX-X[.7XdX) ' A A kXPX'._.KXw.%.",
"ZX-X}.0XfX) ` A Z jX:X}./.N.q.P ",
"r.<X2X[.wXaXlXC Z lXtX6XOXJ.q.P ",
"SX-X+XoX5XrXgX' Z jX>X@XW.V.w.P ",
"AX<X1X-X{.pXhX` Z jX;XOX~.b.8.P ",
"SXeXuX-XOXpXfXH Z kX7X[./.V.e.P ",
"SX=X X+X|.wXgXH Z kX>X[.A.h.q.-.",
"ZX&X+X&X-XrXhX` Z jX;X{.H.h.w.P ",
"r.=X2X=X4X0XfXH Z jXtX`./.V.0.I ",
"GX<X&XOX2XpXhX_ C jXyX+X/.b.q.%.",
"CX=X=X~./.OXsXdXgXsX:X3X[.b.q.%.",
"CX+X[._.~.{.*X7X^.^.E.|.'.h.t.%.",
"BX'.~.H.U.I.'.W.V.h.A.J.A.JXa.&.",
"nXMX<.:.<.<.MXVX:.:.NX:.<.4.j.| ",
"=. .L K vXvXUXK UXvXUXK UX .=.zX",
"xX{ cX#.#.#.#.#.#.#.#.{ { | v zX",
"i.IXXXIX%XP.(.P.(.P.).XXXXy.*. .",
"i.iX9X9X^ L.L.S.L.L.R.9XiX%Xi.} ",
"5.,X!.Y.C.U W E d.U p.Y.$X^ j.} ",
"HX#XG.~ x g a j l j b B.n.v.u.@.",
"3..XD.x 8 2 < , 6 1 2 h l.c.4.O.",
"5.].! h < , 6 s i 1 4 g Q d.8.O.",
"5.Q.! d : , w s i + # p Y s.8.o.",
"y.].k.p $ . * w i + $ 4 T n.8.o.",
"y.Q.l.u X   O 6 w + @ y Y x.8.o.",
"6.].B.8 @   O 7 i & > y Q d.8.X.",
"2.]./ r @   % 6 i & = e S m.8.X.",
"6.T.! t @ X o 6 i & = r Q s.e.o.",
"2.!.! t @ X O 7 i & > p R d.8.X.",
"6.T.D.a # X % 6 i + - g Q d.0.X.",
"5.Q.Z.x 2 ; % q C & 2 x B.c.e.o.",
"2.$X^.R z 4 3 5 0 9 d S D.f.q.O.",
"2.LXK.l.T g h h z x Y B.F.g.q.O.",
"2.LXC.M.k.R Q R 9.7.l.z.M.v.a.@.",
"*.3.1.,.;.>.>.>.;.;.;.mXmXVXj.J ",
"v {  .K J %.J %.J [ J J K L =.zX"
};
