/* XPM */
static char *bmp00130[] = {
/* columns rows colors chars-per-pixel */
"20 38 23 1",
"  c #FFAD00",
". c gray61",
"X c gray55",
"o c #847B7B",
"O c #7B7B7B",
"+ c #635A5A",
"@ c gray29",
"# c #4A4242",
"$ c gray26",
"% c #42423A",
"& c #423A3A",
"* c #3A3A3A",
"= c #3A3A31",
"- c #3A3131",
"; c #313131",
": c #312929",
"> c gray16",
", c #292121",
"< c gray13",
"1 c #211919",
"2 c #191919",
"3 c #191910",
"4 c #101010",
/* pixels */
"@#****************;:",
";*X.oooOOOOOOOOO+;><",
";;#@$$$$$$$$$$$$*><<",
";;***************><<",
";;***************><<",
"-;******&*******=><<",
";;-*******=--*-=;><<",
"::;*-------;;;;;;,<<",
">>;-;;;;;;;;;;;;;<11",
">>;;;;;;;;;;;;;;;<22",
">>;;;;;;;;;;;;;;:<22",
"<,:;>>>>>>>>>>>>><22",
"<<>;>>>>>>>>>>>>><22",
",<>:>>>>:>>>>>>>:<22",
"<<>:>>>>>>>>>>>>><22",
"<<>>>>>>>>>>>>>>><22",
"<<<22222222222222222",
"<<244444444444444422",
"<2344444444444444322",
"@#               *;:",
";*X.oooOOOOOOOOO+;><",
"-;#@$$$$#$$$$$$$&><<",
";;***************><<",
";;***************><<",
";;**************-><<",
";;-*******=--*-=;><<",
"::;*-------;;;;;;,<<",
">>;-;;;;;;;;;;;;;<11",
">>;;;;;;;;;;;;;;;<22",
":>;;;;;;-;;;;;;;><22",
"<,:;>>>>>>>>>>>>><22",
"<<>;>>>>>>>>>>>>><22",
"<<>:>>>>>>>>>>>>><22",
"<<>:>>>>>>>>>>>>><22",
"<<>>>>>>>>>>>>>>><22",
"<<<22222222222222222",
"<<244444444444444422",
",2344444344444443322"
};
