/* XPM */
static char *bmp00155[] = {
/* columns rows colors chars-per-pixel */
"16 42 256 2",
"   c #FFF769",
".  c #FFF155",
"X  c #FFF579",
"o  c #FFF691",
"O  c #FFF5A6",
"+  c #FFF3B5",
"@  c #FFE787",
"#  c #FFF5CA",
"$  c #FFF7D7",
"%  c #FFF5D0",
"&  c #FFF6D8",
"*  c #FFF6DA",
"=  c #FECF49",
"-  c #FED867",
";  c #FFF5D8",
":  c #FED776",
">  c #FFF2D3",
",  c #FFF6DF",
"<  c #FED171",
"1  c #FFD67E",
"2  c #FFE3A4",
"3  c #FFE8B3",
"4  c #FFF2D5",
"5  c #FFF4DA",
"6  c #FFC552",
"7  c #FEC85D",
"8  c #FED788",
"9  c #FFEECC",
"0  c #FFF4DD",
"q  c #FEBD45",
"w  c #FCC054",
"e  c #EFBC61",
"r  c #FFEFD2",
"t  c #FFF5E3",
"y  c #FEBD4E",
"u  c #ECB55D",
"i  c #FDB244",
"p  c #F9B24D",
"a  c #E1A54C",
"s  c #EAAE55",
"d  c #EDB057",
"f  c #EBB158",
"g  c #F2BA66",
"h  c #F9CA81",
"j  c #FFF6E9",
"k  c #F6A944",
"l  c #FEBB5F",
"z  c #F8B864",
"x  c #F3B663",
"c  c #F7BB68",
"v  c #FFF5E7",
"b  c #FFF6EA",
"n  c #291803",
"m  c #221403",
"M  c #53330D",
"N  c #4E310F",
"B  c #2D1D09",
"V  c #4E3211",
"C  c #ED9C3A",
"Z  c #E59739",
"A  c #E19439",
"S  c #EB9C3D",
"D  c #EF9F3F",
"F  c #F3A241",
"G  c #734E22",
"H  c #E3A353",
"J  c #ECAD5C",
"K  c #FAEAD7",
"L  c #291703",
"P  c #432505",
"I  c #271603",
"U  c #2A1804",
"Y  c #150C02",
"T  c #281704",
"R  c #1E1103",
"E  c #5D350A",
"W  c #2F1B05",
"Q  c #1C1003",
"!  c #73420D",
"~  c #63390B",
"^  c #76440E",
"/  c #291805",
"(  c #201304",
")  c #0F0902",
"_  c #211405",
"`  c #8D5517",
"'  c #764713",
"]  c #945A19",
"[  c #7A4A15",
"{  c #784915",
"}  c #7C4B16",
"|  c #7B4B16",
" . c #5E3911",
".. c #7D4C17",
"X. c #523310",
"o. c #503210",
"O. c #4F3110",
"+. c #432A0E",
"@. c #4D3111",
"#. c #B87629",
"$. c #EA9636",
"%. c #38240D",
"&. c #DC8E34",
"*. c #E49437",
"=. c #AE6F2A",
"-. c #AB6D29",
";. c #71481B",
":. c #ED9A3A",
">. c #C17D30",
",. c #BE7C2F",
"<. c #A46929",
"1. c #A36829",
"2. c #9F6628",
"3. c #D08635",
"4. c #C68133",
"5. c #A76C2B",
"6. c #A3692A",
"7. c #5C3C18",
"8. c #BA7831",
"9. c #AE722E",
"0. c #A76C2C",
"q. c #CB8536",
"w. c #EF9E41",
"e. c #D98F3B",
"r. c #D28A39",
"t. c #BB7C33",
"y. c #B27530",
"u. c #C07D35",
"i. c #BD7B34",
"p. c #A36C2D",
"a. c #6A451D",
"s. c #62401B",
"d. c #E1963F",
"f. c #96632A",
"g. c #7E5423",
"h. c #E59841",
"j. c #CE873A",
"k. c #8A5B27",
"l. c #7F5524",
"z. c #63411C",
"x. c #DC913F",
"c. c #C68239",
"v. c #5A3C1A",
"b. c #D28A3D",
"n. c #67441E",
"m. c #64421D",
"M. c #593B1A",
"N. c #4C3216",
"B. c #EB9E45",
"V. c #C9853B",
"C. c #513618",
"Z. c #4E3417",
"A. c #D78E40",
"S. c #D48C3F",
"D. c #CC873D",
"F. c #CA863C",
"G. c #AD7334",
"H. c #785024",
"J. c #6E4A21",
"K. c #D88F41",
"L. c #D08B3F",
"P. c #CE893E",
"I. c #B37836",
"U. c #5C3E1C",
"Y. c #DA9143",
"T. c #D08B40",
"R. c #9C6930",
"E. c #DD9445",
"W. c #D28D41",
"Q. c #D48E43",
"!. c #D28D42",
"~. c #583B1C",
"^. c #DC9447",
"/. c #D99246",
"(. c #D79145",
"). c #D48F44",
"_. c #C3843F",
"`. c #BB7E3C",
"'. c #DE9648",
"]. c #8D602E",
"[. c #DF974A",
"{. c #DD9649",
"}. c #DC9549",
"|. c #D79247",
" X c #D49046",
".X c #5E401F",
"XX c #E1994B",
"oX c #DD974A",
"OX c #B67D3D",
"+X c #D89349",
"@X c #E69D4F",
"#X c #E29B4E",
"$X c #DB974C",
"%X c #D8944B",
"&X c #CD8D47",
"*X c #EAA152",
"=X c #DC974D",
"-X c #EDA354",
";X c #EDA556",
":X c #D3924C",
">X c #D59753",
",X c #DB9B56",
"<X c #DE9E59",
"1X c #E1A25D",
"2X c #E3A562",
"3X c #DDA364",
"4X c #E1AC72",
"5X c #E8B782",
"6X c #EAB984",
"7X c #E7BA89",
"8X c #EBBF90",
"9X c #F1C799",
"0X c #EAC399",
"qX c #EDCAA3",
"wX c #EDD2B4",
"eX c #F6E0C7",
"rX c #F8E3CB",
"tX c #F9E6D0",
"yX c #FAE8D3",
"uX c #FEEEDC",
"iX c #FCECDA",
"pX c #FEEFDE",
"aX c #FDEEDD",
"sX c #FDEEDE",
"dX c #FDF0E1",
"fX c #FFF3E6",
"gX c #FFF4E8",
"hX c #040200",
"jX c #1C0F02",
"kX c #4F2C07",
"lX c #6D3D0A",
"zX c #5D3409",
"xX c #5C3309",
"cX c #5B3309",
"vX c #73410C",
"bX c #271604",
"nX c #5E350A",
"mX c #251504",
"MX c #74420D",
"NX c #090501",
"BX c #60360B",
"VX c #7C470F",
"CX c #74420E",
"ZX c #834E17",
"AX c #7A4915",
"SX c #D2893C",
"DX c #DC9244",
"FX c #55391C",
"GX c #654523",
"HX c #E6B179",
"JX c #DBA975",
"KX c #F0CEAB",
"LX c #FDEBD8",
"PX c #FBEAD9",
"IX c #FDEDDD",
"UX c #261505",
/* pixels */
") kX~ BXnXBXnXE nXxXzXnXE cXP ) ",
"BXa e e u d u f d s u u f s #.P ",
"VXH c J u J c x z x g x J H y.M ",
"vXA.*X^.'.|.oXoX*X;X*X[.'.D.<.X.",
"MXDXXXL.:X7X7X8X8X9X7X,X).c.6.N ",
"! E.@X(.3XtXfXpXsXiXtX4X+XT.6.o.",
"MXK.#XF.HXuXv rXqX0XqX2X!.T.0.o.",
"MXb.XXD.4XaXdXKX6XHX4X=X/.c.2.o.",
"CXK.!.!.4XiXgXyXLXsXyX7X X(.0.o.",
"^ Y.}.Q.HXiXfXK wXfXgXrX>Xc.2.o.",
"MXSX@X#X2X9XqX7XJXK gXtX<XD.6.o.",
"vXb.XX/.%X2X,X<X3XK gXyX1Xc.<.o.",
"! S.{.oXHXrXrXKX4XPXgXtX1Xc.2.X.",
"! A.-X}.5XIXv eXHXPXfXyX<XD.<.o.",
"MXA.@XV.3XK gXK 8XIXv eX,XP.5.X.",
"! A.;XL.,XqXPXdXyXdXrX5X+XF.6.o.",
"vXb.*XW.W.&XJX0XKX0X4X#XV.u.2.o.",
"vXj.(.Q.D.V.$X$X&X%X|.^.L.u.2.o.",
"lX>.V.i.8.u.(.!.i.8.u.u.P.i.2.V ",
"P ' [ AX' | ..} { ' { [ ..{ a.%.",
"NXjXUXmXmXmXUXmXUXmXmXmXmXmX( ) ",
"hXY Q Q Q Q jXQ Q Q jXQ Q Q Y hX",
"R N.FXFX~.M.v.v.v.v.U.v.FXC.+.Q ",
"T FXGXGXJ.G l.l.g.g.g.G GX.XZ.B ",
"U a.].R.p.t.>.q.4.q.,.9.f.k.J.%.",
"W k._.e.B.h h 8 h 8 h p d.c.2.+.",
"U H._.B.l 9 t , , 5 r < p h.5.N ",
"T a.I.A < 0 j % + O O - i w.9.O.",
"T z.I.Z : 0 t O X X   . q A -.N ",
"T n.9.:.< 0 j % $ , % @ q *.=.O.",
"/ n.G.S : 0 v ; + v j 9 w *.-.N ",
"L z.I.F - O O o X ; b > 7 S -.N ",
"I s.G.C =   . .   & j 4 7 Z -.N ",
"T m.G.F : # # O X * j > 7 Z -.O.",
"bXm.`.F 1 0 v # X * v 4 7 S =.N ",
"T n.`.*.- 5 j ; O , j 9 7 w.=.o.",
"T n.OXe.w 2 0 t * t r 8 p d.-.N ",
"bXz.G.r.k q 1 2 3 2 : 6 D r.<.N ",
"T s.R.D.w.i y y y y y p h.q.1.N ",
"mX7.k.9.3.&.k k $.&.*.&.x.4.1.@.",
"Y %. .' ZX` ] ] ` ` ` ` ` ZX;.%.",
"hX) R m T L U L U U n T T I _ ) "
};
