/* XPM */
static char *bmp00158[] = {
/* columns rows colors chars-per-pixel */
"16 42 256 2",
"   c #FFF373",
".  c #FFF38B",
"X  c #FFF595",
"o  c #FFF4CD",
"O  c #FFEAAA",
"+  c #FFF5D6",
"@  c #FED35E",
"#  c #FFCD4B",
"$  c #FFEFC5",
"%  c #FFF4D9",
"&  c #FFF1D3",
"*  c #FFC85C",
"=  c #FFCD68",
"-  c #FFD57C",
";  c #FFDC96",
":  c #FFF3DC",
">  c #FEBC47",
",  c #FEBF52",
"<  c #EDBB61",
"1  c #FFF0D4",
"2  c #FFF1D8",
"3  c #FFF4DF",
"4  c #EAB25A",
"5  c #FAC772",
"6  c #FFEBCA",
"7  c #FFEFD6",
"8  c #FFF4E2",
"9  c #FEB544",
"0  c #F7B149",
"q  c #FEB84D",
"w  c #FBB64F",
"e  c #F7B452",
"r  c #FBBC5B",
"t  c #EBB057",
"y  c #F9C069",
"u  c #FAD193",
"i  c #FFF4E3",
"p  c #FDAE43",
"a  c #F3A640",
"s  c #F2AA4B",
"d  c #EAAA52",
"f  c #E9AC56",
"g  c #EBAD5B",
"h  c #F2B360",
"j  c #F6B663",
"k  c #261603",
"l  c #231503",
"z  c #291804",
"x  c #251604",
"c  c #231504",
"v  c #180F04",
"b  c #E99734",
"n  c #BC7B2C",
"m  c #F8A23B",
"M  c #F19D3A",
"N  c #F4A23D",
"B  c #C68334",
"V  c #7B5222",
"C  c #F6A946",
"Z  c #6C491F",
"A  c #EFAF5D",
"S  c #F9E8D4",
"D  c #F7E6D2",
"F  c #FAECDB",
"G  c #F9EBDA",
"H  c #FFF4E7",
"J  c #FDF2E5",
"K  c #FDF3E7",
"L  c #160C01",
"P  c #1E1102",
"I  c #1B0F02",
"U  c #190E02",
"Y  c #492906",
"T  c #472806",
"R  c #452706",
"E  c #553008",
"W  c #4A2A07",
"Q  c #2A1804",
"!  c #5C3409",
"~  c #261604",
"^  c #77440D",
"/  c #5D350A",
"(  c #1C1003",
")  c #2D1A05",
"_  c #6A3F11",
"`  c #754714",
"'  c #915819",
"]  c #774815",
"[  c #855118",
"{  c #7A4A16",
"}  c #7C4C17",
"|  c #B36F25",
" . c #B16D24",
".. c #754818",
"X. c #42290E",
"o. c #E49032",
"O. c #DF8E31",
"+. c #7B4D1B",
"@. c #754A1A",
"#. c #784B1B",
"$. c #784C1B",
"%. c #432A0F",
"&. c #3E270E",
"*. c #AB6D27",
"=. c #7A4D1C",
"-. c #774B1B",
";. c #774C1C",
":. c #E99738",
">. c #C57E30",
",. c #C27E2F",
"<. c #4A2F12",
"1. c #754B1D",
"2. c #CA8233",
"3. c #C68032",
"4. c #C58032",
"5. c #EC9A3C",
"6. c #C27D32",
"7. c #AF712D",
"8. c #E3943B",
"9. c #D18736",
"0. c #B5752F",
"q. c #B2732E",
"w. c #D18837",
"e. c #CE8636",
"r. c #CA8435",
"t. c #B1752F",
"y. c #C37F34",
"u. c #C07C33",
"i. c #BB7932",
"p. c #B47530",
"a. c #B37430",
"s. c #B77732",
"d. c #B57631",
"f. c #D58D3B",
"g. c #B97933",
"h. c #7C5222",
"j. c #E59740",
"k. c #CF8A3A",
"l. c #BF7D35",
"z. c #593B19",
"x. c #523617",
"c. c #C38037",
"v. c #C27F37",
"b. c #BC7B35",
"n. c #A56D2F",
"m. c #D9913E",
"M. c #C68239",
"N. c #B47734",
"B. c #5A3C1A",
"V. c #C58239",
"C. c #825626",
"Z. c #C9853B",
"A. c #CA863C",
"S. c #C9873C",
"D. c #C9853C",
"F. c #9D692F",
"G. c #855928",
"H. c #8E5F2B",
"J. c #7A5125",
"K. c #714C22",
"L. c #D28D40",
"P. c #D18B40",
"I. c #CD893F",
"U. c #865A29",
"Y. c #7C5326",
"T. c #885C2A",
"R. c #7D5427",
"E. c #D68F43",
"W. c #D38D42",
"Q. c #D69044",
"!. c #A16D33",
"~. c #583C1C",
"^. c #55391B",
"/. c #DA9447",
"(. c #D08E44",
"). c #DD9649",
"_. c #C58641",
"`. c #E39B4C",
"'. c #E1994B",
"]. c #81582B",
"[. c #E49B4D",
"{. c #E89F4F",
"}. c #E59D4E",
"|. c #EDA352",
" X c #624422",
".X c #D4924A",
"XX c #DD984E",
"oX c #D7954D",
"OX c #E7A054",
"+X c #EDA558",
"@X c #CE9251",
"#X c #D49754",
"$X c #E1A15C",
"%X c #D49857",
"&X c #D69B5C",
"*X c #E2A665",
"=X c #DBA264",
"-X c #DDA76D",
";X c #D8A670",
":X c #E3AF77",
">X c #E8B884",
",X c #E4BA8C",
"<X c #E9BF90",
"1X c #EBC59B",
"2X c #EDCAA4",
"3X c #E8C7A2",
"4X c #ECCFAF",
"5X c #F5DDC3",
"6X c #F6E1CA",
"7X c #F8E5CF",
"8X c #F9E7D3",
"9X c #FCEAD6",
"0X c #FAE9D6",
"qX c #F9E9D7",
"wX c #F9EAD9",
"eX c #FAEBDB",
"rX c #FBEDDE",
"tX c #FCEFE1",
"yX c #FDF1E4",
"uX c #FFF4E8",
"iX c #FEF3E7",
"pX c #020100",
"aX c #311B04",
"sX c #241403",
"dX c #180D02",
"fX c #0B0601",
"gX c #291704",
"hX c #261504",
"jX c #5E350A",
"kX c #251504",
"lX c #5F360B",
"zX c #A6641E",
"xX c #4F300F",
"cX c #40270D",
"vX c #3B240C",
"bX c #482C0F",
"nX c #B36E26",
"mX c #7E4E1B",
"MX c #B57027",
"NX c #41280E",
"BX c #B97329",
"VX c #B67128",
"CX c #442A0F",
"ZX c #553616",
"AX c #B67530",
"SX c #B77631",
"DX c #C17E37",
"FX c #C58139",
"GX c #C7833B",
"HX c #CA853C",
"JX c #CB8B47",
"KX c #D89854",
"LX c #E4B079",
"PX c #F1D0AD",
"IX c #FAEAD9",
"UX c #FEF3E8",
/* pixels */
"pXaX! lX/ / / ! lX! ! / jX! E sX",
"gXn < 4 t 4 f t f 4 t d d d m.^ ",
"R ,.y j j h g h j h A f A g (.} ",
"R MX|.'.'.}./.OX+XOX/.E.`./.g.-.",
"T BX}.L.P.XX-X1X2X2XLXJXL.V.p.-.",
"W BX|./..X>X6XyXwXJ 8X1XoXM.s.@.",
"Y VX'.P.@X6XiXrX2XrXUXD &XA.g.#.",
"W | ).L.%X8XK IX>XS UXqX&Xc.p.@.",
"Y BX[.W.#X5XJ IX<X0XK 6X$XI.DX-.",
"W BX}./.).>XIXiXIXJ qX,X.Xc.b.;.",
"W MX{.}.$XPXtXK 0XUXtX4XKXl.d.-.",
"W nX{.{.*XqXiXG <X9XUXwX=XD.g.$.",
"W | `.Q.*XIXiX0X:X6XJ G -XFXa.$.",
"Y  .'.L.=XqXK S :X6XJ eX-Xv.q.-.",
"W BX`.`.$X6XK F <XD K D &XA.AX=.",
"W VX}.`.oX,X7XJ D yXD 2XKXI.0.$.",
"Y  .).Q.Z.I.-X1X3X3X;XJXW.GXs.#.",
"Y  ./.I.I.A.(..X.X_.GXGXI.A.d.@.",
"R zXP.A.DXZ.v.HXV.i.0.FXl.v.q.1.",
"Q _ } { ` } ] } } ] ] } ] { ..x.",
"pXL sXkXkX~ hXhXhXhX~ hXhXkXc v ",
"pXfXU I I I ( ( ( I ( ( I I dXfX",
"L vX^.^.^.z.z.z.B.B.B.z.x.x.<.) ",
"l NX X XZ K.V h.C.h.h.Z Z  X~.&.",
"k bX].H.F.t.,.B r.4.n *.n.H.V x.",
"~ ZX!.V.8.0 y u u u 5 a 5.3.7.Z ",
"~ <.F.L.C - 6 i : i & ; w 8.y.@.",
"~ CXT.y.s 6 H 3 O 3 uX1 * M 4.$.",
"~ X.U.4.e 1 uX% . + uX2 * M >.-.",
"~ %.U.3.w $ uX% . + uXo @ N w.$.",
"x %.T.k.> . % uX+ H % . # M e.$.",
"~ NXT.f., O 8 uX% uX8 O * b 2.$.",
"~ cXG.k.r 7 uX% . + uX2 = m 2.$.",
"x cXC.4.r 2 uX+   o H : = N 3.$.",
"~ cXG.r.r 7 uX&   o H : = M 3.=.",
"~ NXU.k.r 6 uX: X + uX1 * N >.+.",
"x NXU.S.s ; 1 H + H 7 O , 5.6.$.",
"x cXY.N.8.9 - ; O O - , p j.u.-.",
"x cXR.n.f.N 9 > q p p m 5.m.i.-.",
"c vXJ.F.u.8.:.M 5.o.O.8.9.r.SX1.",
"L Q xX_ ] ' ' ' ' ' ' ' [ [ mXZX",
"pXfXU P l k z z Q z z ~ gXk x v "
};
