<?xml version="1.0" encoding="UTF-8" standalone="no"?>
<!-- Generator: Adobe Illustrator 9.0, SVG Export Plug-In  -->
<svg xmlns:dc="http://purl.org/dc/elements/1.1/" xmlns:cc="http://creativecommons.org/ns#" xmlns:rdf="http://www.w3.org/1999/02/22-rdf-syntax-ns#" xmlns:svg="http://www.w3.org/2000/svg" xmlns="http://www.w3.org/2000/svg" xmlns:sodipodi="http://sodipodi.sourceforge.net/DTD/sodipodi-0.dtd" xmlns:inkscape="http://www.inkscape.org/namespaces/inkscape" width="48.000000px" height="48.000000px" viewBox="0 0 48 48" xml:space="preserve" id="svg2" sodipodi:version="0.32" inkscape:version="0.46" sodipodi:docname="x-office-document.svg" sodipodi:docbase="/home/luca/Artwork/blackwhite-icon-theme/scalable/mimetypes" inkscape:output_extension="org.inkscape.output.svg.inkscape"><metadata id="metadata19"><rdf:RDF><cc:Work rdf:about=""><dc:format>image/svg+xml</dc:format><dc:type rdf:resource="http://purl.org/dc/dcmitype/StillImage"/><dc:title>Office Document</dc:title><dc:creator><cc:Agent><dc:title>Luca Ferretti &lt;elle.uca@libero.it&gt;</dc:title></cc:Agent></dc:creator><cc:license rdf:resource=""/><dc:date>December 2008</dc:date><dc:contributor><cc:Agent><dc:title>Based on text-x-generic</dc:title></cc:Agent></dc:contributor></cc:Work></rdf:RDF></metadata><defs id="defs17"><inkscape:perspective sodipodi:type="inkscape:persp3d" inkscape:vp_x="0 : 24 : 1" inkscape:vp_y="0 : 1000 : 0" inkscape:vp_z="48 : 24 : 1" inkscape:persp3d-origin="24 : 16 : 1" id="perspective3488"/>
		
		
		
		
	</defs><sodipodi:namedview inkscape:window-height="949" inkscape:window-width="1280" inkscape:pageshadow="2" inkscape:pageopacity="0.0" borderopacity="1.0" bordercolor="#666666" pagecolor="#ffffff" id="base" gridtolerance="10000" showgrid="true" guidetolerance="10000" inkscape:grid-points="true" inkscape:zoom="15.541667" inkscape:cx="12.450402" inkscape:cy="24" inkscape:window-x="0" inkscape:window-y="25" inkscape:current-layer="svg2" showguides="true" inkscape:guide-bbox="true" inkscape:snap-bbox="true" inkscape:object-nodes="true" inkscape:object-paths="true" objecttolerance="10000"><sodipodi:guide orientation="vertical" position="24.944882" id="guide3305"/><sodipodi:guide orientation="horizontal" position="28.031496" id="guide3307"/><inkscape:grid type="xygrid" visible="true" enabled="true" id="grid3490"/></sodipodi:namedview>
	<rect style="fill: none; fill-opacity: 0.75; fill-rule: evenodd; stroke: none; stroke-width: 1px; stroke-linecap: butt; stroke-linejoin: miter; stroke-opacity: 1;" id="rect3319" width="48.000000" height="48.000000" x="0.0000000" y="0.0000000"/><path sodipodi:nodetypes="ccccccc" style="fill: rgb(255, 255, 255); fill-rule: nonzero; stroke: rgb(255, 255, 255); stroke-width: 12; stroke-linejoin: round; stroke-miterlimit: 4; stroke-dasharray: none; fill-opacity: 1; stroke-opacity: 1;" d="M 39,41 L 9,41 L 9,6 L 30,6 L 39,16 L 39,20.678851 L 39,41 z " id="path4775"/><path id="path7" d="M 39,41 L 9,41 L 9,6 L 30,6 L 39,16 L 39,41 z " style="fill: rgb(0, 0, 0); fill-rule: nonzero; stroke: rgb(0, 0, 0); stroke-width: 4; stroke-linejoin: round; stroke-miterlimit: 4; stroke-dasharray: none; fill-opacity: 1;" sodipodi:nodetypes="cccccc"/><path id="path9" d="M 37,16 L 36.996573,39.003906 L 11,39 L 11.016535,8.0181102 L 29,8 L 37,16 z " style="fill: rgb(255, 255, 255); fill-rule: nonzero; stroke: none; stroke-miterlimit: 4;" sodipodi:nodetypes="cccccc"/>
	
<path style="fill: none; fill-opacity: 0.75; fill-rule: evenodd; stroke: rgb(0, 0, 0); stroke-width: 4; stroke-linecap: round; stroke-linejoin: miter; stroke-miterlimit: 4; stroke-dasharray: none; stroke-opacity: 1;" d="M 15,16 L 28,16" id="path1309"/><path sodipodi:nodetypes="cc" style="fill: none; fill-opacity: 0.75; fill-rule: evenodd; stroke: rgb(0, 0, 0); stroke-width: 4; stroke-linecap: round; stroke-linejoin: miter; stroke-miterlimit: 4; stroke-dasharray: none; stroke-opacity: 1;" d="M 28,32 L 33,32" id="path2186"/><path id="path3492" d="M 28,24 L 33,24" style="fill: none; fill-opacity: 0.75; fill-rule: evenodd; stroke: rgb(0, 0, 0); stroke-width: 4; stroke-linecap: round; stroke-linejoin: miter; stroke-miterlimit: 4; stroke-dasharray: none; stroke-opacity: 1;" sodipodi:nodetypes="cc"/><rect style="fill: rgb(0, 0, 0); fill-opacity: 1; stroke: none; stroke-width: 2; stroke-linecap: round; stroke-linejoin: round; stroke-miterlimit: 4; stroke-dasharray: none; stroke-opacity: 1;" id="rect3494" width="10" height="15" x="13" y="21" ry="2.0678852"/></svg>