<?xml version="1.0" encoding="UTF-8" standalone="no"?>
<!-- Created with Inkscape (http://www.inkscape.org/) -->
<svg
   xmlns:dc="http://purl.org/dc/elements/1.1/"
   xmlns:cc="http://web.resource.org/cc/"
   xmlns:rdf="http://www.w3.org/1999/02/22-rdf-syntax-ns#"
   xmlns:svg="http://www.w3.org/2000/svg"
   xmlns="http://www.w3.org/2000/svg"
   xmlns:sodipodi="http://sodipodi.sourceforge.net/DTD/sodipodi-0.dtd"
   xmlns:inkscape="http://www.inkscape.org/namespaces/inkscape"
   width="744.09448819"
   height="1052.3622047"
   id="svg2"
   sodipodi:version="0.32"
   inkscape:version="0.45.1"
   sodipodi:docbase="/home/rodney/dev/my-vala/doc/hackers/figures"
   sodipodi:docname="valac-data.svg"
   inkscape:output_extension="org.inkscape.output.svg.inkscape">
  <defs
     id="defs4">
    <marker
       inkscape:stockid="Arrow2Lend"
       orient="auto"
       refY="0.0"
       refX="0.0"
       id="Arrow2Lend"
       style="overflow:visible;">
      <path
         id="path3235"
         style="font-size:12.0;fill-rule:evenodd;stroke-width:0.62500000;stroke-linejoin:round;"
         d="M 8.7185878,4.0337352 L -2.2072895,0.016013256 L 8.7185884,-4.0017078 C 6.9730900,-1.6296469 6.9831476,1.6157441 8.7185878,4.0337352 z "
         transform="scale(1.1) rotate(180) translate(1,0)" />
    </marker>
  </defs>
  <sodipodi:namedview
     id="base"
     pagecolor="#ffffff"
     bordercolor="#666666"
     borderopacity="1.0"
     gridtolerance="10000"
     guidetolerance="10"
     objecttolerance="10"
     inkscape:pageopacity="0.0"
     inkscape:pageshadow="2"
     inkscape:zoom="1"
     inkscape:cx="434.8954"
     inkscape:cy="868.1"
     inkscape:document-units="px"
     inkscape:current-layer="layer1"
     inkscape:window-width="889"
     inkscape:window-height="679"
     inkscape:window-x="0"
     inkscape:window-y="26" />
  <metadata
     id="metadata7">
    <rdf:RDF>
      <cc:Work
         rdf:about="">
        <dc:format>image/svg+xml</dc:format>
        <dc:type
           rdf:resource="http://purl.org/dc/dcmitype/StillImage" />
      </cc:Work>
    </rdf:RDF>
  </metadata>
  <g
     inkscape:label="Layer 1"
     inkscape:groupmode="layer"
     id="layer1">
    <path
       style="fill:none;fill-rule:evenodd;stroke:#000000;stroke-width:1px;stroke-linecap:butt;stroke-linejoin:miter;stroke-opacity:1;marker-end:url(#Arrow2Lend)"
       d="M 137,70.362183 L 164,88.362183"
       id="path3197" />
    <path
       style="fill:none;fill-rule:evenodd;stroke:#000000;stroke-width:1px;stroke-linecap:butt;stroke-linejoin:miter;stroke-opacity:1;marker-end:url(#Arrow2Lend)"
       d="M 138,131.36218 L 163,108.36218"
       id="path3199" />
    <path
       style="fill:none;fill-rule:evenodd;stroke:#000000;stroke-width:1px;stroke-linecap:butt;stroke-linejoin:miter;stroke-opacity:1;marker-end:url(#Arrow2Lend)"
       d="M 258,98.362183 L 284,99.362183"
       id="path3201" />
    <path
       style="fill:none;fill-rule:evenodd;stroke:#000000;stroke-width:1px;stroke-linecap:butt;stroke-linejoin:miter;stroke-opacity:1;marker-end:url(#Arrow2Lend)"
       d="M 368,100.36218 L 396,93.362183"
       id="path3203" />
    <path
       style="fill:none;fill-rule:evenodd;stroke:#000000;stroke-width:1px;stroke-linecap:butt;stroke-linejoin:miter;stroke-opacity:1;marker-end:url(#Arrow2Lend)"
       d="M 449,163.36218 L 445,198.36218"
       id="path3205" />
    <path
       style="fill:none;fill-rule:evenodd;stroke:#000000;stroke-width:1px;stroke-linecap:butt;stroke-linejoin:miter;stroke-opacity:1;marker-end:url(#Arrow2Lend)"
       d="M 442,288.36218 L 442,304.36218"
       id="path3207" />
    <path
       style="fill:none;fill-rule:evenodd;stroke:#000000;stroke-width:1px;stroke-linecap:butt;stroke-linejoin:miter;stroke-opacity:1;marker-end:url(#Arrow2Lend)"
       d="M 139,194.36218 C 193.8069,194.36218 239.76086,234.15327 261.90625,259.08093 C 280.3125,279.79968 312.4748,327.36218 386,327.36218"
       id="path3209"
       sodipodi:nodetypes="ccz" />
    <rect
       style="opacity:1;fill:none;stroke:#000000;stroke-width:1.52751458;stroke-linejoin:round;stroke-miterlimit:4;stroke-dasharray:none;stroke-opacity:1"
       id="rect2160"
       width="68.472481"
       height="38.472481"
       x="68.763756"
       y="52.125938"
       ry="9.8067122" />
    <text
       xml:space="preserve"
       style="font-size:12px;font-style:normal;font-weight:normal;fill:#000000;fill-opacity:1;stroke:none;stroke-width:1px;stroke-linecap:butt;stroke-linejoin:miter;stroke-opacity:1;font-family:Bitstream Vera Sans"
       x="88.421875"
       y="75.835815"
       id="text3134"><tspan
         sodipodi:role="line"
         id="tspan3136"
         x="88.421875"
         y="75.835815">.vala</tspan></text>
    <text
       id="text3140"
       y="134.67273"
       x="88.304688"
       style="font-size:12px;font-style:normal;font-weight:normal;fill:#000000;fill-opacity:1;stroke:none;stroke-width:1px;stroke-linecap:butt;stroke-linejoin:miter;stroke-opacity:1;font-family:Bitstream Vera Sans"
       xml:space="preserve"><tspan
         y="134.67273"
         x="88.304688"
         id="tspan3142"
         sodipodi:role="line">.vapi</tspan></text>
    <text
       xml:space="preserve"
       style="font-size:12px;font-style:normal;font-weight:normal;fill:#000000;fill-opacity:1;stroke:none;stroke-width:1px;stroke-linecap:butt;stroke-linejoin:miter;stroke-opacity:1;font-family:Bitstream Vera Sans"
       x="98"
       y="199.36218"
       id="text3146"><tspan
         sodipodi:role="line"
         id="tspan3148"
         x="98"
         y="199.36218">.c</tspan></text>
    <rect
       ry="9.8067122"
       y="61.125946"
       x="162.76376"
       height="83.472488"
       width="95.472504"
       id="rect3150"
       style="opacity:1;fill:none;stroke:#000000;stroke-width:1.52751458;stroke-linejoin:round;stroke-miterlimit:4;stroke-dasharray:none;stroke-opacity:1" />
    <path
       style="fill:none;stroke:#000000;stroke-width:1.52751458;stroke-linejoin:round;stroke-miterlimit:4;stroke-opacity:1"
       d="M 293.57048,56.125946 C 293.57048,56.125946 312.53524,46.692118 331.50001,56.125946 C 350.46478,65.559774 360.42955,62.125946 360.42955,62.125946 C 365.86247,62.125946 370.23627,66.49974 370.23627,71.932658 C 370.23627,71.932658 367.23627,89.897425 367.23627,105.86219 C 367.23627,121.82696 370.23627,135.79172 370.23627,135.79172 C 370.23627,141.22464 365.86247,145.59843 360.42955,145.59843 C 347.78637,145.59843 350.64319,138.09843 326.50001,132.59843 C 303.30649,127.31477 297.21366,145.59843 284.57048,145.59843 C 279.13756,145.59843 274.76376,141.22464 274.76376,135.79172 C 274.76376,125.14854 282.76376,114.50537 282.76376,103.86219 C 282.76376,93.219012 274.76376,82.575835 274.76376,71.932658 C 274.76376,66.49974 288.13756,56.125946 293.57048,56.125946 z "
       id="rect3152"
       sodipodi:nodetypes="czcczcczccccc" />
    <path
       sodipodi:type="star"
       style="opacity:1;fill:none;stroke:#000000;stroke-width:2;stroke-linejoin:round;stroke-miterlimit:4;stroke-dasharray:none;stroke-opacity:1"
       id="path3163"
       sodipodi:sides="5"
       sodipodi:cx="475"
       sodipodi:cy="101.36218"
       sodipodi:r1="47.507893"
       sodipodi:r2="38.434692"
       sodipodi:arg1="0.85988695"
       sodipodi:arg2="1.4882055"
       inkscape:flatsided="true"
       inkscape:rounded="0.93"
       inkscape:randomized="0.071"
       d="M 508.3933,139.91036 C 467.50888,173.3742 496.1851,166.86576 451.08861,143.24746 C 405.99211,119.62916 417.24787,143.30695 429.03126,91.47939 C 440.81465,39.651833 419.13202,59.553864 470.39081,56.019102 C 521.64961,52.484339 503.76273,33.360411 520.68727,81.327036 C 537.61182,129.29366 549.27771,106.44652 508.3933,139.91036 z "
       transform="translate(-34,0)" />
    <path
       sodipodi:type="star"
       style="opacity:1;fill:none;stroke:#000000;stroke-width:2;stroke-linejoin:round;stroke-miterlimit:4;stroke-dasharray:none;stroke-opacity:1"
       id="path3165"
       sodipodi:sides="5"
       sodipodi:cx="618"
       sodipodi:cy="110.36218"
       sodipodi:r1="56.080299"
       sodipodi:r2="35.514645"
       sodipodi:arg1="0.87377495"
       sodipodi:arg2="1.5788422"
       inkscape:flatsided="false"
       inkscape:rounded="0.93"
       inkscape:randomized="0.071"
       d="M 655.23869,149.68215 C 627.82911,169.78068 656.29721,143.21919 621.17959,144.91919 C 591.00205,146.38004 610.13732,172.82185 587.71756,154.63154 C 561.62769,133.46347 595.7806,153.2355 585.213,121.3185 C 576.13197,93.891337 557.06961,127.31253 563.62555,98.16296 C 571.25469,64.241597 573.01745,105.71175 600.26202,83.861726 C 623.67403,65.085397 585.55746,57.567819 614.47924,56.481192 C 648.13553,55.216683 608.93036,65.051975 638.71566,81.387825 C 664.31098,95.425674 658.3667,58.269693 669.5829,85.482305 C 682.63519,117.14963 662.38659,92.829319 653.09774,125.14806 C 645.11558,152.92045 678.79251,132.41092 655.23869,149.68215 z "
       transform="matrix(0.9310943,-0.3647785,0.3647785,0.9310943,-176.05747,355.94454)" />
    <rect
       ry="9.8067122"
       y="112.12594"
       x="68.763756"
       height="38.472481"
       width="68.472481"
       id="rect3167"
       style="opacity:1;fill:none;stroke:#000000;stroke-width:1.52751458;stroke-linejoin:round;stroke-miterlimit:4;stroke-dasharray:none;stroke-opacity:1" />
    <rect
       style="opacity:1;fill:none;stroke:#000000;stroke-width:1.52751458;stroke-linejoin:round;stroke-miterlimit:4;stroke-dasharray:none;stroke-opacity:1"
       id="rect3169"
       width="68.472481"
       height="38.472481"
       x="69.242279"
       y="176.85056"
       ry="9.8067122" />
    <text
       xml:space="preserve"
       style="font-size:12px;font-style:normal;font-weight:normal;text-align:center;text-anchor:middle;fill:#000000;fill-opacity:1;stroke:none;stroke-width:1px;stroke-linecap:butt;stroke-linejoin:miter;stroke-opacity:1;font-family:Bitstream Vera Sans"
       x="438.70886"
       y="231.05055"
       id="text3171"><tspan
         sodipodi:role="line"
         id="tspan3173"
         x="438.70886"
         y="231.05055">C code</tspan><tspan
         sodipodi:role="line"
         x="438.70886"
         y="246.05055"
         id="tspan3175">.c  .h</tspan></text>
    <text
       xml:space="preserve"
       style="font-size:12px;font-style:normal;font-weight:normal;fill:#000000;fill-opacity:1;stroke:none;stroke-width:1px;stroke-linecap:butt;stroke-linejoin:miter;stroke-opacity:1;font-family:Bitstream Vera Sans"
       x="198.86037"
       y="107.23035"
       id="text3177"><tspan
         sodipodi:role="line"
         id="tspan3179"
         x="198.86037"
         y="107.23035">AST</tspan></text>
    <text
       xml:space="preserve"
       style="font-size:12px;font-style:normal;font-weight:normal;fill:#000000;fill-opacity:1;stroke:none;stroke-width:1px;stroke-linecap:butt;stroke-linejoin:miter;stroke-opacity:1;font-family:Bitstream Vera Sans"
       x="309.7998"
       y="103.13395"
       id="text3181"><tspan
         sodipodi:role="line"
         id="tspan3183"
         x="309.7998"
         y="103.13395">AST'</tspan></text>
    <text
       xml:space="preserve"
       style="font-size:12px;font-style:normal;font-weight:normal;text-align:center;text-anchor:middle;fill:#000000;fill-opacity:1;stroke:none;stroke-width:1px;stroke-linecap:butt;stroke-linejoin:miter;stroke-opacity:1;font-family:Bitstream Vera Sans"
       x="443.3577"
       y="103.11823"
       id="text3185"><tspan
         sodipodi:role="line"
         id="tspan3187"
         x="443.3577"
         y="103.11823">CCode</tspan><tspan
         sodipodi:role="line"
         x="443.3577"
         y="118.11823"
         id="tspan3189">Tree</tspan></text>
    <rect
       style="opacity:1;fill:none;stroke:#000000;stroke-width:2;stroke-linejoin:round;stroke-miterlimit:4;stroke-dasharray:none;stroke-opacity:1"
       id="rect3191"
       width="104"
       height="46"
       x="387"
       y="304.36218" />
    <text
       xml:space="preserve"
       style="font-size:12px;font-style:normal;font-weight:normal;fill:#000000;fill-opacity:1;stroke:none;stroke-width:1px;stroke-linecap:butt;stroke-linejoin:miter;stroke-opacity:1;font-family:Bitstream Vera Sans"
       x="405.56641"
       y="331.83582"
       id="text3193"><tspan
         sodipodi:role="line"
         id="tspan3195"
         x="405.56641"
         y="331.83582">Executable</tspan></text>
    <rect
       ry="9.8067122"
       y="176.85056"
       x="69.242279"
       height="38.472481"
       width="68.472481"
       id="rect3427"
       style="opacity:1;fill:none;stroke:#000000;stroke-width:1.52751458;stroke-linejoin:round;stroke-miterlimit:4;stroke-dasharray:none;stroke-opacity:1" />
    <text
       xml:space="preserve"
       style="font-size:12px;font-style:italic;font-weight:normal;fill:#000000;fill-opacity:1;stroke:none;stroke-width:1px;stroke-linecap:butt;stroke-linejoin:miter;stroke-opacity:1;font-family:Bitstream Vera Sans"
       x="153"
       y="163.36218"
       id="text3429"><tspan
         sodipodi:role="line"
         id="tspan3431"
         x="153"
         y="163.36218">Vala code is</tspan><tspan
         sodipodi:role="line"
         x="153"
         y="178.36218"
         id="tspan3435">parsed in an AST</tspan></text>
    <text
       xml:space="preserve"
       style="font-size:12px;font-style:italic;font-weight:normal;fill:#000000;fill-opacity:1;stroke:none;stroke-width:1px;stroke-linecap:butt;stroke-linejoin:miter;stroke-opacity:1;font-family:Bitstream Vera Sans"
       x="267"
       y="163.36218"
       id="text3439"><tspan
         sodipodi:role="line"
         id="tspan3441"
         x="267"
         y="163.36218">AST is transformed,</tspan><tspan
         sodipodi:role="line"
         x="267"
         y="178.36218"
         id="tspan2218">e.g. symbols resolved</tspan></text>
    <text
       xml:space="preserve"
       style="font-size:12px;font-style:italic;font-weight:normal;fill:#000000;fill-opacity:1;stroke:none;stroke-width:1px;stroke-linecap:butt;stroke-linejoin:miter;stroke-opacity:1;font-family:Bitstream Vera Sans"
       x="500"
       y="59.362183"
       id="text3445"><tspan
         sodipodi:role="line"
         x="500"
         y="59.362183"
         id="tspan3457">A tree is built,</tspan><tspan
         sodipodi:role="line"
         x="500"
         y="74.362183"
         id="tspan3459">representing</tspan><tspan
         sodipodi:role="line"
         x="500"
         y="89.362183"
         id="tspan3463">the C code.</tspan></text>
    <text
       xml:space="preserve"
       style="font-size:12px;font-style:italic;font-weight:normal;fill:#000000;fill-opacity:1;stroke:none;stroke-width:1px;stroke-linecap:butt;stroke-linejoin:miter;stroke-opacity:1;font-family:Bitstream Vera Sans"
       x="501"
       y="164.36218"
       id="text3465"><tspan
         sodipodi:role="line"
         id="tspan3467"
         x="501"
         y="164.36218">The tree is</tspan><tspan
         sodipodi:role="line"
         x="501"
         y="179.36218"
         id="tspan3469">converted</tspan><tspan
         sodipodi:role="line"
         x="501"
         y="194.36218"
         id="tspan3471">into real C</tspan><tspan
         sodipodi:role="line"
         x="501"
         y="209.36218"
         id="tspan3473">code.</tspan></text>
    <text
       xml:space="preserve"
       style="font-size:12px;font-style:italic;font-weight:normal;fill:#000000;fill-opacity:1;stroke:none;stroke-width:1px;stroke-linecap:butt;stroke-linejoin:miter;stroke-opacity:1;font-family:Bitstream Vera Sans"
       x="505"
       y="273.36218"
       id="text3475"><tspan
         sodipodi:role="line"
         id="tspan3477"
         x="505"
         y="273.36218">gcc is used</tspan><tspan
         sodipodi:role="line"
         x="505"
         y="288.36218"
         id="tspan3479">to build the</tspan><tspan
         sodipodi:role="line"
         x="505"
         y="303.36218"
         id="tspan3481">final program</tspan><tspan
         sodipodi:role="line"
         x="505"
         y="318.36218"
         id="tspan3483">or library.</tspan></text>
    <text
       xml:space="preserve"
       style="font-size:12px;font-style:italic;font-weight:normal;fill:#000000;fill-opacity:1;stroke:none;stroke-width:1px;stroke-linecap:butt;stroke-linejoin:miter;stroke-opacity:1;font-family:Bitstream Vera Sans"
       x="71"
       y="237.36218"
       id="text3485"><tspan
         sodipodi:role="line"
         id="tspan3487"
         x="71"
         y="237.36218">User supplies</tspan><tspan
         sodipodi:role="line"
         x="71"
         y="252.36218"
         id="tspan3489">Vala code and</tspan><tspan
         sodipodi:role="line"
         x="71"
         y="267.36218"
         id="tspan3493">sometimes plain</tspan><tspan
         sodipodi:role="line"
         x="71"
         y="282.36218"
         id="tspan3497">C code.</tspan></text>
  </g>
</svg>
