%!PS-Adobe-3.0
%%Title: transyMjolnir.ps
%%Creator: Candace Hierehāt
%%CreationDate: 2017-07-01
%%Pages: 1
%%BoundingBox: 0 0 128 128
%%EndComments
%
% Draw a Mjölnir (Thor's hammer) symbol adorned with the tricolour
% of the transgender pride flag.
%


% <n> <f> hammerdo -
% create a Mjölnir path within a square of size <n> and call procedure <f>
% within the path's context, passing atop the stack the size of the context:
%     <sz> <f> -
%
/hammerdo {
	2 dict begin				% room for 2 local variables
	/f exch def					% top of stack goes into <f>
	/s exch def					% new top goes into <s>

	gsave						% save the graphics context
		s 36290 div dup scale	% scale local coords to fit within <s>x<s>
		newpath					% start drawing a new path
		18145 0 moveto			% path data...
		11842 3800 1528 4560 764 4560 curveto
		0 4560 0 5320 0 5320 curveto
		0 12160 lineto
		14325 11970 13370 15010 13370 15010 curveto
		13370 27170 lineto
		13370 27170 13561 33250 10314 33250 curveto
		10123 33250 10314 36290 10314 36290 curveto
		25785 36290 lineto
		25785 36290 25785 33250 25785 33250 curveto
		22538 33250 22729 27170 22729 27170 curveto
		22729 15010 lineto
		22729 15010 21774 11970 36290 12160 curveto
		36290 5320 lineto
		36290 5320 36290 4560 35335 4560 curveto
		34571 4560 24257 3800 18145 0 curveto
		closepath				% that's all the data; close the path
		36290 f					% call <f> with the local coord scale factor
	grestore					% restore the previous graphics context

	end							% end local scope
} def


% push some rgb values onto the stack for use with setrgbcolor
% - /colour <r> <g> <b>
%
/blue  {  91 255 div 206 255 div 250 255 div } def
/pink  { 245 255 div 169 255 div 184 255 div } def
/white { 255 255 div 255 255 div 255 255 div } def


% <s> flagfill -
% draw an <s>x<s> square trans pride flag at the origin
%
/flagfill {
	2 dict begin				% room for two local variables
	/s exch def					% pop top of stack into <s>

	/t s 5 div def				% height of each stripe

	blue setrgbcolor			% fill the background with a blue
	0 0 s s rectfill			% <s>x<s> square
	pink setrgbcolor			% now paint over part of the bg with a pink,
	0 t s 3 t mul rectfill		% vertically-centered <s>x<3t> rectangle
	white setrgbcolor			% and paint over part of that with a white,
	0 t t add s t rectfill		% vertically-centered <s>x<t> rectangle

	end							% end of local scope
} def

%%EndProlog

%

%%BeginSetup
initgraphics

/sz  currentpagedevice /PageSize     get 0 get def		% page size
/res currentpagedevice /HWResolution get 0 get def		% output DPI
/rsb 72 def						% the resolutory basis in which to draw
/lwd rsb res sub rsb res div dup add div res add def
						% line width divisor:  (rsb-res) / 2*(rsb/res) + res
/ofs sz lwd div 2 mul def 		% the desired offset for drop shadow
/tsz sz ofs sub def				% size of the Mjölnir symbol to draw
% uncomment to "disable" drop shadow:
%/ofs 0  def
%/tsz sz def
%%EndSetup


%%Page: 1 1
gsave
	ofs 0 translate				% to the right by <lw> units
	tsz {						% draw a drop shadow
		pop						% don't need the context size here
		0 setgray				% paint it black
		fill					% fill the hammer shape black
	} hammerdo
grestore						% back to the initial graphics state
gsave
	0 ofs translate				% up by <lw> units
	tsz {						% main attraction
		clip flagfill			% use hammer as clip path when drawing flag
	} hammerdo
	
	tsz {						% draw a dark outline
		lwd div setlinewidth
		0 setgray				% paint it black
		stroke					% draw the outline along the path
	} hammerdo
grestore
showpage						% finished drawing

quit
%%EOF
