format 58
"Diagrammi"
  revision 8
  modified_by 42 "nico"


  
  // class settings
  default_attribute_visibility protected default_relation_visibility protected default_operation_visibility public
  //class diagram settings
  draw_all_relations yes hide_attributes no hide_operations no show_members_full_definition no show_members_visibility no show_members_stereotype no show_members_multiplicity no show_members_initialization no member_max_width 127 show_parameter_dir yes show_parameter_name yes package_name_in_tab no class_drawing_mode natural drawing_language uml show_context_mode no auto_label_position yes show_infonote no shadow yes show_stereotype_properties no
  //use case diagram settings
  package_name_in_tab no show_context no auto_label_position yes draw_all_relations yes class_drawing_mode actor shadow yes show_stereotype_properties no
  //sequence diagram settings
  show_full_operations_definition no write_horizontally yes class_drawing_mode natural drawing_language uml draw_all_relations yes shadow yes show_stereotype_properties no
  //collaboration diagram settings
  show_full_operations_definition no show_hierarchical_rank no write_horizontally yes drawing_language uml package_name_in_tab no show_context no draw_all_relations yes shadow yes show_stereotype_properties no
  //object diagram settings
   write_horizontally yes package_name_in_tab no show_context no auto_label_position yes draw_all_relations yes shadow yes show_stereotype_properties no
  //component diagram settings
  package_name_in_tab no show_context no auto_label_position yes draw_all_relations yes shadow yes
  draw_component_as_icon no show_component_req_prov no show_component_rea no show_stereotype_properties no
  //deployment diagram settings
  package_name_in_tab no show_context no write_horizontally yes auto_label_position yes draw_all_relations yes shadow yes
  draw_component_as_icon no show_component_req_prov no show_component_rea no show_stereotype_properties no
  //state diagram settings
  package_name_in_tab no show_context no auto_label_position yes write_trans_label_horizontally yes show_trans_definition no draw_all_relations yes shadow yes
  show_activities yes region_horizontally yes drawing_language uml show_stereotype_properties no
  //activity diagram settings
  package_name_in_tab no show_context no show_opaque_action_definition no auto_label_position yes write_flow_label_horizontally no draw_all_relations yes shadow yes
  show_infonote yes drawing_language uml show_stereotype_properties no
  
  class_color yellow duration_color transparent continuation_color gray note_color blue fragment_color transparent subject_color transparent usecase_color yellow package_color transparent component_color green artifact_color green deploymentnode_color gray state_color yellow stateaction_color transparent activity_color transparent activityregion_color transparent activityaction_color transparent parameterpin_color white 
  font_size 9
  diagram_format A4

  mark_for_import
  
  classview 128042 "Diagrammi"
    //class diagram settings
    draw_all_relations default hide_attributes default hide_operations default show_members_full_definition default show_members_visibility default show_members_stereotype default show_members_multiplicity default show_members_initialization default member_max_width 0 show_parameter_dir default show_parameter_name default package_name_in_tab default class_drawing_mode default drawing_language default show_context_mode default auto_label_position default show_infonote default shadow default show_stereotype_properties default
    //collaboration diagram settings
    show_full_operations_definition default show_hierarchical_rank default write_horizontally default drawing_language default package_name_in_tab default show_context default draw_all_relations default shadow default show_stereotype_properties default
    //object diagram settings
     write_horizontally default package_name_in_tab default show_context default auto_label_position default draw_all_relations default shadow default show_stereotype_properties default
    //sequence diagram settings
    show_full_operations_definition default write_horizontally default class_drawing_mode default drawing_language default draw_all_relations default shadow default show_stereotype_properties default
    //state diagram settings
    package_name_in_tab default show_context default auto_label_position default write_trans_label_horizontally default show_trans_definition default draw_all_relations default shadow default
    show_activities default region_horizontally default drawing_language default show_stereotype_properties default
    //class settings
    //activity diagram settings
    package_name_in_tab default show_context default show_opaque_action_definition default auto_label_position default write_flow_label_horizontally default draw_all_relations default shadow default
    show_infonote default drawing_language default show_stereotype_properties default
    classdiagram 128042 "Alto_Livello"
      draw_all_relations default hide_attributes default hide_operations default show_members_full_definition default show_members_visibility default show_members_stereotype default show_members_multiplicity default show_members_initialization default member_max_width 0 show_parameter_dir default show_parameter_name default package_name_in_tab default class_drawing_mode default drawing_language default show_context_mode default auto_label_position default show_infonote default shadow default show_stereotype_properties default
      size A4
    end

    class 128042 "Track"
      visibility package stereotype "RCI"
      cpp_decl ""
      java_decl ""
      php_decl ""
      python_2_2 python_decl ""
      idl_decl ""
      explicit_switch_type ""
      
      classrelation 128170 // <composition>
	relation 128170 *---
	  a role_name "" multiplicity "1..*" protected
	    classrelation_ref 128170 // <composition>
	  b role_name "" protected
	    classrelation_ref 128298 // <composition>
      end

      operation 128042 "PutOnPitLane"
	public explicit_return_type ""
	nparams 0
	
	
	
	
	
      end

      operation 128170 "StartRace"
	stereotype "Asynchronous"
	public explicit_return_type ""
	nparams 0
	
	
	
	
	
      end

      operation 128298 "ReadTrackConf"
	package explicit_return_type ""
	nparams 0
	
	
	
	
	
      end

      operation 130090 "Kill"
	public explicit_return_type ""
	nparams 0
	
	
	
	
	
      end

      operation 130218 "CallForPitStop"
	public explicit_return_type ""
	nparams 0
	
	
	
	
	
      end
    end

    class 128170 "Car"
      visibility package stereotype "RT"
      cpp_decl ""
      java_decl ""
      php_decl ""
      python_2_2 python_decl ""
      idl_decl ""
      explicit_switch_type ""
      
      classrelation 128682 // <dependency>
	relation 128426 -_->
	  a default
	    classrelation_ref 128682 // <dependency>
	  b parent class_ref 128298 // Controller
      end

      classrelation 129066 // <dependency>
	relation 128810 -_->
	  a default
	    classrelation_ref 129066 // <dependency>
	  b parent class_ref 128042 // Track
      end

      operation 129578 "UpdateProperties"
	public explicit_return_type ""
	nparams 0
	
	
	
	
	
      end
    end

    class 128298 "Controller"
      visibility package stereotype "RCI"
      cpp_decl ""
      java_decl ""
      php_decl ""
      python_2_2 python_decl ""
      idl_decl ""
      explicit_switch_type ""
      
      operation 128682 "RegisterCar"
	public explicit_return_type ""
	nparams 0
	
	
	
	
	
      end

      operation 128810 "RegisterRace"
	public explicit_return_type ""
	nparams 0
	
	
	
	
	
      end

      operation 128938 "RegisterMonitor"
	public explicit_return_type ""
	nparams 0
	
	
	
	
	
      end

      operation 129066 "UnregisterMonitor"
	public explicit_return_type ""
	nparams 0
	
	
	
	
	
      end

      operation 129194 "GetCar"
	public explicit_return_type ""
	nparams 0
	
	
	
	
	
      end

      operation 129322 "GetRace"
	public explicit_return_type ""
	nparams 0
	
	
	
	
	
      end

      operation 129450 "GetMonitor"
	public explicit_return_type ""
	nparams 0
	
	
	
	
	
      end
    end

    class 128426 "Race"
      visibility package stereotype "RT"
      cpp_decl ""
      java_decl ""
      php_decl ""
      python_2_2 python_decl ""
      idl_decl ""
      explicit_switch_type ""
      
      classrelation 128810 // <dependency>
	relation 128554 -_->
	  a default
	    classrelation_ref 128810 // <dependency>
	  b parent class_ref 128298 // Controller
      end

      classrelation 128938 // <dependency>
	relation 128682 -_->
	  a default
	    classrelation_ref 128938 // <dependency>
	  b parent class_ref 128042 // Track
      end

      operation 129706 "UpdateStatistics"
	public explicit_return_type ""
	nparams 0
	
	
	
	
	
      end

      operation 129834 "RegisterCar"
	public explicit_return_type ""
	nparams 0
	
	
	
	
	
      end

      operation 129962 "Kill"
	public explicit_return_type ""
	nparams 0
	
	
	
	
	
      end

      classrelation 129706 // <composition>
	relation 129322 *---
	  a role_name "" multiplicity "1" protected
	    classrelation_ref 129706 // <composition>
	  b role_name "" protected
	    classrelation_ref 129834 // <composition>
      end
    end

    class 128554 "Statistics"
      visibility package 
      cpp_decl ""
      java_decl ""
      php_decl ""
      python_2_2 python_decl ""
      idl_decl ""
      explicit_switch_type ""
      
      classrelation 129834 // <composition>
	relation_ref 129322 // <composition>
      end
    end

    class 128682 "Sector"
      visibility package 
      cpp_decl ""
      java_decl ""
      php_decl ""
      python_2_2 python_decl ""
      idl_decl ""
      explicit_switch_type ""
      
      classrelation 128298 // <composition>
	relation_ref 128170 // <composition>
      end

      classrelation 128426 // <composition>
	relation 128298 *---
	  a role_name "" multiplicity "1..*" protected
	    classrelation_ref 128426 // <composition>
	  b role_name "" protected
	    classrelation_ref 128554 // <composition>
      end

      operation 128426 "Enter"
	public explicit_return_type ""
	nparams 0
	
	
	
	
	
      end

      operation 128554 "Release"
	public explicit_return_type ""
	nparams 0
	
	
	
	
	
      end

      operation 132010 "BookExit"
	public explicit_return_type ""
	nparams 0
	
	
	
	
	
      end
    end

    class 128810 "Lane"
      visibility package 
      cpp_decl ""
      java_decl ""
      php_decl ""
      python_2_2 python_decl ""
      idl_decl ""
      explicit_switch_type ""
      
      classrelation 128554 // <composition>
	relation_ref 128298 // <composition>
      end

      operation 131882 "Demand"
	public explicit_return_type ""
	nparams 0
	
	
	
	
	
      end
    end

    class 128938 "Monitor"
      visibility package stereotype "RT"
      cpp_decl ""
      java_decl ""
      php_decl ""
      python_2_2 python_decl ""
      idl_decl ""
      explicit_switch_type ""
      
      classrelation 129194 // <dependency>
	relation 128938 -_->
	  a default
	    classrelation_ref 129194 // <dependency>
	  b parent class_ref 128426 // Race
      end

      classrelation 129322 // <dependency>
	relation 129066 -_->
	  a default
	    classrelation_ref 129322 // <dependency>
	  b parent class_ref 128298 // Controller
      end

      operation 130346 "UpdateMonitor"
	public explicit_return_type ""
	nparams 0
	
	
	
	
	
      end

      operation 130474 "UpdateBestLap"
	public explicit_return_type ""
	nparams 0
	
	
	
	
	
      end

      operation 130602 "UpdateMaxSpeed"
	public explicit_return_type ""
	nparams 0
	
	
	
	
	
      end

      operation 130730 "EndRace"
	public explicit_return_type ""
	nparams 0
	
	
	
	
	
      end
    end

    sequencediagram 129194 "Track_PutOnPitLane"
      show_full_operations_definition default write_horizontally default class_drawing_mode default drawing_language default draw_all_relations default shadow default show_stereotype_properties default
      overlapping_bars size A4
    end

    class 130090 "PutOnPitLane"
      visibility package 
      cpp_decl ""
      java_decl ""
      php_decl ""
      python_2_2 python_decl ""
      idl_decl ""
      explicit_switch_type ""
      
    end

    class 130218 "Sector_N"
      visibility package 
      cpp_decl ""
      java_decl ""
      php_decl ""
      python_2_2 python_decl ""
      idl_decl ""
      explicit_switch_type ""
      
    end

    class 130346 "Wait"
      visibility package 
      cpp_decl ""
      java_decl ""
      php_decl ""
      python_2_2 python_decl ""
      idl_decl ""
      explicit_switch_type ""
      
    end

    classinstance 128426 "Track"
      type class_ref 128042 // Track
      attributes
        end
      relations
        end
    end

    classinstance 128554 "Sector N"
      type class_ref 128682 // Sector
      attributes
        end
      relations
        end
    end

    classinstance 128682 "PitLane"
      type class_ref 128042 // Track
      attributes
        end
      relations
        end
    end

    classinstance 128810 "Sector N+1"
      type class_ref 128682 // Sector
      attributes
        end
      relations
        end
    end

    classinstance 129962 "car"
      type class_ref 131498 // The_Racer
      attributes
        end
      relations
        end
    end

    class 131498 "The_Racer"
      visibility package 
      cpp_decl ""
      java_decl ""
      php_decl ""
      python_2_2 python_decl ""
      idl_decl ""
      explicit_switch_type ""
      
    end

    classinstance 130090 "Lane"
      type class_ref 128810 // Lane
      attributes
        end
      relations
        end
    end

    sequencediagram 130346 "Attivita_Track_Race_Monitor"
      show_full_operations_definition default write_horizontally default class_drawing_mode default drawing_language default draw_all_relations default shadow default show_stereotype_properties default
      overlapping_bars size A4
    end

    classinstance 131242 "The_Race"
      type class_ref 128426 // Race
      attributes
        end
      relations
        end
    end

    classinstance 131370 "A_Monitor"
      type class_ref 128938 // Monitor
      attributes
        end
      relations
        end
    end
  end
end
