<?xml version="1.0" encoding="UTF-8" standalone="no"?>
<!-- Created with Bouml (http://bouml.free.fr/) -->
<!DOCTYPE svg PUBLIC "-//W3C//DTD SVG 1.1//EN" "http://www.w3.org/Graphics/SVG/1.1/DTD/svg11.dtd">
<svg width="529" height="481" version="1.1" xmlns="http://www.w3.org/2000/svg">
<g>
	<line stroke="black" stroke-opacity="1" x1="209" y1="299" x2="209" y2="325" />
	<polygon fill="#000000" stroke="black" stroke-opacity="1" points="209,299 215,305 209,311 203,305" />
</g>
<g>
	<line stroke="black" stroke-opacity="1" x1="210" y1="398" x2="210" y2="424" />
	<polygon fill="#000000" stroke="black" stroke-opacity="1" points="210,398 216,404 210,410 204,404" />
</g>
<g>
	<line stroke-dasharray="4,4" stroke="black" stroke-opacity="1" x1="325" y1="128" x2="347" y2="128" />
</g>
<g>
	<line stroke="black" stroke-opacity="1" x1="352" y1="329" x2="346" y2="335" />
	<line stroke="black" stroke-opacity="1" x1="352" y1="329" x2="358" y2="335" />
	<line stroke-dasharray="4,4" stroke="black" stroke-opacity="1" x1="352" y1="349" x2="352" y2="329" />
</g>
<g>
	<line stroke-dasharray="4,4" stroke="black" stroke-opacity="1" x1="311" y1="391" x2="273" y2="391" />
</g>
<g>
	<line stroke-dasharray="4,4" stroke="black" stroke-opacity="1" x1="236" y1="128" x2="209" y2="128" />
</g>
<g>
	<line stroke-dasharray="4,4" stroke="black" stroke-opacity="1" x1="471" y1="308" x2="471" y2="349" />
</g>
<g>
	<line stroke="black" stroke-opacity="1" x1="396" y1="257" x2="402" y2="263" />
	<line stroke="black" stroke-opacity="1" x1="396" y1="257" x2="402" y2="251" />
	<line stroke-dasharray="4,4" stroke="black" stroke-opacity="1" x1="428" y1="257" x2="396" y2="257" />
</g>
<g>
	<line stroke="black" stroke-opacity="1" x1="394" y1="390" x2="443" y2="390" />
	<polygon fill="#000000" stroke="black" stroke-opacity="1" points="394,390 400,384 406,390 400,396" />
</g>
<g>
	<line stroke-dasharray="4,4" stroke="black" stroke-opacity="1" x1="347" y1="128" x2="346" y2="132" />
</g>
<g>
	<line stroke="black" stroke-opacity="1" x1="348" y1="184" x2="353" y2="177" />
	<line stroke="black" stroke-opacity="1" x1="348" y1="184" x2="341" y2="178" />
	<line stroke-dasharray="4,4" stroke="black" stroke-opacity="1" x1="346" y1="132" x2="348" y2="184" />
</g>
<g>
	<line stroke-dasharray="4,4" stroke="black" stroke-opacity="1" x1="273" y1="391" x2="273" y2="240" />
</g>
<g>
	<line stroke="black" stroke-opacity="1" x1="209" y1="182" x2="215" y2="176" />
	<line stroke="black" stroke-opacity="1" x1="209" y1="182" x2="203" y2="176" />
	<line stroke-dasharray="4,4" stroke="black" stroke-opacity="1" x1="209" y1="128" x2="209" y2="182" />
</g>
<g>
	<line stroke-dasharray="4,4" stroke="black" stroke-opacity="1" x1="471" y1="349" x2="416" y2="350" />
</g>
<g>
	<line stroke="black" stroke-opacity="1" x1="394" y1="363" x2="402" y2="365" />
	<line stroke="black" stroke-opacity="1" x1="394" y1="363" x2="396" y2="354" />
	<line stroke-dasharray="4,4" stroke="black" stroke-opacity="1" x1="416" y1="350" x2="394" y2="363" />
</g>
<g>
	<line stroke="black" stroke-opacity="1" x1="251" y1="240" x2="257" y2="246" />
	<line stroke="black" stroke-opacity="1" x1="251" y1="240" x2="257" y2="234" />
	<line stroke-dasharray="4,4" stroke="black" stroke-opacity="1" x1="273" y1="240" x2="251" y2="240" />
</g>
<g>
	<rect fill="#808080" stroke="none" stroke-opacity="1" x="321" y="105" width="3" height="55" />
	<rect fill="#808080" stroke="none" stroke-opacity="1" x="241" y="157" width="83" height="3" />
	<rect fill="#ffffc0" stroke="black" stroke-width="1" stroke-opacity="1" x="237" y="101" width="84" height="56" />
	<text font-family="Helvetica" font-size="9" fill="#000000" xml:space="preserve" text-anchor="middle" x="279" y="112">&lt;&lt;RT&gt;&gt;</text>
	<text font-family="Helvetica" font-size="9" fill="#000000" xml:space="preserve" font-weight="bold" text-anchor="middle" x="279" y="128">Car</text>
	<line stroke="black" stroke-opacity="1" x1="237" y1="133" x2="321" y2="133" />
	<line stroke="black" stroke-opacity="1" x1="237" y1="141" x2="321" y2="141" />
	<text font-family="Helvetica" font-size="9" fill="#000000" xml:space="preserve" x="241" y="152">UpdateProperties()</text>
</g>
<g>
	<rect fill="#808080" stroke="none" stroke-opacity="1" x="247" y="187" width="3" height="111" />
	<rect fill="#808080" stroke="none" stroke-opacity="1" x="177" y="295" width="73" height="3" />
	<rect fill="#ffffc0" stroke="black" stroke-width="1" stroke-opacity="1" x="173" y="183" width="74" height="112" />
	<text font-family="Helvetica" font-size="9" fill="#000000" xml:space="preserve" text-anchor="middle" x="210" y="194">&lt;&lt;RCI&gt;&gt;</text>
	<text font-family="Helvetica" font-size="9" fill="#000000" xml:space="preserve" font-weight="bold" text-anchor="middle" x="210" y="210">Track</text>
	<line stroke="black" stroke-opacity="1" x1="173" y1="215" x2="247" y2="215" />
	<line stroke="black" stroke-opacity="1" x1="173" y1="223" x2="247" y2="223" />
	<text font-family="Helvetica" font-size="9" fill="#000000" xml:space="preserve" x="177" y="234">PutOnPitLane()</text>
	<text font-family="Helvetica" font-size="9" fill="#000000" xml:space="preserve" x="177" y="248">StartRace()</text>
	<text font-family="Helvetica" font-size="9" fill="#000000" xml:space="preserve" x="177" y="262">ReadTrackConf()</text>
	<text font-family="Helvetica" font-size="9" fill="#000000" xml:space="preserve" x="177" y="276">Kill()</text>
	<text font-family="Helvetica" font-size="9" fill="#000000" xml:space="preserve" x="177" y="290">CallForPitStop()</text>
</g>
<g>
	<rect fill="#808080" stroke="none" stroke-opacity="1" x="492" y="376" width="3" height="31" />
	<rect fill="#808080" stroke="none" stroke-opacity="1" x="448" y="404" width="47" height="3" />
	<rect fill="#ffffc0" stroke="black" stroke-width="1" stroke-opacity="1" x="444" y="372" width="48" height="32" />
	<text font-family="Helvetica" font-size="9" fill="#000000" xml:space="preserve" font-weight="bold" text-anchor="middle" x="468" y="383">Statistics</text>
	<line stroke="black" stroke-opacity="1" x1="444" y1="388" x2="492" y2="388" />
	<line stroke="black" stroke-opacity="1" x1="444" y1="396" x2="492" y2="396" />
</g>
<g>
	<rect fill="#808080" stroke="none" stroke-opacity="1" x="232" y="330" width="3" height="67" />
	<rect fill="#808080" stroke="none" stroke-opacity="1" x="188" y="394" width="47" height="3" />
	<rect fill="#ffffc0" stroke="black" stroke-width="1" stroke-opacity="1" x="184" y="326" width="48" height="68" />
	<text font-family="Helvetica" font-size="9" fill="#000000" xml:space="preserve" font-weight="bold" text-anchor="middle" x="208" y="337">Sector</text>
	<line stroke="black" stroke-opacity="1" x1="184" y1="342" x2="232" y2="342" />
	<line stroke="black" stroke-opacity="1" x1="184" y1="350" x2="232" y2="350" />
	<text font-family="Helvetica" font-size="9" fill="#000000" xml:space="preserve" x="188" y="361">Enter()</text>
	<text font-family="Helvetica" font-size="9" fill="#000000" xml:space="preserve" x="188" y="375">Release()</text>
	<text font-family="Helvetica" font-size="9" fill="#000000" xml:space="preserve" x="188" y="389">BookExit()</text>
</g>
<g>
	<rect fill="#808080" stroke="none" stroke-opacity="1" x="513" y="210" width="3" height="97" />
	<rect fill="#808080" stroke="none" stroke-opacity="1" x="433" y="304" width="83" height="3" />
	<rect fill="#ffffc0" stroke="black" stroke-width="1" stroke-opacity="1" x="429" y="206" width="84" height="98" />
	<text font-family="Helvetica" font-size="9" fill="#000000" xml:space="preserve" text-anchor="middle" x="471" y="217">&lt;&lt;RT&gt;&gt;</text>
	<text font-family="Helvetica" font-size="9" fill="#000000" xml:space="preserve" font-weight="bold" text-anchor="middle" x="471" y="233">Monitor</text>
	<line stroke="black" stroke-opacity="1" x1="429" y1="238" x2="513" y2="238" />
	<line stroke="black" stroke-opacity="1" x1="429" y1="246" x2="513" y2="246" />
	<text font-family="Helvetica" font-size="9" fill="#000000" xml:space="preserve" x="433" y="257">UpdateMonitor()</text>
	<text font-family="Helvetica" font-size="9" fill="#000000" xml:space="preserve" x="433" y="271">UpdateBestLap()</text>
	<text font-family="Helvetica" font-size="9" fill="#000000" xml:space="preserve" x="433" y="285">UpdateMaxSpeed()</text>
	<text font-family="Helvetica" font-size="9" fill="#000000" xml:space="preserve" x="433" y="299">EndRace()</text>
</g>
<g>
	<rect fill="#808080" stroke="none" stroke-opacity="1" x="392" y="189" width="3" height="139" />
	<rect fill="#808080" stroke="none" stroke-opacity="1" x="312" y="325" width="83" height="3" />
	<rect fill="#ffffc0" stroke="black" stroke-width="1" stroke-opacity="1" x="308" y="185" width="84" height="140" />
	<text font-family="Helvetica" font-size="9" fill="#000000" xml:space="preserve" text-anchor="middle" x="350" y="196">&lt;&lt;RCI&gt;&gt;</text>
	<text font-family="Helvetica" font-size="9" fill="#000000" xml:space="preserve" font-weight="bold" text-anchor="middle" x="350" y="212">Controller</text>
	<line stroke="black" stroke-opacity="1" x1="308" y1="217" x2="392" y2="217" />
	<line stroke="black" stroke-opacity="1" x1="308" y1="225" x2="392" y2="225" />
	<text font-family="Helvetica" font-size="9" fill="#000000" xml:space="preserve" x="312" y="236">RegisterCar()</text>
	<text font-family="Helvetica" font-size="9" fill="#000000" xml:space="preserve" x="312" y="250">RegisterRace()</text>
	<text font-family="Helvetica" font-size="9" fill="#000000" xml:space="preserve" x="312" y="264">RegisterMonitor()</text>
	<text font-family="Helvetica" font-size="9" fill="#000000" xml:space="preserve" x="312" y="278">UnregisterMonitor()</text>
	<text font-family="Helvetica" font-size="9" fill="#000000" xml:space="preserve" x="312" y="292">GetCar()</text>
	<text font-family="Helvetica" font-size="9" fill="#000000" xml:space="preserve" x="312" y="306">GetRace()</text>
	<text font-family="Helvetica" font-size="9" fill="#000000" xml:space="preserve" x="312" y="320">GetMonitor()</text>
</g>
<g>
	<rect fill="#808080" stroke="none" stroke-opacity="1" x="390" y="354" width="3" height="83" />
	<rect fill="#808080" stroke="none" stroke-opacity="1" x="316" y="434" width="77" height="3" />
	<rect fill="#ffffc0" stroke="black" stroke-width="1" stroke-opacity="1" x="312" y="350" width="78" height="84" />
	<text font-family="Helvetica" font-size="9" fill="#000000" xml:space="preserve" text-anchor="middle" x="351" y="361">&lt;&lt;RT&gt;&gt;</text>
	<text font-family="Helvetica" font-size="9" fill="#000000" xml:space="preserve" font-weight="bold" text-anchor="middle" x="351" y="377">Race</text>
	<line stroke="black" stroke-opacity="1" x1="312" y1="382" x2="390" y2="382" />
	<line stroke="black" stroke-opacity="1" x1="312" y1="390" x2="390" y2="390" />
	<text font-family="Helvetica" font-size="9" fill="#000000" xml:space="preserve" x="316" y="401">UpdateStatistics()</text>
	<text font-family="Helvetica" font-size="9" fill="#000000" xml:space="preserve" x="316" y="415">RegisterCar()</text>
	<text font-family="Helvetica" font-size="9" fill="#000000" xml:space="preserve" x="316" y="429">Kill()</text>
</g>
<g>
	<rect fill="#808080" stroke="none" stroke-opacity="1" x="234" y="429" width="3" height="39" />
	<rect fill="#808080" stroke="none" stroke-opacity="1" x="192" y="465" width="45" height="3" />
	<rect fill="#ffffc0" stroke="black" stroke-width="1" stroke-opacity="1" x="188" y="425" width="46" height="40" />
	<text font-family="Helvetica" font-size="9" fill="#000000" xml:space="preserve" font-weight="bold" text-anchor="middle" x="211" y="436">Lane</text>
	<line stroke="black" stroke-opacity="1" x1="188" y1="441" x2="234" y2="441" />
	<line stroke="black" stroke-opacity="1" x1="188" y1="449" x2="234" y2="449" />
	<text font-family="Helvetica" font-size="9" fill="#000000" xml:space="preserve" x="192" y="460">Demand()</text>
</g>
<g>
	<text font-family="Helvetica" font-size="9" fill="#000000" xml:space="preserve" x="184" y="318">1..*</text>
</g>
<g>
	<text font-family="Helvetica" font-size="9" fill="#000000" xml:space="preserve" x="185" y="417">1..*</text>
</g>
<g>
	<text font-family="Helvetica" font-size="9" fill="#000000" xml:space="preserve" x="428" y="405">1</text>
</g>
</svg>
