<?xml version="1.0" encoding="UTF-8" standalone="no"?>
<!-- Created with Inkscape (http://www.inkscape.org/) -->

<svg
   xmlns:dc="http://purl.org/dc/elements/1.1/"
   xmlns:cc="http://creativecommons.org/ns#"
   xmlns:rdf="http://www.w3.org/1999/02/22-rdf-syntax-ns#"
   xmlns:svg="http://www.w3.org/2000/svg"
   xmlns="http://www.w3.org/2000/svg"
   xmlns:sodipodi="http://sodipodi.sourceforge.net/DTD/sodipodi-0.dtd"
   xmlns:inkscape="http://www.inkscape.org/namespaces/inkscape"
   width="3.3866668mm"
   height="3.9640934mm"
   viewBox="0 0 12 14.046"
   id="svg12893"
   version="1.1"
   inkscape:version="0.91 r13725"
   sodipodi:docname="tails-locked.svg">
  <defs
     id="defs12895" />
  <sodipodi:namedview
     id="base"
     pagecolor="#ffffff"
     bordercolor="#666666"
     borderopacity="1.0"
     inkscape:pageopacity="0.0"
     inkscape:pageshadow="2"
     inkscape:zoom="7.9195959"
     inkscape:cx="69.800165"
     inkscape:cy="-15.632092"
     inkscape:document-units="px"
     inkscape:current-layer="layer1"
     showgrid="false"
     fit-margin-top="0"
     fit-margin-left="0"
     fit-margin-right="0"
     fit-margin-bottom="0"
     inkscape:window-width="1280"
     inkscape:window-height="773"
     inkscape:window-x="0"
     inkscape:window-y="27"
     inkscape:window-maximized="1" />
  <metadata
     id="metadata12898">
    <rdf:RDF>
      <cc:Work
         rdf:about="">
        <dc:format>image/svg+xml</dc:format>
        <dc:type
           rdf:resource="http://purl.org/dc/dcmitype/StillImage" />
        <dc:title></dc:title>
      </cc:Work>
    </rdf:RDF>
  </metadata>
  <g
     inkscape:label="Calque 1"
     inkscape:groupmode="layer"
     id="layer1"
     transform="translate(-369,-525.3392)">
    <path
       style="fill:#000000"
       d="M 6 0 C 3.622 0 2 1.9286406 2 4.3066406 L 2 6.046875 L 0 6.046875 L 0 14.046875 L 12 14.046875 L 12 6.046875 L 10 6.046875 L 10 4.3066406 C 10 1.9276406 8.378 0 6 0 z M 5.9980469 2.046875 C 7.0800469 2.046875 8 3.0464688 8 4.4804688 L 8 6.046875 L 4 6.046875 L 4 4.3085938 C 4 3.0465938 4.9180469 2.046875 5.9980469 2.046875 z "
       transform="translate(369,525.3392)"
       id="path8047" />
  </g>
</svg>
