%!PS-Adobe-2.0 EPSF-1.2
%%Title: web_0
%%Creator: tcldot version 1.7.9 (Thu Sep  6 12:18:28 CEST 2001)
%%CreationDate: Sep 16 11:51
%%For: (www-data) www-data
%%Pages: 1
%%DocumentFonts: Times-Roman
%%BoundingBox: 34 44 254 589
%%BeginPreview: 221 544 1 544
% 00000000000000000000000000b80000000000000000000000000000
% 00000000000000000000007ffffffe00000000000000000000000000
% 000000000000000000000ee800000ee0000000000000000000000000
% 00000000000000000000fe000000007f000000000000000000000000
% 00000000000000000003a00000000003a00000000000000000000000
% 0000000000000000001e000000000000780000000000000000000000
% 000000000000000000e80000000000000f0000000000000000000000
% 000000000000000003c000000000000003c000000000000000000000
% 0000000000000000030000000000000000a000000000000000000000
% 00000000000000001c00000000780000003800000000000000000000
% 000000000000000028000000006c0000000c00000000000000000000
% 00000000000000006000000000440000000600000000000000000000
% 00000000000000018000000074440000000380000000000000000000
% 0000000000000003800000001c4400000001c0000000000000000000
% 000000000000000700000000184400000000e0000000000000000000
% 0000000000000006000000001c440000000060000000000000000000
% 000000000000000800000000346c0000000030000000000000000000
% 000000000000000c0000000027380000000030000000000000000000
% 00000000000000080000000000000000000008000000000000000000
% 00000000000000180000000000000000000018000000000000000000
% 00000000000000100000000000000000000008000000000000000000
% 0000000000000030000000000000000000000c000000000000000000
% 0000000000000020000000000000000000000c000000000000000000
% 0000000000000030000000000000000000000c000000000000000000
% 00000000000000300000000000000000000008000000000000000000
% 0000000000000010001f1c9c003e31c8dc0008000000000000000000
% 00000000000000080021900400431100440008000000000000000000
% 00000000000000180041900400832100840018000000000000000000
% 00000000000000080040918400810118040030000000000000000000
% 000000000000000c00409085fe810108040030000000000000000000
% 00000000000000060040908400810108040060000000000000000000
% 000000000000000700609085fec101080400e0000000000000000000
% 00000000000000038061108400c20108040180000000000000000000
% 0000000000000001c03e10c4007c010c040380000000000000000000
% 00000000000000006000100400000100040600000000000000000000
% 00000000000000003800100400000100041c00000000000000000000
% 000000000000000018001c1c000001c01c3800000000000000000000
% 0000000000000000070000000000000000e000000000000000000000
% 000000000000000003c000000000000003c000000000000000000000
% 000000000000000000f80000000000001f0000000000000000000000
% 0000000000000000001a000000000000380000000000000000000000
% 00000000000000000007e00000000007e00000000000000000000000
% 00000000000000000000ee000000006e000000000000000000000000
% 000000000000000000000ff800001ff0000000000000000000000000
% 00000000000000000000003bbbbbba00000000000000000000000000
% 0000000000000000000000001f000000000000000000000000000000
% 00000000000000000000000000800000000000000000000000000000
% 00000000000000000000000000800000000000000000000000000000
% 00000000000000000000000000800000000000000000000000000000
% 00000000000000000000000000800000000000000000000000000000
% 00000000000000000000000000800000000000000000000000000000
% 00000000000000000000000000800000000000000000000000000000
% 00000000000000000000000000800000000000000000000000000000
% 00000000000000000000000000800000000000000000000000000000
% 00000000000000000000000000800000000000000000000000000000
% 00000000000000000000000000800000000000000000000000000000
% 00000000000000000000000000800000000000000000000000000000
% 00000000000000000000000000800000000000000000000000000000
% 00000000000000000000000000800000000000000000000000000000
% 00000000000000000000000000800000000000000000000000000000
% 00000000000000000000000000800000000000000000000000000000
% 00000000000000000000000000800000000000000000000000000000
% 00000000000000000000000000800000000000000000000000000000
% 00000000000000000000000000800000000000000000000000000000
% 00000000000000000000000000800000000000000000000000000000
% 00000000000000000000000000800000000000000000000000000000
% 00000000000000000000000000807c78000000000000000000000000
% 00000000000000000000000000804c6c000000000000000000000000
% 00000000000000000000000000804444000000000000000000000000
% 00000000000000000000000000804c44000000000000000000000000
% 00000000000000000000000000807844000000000000000000000000
% 00000000000000000000000000805844000000000000000000000000
% 00000000000000000000000000804c44000000000000000000000000
% 0000000000000000000000000080466c000000000000000000000000
% 0000000000000000000000000080c338000000000000000000000000
% 00000000000000000000000000800000000000000000000000000000
% 00000000000000000000000000800000000000000000000000000000
% 00000000000000000000000000800000000000000000000000000000
% 00000000000000000000000000800000000000000000000000000000
% 00000000000000000000000000800000000000000000000000000000
% 00000000000000000000000000800000000000000000000000000000
% 00000000000000000000000000800000000000000000000000000000
% 00000000000000000000000000800000000000000000000000000000
% 00000000000000000000000000800000000000000000000000000000
% 00000000000000000000000000800000000000000000000000000000
% 00000000000000000000000000800000000000000000000000000000
% 00000000000000000000000000800000000000000000000000000000
% 00000000000000000000000000800000000000000000000000000000
% 00000000000000000000000003e00000000000000000000000000000
% 00000000000000000000000003e00000000000000000000000000000
% 00000000000000000000000003e00000000000000000000000000000
% 00000000000000000000000003c00000000000000000000000000000
% 00000000000000000000000001c00000000000000000000000000000
% 00000000000000000000000001c00000000000000000000000000000
% 00000000000000000000000001800000000000000000000000000000
% 00000000000000000000000001800000000000000000000000000000
% 00000000000000000000000001800000000000000000000000000000
% 00000000000000000000000000000000000000000000000000000000
% 00000000000000000000000000ec0000000000000000000000000000
% 0000000000000000000000ffffffff00000000000000000000000000
% 000000000000000000001bb000000bb8000000000000000000000000
% 00000000000000000001fc000000003f800000000000000000000000
% 0000000000000000000fc00000000003e00000000000000000000000
% 0000000000000000007c0000000000003e0000000000000000000000
% 000000000000000003a0000000000000038000000000000000000000
% 00000000000000000f0000000000000000f000000000000000000000
% 00000000000000002c00000000000000002c00000000000000000000
% 00000000000000007000000000100000000e00000000000000000000
% 00000000000000018000000000100000000380000000000000000000
% 000000000000000380000000001000000001c0000000000000000000
% 00000000000000060000000074100000000060000000000000000000
% 000000000000000c000000001c100000000030000000000000000000
% 00000000000000180000000018100000000018000000000000000000
% 0000000000000030000000001c10000000000c000000000000000000
% 00000000000000600000000034100000000006000000000000000000
% 000000000000006000000000273c0000000006000000000000000000
% 00000000000000800000000000000000000003000000000000000000
% 00000000000000c00000000000000000000003000000000000000000
% 00000000000000800000000000000000000001000000000000000000
% 00000000000000800000000000000000000001000000000000000000
% 00000000000001800000000000000000000001800000000000000000
% 00000000000001800000000000000000000001800000000000000000
% 00000000000000800000000000000000000000000000000000000000
% 0000000000000080039c9c01e731c8c0038001000000000000000000
% 00000000000000800090040066110040008003000000000000000000
% 00000000000000c00090040034210080008003000000000000000000
% 00000000000000600091840018011800f88006000000000000000000
% 0000000000000060009085fe18010800888006000000000000000000
% 0000000000000030009084003c010800888008000000000000000000
% 0000000000000018009085fe66010800888018000000000000000000
% 000000000000000c0090840046010800888020000000000000000000
% 000000000000000601f0c400c7010c0cc88060000000000000000000
% 00000000000000038010040000010004008180000000000000000000
% 0000000000000001c010040000010008008380000000000000000000
% 0000000000000000601c1c000001c000038e00000000000000000000
% 00000000000000003c00000000000000003c00000000000000000000
% 00000000000000000b0000000000000000b000000000000000000000
% 000000000000000003e000000000000007c000000000000000000000
% 0000000000000000006c0000000000002e0000000000000000000000
% 0000000000000000000fc00000000003f00000000000000000000000
% 00000000000000000001b8000000003b800000000000000000000000
% 000000000000000000001ff000000ff8000000000000000000000000
% 0000000000000000000000efefefef00000000000000000000000000
% 0000000000000000000000003f000000000000000000000000000000
% 00000000000000000000000000800000000000000000000000000000
% 00000000000000000000000000800000000000000000000000000000
% 00000000000000000000000000800000000000000000000000000000
% 00000000000000000000000000800000000000000000000000000000
% 00000000000000000000000000800000000000000000000000000000
% 00000000000000000000000000800000000000000000000000000000
% 00000000000000000000000000800000000000000000000000000000
% 00000000000000000000000000800000000000000000000000000000
% 00000000000000000000000000800000000000000000000000000000
% 00000000000000000000000000800000000000000000000000000000
% 00000000000000000000000000800000000000000000000000000000
% 00000000000000000000000000800000000000000000000000000000
% 00000000000000000000000000800000000000000000000000000000
% 00000000000000000000000000800000000000000000000000000000
% 00000000000000000000000000800000000000000000000000000000
% 00000000000000000000000000800000000000000000000000000000
% 00000000000000000000000000800000000000000000000000000000
% 00000000000000000000000000800000000000000000000000000000
% 00000000000000000000000000800000000000000000000000000000
% 00000000000000000000000000800000000000000000000000000000
% 00000000000000000000000000807c10000000000000000000000000
% 00000000000000000000000000804c10000000000000000000000000
% 00000000000000000000000000804410000000000000000000000000
% 00000000000000000000000000804c10000000000000000000000000
% 00000000000000000000000000807810000000000000000000000000
% 00000000000000000000000000805810000000000000000000000000
% 00000000000000000000000000804c10000000000000000000000000
% 00000000000000000000000000804610000000000000000000000000
% 0000000000000000000000000080c33c000000000000000000000000
% 00000000000000000000000000800000000000000000000000000000
% 00000000000000000000000000800000000000000000000000000000
% 00000000000000000000000000800000000000000000000000000000
% 00000000000000000000000000800000000000000000000000000000
% 00000000000000000000000000800000000000000000000000000000
% 00000000000000000000000000800000000000000000000000000000
% 00000000000000000000000000800000000000000000000000000000
% 00000000000000000000000000800000000000000000000000000000
% 00000000000000000000000000800000000000000000000000000000
% 00000000000000000000000000800000000000000000000000000000
% 00000000000000000000000000800000000000000000000000000000
% 00000000000000000000000000800000000000000000000000000000
% 00000000000000000000000000800000000000000000000000000000
% 00000000000000000000000003e00000000000000000000000000000
% 00000000000000000000000003e00000000000000000000000000000
% 00000000000000000000000003e00000000000000000000000000000
% 00000000000000000000000003c00000000000000000000000000000
% 00000000000000000000000001c00000000000000000000000000000
% 00000000000000000000000001c00000000000000000000000000000
% 00000000000000000000000001800000000000000000000000000000
% 00000000000000000000000001800000000000000000000000000000
% 00000000000000000000000001800000000000000000000000000000
% 00000000000000000000000000000000000000000000000000000000
% 00000000000000000000000000b80000000000000000000000000000
% 0000000000000000000000ffffffff00000000000000000000000000
% 000000000000000000000fe000000fe8000000000000000000000000
% 00000000000000000001fc000000003f800000000000000000000000
% 0000000000000000000b800000000003b00000000000000000000000
% 0000000000000000007c0000000000003e0000000000000000000000
% 000000000000000002e000000000000006c000000000000000000000
% 00000000000000000f0000000000000000f000000000000000000000
% 00000000000000003800000000000000003800000000000000000000
% 00000000000000007000000000780000000e00000000000000000000
% 0000000000000001c000000000cc0000000380000000000000000000
% 000000000000000380000000000400000001c0000000000000000000
% 00000000000000020000000074040000000020000000000000000000
% 000000000000000c000000001c080000000030000000000000000000
% 00000000000000080000000018180000000008000000000000000000
% 0000000000000030000000001c20000000000c000000000000000000
% 00000000000000200000000034620000000002000000000000000000
% 000000000000006000000000277c0000000006000000000000000000
% 00000000000000c00000000000000000000003000000000000000000
% 00000000000000c00000000000000000000003000000000000000000
% 00000000000000800000000000000000000001000000000000000000
% 00000000000000800000000000000000000001000000000000000000
% 00000000000000800000000000000000000000800000000000000000
% 00000000000001800000000000000000000001800000000000000000
% 00000000000000800000000000000000000001000000000000000000
% 000000000000008007393801e733918099c001000000000000000000
% 00000000000000c00120080066120080084003000000000000000000
% 00000000000000c00120080034220100904003000000000000000000
% 00000000000000200123080018023001804002000000000000000000
% 0000000000000060012109fe18021000804006000000000000000000
% 0000000000000020012108003c02100080400c000000000000000000
% 0000000000000018012109fe66021000804018000000000000000000
% 00000000000000080121080046021000804030000000000000000000
% 000000000000000603e18800c702180c804060000000000000000000
% 000000000000000380200800000200048041c0000000000000000000
% 0000000000000001c020080000020008804380000000000000000000
% 0000000000000000303838000003800701ca00000000000000000000
% 00000000000000003c00000000000000003c00000000000000000000
% 00000000000000000e0000000000000000e000000000000000000000
% 000000000000000003e000000000000007c000000000000000000000
% 000000000000000000380000000000003a0000000000000000000000
% 0000000000000000000fc00000000003f00000000000000000000000
% 00000000000000000001ec000000002f800000000000000000000000
% 000000000000000000001ff000000ff8c00000000000000000000000
% 0000000000000000000000bbbbbbbb00600000000000000000000000
% 0000000000000000000000c03f000000780000000000000000000000
% 000000000000000000000180000c00003e0000000000000000000000
% 000000000000000000000300000400001f8000000000000000000000
% 000000000000000000000300000400000f8000000000000000000000
% 000000000000000000000600000600000f8000000000000000000000
% 000000000000000000000c000006000006c000000000000000000000
% 000000000000000000000c0000020000006000000000000000000000
% 00000000000000000000180000030000003800000000000000000000
% 00000000000000000000300000030000001c00000000000000000000
% 00000000000000000000300000030000000e00000000000000000000
% 00000000000000000000600000010000000300000000000000000000
% 00000000000000000000c00000010000000180000000000000000000
% 00000000000000000000c000000180000000c0000000000000000000
% 00000000000000000001800000018000000070000000000000000000
% 00000000000000000003000000008000000038000000000000000000
% 0000000000000000000300000000800000001c000000000000000000
% 0000000000000000000600000000c00000000e000000000000000000
% 0000000000000000000c00000000c000000007000000000000000000
% 0000000000000000000c000000004000000003800000000000000000
% 00000000000000000018000000004000000001800000000000000000
% 00000000000000000030000000006000000000800001000000000000
% 000000000000000000700f8f00006001f0f000c00f83000000000000
% 00000000000000000060099980002001310000c00984000000000000
% 000000000000000000c008808000200111c00040088c000000000000
% 0000000000000000018009808000300131e00060098f000000000000
% 000000000000000001800f0100003001e03000600f09800000000000
% 000000000000000003000b0300001001601000200b08800000000000
% 00000000000000000600098400001001301000200988800000000000
% 0000000000000000060008cc400018011830003008cc800000000000
% 00000000000000000c00186f800018030fe000301867000000000000
% 00000000000000001800000000000800000000300000000000000000
% 00000000000000001800000000000800000000100000000000000000
% 00000000000000003000000000000c00000000100000000000000000
% 00000000000000006000000000000c00000000180000000000000000
% 0000000000000000e000000000000600000000180000000000000000
% 0000000000000000c000000000000600000000180000000000000000
% 00000000000000018000000000000300000000180000000000000000
% 00000000000000030000000000000300000000080000000000000000
% 00000000000000030000000000000180000000080000000000000000
% 00000000000000060000000000000180000000080000000000000000
% 000000000000000c00000000000000c00000000c0000000000000000
% 000000000000000c00000000000000600000000c0000000000000000
% 000000000000001800000000000000600000000c0000000000000000
% 000000000000003000000000000000300000000c0000000000000000
% 000000000000003000000000000000180000000c0000000000000000
% 00000000000001600000000000000018000000040000000000000000
% 00000000000003c0000000000000000c000000040000000000000000
% 00000000000003e00000000000000006c00000040000000000000000
% 00000000000003e00000000000000003c00000040000000000000000
% 00000000000007c00000000000000003e00000040000000000000000
% 00000000000007800000000000000007e00000060000000000000000
% 00000000000007000000000000000007f00000060000000000000000
% 0000000000000e000000000000000001f00000060000000000000000
% 0000000003c00c00000000000000000078000000ee00000000000000
% 0000003fffffc80000000000000000001c07ffffffffe00000000000
% 000003b80001b80000000000000000000dbb80000003bb8000000000
% 00001f0000000f8000000000000000003fc00000000003fc00000000
% 0000e800000000e00000000000000002e80000000000000ec0000000
% 0003c0000000003c000000000000003f0000000000000000fc000000
% 000b00000000000b00000000000001b800000000000000001b800000
% 003c000000000003c0000000000007c0000000000000000003e00000
% 0060000000000000e000000000000e00000000000800000000680000
% 00c0000001f0000030000000000078000000000018000000001e0000
% 03800000011000001800000000018000000000002000000000038000
% 07000000003000000e0000000007000000000000600000000000e000
% 06000001d060000006000000000e0000000000747800000000006000
% 0c0000007070000003000000003800000000001c4c00000000001c00
% 18000000601000000180000000300000000000184400000000000a00
% 300000007010000000c00000006000000000001c4400000000000600
% 20000000d010000000c0000000c00000000000346400000000000300
% 600000009de000000060000001800000000000273800000000000180
% 20000000000000000020000003000000000000000000000000000080
% 400000000000000000200000030000000000000000000000000000c0
% 40000000000000000020000002000000000000000000000000000040
% c0000000000000000030000002000000000000000000000000000040
% 80000000000000000030000002000000000000000000000000000020
% c0000000000000000030000006000000000000000000000000000060
% c0000000000000000020000002000000000000000000000000000040
% 40038e9c00e723700020000002001c74e0079cc74600080026e00040
% 00008804002401100020000003000440200198440200080002200080
% 600088040024021000600000030004402000d08404000810242000c0
% 6000898400246010006000000080044c20006004c000081060200080
% 30008884ff24201000c0000000c0044427f860044000081020200300
% 300088840024201000800000002004442000f004400708ff20200200
% 18008884ff242010018000000070044427f998044000081020200e00
% 0c008884002420100300000000280444200118044000081020200c00
% 0601e8c4007c301006000000000e0f4620031c0460301e1020207000
% 03000804000400100a0000000003004020000004001000002020a000
% 03800804000400101c0000000001c040200000040020000020238000
% 00c00e1c000700702000000000006870e000000700000001c0ee0000
% 0070000000000000e000000000001e00000000000000000000780000
% 00380000000000038000000000000380000000000000000003a00000
% 000f00000000000f00000000000001f800000000000000001f800000
% 0003c0000000002c000000000000002f0000000000000000ec000000
% 0000f800000001f00000000000000003f80000000000001fc0000000
% 00001b0000000b8000000000000000003b800000000003b800000000
% 000003f80001fc00000000000000000001ffc0000003ff8000000000
% 0000002eeeeec00000000000000000000006eeeeeeeee00000000000
% 000000003c00000000000000000000000000007f0000000000000000
% 00000000020000000000000000000000000000000000000000000000
% 00000000020000000000000000000000000000000000000000000000
% 00000000020000000000000000000000000000000000000000000000
% 00000000020000000000000000000000000000000000000000000000
% 00000000020000000000000000000000000000000000000000000000
% 00000000020000000000000000000000000000000000000000000000
% 00000000020000000000000000000000000000000000000000000000
% 00000000020000000000000000000000000000000000000000000000
% 00000000020000000000000000000000000000000000000000000000
% 00000000020000000000000000000000000000000000000000000000
% 00000000020000000000000000000000000000000000000000000000
% 00000000020000000000000000000000000000000000000000000000
% 00000000020000000000000000000000000000000000000000000000
% 00000000020000000000000000000000000000000000000000000000
% 00000000020000000000000000000000000000000000000000000000
% 00000000020000000000000000000000000000000000000000000000
% 00000000020000000000000000000000000000000000000000000000
% 00000000020000000000000000000000000000000000000000000000
% 00000000020000000000000000000000000000000000000000000000
% 00000000020000000000000000000000000000000000000000000000
% 000000000201f1f00000000000000000000000000000000000000000
% 00000000020131100000000000000000000000000000000000000000
% 00000000020110300000000000000000000000000000000000000000
% 00000000020130600000000000000000000000000000000000000000
% 000000000201e0700000000000000000000000000000000000000000
% 00000000020160100000000000000000000000000000000000000000
% 00000000020130100000000000000000000000000000000000000000
% 00000000020118100000000000000000000000000000000000000000
% 0000000002030de00000000000000000000000000000000000000000
% 00000000020000000000000000000000000000000000000000000000
% 00000000020000000000000000000000000000000000000000000000
% 00000000020000000000000000000000000000000000000000000000
% 00000000020000000000000000000000000000000000000000000000
% 00000000020000000000000000000000000000000000000000000000
% 00000000020000000000000000000000000000000000000000000000
% 00000000020000000000000000000000000000000000000000000000
% 00000000020000000000000000000000000000000000000000000000
% 00000000020000000000000000000000000000000000000000000000
% 00000000020000000000000000000000000000000000000000000000
% 00000000020000000000000000000000000000000000000000000000
% 00000000020000000000000000000000000000000000000000000000
% 00000000020000000000000000000000000000000000000000000000
% 000000000f8000000000000000000000000000000000000000000000
% 000000000f8000000000000000000000000000000000000000000000
% 000000000f8000000000000000000000000000000000000000000000
% 000000000f0000000000000000000000000000000000000000000000
% 00000000070000000000000000000000000000000000000000000000
% 00000000070000000000000000000000000000000000000000000000
% 00000000060000000000000000000000000000000000000000000000
% 00000000060000000000000000000000000000000000000000000000
% 00000000060000000000000000000000000000000000000000000000
% 00000000000000000000000000000000000000000000000000000000
% 00000000038000000000000000000000000000000000000000000000
% 0000003fffffc0000000000000000000000000000000000000000000
% 000002e80000ec000000000000000000000000000000000000000000
% 00001f0000000f800000000000000000000000000000000000000000
% 0000b800000001b00000000000000000000000000000000000000000
% 0003c0000000003c0000000000000000000000000000000000000000
% 000f00000000000f0000000000000000000000000000000000000000
% 003c000000000003c000000000000000000000000000000000000000
% 0030000000000000a000000000000000000000000000000000000000
% 00c00000002000003000000000000000000000000000000000000000
% 02800000006000000c00000000000000000000000000000000000000
% 07000000006000000e00000000000000000000000000000000000000
% 02000001d06000000200000000000000000000000000000000000000
% 0c000000716000000300000000000000000000000000000000000000
% 08000000626000000180000000000000000000000000000000000000
% 3000000073f8000000c0000000000000000000000000000000000000
% 30000000d02000000080000000000000000000000000000000000000
% 600000009c2000000060000000000000000000000000000000000000
% 60000000000000000060000000000000000000000000000000000000
% 40000000000000000020000000000000000000000000000000000000
% 00000000000000000020000000000000000000000000000000000000
% c0000000000000000030000000000000000000000000000000000000
% c0000000000000000020000000000000000000000000000000000000
% c0000000000000000030000000000000000000000000000000000000
% 80000000000000000030000000000000000000000000000000000000
% 40038e9c00e723700020000000000000000000000000000000000000
% 40008804002401100020000000000000000000000000000000000000
% 60008804002402100060000000000000000000000000000000000000
% 20008984002460100020000000000000000000000000000000000000
% 30008884ff24201000c0000000000000000000000000000000000000
% 200088840024201000c0000000000000000000000000000000000000
% 18008884ff2420100180000000000000000000000000000000000000
% 08008884002420100300000000000000000000000000000000000000
% 0601e8c4007c30100600000000000000000000000000000000000000
% 06000804000400100e00000000000000000000000000000000000000
% 03800804000400101c00000000000000000000000000000000000000
% 00800e1c000700703000000000000000000000000000000000000000
% 0070000000000000e000000000000000000000000000000000000000
% 002c000000000003c000000000000000000000000000000000000000
% 000f00000000000f0000000000000000000000000000000000000000
% 00038000000000380000000000000000000000000000000000000000
% 0000f800000001f00000000000000000000000000000000000000000
% 00000e0000000e800000000000000000000000000000000000000000
% 000003f80001fc000000000000000000000000000000000000000000
% 0000003bbbbb80000000000000000000000000000000000000000000
% 000000003c0000000000000000000000000000000000000000000000
% 00000000020000000000000000000000000000000000000000000000
% 00000000020000000000000000000000000000000000000000000000
% 00000000020000000000000000000000000000000000000000000000
% 00000000020000000000000000000000000000000000000000000000
% 00000000020000000000000000000000000000000000000000000000
% 00000000020000000000000000000000000000000000000000000000
% 00000000020000000000000000000000000000000000000000000000
% 00000000020000000000000000000000000000000000000000000000
% 00000000020000000000000000000000000000000000000000000000
% 00000000020000000000000000000000000000000000000000000000
% 00000000020000000000000000000000000000000000000000000000
% 00000000020000000000000000000000000000000000000000000000
% 00000000020000000000000000000000000000000000000000000000
% 00000000020000000000000000000000000000000000000000000000
% 00000000020000000000000000000000000000000000000000000000
% 00000000020000000000000000000000000000000000000000000000
% 00000000020000000000000000000000000000000000000000000000
% 00000000020000000000000000000000000000000000000000000000
% 00000000020000000000000000000000000000000000000000000000
% 00000000020000000000000000000000000000000000000000000000
% 000000000201f0200000000000000000000000000000000000000000
% 00000000020130600000000000000000000000000000000000000000
% 00000000020110600000000000000000000000000000000000000000
% 00000000020130600000000000000000000000000000000000000000
% 000000000201e1600000000000000000000000000000000000000000
% 00000000020162600000000000000000000000000000000000000000
% 00000000020133f80000000000000000000000000000000000000000
% 00000000020118200000000000000000000000000000000000000000
% 0000000002030c200000000000000000000000000000000000000000
% 00000000020000000000000000000000000000000000000000000000
% 00000000020000000000000000000000000000000000000000000000
% 00000000020000000000000000000000000000000000000000000000
% 00000000020000000000000000000000000000000000000000000000
% 00000000020000000000000000000000000000000000000000000000
% 00000000020000000000000000000000000000000000000000000000
% 00000000020000000000000000000000000000000000000000000000
% 00000000020000000000000000000000000000000000000000000000
% 00000000020000000000000000000000000000000000000000000000
% 00000000020000000000000000000000000000000000000000000000
% 00000000020000000000000000000000000000000000000000000000
% 00000000020000000000000000000000000000000000000000000000
% 00000000020000000000000000000000000000000000000000000000
% 000000000f8000000000000000000000000000000000000000000000
% 000000000f8000000000000000000000000000000000000000000000
% 000000000f8000000000000000000000000000000000000000000000
% 000000000f0000000000000000000000000000000000000000000000
% 00000000070000000000000000000000000000000000000000000000
% 00000000070000000000000000000000000000000000000000000000
% 00000000060000000000000000000000000000000000000000000000
% 00000000060000000000000000000000000000000000000000000000
% 00000000060000000000000000000000000000000000000000000000
% 00000000000000000000000000000000000000000000000000000000
% 00000000028000000000000000000000000000000000000000000000
% 00000004545400000000000000000000000000000000000000000000
% 0000002a0002a0000000000000000000000000000000000000000000
% 00000100000010000000000000000000000000000000000000000000
% 0000028002800a000000000000000000000000000000000000000000
% 00000405454405000000000000000000000000000000000000000000
% 0000282a000a80800000000000000000000000000000000000000000
% 00000010000010100000000000000000000000000000000000000000
% 00008280000028280000000000000000000000000000000000000000
% 00000400000005040000000000000000000000000000000000000000
% 00020800000002820000000000000000000000000000000000000000
% 00001000000000010000000000000000000000000000000000000000
% 00082000000000208000000000000000000000000000000000000000
% 00004000004000010000000000000000000000000000000000000000
% 00208000000000088000000000000000000000000000000000000000
% 00010000010000000000000000000000000000000000000000000000
% 0022000080a000022000000000000000000000000000000000000000
% 00440000501000041000000000000000000000000000000000000000
% 00880000200000022000000000000000000000000000000000000000
% 00000000101000011000000000000000000000000000000000000000
% 00880000802000008800000000000000000000000000000000000000
% 01000000054000010000000000000000000000000000000000000000
% 00000000000000008800000000000000000000000000000000000000
% 01100000000000000000000000000000000000000000000000000000
% 00000000000000008800000000000000000000000000000000000000
% 01100000000000004400000000000000000000000000000000000000
% 02200000000000008800000000000000000000000000000000000000
% 01100000000000000000000000000000000000000000000000000000
% 02200000000000008800000000000000000000000000000000000000
% 01000005000000000000000000000000000000000000000000000000
% 00000000000800008800000000000000000000000000000000000000
% 01100001000000000000000000000000000000000000000000000000
% 00880000000800008800000000000000000000000000000000000000
% 00100000144000001000000000000000000000000000000000000000
% 00880000000800020000000000000000000000000000000000000000
% 00000001110000011000000000000000000000000000000000000000
% 00820000000800022000000000000000000000000000000000000000
% 00440001400400044000000000000000000000000000000000000000
% 00220000000000082000000000000000000000000000000000000000
% 00110000000000100000000000000000000000000000000000000000
% 00088000000000208000000000000000000000000000000000000000
% 00104000000000400000000000000000000000000000000000000000
% 00082000000000820000000000000000000000000000000000000000
% 00001000000001000000000000000000000000000000000000000000
% 00020a00000002080000000000000000000000000000000000000000
% 00014140000004000000000000000000000000000000000000000000
% 0000a0a00000a0200000000000000000000000000000000000000000
% 00001011000101000000000000000000000000000000000000000000
% 00000a02aaaa02800000000000000000000000000000000000000000
% 00000400140014000000000000000000000000000000000000000000
% 000000a0000028000000000000000000000000000000000000000000
% 00000010000100000000000000000000000000000000000000000000
% 00000002aaaa00000000000000000000000000000000000000000000
% 00000000040000000000000000000000000000000000000000000000
%%EndImage
%%EndPreview
save
countdictstack
mark
newpath
/showpage {} def
%%EndProlog
%%Page 1 1
save
/DotDict 200 dict def
DotDict begin

/coord-font-family /Times-Roman def
/default-font-family /Times-Roman def
/coordfont coord-font-family findfont 8 scalefont def

/InvScaleFactor 1.0 def
/set_scale {
	dup 1 exch div /InvScaleFactor exch def
	dup scale
} bind def

% styles
/solid { } bind def
/dashed { [9 InvScaleFactor mul dup ] 0 setdash } bind def
/dotted { [1 InvScaleFactor mul 6 InvScaleFactor mul] 0 setdash } bind def
/invis {/fill {newpath} def /stroke {newpath} def /show {pop newpath} def} bind def
/bold { 2 setlinewidth } bind def
/filled { } bind def
/unfilled { } bind def
/rounded { } bind def
/diagonals { } bind def

% hooks for setting color 
/nodecolor { sethsbcolor } bind def
/edgecolor { sethsbcolor } bind def
/graphcolor { sethsbcolor } bind def
/nopcolor {pop pop pop} bind def

/beginpage {	% i j npages
	/npages exch def
	/j exch def
	/i exch def
	/str 10 string def
	npages 1 gt {
		gsave
			coordfont setfont
			0 0 moveto
			(\() show i str cvs show (,) show j str cvs show (\)) show
		grestore
	} if
} bind def

/set_font {
	findfont exch
	scalefont setfont
} def

% draw aligned label in bounding box aligned to current point
% alignfactor tells what fraction to place on the left.
% -.5 is centered.
/alignedtext {			% text labelwidth fontsz alignfactor
	/alignfactor exch def
	/fontsz exch def
	/width exch def
	/text exch def
	gsave
		% even if node or edge is dashed, don't paint text with dashes
		[] 0 setdash
		currentpoint newpath moveto
		text stringwidth pop
		alignfactor mul fontsz -.3 mul rmoveto
		text show
	grestore
} def

/boxprim {				% xcorner ycorner xsize ysize
		4 2 roll
		moveto
		2 copy
		exch 0 rlineto
		0 exch rlineto
		pop neg 0 rlineto
		closepath
} bind def

/ellipse_path {
	/ry exch def
	/rx exch def
	/y exch def
	/x exch def
	matrix currentmatrix
	newpath
	x y translate
	rx ry scale
	0 0 1 0 360 arc
	setmatrix
} bind def

/endpage { showpage } bind def

/layercolorseq
	[	% layer color sequence - darkest to lightest
		[0 0 0]
		[.2 .8 .8]
		[.4 .8 .8]
		[.6 .8 .8]
		[.8 .8 .8]
	]
def

/setlayer {/maxlayer exch def /curlayer exch def
	layercolorseq curlayer get
	aload pop sethsbcolor
	/nodecolor {nopcolor} def
	/edgecolor {nopcolor} def
	/graphcolor {nopcolor} def
} bind def

/onlayer { curlayer ne {invis} if } def

/onlayers {
	/myupper exch def
	/mylower exch def
	curlayer mylower lt
	curlayer myupper gt
	or
	{invis} if
} def

/curlayer 0 def

14 default-font-family set_font
1 setmiterlimit
% /arrowlength 10 def
% /arrowwidth 5 def

% make sure pdfmark is harmless for PS-interpreters other than Distiller
/pdfmark where {pop} {userdict /pdfmark /cleartomark load put} ifelse
% make '<<' and '>>' safe on PS Level 1 devices
/languagelevel where {pop languagelevel}{1} ifelse
2 lt {
    userdict (<<) cvn ([) cvn load put
    userdict (>>) cvn ([) cvn load put
} if

gsave
35 35 219 562 boxprim clip newpath
36 36 translate
0 0 1 beginpage
0 0 translate 0 rotate
[ /CropBox [36 36 254 597] /PAGES pdfmark
0.000 0.000 0.000 graphcolor
14.00 /Times-Roman set_font

%	0
gsave 10 dict begin
0.667 1.000 1.000 nodecolor
103 529 45 22 ellipse_path
stroke
gsave 10 dict begin
0.000 0.000 0.000 nodecolor
103 538 moveto (x0) 14 14.00 -0.50 alignedtext
103 522 moveto (O[i]=O'[i']) 63 14.00 -0.50 alignedtext
end grestore
end grestore

%	1
gsave 10 dict begin
0.667 1.000 1.000 nodecolor
103 431 48 22 ellipse_path
stroke
gsave 10 dict begin
0.000 0.000 0.000 nodecolor
103 440 moveto (x1) 14 14.00 -0.50 alignedtext
103 424 moveto (I[i]=X'[i',n]) 68 14.00 -0.50 alignedtext
end grestore
end grestore

%	0 -> 1
gsave 10 dict begin
newpath 103 506 moveto
103 493 103 477 103 463 curveto
stroke
newpath 101 464 moveto
103 454 lineto
106 464 lineto
closepath
fill
gsave 10 dict begin
118 481 moveto (R0) 16 14.00 -0.50 alignedtext
end grestore
end grestore

%	2
gsave 10 dict begin
0.667 1.000 1.000 nodecolor
103 333 48 22 ellipse_path
stroke
gsave 10 dict begin
0.000 0.000 0.000 nodecolor
103 342 moveto (x2) 14 14.00 -0.50 alignedtext
103 326 moveto (I[i]=X'[i',j']) 70 14.00 -0.50 alignedtext
end grestore
end grestore

%	1 -> 2
gsave 10 dict begin
newpath 103 408 moveto
103 395 103 379 103 365 curveto
stroke
newpath 101 366 moveto
103 356 lineto
106 366 lineto
closepath
fill
gsave 10 dict begin
118 383 moveto (R1) 16 14.00 -0.50 alignedtext
end grestore
end grestore

%	3
gsave 10 dict begin
0.667 1.000 1.000 nodecolor
37 235 37 22 ellipse_path
stroke
gsave 10 dict begin
0.000 0.000 0.000 nodecolor
37 244 moveto (x3) 14 14.00 -0.50 alignedtext
37 228 moveto (I[i]=I[i']) 48 14.00 -0.50 alignedtext
end grestore
end grestore

%	2 -> 3
gsave 10 dict begin
newpath 88 311 moveto
79 297 66 279 56 264 curveto
stroke
newpath 54 266 moveto
51 256 lineto
58 263 lineto
closepath
fill
gsave 10 dict begin
89 285 moveto (R2) 16 14.00 -0.50 alignedtext
end grestore
end grestore

%	6
gsave 10 dict begin
0.667 1.000 1.000 nodecolor
159 235 58 22 ellipse_path
stroke
gsave 10 dict begin
0.000 0.000 0.000 nodecolor
159 244 moveto (x6) 14 14.00 -0.50 alignedtext
159 228 moveto (I[i]=X'[i',-1+j']) 89 14.00 -0.50 alignedtext
end grestore
end grestore

%	2 -> 6
gsave 10 dict begin
newpath 108 310 moveto
112 295 116 276 117 276 curveto
119 271 123 266 126 262 curveto
stroke
newpath 124 260 moveto
133 255 lineto
128 264 lineto
closepath
fill
gsave 10 dict begin
132 285 moveto (R5) 16 14.00 -0.50 alignedtext
end grestore
end grestore

%	4
gsave 10 dict begin
0.667 1.000 1.000 nodecolor
37 137 37 22 ellipse_path
stroke
gsave 10 dict begin
0.000 0.000 0.000 nodecolor
37 146 moveto (x4) 14 14.00 -0.50 alignedtext
37 130 moveto (I[i]=I[i']) 48 14.00 -0.50 alignedtext
end grestore
end grestore

%	3 -> 4
gsave 10 dict begin
newpath 37 212 moveto
37 199 37 183 37 169 curveto
stroke
newpath 35 170 moveto
37 160 lineto
40 170 lineto
closepath
fill
gsave 10 dict begin
52 187 moveto (R3) 16 14.00 -0.50 alignedtext
end grestore
end grestore

%	5
gsave 10 dict begin
0.333 1.000 1.000 nodecolor
37 35 27 22 ellipse_path
stroke
37 35 31 26 ellipse_path
stroke
gsave 10 dict begin
37 44 moveto (x5) 14 14.00 -0.50 alignedtext
37 28 moveto (I=I) 17 14.00 -0.50 alignedtext
end grestore
end grestore

%	4 -> 5
gsave 10 dict begin
newpath 37 114 moveto
37 102 37 86 37 72 curveto
stroke
newpath 35 72 moveto
37 62 lineto
40 72 lineto
closepath
fill
gsave 10 dict begin
52 89 moveto (R4) 16 14.00 -0.50 alignedtext
end grestore
end grestore

%	6 -> 2
gsave 10 dict begin
newpath 134 307 moveto
142 301 149 294 151 292 curveto
154 286 156 271 157 258 curveto
stroke
newpath 136 308 moveto
127 313 lineto
133 305 lineto
closepath
fill
gsave 10 dict begin
169 285 moveto (R6) 16 14.00 -0.50 alignedtext
end grestore
end grestore
endpage
grestore
%%Trailer
cleartomark
countdictstack exch sub { end } repeat
restore
%%EOF

