/* XPM */
static char * SpiralIcon_xpm[] = {
"36 36 274 2",
"  	c None",
". 	c #8B889B",
"+ 	c #9C99AA",
"@ 	c #ADAAB9",
"# 	c #837F94",
"$ 	c #7D7990",
"% 	c #9995A7",
"& 	c #67627C",
"* 	c #CDCBD4",
"= 	c #FCFCFC",
"- 	c #D1D0D8",
"; 	c #FFFFFF",
"> 	c #F1F1F3",
", 	c #848095",
"' 	c #2A2248",
") 	c #CFCED6",
"! 	c #68637D",
"~ 	c #ABA8B6",
"{ 	c #D5D3DB",
"] 	c #9490A2",
"^ 	c #C4C4C4",
"/ 	c #1D1C1D",
"( 	c #313134",
"_ 	c #EEEFEE",
": 	c #FBFBFB",
"< 	c #EFEFEF",
"[ 	c #7B768D",
"} 	c #464060",
"| 	c #DEDEE1",
"1 	c #CBCACC",
"2 	c #EEEEF1",
"3 	c #79758C",
"4 	c #FBFBFC",
"5 	c #A2A2A2",
"6 	c #000000",
"7 	c #F5F6F5",
"8 	c #747474",
"9 	c #2A2A2B",
"0 	c #403958",
"a 	c #7D788F",
"b 	c #C0BEC8",
"c 	c #BCBAC6",
"d 	c #BCBAC5",
"e 	c #625C79",
"f 	c #2B2932",
"g 	c #191919",
"h 	c #CCCCCC",
"i 	c #807B91",
"j 	c #3B3556",
"k 	c #F2F2F4",
"l 	c #929292",
"m 	c #0E0E0E",
"n 	c #BFBFBF",
"o 	c #111111",
"p 	c #100E15",
"q 	c #868689",
"r 	c #FEFDFE",
"s 	c #D9D7DE",
"t 	c #9C98AA",
"u 	c #FDFCFD",
"v 	c #DDDDDD",
"w 	c #575755",
"x 	c #5E5E5E",
"y 	c #C4C2CD",
"z 	c #423C5C",
"A 	c #F0F0F2",
"B 	c #939393",
"C 	c #555555",
"D 	c #4A4A4A",
"E 	c #010101",
"F 	c #282828",
"G 	c #C2C2C2",
"H 	c #DBDAE0",
"I 	c #615C78",
"J 	c #F6F6F7",
"K 	c #DADADA",
"L 	c #545454",
"M 	c #0F0F0F",
"N 	c #B8B8B8",
"O 	c #48445C",
"P 	c #2B2B2C",
"Q 	c #181900",
"R 	c #D3D3D3",
"S 	c #C1BEC9",
"T 	c #474060",
"U 	c #31294D",
"V 	c #716C85",
"W 	c #65607A",
"X 	c #625D78",
"Y 	c #D5D4DB",
"Z 	c #F7F7F7",
"` 	c #8B8B8B",
" .	c #161616",
"..	c #0C0C0C",
"+.	c #5B5571",
"@.	c #393643",
"#.	c #47415F",
"$.	c #9692A4",
"%.	c #D9D8DE",
"&.	c #F7F7F8",
"*.	c #918DA0",
"=.	c #B8B5C1",
"-.	c #D1D1D1",
";.	c #252525",
">.	c #5C5C00",
",.	c #727175",
"'.	c #FEFEFF",
").	c #9D99AA",
"!.	c #DBD9E0",
"~.	c #E9E9E9",
"{.	c #CBCBCB",
"].	c #E0E0E0",
"^.	c #6C6C6C",
"/.	c #FFFF00",
"(.	c #515151",
"_.	c #A6A6A7",
":.	c #827E93",
"<.	c #615C77",
"[.	c #EAEAED",
"}.	c #DFDFE1",
"|.	c #1E1D24",
"1.	c #9894A7",
"2.	c #B1AEBB",
"3.	c #69686F",
"4.	c #000001",
"5.	c #0A0A00",
"6.	c #615C76",
"7.	c #5F5A75",
"8.	c #413E4D",
"9.	c #020203",
"0.	c #1A1A1C",
"a.	c #C3C1CB",
"b.	c #9D9D9D",
"c.	c #202020",
"d.	c #383838",
"e.	c #4C4C4C",
"f.	c #111112",
"g.	c #C9C7D0",
"h.	c #F1F1F1",
"i.	c #F8F8F8",
"j.	c #232323",
"k.	c #010100",
"l.	c #050408",
"m.	c #AEACB9",
"n.	c #FEFEFE",
"o.	c #1D1D1D",
"p.	c #020200",
"q.	c #B7B5C1",
"r.	c #9390A2",
"s.	c #BBBBBB",
"t.	c #414141",
"u.	c #030303",
"v.	c #28272A",
"w.	c #F4F4F6",
"x.	c #605B76",
"y.	c #736E86",
"z.	c #D8D8D8",
"A.	c #727272",
"B.	c #101010",
"C.	c #848486",
"D.	c #CCCBD3",
"E.	c #747087",
"F.	c #6D6881",
"G.	c #1C1C1C",
"H.	c #242424",
"I.	c #656566",
"J.	c #F6F6F6",
"K.	c #E8E6EA",
"L.	c #706B84",
"M.	c #E3E1E6",
"N.	c #474746",
"O.	c #151515",
"P.	c #C8C8C8",
"Q.	c #AEAEAE",
"R.	c #080808",
"S.	c #373639",
"T.	c #FDFCFE",
"U.	c #ABA8B7",
"V.	c #F1F0F3",
"W.	c #6D6980",
"X.	c #0A090E",
"Y.	c #95929E",
"Z.	c #0A0810",
"`.	c #050505",
" +	c #5B5A5C",
".+	c #F7F6F7",
"++	c #F4F3F5",
"@+	c #908C9F",
"#+	c #C8C6D0",
"$+	c #837E96",
"%+	c #86868A",
"&+	c #070608",
"*+	c #ECEBEE",
"=+	c #646078",
"-+	c #AFAFB0",
";+	c #454545",
">+	c #333408",
",+	c #7A7A7A",
"'+	c #C8C8C9",
")+	c #212025",
"!+	c #060607",
"~+	c #969699",
"{+	c #FAFAFA",
"]+	c #F8F8F9",
"^+	c #A29EAF",
"/+	c #F7F6F8",
"(+	c #F0F0F1",
"_+	c #B8B7B9",
":+	c #E4E4E4",
"<+	c #FDFDFD",
"[+	c #A5A2B2",
"}+	c #3B3456",
"|+	c #A8A5B4",
"1+	c #525252",
"2+	c #848387",
"3+	c #CDCDCD",
"4+	c #8D899C",
"5+	c #494262",
"6+	c #68627C",
"7+	c #40395A",
"8+	c #ECECEC",
"9+	c #020202",
"0+	c #B4B5B5",
"a+	c #0B0B0B",
"b+	c #313232",
"c+	c #E3E3E3",
"d+	c #B1AEBC",
"e+	c #BDBBC6",
"f+	c #3C3556",
"g+	c #898599",
"h+	c #EDEDED",
"i+	c #39393A",
"j+	c #040404",
"k+	c #333333",
"l+	c #F5F5F5",
"m+	c #2B2B2B",
"n+	c #2D2A3D",
"o+	c #B6B4C1",
"p+	c #F5F5F6",
"q+	c #605A76",
"r+	c #DAD8DF",
"s+	c #F5F4F6",
"t+	c #615B76",
"u+	c #524D6A",
"v+	c #E4E3E8",
"w+	c #D5D5D5",
"x+	c #1B1B1B",
"y+	c #303030",
"z+	c #AAABAB",
"A+	c #585464",
"B+	c #B0AEBB",
"C+	c #A29FAF",
"D+	c #E9E8E9",
"E+	c #787779",
"F+	c #0F0E15",
"G+	c #2D2D2E",
"H+	c #595959",
"I+	c #FAFAFB",
"J+	c #807B92",
"K+	c #B0ADBB",
"L+	c #E8E7EB",
"M+	c #3A3258",
"N+	c #E6E5EA",
"O+	c #DFDEE3",
"P+	c #443E5E",
"Q+	c #BAB8C4",
"R+	c #C1BFCA",
"S+	c #E0E0E5",
"T+	c #D0CED6",
"U+	c #362F52",
"V+	c #CECCD5",
"W+	c #413A5B",
"X+	c #6A657F",
"Y+	c #9793A6",
"                                                                        ",
"                                                                        ",
"                                                                        ",
"                      .   + @ #     $ %                                 ",
"                & * = *   - ; > , ' ; ; ; ) !                           ",
"                ~ ; ; {   ] ; ^ / ( _ ; : < [                           ",
"                } | 1 2   3 4 5 6 6 7 : 8 9 0 a b                       ",
"          c : d e f g h i j k l 6 m ; n o 6 p q r s                     ",
"        t u ; v w 6 6 x y z A B 6 C ; D E 6 F G ; H                     ",
"      I J ; ; K L 6 6 M N O P E 6 6 6 Q Q M R S T U V W                 ",
"    X Y ; ; ; ; Z `  .6 ..6 6 6 6 6 6 6 6 +.@.#.$.%.&.*.                ",
"    =.; ; ; ; ; ; = -.;.6 6 6 >.>.>.6 6 6 6 E ,.'.; ; ).                ",
"    !.; ; ~.R h {.].^.6 6 6 >./././.6 6 6 6 6 E (._.4 :.                ",
"  <.[.; }...6 6 6 6 6 6 6 6 /./././.>.6 6 6 6 6 6 |.1.                  ",
"  V @ 2.3.4.6 6 6 6 6 5.6 6 >././././.6 6 6 6 6 6                       ",
"    6.7.8.6 9.6 6 6 6 6 6 6 6 6 /././.6 6 6 6 6 6 0.                    ",
"  a.; ; b.c.c.d.e.c.6 6 6 6 6 6 >././.6 6 6 6 6 6 f.                    ",
"  g.; ; h.i.; ; ; j.6 k.6 6 6 6 /././.6 6 6 6 6 6 l.                    ",
"  m.; ; ; ; n.; ; o.6 p.6 6 6 6 >././.6 6 6 6 6 6 6 q.,                 ",
"  r.; ; n.; : s.t.u.6 6 6 6 6 6 /././.6 6 6 6 6 6 v.n.w.x.              ",
"  y.; ; ; z.A.B.6 6 6 6 6 6 6 >.>././.>.6 6 6 6 6 C.; ; D.E.            ",
"  F.J ; : G.6 6 6 6 H...6 >./././././././.>.6 6 6 I.J.; ; K.L.          ",
"    M.; ; N.6 E 6 O.P.Q.R./././././././././.6 6 6 6 S.T.; ; > L.        ",
"    U.; V.W.X.6 6 Q.n.; Y.Z.6 6 6 6 6 6 6 +.m `.6 6 6  +.+; ; ++@+      ",
"    L.#+! $+%+&+x ; ; *++.=+-+l ;+6 6 6 >+,+'+)+6 6 6 !+~+{+; ; ]+@     ",
"        ^+/+(+_+:+<+; [+}+|+; J.;+6 6 E 1+; ; 2+6 6 E 6 o 3+; ; = 4+    ",
"      5+> ; ; ; ; ; ; 6+7+; ; 8+d.6 6 9+D ; ; 0+a+6 6 6 b+c+; ; d+      ",
"          > ; ; ; ; e+f+g+; ; h+i+6 6 j+k+; ; l+m+6 6 n+o+; p+3         ",
"          q+r+= ; s+t+u+v+; ; w+x+6 6 9+y+; ; ; z+1+A+                  ",
"              B+4 C+  X ; ; ; D+E+y+F+G+H+; ; ; n.I+J+                  ",
"                      K+; ; ; ; ; L+M+N+; ; ; ; = O+P+                  ",
"                      Q+R+S+4 ; ; T+U+V+; ; ; s g+T                     ",
"                          W+          X+Y+g+                            ",
"                                                                        ",
"                                                                        ",
"                                                                        "};
