/* XPM */
static char * SpiralIcon_xpm[] = {
"36 36 288 2",
"  	c None",
". 	c #8B889B",
"+ 	c #9C99AA",
"@ 	c #ADAAB9",
"# 	c #837F94",
"$ 	c #7D7990",
"% 	c #9995A7",
"& 	c #67627C",
"* 	c #CDCBD4",
"= 	c #FCFCFC",
"- 	c #D1D0D8",
"; 	c #FFFFFF",
"> 	c #F1F1F3",
", 	c #848095",
"' 	c #2A2248",
") 	c #CFCED6",
"! 	c #68637D",
"~ 	c #ABA8B6",
"{ 	c #D5D3DB",
"] 	c #9490A2",
"^ 	c #C4C4C4",
"/ 	c #1D1C1D",
"( 	c #313134",
"_ 	c #EEEFEE",
": 	c #FBFBFB",
"< 	c #EFEFEF",
"[ 	c #7B768D",
"} 	c #464060",
"| 	c #DEDEE1",
"1 	c #CBCACC",
"2 	c #EEEEF1",
"3 	c #79758C",
"4 	c #FBFBFC",
"5 	c #A2A2A2",
"6 	c #000000",
"7 	c #F5F6F5",
"8 	c #747474",
"9 	c #2A2A2B",
"0 	c #403958",
"a 	c #7D788F",
"b 	c #C0BEC8",
"c 	c #BCBAC6",
"d 	c #BCBAC5",
"e 	c #625C79",
"f 	c #2B2932",
"g 	c #191919",
"h 	c #CCCCCC",
"i 	c #807B91",
"j 	c #3B3556",
"k 	c #F2F2F4",
"l 	c #929292",
"m 	c #0E0E0E",
"n 	c #BFBFBF",
"o 	c #111111",
"p 	c #100E15",
"q 	c #868689",
"r 	c #FEFDFE",
"s 	c #D9D7DE",
"t 	c #9C98AA",
"u 	c #FDFCFD",
"v 	c #DDDDDD",
"w 	c #575755",
"x 	c #5E5E5E",
"y 	c #C4C2CD",
"z 	c #423C5C",
"A 	c #F0F0F2",
"B 	c #939393",
"C 	c #555555",
"D 	c #4A4A4A",
"E 	c #010101",
"F 	c #282828",
"G 	c #C2C2C2",
"H 	c #DBDAE0",
"I 	c #615C78",
"J 	c #F6F6F7",
"K 	c #DADADA",
"L 	c #545454",
"M 	c #0F0F0F",
"N 	c #B8B8B8",
"O 	c #48445C",
"P 	c #2B2B2C",
"Q 	c #181900",
"R 	c #D3D3D3",
"S 	c #C1BEC9",
"T 	c #474060",
"U 	c #31294D",
"V 	c #716C85",
"W 	c #65607A",
"X 	c #625D78",
"Y 	c #D5D4DB",
"Z 	c #F7F7F7",
"` 	c #8B8B8B",
" .	c #161616",
"..	c #0C0C0C",
"+.	c #161800",
"@.	c #1A1B00",
"#.	c #060600",
"$.	c #191A00",
"%.	c #393643",
"&.	c #47415F",
"*.	c #9692A4",
"=.	c #D9D8DE",
"-.	c #F7F7F8",
";.	c #918DA0",
">.	c #B8B5C1",
",.	c #D1D1D1",
"'.	c #212121",
").	c #2D2F00",
"!.	c #111200",
"~.	c #0F0F00",
"{.	c #090A00",
"].	c #040400",
"^.	c #727175",
"/.	c #FEFEFF",
"(.	c #9D99AA",
"_.	c #DBD9E0",
":.	c #E9E9E9",
"<.	c #CBCBCB",
"[.	c #E0E0E0",
"}.	c #6C6C6C",
"|.	c #050500",
"1.	c #515151",
"2.	c #A6A6A7",
"3.	c #827E93",
"4.	c #615C77",
"5.	c #EAEAED",
"6.	c #DFDFE1",
"7.	c #FEF100",
"8.	c #010100",
"9.	c #1E1D24",
"0.	c #9894A7",
"a.	c #B1AEBB",
"b.	c #69686F",
"c.	c #000001",
"d.	c #615C76",
"e.	c #5F5A75",
"f.	c #413E4D",
"g.	c #020203",
"h.	c #1A1A1C",
"i.	c #C3C1CB",
"j.	c #9D9D9D",
"k.	c #202020",
"l.	c #383838",
"m.	c #4C4C4C",
"n.	c #2C2E00",
"o.	c #111112",
"p.	c #C9C7D0",
"q.	c #F1F1F1",
"r.	c #F8F8F8",
"s.	c #232323",
"t.	c #050600",
"u.	c #050408",
"v.	c #AEACB9",
"w.	c #FEFEFE",
"x.	c #1D1D1D",
"y.	c #292B00",
"z.	c #B7B5C1",
"A.	c #9390A2",
"B.	c #BBBBBB",
"C.	c #414141",
"D.	c #030303",
"E.	c #28272A",
"F.	c #F4F4F6",
"G.	c #605B76",
"H.	c #736E86",
"I.	c #D8D8D8",
"J.	c #727272",
"K.	c #101010",
"L.	c #020200",
"M.	c #1E2000",
"N.	c #848486",
"O.	c #CCCBD3",
"P.	c #747087",
"Q.	c #6D6881",
"R.	c #1C1C1C",
"S.	c #242424",
"T.	c #0A0A00",
"U.	c #656566",
"V.	c #F6F6F6",
"W.	c #E8E6EA",
"X.	c #706B84",
"Y.	c #E3E1E6",
"Z.	c #474746",
"`.	c #151515",
" +	c #C8C8C8",
".+	c #AEAEAE",
"++	c #080808",
"@+	c #373639",
"#+	c #FDFCFE",
"$+	c #ABA8B7",
"%+	c #F1F0F3",
"&+	c #6D6980",
"*+	c #0A090E",
"=+	c #95929E",
"-+	c #0A0810",
";+	c #0D0D0D",
">+	c #050505",
",+	c #5B5A5C",
"'+	c #F7F6F7",
")+	c #F4F3F5",
"!+	c #908C9F",
"~+	c #C8C6D0",
"{+	c #837E96",
"]+	c #86868A",
"^+	c #070608",
"/+	c #ECEBEE",
"(+	c #5B5571",
"_+	c #646078",
":+	c #AFAFB0",
"<+	c #454545",
"[+	c #363636",
"}+	c #7A7A7A",
"|+	c #C8C8C9",
"1+	c #212025",
"2+	c #060607",
"3+	c #969699",
"4+	c #FAFAFA",
"5+	c #F8F8F9",
"6+	c #A29EAF",
"7+	c #F7F6F8",
"8+	c #F0F0F1",
"9+	c #B8B7B9",
"0+	c #E4E4E4",
"a+	c #FDFDFD",
"b+	c #A5A2B2",
"c+	c #3B3456",
"d+	c #A8A5B4",
"e+	c #525252",
"f+	c #848387",
"g+	c #CDCDCD",
"h+	c #8D899C",
"i+	c #494262",
"j+	c #68627C",
"k+	c #40395A",
"l+	c #ECECEC",
"m+	c #020202",
"n+	c #B4B5B5",
"o+	c #0B0B0B",
"p+	c #313232",
"q+	c #E3E3E3",
"r+	c #B1AEBC",
"s+	c #BDBBC6",
"t+	c #3C3556",
"u+	c #898599",
"v+	c #EDEDED",
"w+	c #39393A",
"x+	c #040404",
"y+	c #333333",
"z+	c #F5F5F5",
"A+	c #2B2B2B",
"B+	c #2D2A3D",
"C+	c #B6B4C1",
"D+	c #F5F5F6",
"E+	c #605A76",
"F+	c #DAD8DF",
"G+	c #F5F4F6",
"H+	c #615B76",
"I+	c #524D6A",
"J+	c #E4E3E8",
"K+	c #D5D5D5",
"L+	c #1B1B1B",
"M+	c #303030",
"N+	c #AAABAB",
"O+	c #585464",
"P+	c #B0AEBB",
"Q+	c #A29FAF",
"R+	c #E9E8E9",
"S+	c #787779",
"T+	c #0F0E15",
"U+	c #2D2D2E",
"V+	c #595959",
"W+	c #FAFAFB",
"X+	c #807B92",
"Y+	c #B0ADBB",
"Z+	c #E8E7EB",
"`+	c #3A3258",
" @	c #E6E5EA",
".@	c #DFDEE3",
"+@	c #443E5E",
"@@	c #BAB8C4",
"#@	c #C1BFCA",
"$@	c #E0E0E5",
"%@	c #D0CED6",
"&@	c #362F52",
"*@	c #CECCD5",
"=@	c #413A5B",
"-@	c #6A657F",
";@	c #9793A6",
"                                                                        ",
"                                                                        ",
"                                                                        ",
"                      .   + @ #     $ %                                 ",
"                & * = *   - ; > , ' ; ; ; ) !                           ",
"                ~ ; ; {   ] ; ^ / ( _ ; : < [                           ",
"                } | 1 2   3 4 5 6 6 7 : 8 9 0 a b                       ",
"          c : d e f g h i j k l 6 m ; n o 6 p q r s                     ",
"        t u ; v w 6 6 x y z A B 6 C ; D E 6 F G ; H                     ",
"      I J ; ; K L 6 6 M N O P E 6 6 6 Q Q M R S T U V W                 ",
"    X Y ; ; ; ; Z `  .6 ..6 6 6 6 6 +.@.#.$.%.&.*.=.-.;.                ",
"    >.; ; ; ; ; ; = ,.'.).!.6 ~.{.6 ].6 6 6 E ^./.; ; (.                ",
"    _.; ; :.R h <.[.}.6 |.6 6 6 6 6 6 6 6 6 6 E 1.2.4 3.                ",
"  4.5.; 6...6 6 6 6 6 6 6 6 6 7.7.8.6 6 6 6 6 6 6 9.0.                  ",
"  V @ a.b.c.6 6 6 6 6 6 6 6 7.7.7.6 6 6 6 6 6 6 6                       ",
"    d.e.f.6 g.6 6 6 6 6 6 7.7.7.7.7.6 6 6 |.6 6 6 h.                    ",
"  i.; ; j.k.k.l.m.k.6 7.7.7.7.7.7.7.6 6 6 n.7.6 6 o.                    ",
"  p.; ; q.r.; ; ; s.6 7.7.7.7.7.7.7.7.6 6 7.7.t.6 u.                    ",
"  v.; ; ; ; w.; ; x.6 7.7.7.7.7.7.7.7.7.7.7.7.y.6 6 z.,                 ",
"  A.; ; w.; : B.C.D.Q 7.7.7.7.7.7.7.7.7.7.7.7.6 6 E.w.F.G.              ",
"  H.; ; ; I.J.K.6 6 6 6 6 6 6 6 6 6 L.6 M.6 6 6 6 N.; ; O.P.            ",
"  Q.J ; : R.6 6 6 6 S...6 6 6 6 6 6 T.6 6 8.6 6 6 U.V.; ; W.X.          ",
"    Y.; ; Z.6 E 6 `. +.+++6 6 6 6 6 6 6 6 8.6 6 6 6 @+#+; ; > X.        ",
"    $+; %+&+*+6 6 .+w.; =+-+6 6 6 6 6 6 6 6 ;+>+6 6 6 ,+'+; ; )+!+      ",
"    X.~+! {+]+^+x ; ; /+(+_+:+l <+6 6 6 [+}+|+1+6 6 6 2+3+4+; ; 5+@     ",
"        6+7+8+9+0+a+; b+c+d+; V.<+6 6 E e+; ; f+6 6 E 6 o g+; ; = h+    ",
"      i+> ; ; ; ; ; ; j+k+; ; l+l.6 6 m+D ; ; n+o+6 6 6 p+q+; ; r+      ",
"          > ; ; ; ; s+t+u+; ; v+w+6 6 x+y+; ; z+A+6 6 B+C+; D+3         ",
"          E+F+= ; G+H+I+J+; ; K+L+6 6 m+M+; ; ; N+e+O+                  ",
"              P+4 Q+  X ; ; ; R+S+M+T+U+V+; ; ; w.W+X+                  ",
"                      Y+; ; ; ; ; Z+`+ @; ; ; ; = .@+@                  ",
"                      @@#@$@4 ; ; %@&@*@; ; ; s u+T                     ",
"                          =@          -@;@u+                            ",
"                                                                        ",
"                                                                        ",
"                                                                        "};
