			IFACE	rxpck/s	txpck/s	rxbyt/s	txbyt/s	rxerr/s	txerr/s
13:13:28/1172084248	eth0	0.67	1.44	108.53	241.28	0.00	0.00
13:13:28/1172084248	eth1	0.00	0.00	0.00	0.00	0.00	0.00
13:13:28/1172084248	eth2	0.00	0.00	0.00	0.00	0.00	0.00
13:13:28/1172084248	eth3	0.00	0.00	0.00	0.00	0.00	0.00
13:13:28/1172084248	eth4	0.00	0.00	0.00	0.00	0.00	0.00
13:13:28/1172084248	lo	0.00	0.00	0.00	0.00	0.00	0.00

14:14:58/1172084518	eth0	0.93	1.81	120.74	213.32	0.00	0.00
14:14:58/1172084518	eth1	0.00	0.00	0.00	0.00	0.00	0.00
14:14:58/1172084518	eth2	0.00	0.00	0.00	0.00	0.00	0.00
14:14:58/1172084518	eth3	0.00	0.00	0.00	0.00	0.00	0.00
14:14:58/1172084518	eth4	0.00	0.00	0.00	0.00	0.00	0.00
14:14:58/1172084518	lo	0.00	0.00	0.00	0.00	0.00	0.00

15:15:44/1172089124	eth0	0.83	1.69	102.31	180.96	0.00	0.00
15:15:44/1172089124	eth1	0.00	0.00	0.00	0.00	0.00	0.00
15:15:44/1172089124	eth2	0.00	0.00	0.00	0.00	0.00	0.00
15:15:44/1172089124	eth3	0.00	0.00	0.00	0.00	0.00	0.00
15:15:44/1172089124	eth4	0.00	0.00	0.00	0.00	0.00	0.00
15:15:44/1172089124	lo	0.00	0.00	0.00	0.00	0.00	0.00
