12	4	2
300	250	220	150
180	10	1	0.134	0
180	20	1	0.44	0.1
180	30	1	0	0.7
180	30	1	0.0	0.12
180	30	1	0.12	0.15
180	30	1	0	0
180	30	1	0.13	0.45
120	10	1	0.3	0.14
120	20	1	0.04	0.01
120	30	1	0	0
120	30	1	0	0
100	10	1	0	0
