<?xml version="1.0" encoding="UTF-8" standalone="no"?>
<!-- Created with Inkscape (http://www.inkscape.org/) -->
<svg
   xmlns:dc="http://purl.org/dc/elements/1.1/"
   xmlns:cc="http://creativecommons.org/ns#"
   xmlns:rdf="http://www.w3.org/1999/02/22-rdf-syntax-ns#"
   xmlns:svg="http://www.w3.org/2000/svg"
   xmlns="http://www.w3.org/2000/svg"
   xmlns:sodipodi="http://sodipodi.sourceforge.net/DTD/sodipodi-0.dtd"
   xmlns:inkscape="http://www.inkscape.org/namespaces/inkscape"
   width="640"
   height="640"
   id="svg5305"
   sodipodi:version="0.32"
   inkscape:version="0.46"
   version="1.0"
   sodipodi:docname="list.svg"
   inkscape:output_extension="org.inkscape.output.svg.inkscape"
   inkscape:export-filename="/everything/devel/maemo/qt4/qtshopper-git/src/data/64x64/categories.png"
   inkscape:export-xdpi="9"
   inkscape:export-ydpi="9">
  <defs
     id="defs5307">
    <inkscape:perspective
       sodipodi:type="inkscape:persp3d"
       inkscape:vp_x="0 : 526.18109 : 1"
       inkscape:vp_y="6.1230318e-14 : 1000 : 0"
       inkscape:vp_z="744.09448 : 526.18109 : 1"
       inkscape:persp3d-origin="372.04724 : 350.78739 : 1"
       id="perspective5313" />
  </defs>
  <sodipodi:namedview
     id="base"
     pagecolor="#ffffff"
     bordercolor="#666666"
     borderopacity="1.0"
     gridtolerance="10000"
     guidetolerance="10"
     objecttolerance="10"
     inkscape:pageopacity="0.0"
     inkscape:pageshadow="2"
     inkscape:zoom="1.4142136"
     inkscape:cx="303.94211"
     inkscape:cy="359.97061"
     inkscape:document-units="px"
     inkscape:current-layer="layer5"
     showgrid="true"
     inkscape:window-width="1833"
     inkscape:window-height="1178"
     inkscape:window-x="82"
     inkscape:window-y="-3"
     inkscape:snap-global="true">
    <inkscape:grid
       type="xygrid"
       id="grid5846"
       visible="true"
       enabled="true" />
  </sodipodi:namedview>
  <metadata
     id="metadata5310">
    <rdf:RDF>
      <cc:Work
         rdf:about="">
        <dc:format>image/svg+xml</dc:format>
        <dc:type
           rdf:resource="http://purl.org/dc/dcmitype/StillImage" />
      </cc:Work>
    </rdf:RDF>
  </metadata>
  <g
     inkscape:label="page"
     inkscape:groupmode="layer"
     id="layer1"
     style="display:none">
    <rect
       style="fill:#ffffff;fill-opacity:1;fill-rule:nonzero;stroke:#3b6493;stroke-width:20;stroke-linecap:round;stroke-linejoin:round;stroke-miterlimit:4;stroke-dasharray:none;stroke-opacity:1"
       id="rect5315"
       width="366.68536"
       height="536.39099"
       x="140"
       y="50" />
    <flowRoot
       xml:space="preserve"
       id="flowRoot5860"
       style="font-size:32px;font-style:normal;font-weight:normal;fill:#000000;fill-opacity:1;stroke:none;stroke-width:1px;stroke-linecap:butt;stroke-linejoin:miter;stroke-opacity:1;font-family:Bitstream Vera Sans"><flowRegion
         id="flowRegion5862"><rect
           id="rect5864"
           width="195.46452"
           height="28.789347"
           x="230.81985"
           y="123.81205"
           style="font-size:32px" /></flowRegion><flowPara
         id="flowPara5866">Ba</flowPara></flowRoot>  </g>
  <g
     inkscape:groupmode="layer"
     id="layer5"
     style="display:inline">
    <rect
       style="fill:#ffffff;fill-opacity:1;fill-rule:nonzero;stroke:#3b6493;stroke-width:5;stroke-linecap:round;stroke-linejoin:round;stroke-miterlimit:4;stroke-dasharray:none;stroke-opacity:1;display:inline"
       id="rect2466"
       width="366.68536"
       height="536.39099"
       x="140.31464"
       y="50" />
  </g>
  <g
     inkscape:groupmode="layer"
     id="layer2"
     inkscape:label="list"
     style="display:none">
    <rect
       style="fill:#ffffff;fill-opacity:1;fill-rule:nonzero;stroke:#3b6493;stroke-width:10;stroke-linecap:round;stroke-linejoin:round;stroke-miterlimit:4;stroke-dasharray:none;stroke-opacity:1"
       id="rect5842"
       width="27.274118"
       height="27.274118"
       x="175"
       y="125" />
    <rect
       style="fill:#ffffff;fill-opacity:1;fill-rule:nonzero;stroke:#3b6493;stroke-width:10;stroke-linecap:round;stroke-linejoin:round;stroke-miterlimit:4;stroke-dasharray:none;stroke-opacity:1"
       id="rect5844"
       width="27.274118"
       height="27.274118"
       x="175"
       y="180" />
    <rect
       style="fill:#ffffff;fill-opacity:1;fill-rule:nonzero;stroke:#3b6493;stroke-width:10;stroke-linecap:round;stroke-linejoin:round;stroke-miterlimit:4;stroke-dasharray:none;stroke-opacity:1"
       id="rect5848"
       width="27.274118"
       height="27.274118"
       x="175"
       y="235" />
    <rect
       style="fill:#ffffff;fill-opacity:1;fill-rule:nonzero;stroke:#3b6493;stroke-width:10;stroke-linecap:round;stroke-linejoin:round;stroke-miterlimit:4;stroke-dasharray:none;stroke-opacity:1"
       id="rect5850"
       width="27.274118"
       height="27.274118"
       x="175"
       y="290" />
    <rect
       style="fill:#ffffff;fill-opacity:1;fill-rule:nonzero;stroke:#3b6493;stroke-width:10;stroke-linecap:round;stroke-linejoin:round;stroke-miterlimit:4;stroke-dasharray:none;stroke-opacity:1"
       id="rect5852"
       width="27.274118"
       height="27.274118"
       x="175"
       y="345" />
    <rect
       style="fill:#ffffff;fill-opacity:1;fill-rule:nonzero;stroke:#3b6493;stroke-width:10;stroke-linecap:round;stroke-linejoin:round;stroke-miterlimit:4;stroke-dasharray:none;stroke-opacity:1"
       id="rect5854"
       width="27.274118"
       height="27.274118"
       x="175"
       y="400" />
    <rect
       style="fill:#ffffff;fill-opacity:1;fill-rule:nonzero;stroke:#3b6493;stroke-width:10;stroke-linecap:round;stroke-linejoin:round;stroke-miterlimit:4;stroke-dasharray:none;stroke-opacity:1"
       id="rect5856"
       width="27.274118"
       height="27.274118"
       x="175"
       y="455" />
    <rect
       style="fill:#ffffff;fill-opacity:1;fill-rule:nonzero;stroke:#3b6493;stroke-width:10;stroke-linecap:round;stroke-linejoin:round;stroke-miterlimit:4;stroke-dasharray:none;stroke-opacity:1"
       id="rect5858"
       width="27.274118"
       height="27.274118"
       x="175"
       y="510" />
    <text
       xml:space="preserve"
       style="font-size:32px;font-style:normal;font-weight:normal;fill:#000000;fill-opacity:1;stroke:none;stroke-width:1px;stroke-linecap:butt;stroke-linejoin:miter;stroke-opacity:1;font-family:Bitstream Vera Sans"
       x="230"
       y="155"
       id="text5868"><tspan
         sodipodi:role="line"
         id="tspan5870"
         x="230"
         y="155">Bacon</tspan></text>
    <text
       xml:space="preserve"
       style="font-size:32px;font-style:normal;font-weight:normal;fill:#000000;fill-opacity:1;stroke:none;stroke-width:1px;stroke-linecap:butt;stroke-linejoin:miter;stroke-opacity:1;font-family:Bitstream Vera Sans"
       x="230"
       y="210"
       id="text5872"><tspan
         sodipodi:role="line"
         id="tspan5874"
         x="230"
         y="210">Cheese</tspan></text>
    <text
       xml:space="preserve"
       style="font-size:32px;font-style:normal;font-weight:normal;fill:#000000;fill-opacity:1;stroke:none;stroke-width:1px;stroke-linecap:butt;stroke-linejoin:miter;stroke-opacity:1;font-family:Bitstream Vera Sans"
       x="230"
       y="260"
       id="text5880"><tspan
         sodipodi:role="line"
         id="tspan5882"
         x="230"
         y="260">Bread</tspan></text>
    <text
       xml:space="preserve"
       style="font-size:32px;font-style:normal;font-weight:normal;fill:#000000;fill-opacity:1;stroke:none;stroke-width:1px;stroke-linecap:butt;stroke-linejoin:miter;stroke-opacity:1;font-family:Bitstream Vera Sans"
       x="230"
       y="315"
       id="text5884"><tspan
         sodipodi:role="line"
         id="tspan5886"
         x="230"
         y="315">Pancakes</tspan></text>
    <text
       xml:space="preserve"
       style="font-size:32px;font-style:normal;font-weight:normal;fill:#000000;fill-opacity:1;stroke:none;stroke-width:1px;stroke-linecap:butt;stroke-linejoin:miter;stroke-opacity:1;font-family:Bitstream Vera Sans"
       x="230"
       y="370"
       id="text5888"><tspan
         sodipodi:role="line"
         id="tspan5890"
         x="230"
         y="370">Steak</tspan></text>
    <text
       xml:space="preserve"
       style="font-size:32px;font-style:normal;font-weight:normal;fill:#000000;fill-opacity:1;stroke:none;stroke-width:1px;stroke-linecap:butt;stroke-linejoin:miter;stroke-opacity:1;font-family:Bitstream Vera Sans"
       x="230"
       y="425"
       id="text5892"><tspan
         sodipodi:role="line"
         id="tspan5894"
         x="230"
         y="425">Cream</tspan></text>
    <text
       xml:space="preserve"
       style="font-size:32px;font-style:normal;font-weight:normal;fill:#000000;fill-opacity:1;stroke:none;stroke-width:1px;stroke-linecap:butt;stroke-linejoin:miter;stroke-opacity:1;font-family:Bitstream Vera Sans"
       x="230"
       y="480"
       id="text5896"><tspan
         sodipodi:role="line"
         id="tspan5898"
         x="230"
         y="480">Chips</tspan></text>
    <text
       xml:space="preserve"
       style="font-size:32px;font-style:normal;font-weight:normal;fill:#000000;fill-opacity:1;stroke:none;stroke-width:1px;stroke-linecap:butt;stroke-linejoin:miter;stroke-opacity:1;font-family:Bitstream Vera Sans"
       x="230"
       y="540"
       id="text5900"><tspan
         sodipodi:role="line"
         id="tspan5902"
         x="230"
         y="540">Fruit</tspan></text>
  </g>
  <g
     inkscape:groupmode="layer"
     id="layer3"
     inkscape:label="tick"
     style="display:none">
    <g
       id="g3296"
       style="display:inline"
       transform="translate(522.98762,-1061.2247)">
      <path
         d="M -344.14464,1506.3929 C -344.11517,1505.6577 -344.09348,1504.9241 -343.99574,1504.1943 C -343.86139,1503.2971 -343.57771,1502.4345 -343.20776,1501.6093 C -342.78861,1500.7273 -342.17449,1499.9719 -341.48817,1499.2864 C -340.72715,1498.5467 -339.81249,1498.028 -338.85877,1497.5832 C -325.54527,1492.459 -312.55786,1485.8902 -298.547,1483.1435 C -297.35184,1482.9205 -296.13654,1482.8743 -294.92436,1482.8446 C -293.62672,1482.795 -292.34369,1482.9499 -291.06554,1483.1521 C -289.69061,1483.3843 -288.34971,1483.7699 -287.02432,1484.1962 C -285.66447,1484.6439 -284.35595,1485.2251 -283.07962,1485.8699 C -281.71682,1486.5691 -280.45682,1487.4391 -279.23132,1488.3525 C -277.93219,1489.3472 -276.68586,1490.4081 -275.48602,1491.52 C -274.21722,1492.6789 -273.08437,1493.9699 -271.99215,1495.293 C -270.83681,1496.6945 -269.78561,1498.1772 -268.76055,1499.6753 C -267.66189,1501.255 -266.743,1502.9434 -265.86179,1504.6504 C -264.91664,1506.4826 -264.06834,1508.3597 -263.25664,1510.254 C -262.402,1512.2454 -261.66625,1514.2838 -260.92707,1516.3199 C -260.16336,1518.4297 -259.43019,1520.5504 -258.70458,1522.6736 C -257.97383,1524.8298 -257.29697,1527.0043 -256.68253,1529.1965 C -256.22139,1531.0397 -255.75139,1532.8804 -255.23288,1534.7082 C -254.9004,1535.9303 -254.56235,1537.1504 -254.16364,1538.3527 C -253.95173,1539.0372 -253.66541,1539.6846 -253.20857,1540.2393 C -253.00401,1540.4995 -252.76864,1540.5569 -252.46456,1540.5675 C -264.80854,1544.9698 -277.15248,1549.3722 -289.49641,1553.7745 C -289.0343,1553.0575 -288.76501,1552.2511 -288.47821,1551.455 C -288.05315,1550.2589 -287.75899,1549.0248 -287.48627,1547.7871 C -287.0999,1546.2223 -286.77032,1544.6447 -286.4262,1543.0703 C -286.04896,1541.2361 -285.62846,1539.4117 -285.20694,1537.5873 C -284.72454,1535.4613 -284.18161,1533.3489 -283.64081,1531.2369 C -282.95815,1528.7057 -282.25563,1526.1798 -281.55241,1523.6541 C -280.60223,1520.4921 -279.69696,1517.3162 -278.79063,1514.1411 C -277.68415,1510.2532 -276.42038,1506.4128 -275.22097,1502.5533 C -273.78474,1497.731 -272.10595,1492.9883 -270.53859,1488.2083 C -268.45641,1482.0853 -266.26249,1476.0001 -264.09174,1469.9079 C -261.36083,1462.4695 -258.39175,1455.121 -255.41189,1447.7797 C -251.87368,1438.9518 -247.89403,1430.3142 -244.04928,1421.6187 C -239.85203,1411.8759 -235.47297,1402.2144 -230.9784,1392.6057 C -226.00863,1381.9566 -220.69555,1371.4731 -215.14119,1361.1183 C -209.28023,1350.2593 -202.88706,1339.6992 -196.28557,1329.2776 C -189.87045,1318.945 -182.84744,1309.0178 -175.78154,1299.1259 C -168.86287,1289.7325 -161.29499,1280.8572 -153.38755,1272.2893 C -145.94065,1264.2857 -138.25758,1256.5067 -130.52517,1248.7802 C -123.7633,1242.043 -116.76659,1235.5499 -109.62963,1229.2135 C -103.54226,1223.8826 -97.26895,1218.77 -90.94175,1213.7279 C -86.47617,1210.1722 -81.91509,1206.7401 -77.31521,1203.3609 L -43.68953,1191.1221 C -48.525,1194.5858 -53.32235,1198.1027 -58.02412,1201.7468 C -64.65357,1206.8906 -71.21957,1212.1182 -77.60893,1217.559 C -85.05937,1224.0023 -92.3906,1230.5842 -99.44066,1237.4663 C -107.41927,1245.2554 -115.3594,1253.0894 -122.98762,1261.2247 C -130.92309,1269.8587 -138.61008,1278.7281 -145.61205,1288.1451 C -152.84863,1298.0213 -159.87567,1308.0469 -166.41199,1318.4046 C -172.94354,1328.7886 -179.29635,1339.2895 -185.01008,1350.1515 C -190.39831,1360.4121 -195.53382,1370.802 -200.21278,1381.408 C -204.46032,1390.9337 -208.56182,1400.5215 -212.55622,1410.1561 C -216.28278,1418.6712 -219.797,1427.275 -223.02603,1435.9922 C -225.68523,1443.2026 -228.27492,1450.4407 -230.67029,1457.7435 C -232.60427,1463.7168 -234.55864,1469.6849 -236.2573,1475.731 C -237.62181,1480.4024 -238.79637,1485.1258 -240.16888,1489.7954 C -241.22905,1493.5845 -242.26577,1497.3799 -243.22454,1501.196 C -244.01658,1504.2999 -244.77676,1507.4131 -245.50263,1510.5331 C -246.11589,1513.0211 -246.73,1515.5093 -247.29613,1518.0085 C -247.75094,1520.0973 -248.22146,1522.1827 -248.64207,1524.2788 C -249.01357,1526.0814 -249.35753,1527.889 -249.68914,1529.6992 C -249.99017,1531.2434 -250.25791,1532.7934 -250.54255,1534.3406 C -250.76462,1535.5378 -250.97857,1536.7392 -251.28571,1537.918 C -251.50224,1538.7729 -251.68678,1539.6395 -252.36617,1540.2602 C -265.0861,1544.9814 -280.64548,1562.9809 -290.71916,1553.892 C -291.06178,1553.2659 -291.20177,1552.5789 -291.33521,1551.882 C -291.58518,1550.6239 -291.79538,1549.3587 -292.01025,1548.0941 C -292.36763,1546.2117 -292.68164,1544.3204 -293.09173,1542.4484 C -293.63504,1540.2346 -294.32689,1538.0643 -295.07669,1535.912 C -295.8147,1533.7933 -296.5711,1531.6807 -297.34797,1529.576 C -298.11254,1527.549 -298.84888,1525.5102 -299.72392,1523.5269 C -300.55838,1521.6388 -301.46433,1519.7858 -302.42338,1517.9577 C -303.32745,1516.2576 -304.29546,1514.5917 -305.39567,1513.0095 C -306.43947,1511.5159 -307.52459,1510.0488 -308.69566,1508.6519 C -309.82045,1507.3479 -310.94949,1506.0425 -312.24182,1504.8981 C -313.47107,1503.8057 -314.71416,1502.7268 -316.03799,1501.749 C -317.29994,1500.8562 -318.57969,1499.9783 -319.97218,1499.2977 C -321.25881,1498.6589 -322.5828,1498.0949 -323.94399,1497.6339 C -325.28462,1497.2132 -326.6348,1496.8241 -328.02584,1496.6045 C -329.32524,1496.4143 -330.62937,1496.2741 -331.94569,1496.3192 C -333.18164,1496.3604 -334.42265,1496.4027 -335.63956,1496.6441 C -352.17806,1499.8718 -286.93334,1478.4872 -301.72241,1484.0667 C -302.65596,1484.5051 -303.55037,1485.0163 -304.29047,1485.7475 C -304.97001,1486.424 -305.56035,1487.183 -305.96985,1488.0558 C -306.33082,1488.8748 -306.59926,1489.7308 -306.70758,1490.6225 C -306.75015,1491.3343 -306.71354,1492.0432 -306.67355,1492.7546 L -344.14464,1506.3929 z"
         id="path6129"
         style="fill:#800000;fill-opacity:1;fill-rule:nonzero;stroke:#800000;stroke-width:1.61030209;stroke-linecap:round;stroke-linejoin:round;stroke-miterlimit:4;stroke-dasharray:none;stroke-opacity:1" />
    </g>
  </g>
  <g
     inkscape:groupmode="layer"
     id="layer4"
     inkscape:label="pen"
     style="display:none">
    <path
       style="fill:#9c3434;fill-opacity:1;fill-rule:evenodd;stroke:#000000;stroke-width:1px;stroke-linecap:butt;stroke-linejoin:miter;stroke-opacity:1"
       d="M 199,436 L 399,136 L 439,176 L 219,456 L 199,436 z"
       id="path5983" />
    <path
       style="fill:none;fill-rule:evenodd;stroke:#000000;stroke-width:1px;stroke-linecap:butt;stroke-linejoin:miter;stroke-opacity:1"
       d="M 399,136 L 399,176 L 439,176 L 439,176 L 399,136 z"
       id="path5985" />
    <path
       style="fill:none;fill-rule:evenodd;stroke:#000000;stroke-width:1px;stroke-linecap:butt;stroke-linejoin:miter;stroke-opacity:1"
       d="M 399,176 L 209,446 L 209,446 L 209,446 L 209,446"
       id="path5987" />
    <path
       style="fill:#280d0d;fill-opacity:1;fill-rule:evenodd;stroke:#000000;stroke-width:1px;stroke-linecap:butt;stroke-linejoin:miter;stroke-opacity:1"
       d="M 199,436 L 190,470 L 219,456 L 199,436 z"
       id="path5989"
       sodipodi:nodetypes="cccc" />
  </g>
  <g
     inkscape:groupmode="layer"
     id="layer6"
     inkscape:label="categories"
     style="display:none">
    <text
       xml:space="preserve"
       style="font-size:36px;font-style:normal;font-weight:normal;text-align:center;text-anchor:middle;fill:#000000;fill-opacity:1;stroke:none;stroke-width:1px;stroke-linecap:butt;stroke-linejoin:miter;stroke-opacity:1;font-family:Bitstream Vera Sans"
       x="315"
       y="143.15865"
       id="text3304"><tspan
         sodipodi:role="line"
         id="tspan3306"
         x="315"
         y="143.15865"
         style="font-weight:bold;-inkscape-font-specification:Bitstream Vera Sans Bold">Dry Food</tspan></text>
    <text
       xml:space="preserve"
       style="font-size:36px;font-style:normal;font-weight:normal;text-align:center;text-anchor:middle;fill:#000000;fill-opacity:1;stroke:none;stroke-width:1px;stroke-linecap:butt;stroke-linejoin:miter;stroke-opacity:1;display:inline;font-family:Bitstream Vera Sans"
       x="311.05469"
       y="288.75"
       id="text3308"><tspan
         sodipodi:role="line"
         id="tspan3310"
         x="311.05469"
         y="288.75"
         style="font-weight:bold;-inkscape-font-specification:Bitstream Vera Sans Bold">Dairy</tspan></text>
    <text
       xml:space="preserve"
       style="font-size:36px;font-style:normal;font-weight:normal;text-align:center;text-anchor:middle;fill:#000000;fill-opacity:1;stroke:none;stroke-width:1px;stroke-linecap:butt;stroke-linejoin:miter;stroke-opacity:1;display:inline;font-family:Bitstream Vera Sans"
       x="311.05469"
       y="480"
       id="text3316"><tspan
         sodipodi:role="line"
         id="tspan3318"
         x="311.05469"
         y="480"
         style="font-weight:bold;-inkscape-font-specification:Bitstream Vera Sans Bold">Fruit and Veg</tspan></text>
  </g>
  <g
     inkscape:groupmode="layer"
     id="layer7"
     inkscape:label="plus"
     style="display:none">
    <path
       style="fill:none;fill-opacity:1;fill-rule:evenodd;stroke:#3b6493;stroke-width:15.58757687;stroke-linecap:round;stroke-linejoin:miter;stroke-miterlimit:4;stroke-dasharray:none;stroke-opacity:1"
       d="M 247.38266,310 L 403.125,310"
       id="path3337"
       sodipodi:nodetypes="cc" />
    <path
       style="fill:none;fill-opacity:1;fill-rule:evenodd;stroke:#3b6493;stroke-width:15.58757687;stroke-linecap:round;stroke-linejoin:miter;stroke-miterlimit:4;stroke-dasharray:none;stroke-opacity:1;display:inline"
       d="M 325,386.545 L 325,233.125"
       id="path4109"
       sodipodi:nodetypes="cc" />
  </g>
  <g
     inkscape:groupmode="layer"
     id="layer8"
     inkscape:label="rotate"
     style="display:inline">
    <path
       sodipodi:type="arc"
       style="fill:none;fill-opacity:1;fill-rule:nonzero;stroke:#800000;stroke-width:30;stroke-linecap:round;stroke-miterlimit:4;stroke-dasharray:none;stroke-opacity:1"
       id="path2464"
       sodipodi:cx="321.25"
       sodipodi:cy="293.75"
       sodipodi:rx="125"
       sodipodi:ry="131.25"
       d="M 321.25,162.5 A 125,131.25 0 1 1 196.25,293.74999"
       sodipodi:start="4.712389"
       sodipodi:end="9.424778"
       sodipodi:open="true" />
    <path
       style="fill:#800000;fill-opacity:1;fill-rule:evenodd;stroke:#800000;stroke-width:20;stroke-linecap:round;stroke-linejoin:round;stroke-miterlimit:4;stroke-dasharray:none;stroke-opacity:1"
       d="M 390.78125,126.1875 L 314.3125,159.9375 L 314.21875,160.15625 L 314.3125,160.34375 L 362.25,233.09375 L 315.3125,160.1875 L 390.78125,126.1875 z"
       id="path2468"
       sodipodi:nodetypes="ccccccc" />
  </g>
</svg>
