chi1
ta1
jin1tian1
can1ting1
huan1ying2
zhong1guo2
duo1shao3
zhi1you3
sheng1ri4
gao1xing4
ma1ma0
ge1ge0
ren2
qian2
shi2jian1
jie2hun1
chang2cheng2
xue2xi2
mei2you3
you2yong3
fo2jiao4
hai2shi4
shen2me0
peng2you0
wo3
xiang3
xi3huan1
yi3jing1
lv3xing2
qi3chuang2
ni3hao3
zhi3you3
mei3li4
nv3shi4
xiao3jie0
na3li0
er4
shi4
tui4xiu1
hou4tian1
shang4xue2
ji4jie2
zi4ji3
xia4wu3
dian4hua4
zai4jian4
xie4xie0
mei4mei0
ma0
ne0
