/* XPM */
static const char * note_xpm_data[] = {
"16 16 158 2",
"  	c None",
". 	c #7E7E7E",
"+ 	c #A2A2A2",
"@ 	c #9B9B9B",
"# 	c #989898",
"$ 	c #959595",
"% 	c #8F8F8F",
"& 	c #898989",
"* 	c #8B8B8B",
"= 	c #8D8D8D",
"- 	c #6F6F6F",
"; 	c #757575",
"> 	c #E4E4E4",
", 	c #FFFFFF",
"' 	c #FEFEFE",
") 	c #968C84",
"! 	c #D18E4E",
"~ 	c #FCD289",
"{ 	c #6E6E6E",
"] 	c #808080",
"^ 	c #BFBFBF",
"/ 	c #DFD4CB",
"( 	c #D28F4F",
"_ 	c #FAC682",
": 	c #FE8F0C",
"< 	c #6C6C6C",
"[ 	c #7F7F7F",
"} 	c #E0D5CA",
"| 	c #D3904E",
"1 	c #FCC280",
"2 	c #FE880E",
"3 	c #FE8801",
"4 	c #6A6A6A",
"5 	c #EBDCCE",
"6 	c #D69250",
"7 	c #FDBC7A",
"8 	c #FD8810",
"9 	c #FE8803",
"0 	c #EC7A03",
"a 	c #686868",
"b 	c #EDE0D2",
"c 	c #DC9353",
"d 	c #FDB669",
"e 	c #FD850C",
"f 	c #FE8703",
"g 	c #E47604",
"h 	c #A54E04",
"i 	c #666666",
"j 	c #FEECE3",
"k 	c #F4CA9B",
"l 	c #F0A87F",
"m 	c #FE8406",
"n 	c #FE8804",
"o 	c #A34C04",
"p 	c #371902",
"q 	c #646464",
"r 	c #FEFCFC",
"s 	c #FDDFC9",
"t 	c #FFE2CD",
"u 	c #EB9260",
"v 	c #FA800A",
"w 	c #E47702",
"x 	c #A04A04",
"y 	c #3F1D02",
"z 	c #626262",
"A 	c #FCFBF9",
"B 	c #FAE6DA",
"C 	c #FFE6CB",
"D 	c #F1B492",
"E 	c #D37043",
"F 	c #CF6524",
"G 	c #A04B0A",
"H 	c #2E1602",
"I 	c #606060",
"J 	c #FCFCFB",
"K 	c #FAF7F2",
"L 	c #FCDCC0",
"M 	c #F8C6AA",
"N 	c #C67E5D",
"O 	c #87542B",
"P 	c #5C4733",
"Q 	c #472C20",
"R 	c #312C25",
"S 	c #5E5E5E",
"T 	c #FBFAF7",
"U 	c #F9F5EE",
"V 	c #F8E2D3",
"W 	c #F8CAAD",
"X 	c #C67D5A",
"Y 	c #825234",
"Z 	c #332E23",
"` 	c #5C554C",
" .	c #8E8472",
"..	c #423B30",
"+.	c #5C5C5C",
"@.	c #FBF9F6",
"#.	c #F9F4EE",
"$.	c #F6F0E6",
"%.	c #978670",
"&.	c #A36F52",
"*.	c #4C392C",
"=.	c #56534E",
"-.	c #8D8679",
";.	c #9A8E7B",
">.	c #B6A68D",
",.	c #544A3A",
"'.	c #595959",
").	c #E2E2E1",
"!.	c #FAF5F0",
"~.	c #F6F0E8",
"{.	c #B3AA9B",
"].	c #1A1812",
"^.	c #55504A",
"/.	c #968E82",
"(.	c #A49884",
"_.	c #B7A890",
":.	c #CCB89A",
"<.	c #DDC4A0",
"[.	c #75644C",
"}.	c #565656",
"|.	c #E1DEDB",
"1.	c #F5EFE5",
"2.	c #F3EBDC",
"3.	c #C6BCAA",
"4.	c #B4AC9E",
"5.	c #A79A89",
"6.	c #ADA08C",
"7.	c #C5B59B",
"8.	c #D8C3A4",
"9.	c #E1C8A4",
"0.	c #E2C7A0",
"a.	c #766348",
"b.	c #4F4F4F",
"c.	c #DFDCD8",
"d.	c #F2EBDE",
"e.	c #F1E6D5",
"f.	c #EBDFCC",
"g.	c #D6C7B2",
"h.	c #D0C0A7",
"i.	c #DAC7AC",
"j.	c #E2CDAD",
"k.	c #E4CCA8",
"l.	c #E2C8A1",
"m.	c #E2C69F",
"n.	c #756246",
"o.	c #2A2A28",
"p.	c #7C776E",
"q.	c #7C746B",
"r.	c #7B7165",
"s.	c #7A7063",
"t.	c #766C5B",
"u.	c #776958",
"v.	c #796A56",
"w.	c #786851",
"x.	c #75654E",
"y.	c #76654A",
"z.	c #756346",
"A.	c #483C2A",
"  . + @ # $ % & * = = = = -     ",
"  ; > , , , ' , , , , , , ) ! ~ ",
"  { > ] ] ] ^ ] ^ , , , / ( _ : ",
"  < > ] ] , [ ] ^ , , } | 1 2 3 ",
"  4 > ] ] , [ , ] ' 5 6 7 8 9 0 ",
"  a > ] ] ] ^ ] ^ b c d e f g h ",
"  i > , , , , , j k l m n g o p ",
"  q > , , , , r s t u v w x y   ",
"  z > , , , A B C D E F G H     ",
"  I > , , J K L M N O P Q R     ",
"  S > ' T U V W X Y Z `  ...    ",
"  +.> @.#.$.%.&.*.=.-.;.>.,.    ",
"  '.).!.~.{.].^./.(._.:.<.[.    ",
"  }.|.1.2.3.4.5.6.7.8.9.0.a.    ",
"  b.c.d.e.f.g.h.i.j.k.l.m.n.    ",
"  o.p.q.r.s.t.u.v.w.x.y.z.A.    "};
