// MilkShape 3D ASCII

Frames: 30
Frame: 1

Meshes: 11
"Leftwheel" 0 0
69
0 31.612858 24.747328 28.048735 0.866026 0.133975 -1
0 31.612854 18.105482 31.883406 1.000000 0.366025 -1
0 31.612865 14.270803 17.572212 0.500000 0.500000 -1
0 24.154526 24.747330 28.048729 0.866025 0.133975 -1
0 24.154522 14.270811 17.572206 0.500000 0.500000 -1
0 24.154518 18.105488 31.883398 1.000000 0.366025 -1
0 31.612858 24.747328 28.048735 0.899194 0.027376 -1
0 24.154526 24.747330 28.048729 0.994192 0.027376 -1
0 31.612854 18.105482 31.883406 0.899194 0.000661 -1
0 24.154518 18.105488 31.883398 0.994192 0.000662 -1
0 31.612854 10.436136 31.883402 1.000000 0.633974 -1
0 24.154522 10.436132 31.883410 1.000000 0.633975 -1
0 24.154522 10.436132 31.883410 0.994192 0.000661 -1
0 31.612854 10.436136 31.883402 0.899194 0.000662 -1
0 31.612850 3.794287 28.048723 0.866025 0.866025 -1
0 24.154522 3.794287 28.048727 0.866025 0.866025 -1
0 31.612850 3.794287 28.048723 0.899195 0.027376 -1
0 24.154522 3.794287 28.048727 0.994192 0.027376 -1
0 31.612850 -0.040386 21.406878 0.633974 1.000000 -1
0 24.154522 -0.040390 21.406887 0.633975 1.000000 -1
0 24.154522 -0.040390 21.406887 0.994192 0.073646 -1
0 31.612850 -0.040386 21.406878 0.899194 0.073646 -1
0 31.612858 -0.040390 13.737534 0.366025 1.000000 -1
0 24.154518 -0.040384 13.737532 0.366025 1.000000 -1
0 31.612858 -0.040390 13.737534 0.899194 0.127075 -1
0 24.154518 -0.040384 13.737532 0.994192 0.127075 -1
0 31.612865 3.794281 7.095694 0.133975 0.866026 -1
0 24.154522 3.794285 7.095688 0.133975 0.866025 -1
0 24.154522 3.794285 7.095688 0.994192 0.173346 -1
0 31.612865 3.794281 7.095694 0.899194 0.173346 -1
0 31.612858 10.436132 3.261016 0.000000 0.633975 -1
0 24.154518 10.436132 3.261017 0.000000 0.633975 -1
0 31.612858 10.436132 3.261016 0.899194 0.200060 -1
0 24.154518 10.436132 3.261017 0.994192 0.200060 -1
0 31.612865 18.105473 3.261025 0.000000 0.366026 -1
0 24.154530 18.105473 3.261030 0.000000 0.366026 -1
0 24.154530 18.105473 3.261030 0.994192 0.200060 -1
0 31.612865 18.105473 3.261025 0.899194 0.200060 -1
0 31.612862 24.747316 7.095698 0.133975 0.133975 -1
0 24.154514 24.747330 7.095689 0.133975 0.133975 -1
0 31.612862 24.747316 7.095698 0.899194 0.173346 -1
0 24.154514 24.747330 7.095689 0.994192 0.173346 -1
0 31.612862 28.581987 13.737541 0.366026 0.000001 -1
0 24.154526 28.581987 13.737545 0.366026 0.000001 -1
0 24.154526 28.581987 13.737545 0.994192 0.127075 -1
0 31.612862 28.581987 13.737541 0.899194 0.127075 -1
0 31.612854 28.582003 21.406885 0.633975 0.000000 -1
0 24.154522 28.582003 21.406887 0.633975 0.000000 -1
0 31.612854 28.582003 21.406885 0.899194 0.073646 -1
0 24.154522 28.582003 21.406887 0.994192 0.073646 -1
0 33.987865 14.272955 21.399342 0.633711 0.499925 -1
0 33.987862 10.893326 19.448114 0.565540 0.618001 -1
0 33.987854 14.272955 17.496878 0.497368 0.499925 -1
0 32.696194 14.272947 24.357750 0.737071 0.499925 -1
0 32.696194 8.331276 20.927315 0.617220 0.707513 -1
0 30.779522 14.272959 24.357744 0.737071 0.499925 -1
0 30.779530 8.331276 20.927317 0.617220 0.707513 -1
0 33.987858 10.893326 15.545652 0.429197 0.618001 -1
0 32.696198 8.331276 14.066454 0.377517 0.707513 -1
0 30.779526 8.331276 14.066452 0.377517 0.707513 -1
0 33.987858 14.272955 13.594423 0.361026 0.499925 -1
0 32.696194 14.272947 10.636028 0.257666 0.499925 -1
0 30.779526 14.272959 10.636030 0.257666 0.499925 -1
0 33.987858 17.652576 15.545652 0.429197 0.381849 -1
0 32.696198 20.214628 14.066454 0.377517 0.292337 -1
0 30.779526 20.214628 14.066452 0.377517 0.292337 -1
0 33.987862 17.652576 19.448114 0.565540 0.381849 -1
0 32.696194 20.214628 20.927315 0.617220 0.292337 -1
0 30.779530 20.214628 20.927317 0.617220 0.292337 -1
75
1.000000 0.000000 0.000000
1.000000 -0.000000 0.000001
1.000000 -0.000000 0.000000
-1.000000 0.000000 -0.000000
-1.000000 0.000000 0.000000
-1.000000 0.000000 -0.000000
-0.000000 0.707107 0.707107
-0.000000 0.707107 0.707107
-0.000000 0.258819 0.965926
-0.000001 0.258820 0.965926
1.000000 -0.000000 0.000001
-1.000000 -0.000000 -0.000000
0.000000 -0.258819 0.965926
0.000001 -0.258820 0.965926
1.000000 -0.000001 0.000001
-1.000000 0.000000 0.000000
0.000001 -0.707107 0.707107
0.000000 -0.707107 0.707107
1.000000 -0.000001 0.000001
-1.000000 0.000000 0.000000
0.000000 -0.965926 0.258819
0.000001 -0.965926 0.258819
1.000000 -0.000001 0.000001
-1.000000 0.000000 0.000000
-0.000000 -0.965926 -0.258819
-0.000001 -0.965926 -0.258819
1.000000 -0.000000 0.000000
-1.000000 0.000000 -0.000000
-0.000000 -0.707107 -0.707107
0.000000 -0.707107 -0.707107
1.000000 -0.000000 -0.000000
-1.000000 0.000001 0.000000
-0.000000 -0.258818 -0.965926
-0.000000 -0.258818 -0.965926
1.000000 -0.000000 -0.000000
-1.000000 -0.000000 -0.000001
0.000000 0.258819 -0.965926
-0.000001 0.258820 -0.965926
1.000000 0.000000 -0.000000
-1.000000 -0.000001 0.000000
0.000001 0.707107 -0.707107
0.000002 0.707107 -0.707107
1.000000 0.000000 0.000000
-1.000000 0.000000 0.000000
0.000000 0.965926 -0.258819
-0.000000 0.965926 -0.258820
1.000000 0.000001 0.000000
-1.000000 0.000000 -0.000000
-0.000000 0.965926 0.258818
0.000000 0.965926 0.258818
1.000000 -0.000000 -0.000003
1.000000 0.000001 -0.000002
1.000000 -0.000000 -0.000001
0.916457 0.000000 0.400134
0.579462 -0.000000 0.814999
0.579463 -0.705809 0.407499
0.916457 -0.346527 0.200066
-0.000001 0.000000 1.000000
0.000000 -0.866025 0.500000
1.000000 0.000001 0.000000
0.916457 -0.346526 -0.200067
0.579465 -0.705808 -0.407499
-0.000001 -0.866025 -0.500000
1.000000 -0.000000 0.000001
0.579464 0.000000 -0.814998
0.916457 0.000001 -0.400134
-0.000001 0.000000 -1.000000
1.000000 -0.000001 0.000000
0.916457 0.346526 -0.200067
0.579465 0.705808 -0.407499
0.000001 0.866025 -0.500000
1.000000 -0.000001 -0.000002
0.579464 0.705809 0.407499
0.916457 0.346527 0.200066
0.000000 0.866026 0.500000
78
0 0 1 2 0 1 2 2
0 3 4 5 3 4 5 2
0 6 7 8 6 7 8 1
0 7 9 8 7 9 8 1
0 1 10 2 1 10 2 2
0 5 4 11 5 4 11 2
0 8 9 12 8 9 12 1
0 8 12 13 8 12 13 1
0 10 14 2 10 14 2 2
0 11 4 15 11 4 15 2
0 13 12 16 13 12 16 1
0 12 17 16 12 17 16 1
0 14 18 2 14 18 2 2
0 15 4 19 15 4 19 2
0 16 17 20 16 17 20 1
0 16 20 21 16 20 21 1
0 18 22 2 18 22 2 2
0 19 4 23 19 4 23 2
0 21 20 24 21 20 24 1
0 20 25 24 20 25 24 1
0 22 26 2 22 26 2 2
0 23 4 27 23 4 27 2
0 24 25 28 24 25 28 1
0 24 28 29 24 28 29 1
0 26 30 2 26 30 2 2
0 27 4 31 27 4 31 2
0 29 28 32 29 28 32 1
0 28 33 32 28 33 32 1
0 30 34 2 30 34 2 2
0 31 4 35 31 4 35 2
0 32 33 36 32 33 36 1
0 32 36 37 32 36 37 1
0 34 38 2 34 38 2 2
0 35 4 39 35 4 39 2
0 37 36 40 37 36 40 1
0 36 41 40 36 41 40 1
0 38 42 2 38 42 2 2
0 39 4 43 39 4 43 2
0 40 41 44 40 41 44 1
0 40 44 45 40 44 45 1
0 42 46 2 42 46 2 2
0 43 4 47 43 4 47 2
0 45 44 48 45 44 48 1
0 44 49 48 44 49 48 1
0 46 0 2 46 0 2 2
0 47 4 3 47 4 3 2
0 48 49 7 48 49 7 1
0 48 7 6 48 7 6 1
0 50 51 52 50 51 52 2
0 50 53 54 53 54 55 1
0 50 54 51 53 55 56 1
0 53 55 54 54 57 55 1
0 55 56 54 57 58 55 1
0 51 57 52 51 59 52 2
0 51 54 57 56 55 60 1
0 54 58 57 55 61 60 1
0 54 56 59 55 58 62 1
0 54 59 58 55 62 61 1
0 57 60 52 59 63 52 2
0 57 58 61 60 61 64 1
0 57 61 60 60 64 65 1
0 58 59 61 61 62 64 1
0 59 62 61 62 66 64 1
0 60 63 52 63 67 52 2
0 60 61 63 65 64 68 1
0 61 64 63 64 69 68 1
0 61 62 65 64 66 70 1
0 61 65 64 64 70 69 1
0 63 66 52 67 71 52 2
0 63 64 67 68 69 72 1
0 63 67 66 68 72 73 1
0 64 65 67 69 70 72 1
0 65 68 67 70 74 72 1
0 66 50 52 71 50 52 2
0 66 67 50 73 72 53 1
0 67 53 50 72 54 53 1
0 67 68 55 72 74 57 1
0 67 55 53 72 57 54 1
"Duplicate01" 0 0
69
0 -43.770473 14.270803 17.572216 0.500000 0.500000 -1
0 -43.770458 18.105482 31.883406 1.000000 0.366025 -1
0 -43.770477 24.747328 28.048740 0.866026 0.133975 -1
0 -36.312130 18.105488 31.883402 1.000000 0.366025 -1
0 -36.312141 14.270811 17.572212 0.500000 0.500000 -1
0 -36.312130 24.747330 28.048731 0.866025 0.133975 -1
0 -43.770458 18.105482 31.883406 0.899194 0.000661 -1
0 -36.312130 24.747330 28.048731 0.994192 0.027376 -1
0 -43.770477 24.747328 28.048740 0.899194 0.027376 -1
0 -36.312130 18.105488 31.883402 0.994192 0.000662 -1
0 -43.770466 10.436136 31.883402 1.000000 0.633974 -1
0 -36.312138 10.436132 31.883410 1.000000 0.633975 -1
0 -36.312138 10.436132 31.883410 0.994192 0.000661 -1
0 -43.770466 10.436136 31.883402 0.899194 0.000662 -1
0 -43.770470 3.794287 28.048737 0.866025 0.866025 -1
0 -36.312130 3.794287 28.048733 0.866025 0.866025 -1
0 -43.770470 3.794287 28.048737 0.899195 0.027376 -1
0 -36.312130 3.794287 28.048733 0.994192 0.027376 -1
0 -43.770466 -0.040386 21.406883 0.633974 1.000000 -1
0 -36.312134 -0.040390 21.406889 0.633975 1.000000 -1
0 -36.312134 -0.040390 21.406889 0.994192 0.073646 -1
0 -43.770466 -0.040386 21.406883 0.899194 0.073646 -1
0 -43.770470 -0.040390 13.737541 0.366025 1.000000 -1
0 -36.312134 -0.040384 13.737535 0.366025 1.000000 -1
0 -43.770470 -0.040390 13.737541 0.899194 0.127075 -1
0 -36.312134 -0.040384 13.737535 0.994192 0.127075 -1
0 -43.770473 3.794281 7.095694 0.133975 0.866026 -1
0 -36.312134 3.794285 7.095689 0.133975 0.866025 -1
0 -36.312134 3.794285 7.095689 0.994192 0.173346 -1
0 -43.770473 3.794281 7.095694 0.899194 0.173346 -1
0 -43.770466 10.436132 3.261020 0.000000 0.633975 -1
0 -36.312130 10.436132 3.261020 0.000000 0.633975 -1
0 -43.770466 10.436132 3.261020 0.899194 0.200060 -1
0 -36.312130 10.436132 3.261020 0.994192 0.200060 -1
0 -43.770481 18.105473 3.261033 0.000000 0.366026 -1
0 -36.312145 18.105473 3.261028 0.000000 0.366026 -1
0 -36.312145 18.105473 3.261028 0.994192 0.200060 -1
0 -43.770481 18.105473 3.261033 0.899194 0.200060 -1
0 -43.770481 24.747316 7.095701 0.133975 0.133975 -1
0 -36.312134 24.747330 7.095693 0.133975 0.133975 -1
0 -43.770481 24.747316 7.095701 0.899194 0.173346 -1
0 -36.312134 24.747330 7.095693 0.994192 0.173346 -1
0 -43.770473 28.581987 13.737547 0.366026 0.000001 -1
0 -36.312138 28.581987 13.737543 0.366026 0.000001 -1
0 -36.312138 28.581987 13.737543 0.994192 0.127075 -1
0 -43.770473 28.581987 13.737547 0.899194 0.127075 -1
0 -43.770466 28.582003 21.406889 0.633975 0.000000 -1
0 -36.312134 28.582003 21.406889 0.633975 0.000000 -1
0 -43.770466 28.582003 21.406889 0.899194 0.073646 -1
0 -36.312134 28.582003 21.406889 0.994192 0.073646 -1
0 -46.145477 14.272955 17.496885 0.497368 0.499925 -1
0 -46.145470 10.893326 19.448114 0.565540 0.618001 -1
0 -46.145470 14.272955 21.399343 0.633711 0.499925 -1
0 -44.853813 8.331276 20.927317 0.617220 0.707513 -1
0 -44.853802 14.272947 24.357750 0.737071 0.499925 -1
0 -42.937145 14.272959 24.357752 0.737071 0.499925 -1
0 -42.937138 8.331276 20.927319 0.617220 0.707513 -1
0 -46.145473 10.893326 15.545660 0.429197 0.618001 -1
0 -44.853813 8.331276 14.066456 0.377517 0.707513 -1
0 -42.937138 8.331276 14.066460 0.377517 0.707513 -1
0 -46.145473 14.272955 13.594431 0.361026 0.499925 -1
0 -44.853802 14.272947 10.636032 0.257666 0.499925 -1
0 -42.937141 14.272959 10.636028 0.257666 0.499925 -1
0 -46.145473 17.652576 15.545660 0.429197 0.381849 -1
0 -44.853813 20.214628 14.066456 0.377517 0.292337 -1
0 -42.937138 20.214628 14.066460 0.377517 0.292337 -1
0 -46.145470 17.652576 19.448114 0.565540 0.381849 -1
0 -44.853813 20.214628 20.927317 0.617220 0.292337 -1
0 -42.937138 20.214628 20.927319 0.617220 0.292337 -1
75
-1.000000 -0.000000 0.000000
-1.000000 -0.000000 0.000001
-1.000000 -0.000001 0.000000
1.000000 -0.000001 -0.000001
1.000000 0.000000 -0.000000
1.000000 -0.000000 -0.000001
0.000000 0.258819 0.965926
0.000000 0.707107 0.707107
0.000001 0.707107 0.707107
0.000000 0.258820 0.965926
-1.000000 0.000001 0.000001
1.000000 0.000000 -0.000000
-0.000000 -0.258819 0.965926
-0.000001 -0.258819 0.965926
-1.000000 -0.000000 0.000000
1.000000 0.000001 -0.000000
-0.000000 -0.707107 0.707107
0.000000 -0.707107 0.707107
-1.000000 -0.000000 0.000000
1.000000 0.000000 -0.000000
-0.000000 -0.965926 0.258819
-0.000001 -0.965926 0.258819
-1.000000 -0.000000 0.000000
1.000000 0.000000 0.000000
0.000000 -0.965926 -0.258819
0.000001 -0.965926 -0.258819
-1.000000 0.000000 -0.000000
1.000000 0.000000 0.000001
0.000000 -0.707107 -0.707107
-0.000000 -0.707107 -0.707107
-1.000000 -0.000001 -0.000000
1.000000 0.000001 0.000001
-0.000000 -0.258818 -0.965926
0.000000 -0.258818 -0.965926
-1.000000 -0.000001 0.000000
1.000000 0.000000 -0.000000
-0.000001 0.258819 -0.965926
-0.000001 0.258820 -0.965926
-1.000000 -0.000000 0.000001
1.000000 -0.000001 0.000000
-0.000001 0.707107 -0.707107
-0.000002 0.707107 -0.707107
-1.000000 0.000000 0.000001
1.000000 -0.000000 0.000000
-0.000001 0.965926 -0.258820
-0.000000 0.965926 -0.258820
-1.000000 0.000001 -0.000000
1.000000 -0.000000 -0.000001
0.000000 0.965926 0.258818
0.000000 0.965926 0.258818
-1.000000 0.000000 0.000001
-1.000000 -0.000001 0.000001
-1.000000 0.000000 0.000002
-0.579465 -0.705808 0.407499
-0.579464 -0.000000 0.814998
-0.916457 0.000000 0.400132
-0.916458 -0.346524 0.200066
-0.000001 0.000000 1.000000
-0.000000 -0.866025 0.500000
-1.000000 -0.000001 0.000000
-0.916457 -0.346524 -0.200067
-0.579464 -0.705808 -0.407499
0.000001 -0.866025 -0.500000
-1.000000 0.000000 -0.000001
-0.579463 0.000000 -0.814998
-0.916456 0.000001 -0.400135
-0.000002 0.000000 -1.000000
-1.000000 0.000001 0.000000
-0.916457 0.346525 -0.200067
-0.579464 0.705808 -0.407500
-0.000001 0.866025 -0.500000
-1.000000 0.000001 0.000001
-0.579465 0.705808 0.407499
-0.916458 0.346524 0.200066
-0.000000 0.866026 0.500000
78
0 0 1 2 0 1 2 2
0 3 4 5 3 4 5 2
0 6 7 8 6 7 8 1
0 6 9 7 6 9 7 1
0 0 10 1 0 10 1 2
0 11 4 3 11 4 3 2
0 12 9 6 12 9 6 1
0 13 12 6 13 12 6 1
0 0 14 10 0 14 10 2
0 15 4 11 15 4 11 2
0 16 12 13 16 12 13 1
0 16 17 12 16 17 12 1
0 0 18 14 0 18 14 2
0 19 4 15 19 4 15 2
0 20 17 16 20 17 16 1
0 21 20 16 21 20 16 1
0 0 22 18 0 22 18 2
0 23 4 19 23 4 19 2
0 24 20 21 24 20 21 1
0 24 25 20 24 25 20 1
0 0 26 22 0 26 22 2
0 27 4 23 27 4 23 2
0 28 25 24 28 25 24 1
0 29 28 24 29 28 24 1
0 0 30 26 0 30 26 2
0 31 4 27 31 4 27 2
0 32 28 29 32 28 29 1
0 32 33 28 32 33 28 1
0 0 34 30 0 34 30 2
0 35 4 31 35 4 31 2
0 36 33 32 36 33 32 1
0 37 36 32 37 36 32 1
0 0 38 34 0 38 34 2
0 39 4 35 39 4 35 2
0 40 36 37 40 36 37 1
0 40 41 36 40 41 36 1
0 0 42 38 0 42 38 2
0 43 4 39 43 4 39 2
0 44 41 40 44 41 40 1
0 45 44 40 45 44 40 1
0 0 46 42 0 46 42 2
0 47 4 43 47 4 43 2
0 48 44 45 48 44 45 1
0 48 49 44 48 49 44 1
0 0 2 46 0 2 46 2
0 5 4 47 5 4 47 2
0 7 49 48 7 49 48 1
0 8 7 48 8 7 48 1
0 50 51 52 50 51 52 2
0 53 54 52 53 54 55 1
0 51 53 52 56 53 55 1
0 53 55 54 53 57 54 1
0 53 56 55 53 58 57 1
0 50 57 51 50 59 51 2
0 57 53 51 60 53 56 1
0 57 58 53 60 61 53 1
0 59 56 53 62 58 53 1
0 58 59 53 61 62 53 1
0 50 60 57 50 63 59 2
0 61 58 57 64 61 60 1
0 60 61 57 65 64 60 1
0 61 59 58 64 62 61 1
0 61 62 59 64 66 62 1
0 50 63 60 50 67 63 2
0 63 61 60 68 64 65 1
0 63 64 61 68 69 64 1
0 65 62 61 70 66 64 1
0 64 65 61 69 70 64 1
0 50 66 63 50 71 67 2
0 67 64 63 72 69 68 1
0 66 67 63 73 72 68 1
0 67 65 64 72 70 69 1
0 67 68 65 72 74 70 1
0 50 52 66 50 52 71 2
0 52 67 66 55 72 73 1
0 52 54 67 55 54 72 1
0 55 68 67 57 74 72 1
0 54 55 67 54 57 72 1
"Duplicate02" 0 0
138
0 31.612858 24.747328 -19.284586 0.866026 0.133975 -1
0 31.612850 18.105482 -15.449917 1.000000 0.366025 -1
0 31.612858 14.270803 -29.761112 0.500000 0.500000 -1
0 24.154522 24.747330 -19.284594 0.866025 0.133975 -1
0 24.154522 14.270811 -29.761116 0.500000 0.500000 -1
0 24.154518 18.105488 -15.449923 1.000000 0.366025 -1
0 31.612858 24.747328 -19.284586 0.899194 0.027376 -1
0 24.154522 24.747330 -19.284594 0.994192 0.027376 -1
0 31.612850 18.105482 -15.449917 0.899194 0.000661 -1
0 24.154518 18.105488 -15.449923 0.994192 0.000662 -1
0 31.612854 10.436136 -15.449924 1.000000 0.633974 -1
0 24.154518 10.436132 -15.449917 1.000000 0.633975 -1
0 24.154518 10.436132 -15.449917 0.994192 0.000661 -1
0 31.612854 10.436136 -15.449924 0.899194 0.000662 -1
0 31.612850 3.794287 -19.284594 0.866025 0.866025 -1
0 24.154522 3.794287 -19.284595 0.866025 0.866025 -1
0 31.612850 3.794287 -19.284594 0.899195 0.027376 -1
0 24.154522 3.794287 -19.284595 0.994192 0.027376 -1
0 31.612854 -0.040386 -25.926443 0.633974 1.000000 -1
0 24.154518 -0.040390 -25.926437 0.633975 1.000000 -1
0 24.154518 -0.040390 -25.926437 0.994192 0.073646 -1
0 31.612854 -0.040386 -25.926443 0.899194 0.073646 -1
0 31.612854 -0.040390 -33.595787 0.366025 1.000000 -1
0 24.154518 -0.040384 -33.595791 0.366025 1.000000 -1
0 31.612854 -0.040390 -33.595787 0.899194 0.127075 -1
0 24.154518 -0.040384 -33.595791 0.994192 0.127075 -1
0 31.612862 3.794281 -40.237637 0.133975 0.866026 -1
0 24.154522 3.794285 -40.237640 0.133975 0.866025 -1
0 24.154522 3.794285 -40.237640 0.994192 0.173346 -1
0 31.612862 3.794281 -40.237637 0.899194 0.173346 -1
0 31.612850 10.436132 -44.072308 0.000000 0.633975 -1
0 24.154518 10.436132 -44.072308 0.000000 0.633975 -1
0 31.612850 10.436132 -44.072308 0.899194 0.200060 -1
0 24.154518 10.436132 -44.072308 0.994192 0.200060 -1
0 31.612858 18.105473 -44.072300 0.000000 0.366026 -1
0 24.154526 18.105473 -44.072300 0.000000 0.366026 -1
0 24.154526 18.105473 -44.072300 0.994192 0.200060 -1
0 31.612858 18.105473 -44.072300 0.899194 0.200060 -1
0 31.612858 24.747316 -40.237625 0.133975 0.133975 -1
0 24.154514 24.747330 -40.237637 0.133975 0.133975 -1
0 31.612858 24.747316 -40.237625 0.899194 0.173346 -1
0 24.154514 24.747330 -40.237637 0.994192 0.173346 -1
0 31.612862 28.581987 -33.595779 0.366026 0.000001 -1
0 24.154526 28.581987 -33.595776 0.366026 0.000001 -1
0 24.154526 28.581987 -33.595776 0.994192 0.127075 -1
0 31.612862 28.581987 -33.595779 0.899194 0.127075 -1
0 31.612850 28.582003 -25.926434 0.633975 0.000000 -1
0 24.154518 28.582003 -25.926437 0.633975 0.000000 -1
0 31.612850 28.582003 -25.926434 0.899194 0.073646 -1
0 24.154518 28.582003 -25.926437 0.994192 0.073646 -1
0 33.987862 14.272955 -25.933981 0.633711 0.499925 -1
0 33.987858 10.893326 -27.885212 0.565540 0.618001 -1
0 33.987862 14.272955 -29.836439 0.497368 0.499925 -1
0 32.696190 14.272947 -22.975582 0.737071 0.499925 -1
0 32.696194 8.331276 -26.406012 0.617220 0.707513 -1
0 30.779522 14.272959 -22.975578 0.737071 0.499925 -1
0 30.779526 8.331276 -26.406012 0.617220 0.707513 -1
0 33.987862 10.893326 -31.787666 0.429197 0.618001 -1
0 32.696194 8.331276 -33.266865 0.377517 0.707513 -1
0 30.779522 8.331276 -33.266865 0.377517 0.707513 -1
0 33.987862 14.272955 -33.738892 0.361026 0.499925 -1
0 32.696186 14.272947 -36.697296 0.257666 0.499925 -1
0 30.779518 14.272959 -36.697292 0.257666 0.499925 -1
0 33.987862 17.652576 -31.787666 0.429197 0.381849 -1
0 32.696194 20.214628 -33.266865 0.377517 0.292337 -1
0 30.779522 20.214628 -33.266865 0.377517 0.292337 -1
0 33.987858 17.652576 -27.885212 0.565540 0.381849 -1
0 32.696194 20.214628 -26.406012 0.617220 0.292337 -1
0 30.779526 20.214628 -26.406012 0.617220 0.292337 -1
0 -43.770477 14.270803 -29.761110 0.500000 0.500000 -1
0 -43.770473 18.105482 -15.449915 1.000000 0.366025 -1
0 -43.770473 24.747328 -19.284586 0.866026 0.133975 -1
0 -36.312134 18.105488 -15.449923 1.000000 0.366025 -1
0 -36.312141 14.270811 -29.761112 0.500000 0.500000 -1
0 -36.312141 24.747330 -19.284592 0.866025 0.133975 -1
0 -43.770473 18.105482 -15.449915 0.899194 0.000661 -1
0 -36.312141 24.747330 -19.284592 0.994192 0.027376 -1
0 -43.770473 24.747328 -19.284586 0.899194 0.027376 -1
0 -36.312134 18.105488 -15.449923 0.994192 0.000662 -1
0 -43.770466 10.436136 -15.449923 1.000000 0.633974 -1
0 -36.312134 10.436132 -15.449915 1.000000 0.633975 -1
0 -36.312134 10.436132 -15.449915 0.994192 0.000661 -1
0 -43.770466 10.436136 -15.449923 0.899194 0.000662 -1
0 -43.770470 3.794287 -19.284595 0.866025 0.866025 -1
0 -36.312134 3.794287 -19.284590 0.866025 0.866025 -1
0 -43.770470 3.794287 -19.284595 0.899195 0.027376 -1
0 -36.312134 3.794287 -19.284590 0.994192 0.027376 -1
0 -43.770470 -0.040386 -25.926437 0.633974 1.000000 -1
0 -36.312134 -0.040390 -25.926432 0.633975 1.000000 -1
0 -36.312134 -0.040390 -25.926432 0.994192 0.073646 -1
0 -43.770470 -0.040386 -25.926437 0.899194 0.073646 -1
0 -43.770473 -0.040390 -33.595787 0.366025 1.000000 -1
0 -36.312130 -0.040384 -33.595783 0.366025 1.000000 -1
0 -43.770473 -0.040390 -33.595787 0.899194 0.127075 -1
0 -36.312130 -0.040384 -33.595783 0.994192 0.127075 -1
0 -43.770473 3.794281 -40.237629 0.133975 0.866026 -1
0 -36.312138 3.794285 -40.237633 0.133975 0.866025 -1
0 -36.312138 3.794285 -40.237633 0.994192 0.173346 -1
0 -43.770473 3.794281 -40.237629 0.899194 0.173346 -1
0 -43.770466 10.436132 -44.072296 0.000000 0.633975 -1
0 -36.312134 10.436132 -44.072304 0.000000 0.633975 -1
0 -43.770466 10.436132 -44.072296 0.899194 0.200060 -1
0 -36.312134 10.436132 -44.072304 0.994192 0.200060 -1
0 -43.770481 18.105473 -44.072292 0.000000 0.366026 -1
0 -36.312138 18.105473 -44.072289 0.000000 0.366026 -1
0 -36.312138 18.105473 -44.072289 0.994192 0.200060 -1
0 -43.770481 18.105473 -44.072292 0.899194 0.200060 -1
0 -43.770477 24.747316 -40.237629 0.133975 0.133975 -1
0 -36.312138 24.747330 -40.237633 0.133975 0.133975 -1
0 -43.770477 24.747316 -40.237629 0.899194 0.173346 -1
0 -36.312138 24.747330 -40.237633 0.994192 0.173346 -1
0 -43.770477 28.581987 -33.595776 0.366026 0.000001 -1
0 -36.312145 28.581987 -33.595776 0.366026 0.000001 -1
0 -36.312145 28.581987 -33.595776 0.994192 0.127075 -1
0 -43.770477 28.581987 -33.595776 0.899194 0.127075 -1
0 -43.770470 28.582003 -25.926437 0.633975 0.000000 -1
0 -36.312134 28.582003 -25.926432 0.633975 0.000000 -1
0 -43.770470 28.582003 -25.926437 0.899194 0.073646 -1
0 -36.312134 28.582003 -25.926432 0.994192 0.073646 -1
0 -46.145477 14.272955 -29.836437 0.497368 0.499925 -1
0 -46.145477 10.893326 -27.885208 0.565540 0.618001 -1
0 -46.145470 14.272955 -25.933975 0.633711 0.499925 -1
0 -44.853809 8.331276 -26.406006 0.617220 0.707513 -1
0 -44.853798 14.272947 -22.975573 0.737071 0.499925 -1
0 -42.937141 14.272959 -22.975574 0.737071 0.499925 -1
0 -42.937138 8.331276 -26.406002 0.617220 0.707513 -1
0 -46.145477 10.893326 -31.787661 0.429197 0.618001 -1
0 -44.853809 8.331276 -33.266853 0.377517 0.707513 -1
0 -42.937141 8.331276 -33.266861 0.377517 0.707513 -1
0 -46.145477 14.272955 -33.738888 0.361026 0.499925 -1
0 -44.853806 14.272947 -36.697292 0.257666 0.499925 -1
0 -42.937141 14.272959 -36.697289 0.257666 0.499925 -1
0 -46.145477 17.652576 -31.787661 0.429197 0.381849 -1
0 -44.853809 20.214628 -33.266853 0.377517 0.292337 -1
0 -42.937141 20.214628 -33.266861 0.377517 0.292337 -1
0 -46.145477 17.652576 -27.885208 0.565540 0.381849 -1
0 -44.853809 20.214628 -26.406006 0.617220 0.292337 -1
0 -42.937138 20.214628 -26.406002 0.617220 0.292337 -1
148
1.000000 -0.000000 0.000000
1.000000 -0.000000 0.000001
1.000000 -0.000000 0.000000
-1.000000 0.000000 -0.000000
-1.000000 0.000000 -0.000000
-1.000000 0.000000 -0.000000
-0.000001 0.707107 0.707107
-0.000000 0.707107 0.707107
-0.000000 0.258819 0.965926
-0.000001 0.258820 0.965926
1.000000 -0.000000 0.000000
-1.000000 -0.000000 -0.000000
0.000000 -0.258819 0.965926
0.000001 -0.258819 0.965926
1.000000 -0.000000 0.000000
-1.000000 0.000000 0.000000
0.000000 -0.707107 0.707107
-0.000000 -0.707107 0.707107
1.000000 -0.000000 0.000000
-1.000000 0.000000 0.000000
0.000000 -0.965926 0.258819
0.000001 -0.965926 0.258819
1.000000 -0.000000 0.000000
-1.000000 0.000000 -0.000000
-0.000000 -0.965926 -0.258819
-0.000001 -0.965926 -0.258819
1.000000 0.000000 0.000000
-1.000000 -0.000000 0.000000
-0.000000 -0.707107 -0.707107
0.000000 -0.707107 -0.707107
1.000000 0.000000 -0.000001
-1.000000 0.000000 0.000000
0.000000 -0.258818 -0.965926
0.000000 -0.258818 -0.965926
1.000000 -0.000000 -0.000000
-1.000000 -0.000000 -0.000000
0.000001 0.258819 -0.965926
0.000000 0.258820 -0.965926
1.000000 -0.000000 -0.000000
-1.000000 -0.000000 0.000000
0.000001 0.707107 -0.707107
0.000002 0.707107 -0.707106
1.000000 -0.000000 0.000001
-1.000000 0.000000 0.000000
0.000001 0.965926 -0.258819
-0.000000 0.965926 -0.258820
1.000000 0.000000 0.000000
-1.000000 -0.000000 -0.000000
-0.000000 0.965926 0.258818
-0.000000 0.965926 0.258818
1.000000 0.000000 0.000000
1.000000 -0.000001 0.000000
1.000000 0.000000 0.000000
0.916457 0.000000 0.400134
0.579464 -0.000000 0.814998
0.579464 -0.705809 0.407499
0.916457 -0.346526 0.200067
0.000001 0.000000 1.000000
0.000000 -0.866025 0.500000
1.000000 -0.000000 0.000000
0.916457 -0.346526 -0.200067
0.579463 -0.705809 -0.407499
-0.000001 -0.866025 -0.500000
1.000000 0.000000 0.000000
0.579463 0.000000 -0.814999
0.916456 0.000001 -0.400136
-0.000002 0.000000 -1.000000
1.000000 0.000000 0.000000
0.916457 0.346526 -0.200068
0.579464 0.705809 -0.407499
0.000000 0.866025 -0.500000
1.000000 0.000001 0.000000
0.579464 0.705809 0.407499
0.916457 0.346526 0.200066
0.000000 0.866026 0.500000
-1.000000 -0.000000 0.000000
-1.000000 -0.000000 0.000000
-1.000000 0.000000 0.000000
1.000000 0.000000 -0.000001
1.000000 0.000000 -0.000000
1.000000 0.000000 -0.000000
0.000000 0.258819 0.965926
0.000000 0.707107 0.707107
0.000000 0.707107 0.707107
0.000001 0.258820 0.965926
-1.000000 -0.000000 0.000001
1.000000 0.000000 -0.000000
-0.000000 -0.258819 0.965926
-0.000001 -0.258819 0.965926
-1.000000 -0.000000 0.000001
1.000000 0.000000 -0.000000
-0.000001 -0.707107 0.707107
-0.000001 -0.707107 0.707107
-1.000000 -0.000000 0.000000
1.000000 0.000001 0.000000
-0.000000 -0.965926 0.258819
-0.000001 -0.965926 0.258819
-1.000000 -0.000000 0.000000
1.000000 0.000001 -0.000000
0.000000 -0.965926 -0.258819
0.000001 -0.965926 -0.258819
-1.000000 0.000000 -0.000001
1.000000 0.000000 -0.000000
0.000000 -0.707107 -0.707107
-0.000000 -0.707106 -0.707107
-1.000000 -0.000001 -0.000001
1.000000 0.000000 0.000000
-0.000000 -0.258818 -0.965926
-0.000001 -0.258818 -0.965926
-1.000000 -0.000001 0.000000
1.000000 0.000000 0.000000
-0.000000 0.258819 -0.965926
0.000000 0.258819 -0.965926
-1.000000 0.000000 0.000000
1.000000 0.000000 0.000001
-0.000001 0.707107 -0.707107
-0.000002 0.707107 -0.707107
-1.000000 0.000000 0.000000
1.000000 0.000000 -0.000000
-0.000000 0.965926 -0.258819
0.000000 0.965926 -0.258820
-1.000000 0.000000 0.000000
1.000000 -0.000000 -0.000000
-0.000000 0.965926 0.258818
-0.000000 0.965926 0.258818
-1.000000 -0.000000 0.000001
-1.000000 0.000001 0.000001
-1.000000 -0.000000 0.000002
-0.579463 -0.705809 0.407499
-0.579463 -0.000000 0.814999
-0.916456 0.000000 0.400135
-0.916457 -0.346526 0.200068
-0.000000 0.000000 1.000000
-0.000001 -0.866025 0.500000
-1.000000 0.000000 0.000000
-0.916456 -0.346527 -0.200067
-0.579464 -0.705809 -0.407499
0.000000 -0.866026 -0.500000
-0.579464 0.000000 -0.814998
-0.916456 0.000001 -0.400135
0.000002 0.000000 -1.000000
-0.916456 0.346527 -0.200068
-0.579464 0.705809 -0.407499
-0.000001 0.866026 -0.500000
-1.000000 -0.000001 0.000001
-0.579464 0.705809 0.407499
-0.916457 0.346526 0.200067
-0.000001 0.866026 0.500000
156
0 0 1 2 0 1 2 2
0 3 4 5 3 4 5 2
0 6 7 8 6 7 8 1
0 7 9 8 7 9 8 1
0 1 10 2 1 10 2 2
0 5 4 11 5 4 11 2
0 8 9 12 8 9 12 1
0 8 12 13 8 12 13 1
0 10 14 2 10 14 2 2
0 11 4 15 11 4 15 2
0 13 12 16 13 12 16 1
0 12 17 16 12 17 16 1
0 14 18 2 14 18 2 2
0 15 4 19 15 4 19 2
0 16 17 20 16 17 20 1
0 16 20 21 16 20 21 1
0 18 22 2 18 22 2 2
0 19 4 23 19 4 23 2
0 21 20 24 21 20 24 1
0 20 25 24 20 25 24 1
0 22 26 2 22 26 2 2
0 23 4 27 23 4 27 2
0 24 25 28 24 25 28 1
0 24 28 29 24 28 29 1
0 26 30 2 26 30 2 2
0 27 4 31 27 4 31 2
0 29 28 32 29 28 32 1
0 28 33 32 28 33 32 1
0 30 34 2 30 34 2 2
0 31 4 35 31 4 35 2
0 32 33 36 32 33 36 1
0 32 36 37 32 36 37 1
0 34 38 2 34 38 2 2
0 35 4 39 35 4 39 2
0 37 36 40 37 36 40 1
0 36 41 40 36 41 40 1
0 38 42 2 38 42 2 2
0 39 4 43 39 4 43 2
0 40 41 44 40 41 44 1
0 40 44 45 40 44 45 1
0 42 46 2 42 46 2 2
0 43 4 47 43 4 47 2
0 45 44 48 45 44 48 1
0 44 49 48 44 49 48 1
0 46 0 2 46 0 2 2
0 47 4 3 47 4 3 2
0 48 49 7 48 49 7 1
0 48 7 6 48 7 6 1
0 50 51 52 50 51 52 2
0 50 53 54 53 54 55 1
0 50 54 51 53 55 56 1
0 53 55 54 54 57 55 1
0 55 56 54 57 58 55 1
0 51 57 52 51 59 52 2
0 51 54 57 56 55 60 1
0 54 58 57 55 61 60 1
0 54 56 59 55 58 62 1
0 54 59 58 55 62 61 1
0 57 60 52 59 63 52 2
0 57 58 61 60 61 64 1
0 57 61 60 60 64 65 1
0 58 59 61 61 62 64 1
0 59 62 61 62 66 64 1
0 60 63 52 63 67 52 2
0 60 61 63 65 64 68 1
0 61 64 63 64 69 68 1
0 61 62 65 64 66 70 1
0 61 65 64 64 70 69 1
0 63 66 52 67 71 52 2
0 63 64 67 68 69 72 1
0 63 67 66 68 72 73 1
0 64 65 67 69 70 72 1
0 65 68 67 70 74 72 1
0 66 50 52 71 50 52 2
0 66 67 50 73 72 53 1
0 67 53 50 72 54 53 1
0 67 68 55 72 74 57 1
0 67 55 53 72 57 54 1
0 69 70 71 75 76 77 2
0 72 73 74 78 79 80 2
0 75 76 77 81 82 83 1
0 75 78 76 81 84 82 1
0 69 79 70 75 85 76 2
0 80 73 72 86 79 78 2
0 81 78 75 87 84 81 1
0 82 81 75 88 87 81 1
0 69 83 79 75 89 85 2
0 84 73 80 90 79 86 2
0 85 81 82 91 87 88 1
0 85 86 81 91 92 87 1
0 69 87 83 75 93 89 2
0 88 73 84 94 79 90 2
0 89 86 85 95 92 91 1
0 90 89 85 96 95 91 1
0 69 91 87 75 97 93 2
0 92 73 88 98 79 94 2
0 93 89 90 99 95 96 1
0 93 94 89 99 100 95 1
0 69 95 91 75 101 97 2
0 96 73 92 102 79 98 2
0 97 94 93 103 100 99 1
0 98 97 93 104 103 99 1
0 69 99 95 75 105 101 2
0 100 73 96 106 79 102 2
0 101 97 98 107 103 104 1
0 101 102 97 107 108 103 1
0 69 103 99 75 109 105 2
0 104 73 100 110 79 106 2
0 105 102 101 111 108 107 1
0 106 105 101 112 111 107 1
0 69 107 103 75 113 109 2
0 108 73 104 114 79 110 2
0 109 105 106 115 111 112 1
0 109 110 105 115 116 111 1
0 69 111 107 75 117 113 2
0 112 73 108 118 79 114 2
0 113 110 109 119 116 115 1
0 114 113 109 120 119 115 1
0 69 115 111 75 121 117 2
0 116 73 112 122 79 118 2
0 117 113 114 123 119 120 1
0 117 118 113 123 124 119 1
0 69 71 115 75 77 121 2
0 74 73 116 80 79 122 2
0 76 118 117 82 124 123 1
0 77 76 117 83 82 123 1
0 119 120 121 125 126 127 2
0 122 123 121 128 129 130 1
0 120 122 121 131 128 130 1
0 122 124 123 128 132 129 1
0 122 125 124 128 133 132 1
0 119 126 120 125 134 126 2
0 126 122 120 135 128 131 1
0 126 127 122 135 136 128 1
0 128 125 122 137 133 128 1
0 127 128 122 136 137 128 1
0 119 129 126 125 134 134 2
0 130 127 126 138 136 135 1
0 129 130 126 139 138 135 1
0 130 128 127 138 137 136 1
0 130 131 128 138 140 137 1
0 119 132 129 125 134 134 2
0 132 130 129 141 138 139 1
0 132 133 130 141 142 138 1
0 134 131 130 143 140 138 1
0 133 134 130 142 143 138 1
0 119 135 132 125 144 134 2
0 136 133 132 145 142 141 1
0 135 136 132 146 145 141 1
0 136 134 133 145 143 142 1
0 136 137 134 145 147 143 1
0 119 121 135 125 127 144 2
0 121 136 135 130 145 146 1
0 121 123 136 130 129 145 1
0 124 137 136 132 147 145 1
0 123 124 136 129 132 145 1
"Duplicate03" 0 0
138
0 31.612862 24.747328 -54.284584 0.866026 0.133975 -1
0 31.612854 18.105482 -50.449913 1.000000 0.366025 -1
0 31.612854 14.270803 -64.761101 0.500000 0.500000 -1
0 24.154518 24.747330 -54.284584 0.866025 0.133975 -1
0 24.154522 14.270811 -64.761108 0.500000 0.500000 -1
0 24.154518 18.105488 -50.449913 1.000000 0.366025 -1
0 31.612862 24.747328 -54.284584 0.899194 0.027376 -1
0 24.154518 24.747330 -54.284584 0.994192 0.027376 -1
0 31.612854 18.105482 -50.449913 0.899194 0.000661 -1
0 24.154518 18.105488 -50.449913 0.994192 0.000662 -1
0 31.612858 10.436136 -50.449924 1.000000 0.633974 -1
0 24.154518 10.436132 -50.449905 1.000000 0.633975 -1
0 24.154518 10.436132 -50.449905 0.994192 0.000661 -1
0 31.612858 10.436136 -50.449924 0.899194 0.000662 -1
0 31.612850 3.794287 -54.284588 0.866025 0.866025 -1
0 24.154514 3.794287 -54.284592 0.866025 0.866025 -1
0 31.612850 3.794287 -54.284588 0.899195 0.027376 -1
0 24.154514 3.794287 -54.284592 0.994192 0.027376 -1
0 31.612846 -0.040386 -60.926434 0.633974 1.000000 -1
0 24.154514 -0.040390 -60.926430 0.633975 1.000000 -1
0 24.154514 -0.040390 -60.926430 0.994192 0.073646 -1
0 31.612846 -0.040386 -60.926434 0.899194 0.073646 -1
0 31.612850 -0.040390 -68.595772 0.366025 1.000000 -1
0 24.154514 -0.040384 -68.595779 0.366025 1.000000 -1
0 31.612850 -0.040390 -68.595772 0.899194 0.127075 -1
0 24.154514 -0.040384 -68.595779 0.994192 0.127075 -1
0 31.612854 3.794281 -75.237617 0.133975 0.866026 -1
0 24.154526 3.794285 -75.237625 0.133975 0.866025 -1
0 24.154526 3.794285 -75.237625 0.994192 0.173346 -1
0 31.612854 3.794281 -75.237617 0.899194 0.173346 -1
0 31.612850 10.436132 -79.072304 0.000000 0.633975 -1
0 24.154510 10.436132 -79.072289 0.000000 0.633975 -1
0 31.612850 10.436132 -79.072304 0.899194 0.200060 -1
0 24.154510 10.436132 -79.072289 0.994192 0.200060 -1
0 31.612858 18.105473 -79.072281 0.000000 0.366026 -1
0 24.154518 18.105473 -79.072281 0.000000 0.366026 -1
0 24.154518 18.105473 -79.072281 0.994192 0.200060 -1
0 31.612858 18.105473 -79.072281 0.899194 0.200060 -1
0 31.612854 24.747316 -75.237610 0.133975 0.133975 -1
0 24.154507 24.747330 -75.237617 0.133975 0.133975 -1
0 31.612854 24.747316 -75.237610 0.899194 0.173346 -1
0 24.154507 24.747330 -75.237617 0.994192 0.173346 -1
0 31.612850 28.581987 -68.595757 0.366026 0.000001 -1
0 24.154526 28.581987 -68.595764 0.366026 0.000001 -1
0 24.154526 28.581987 -68.595764 0.994192 0.127075 -1
0 31.612850 28.581987 -68.595757 0.899194 0.127075 -1
0 31.612846 28.582003 -60.926426 0.633975 0.000000 -1
0 24.154514 28.582003 -60.926430 0.633975 0.000000 -1
0 31.612846 28.582003 -60.926426 0.899194 0.073646 -1
0 24.154514 28.582003 -60.926430 0.994192 0.073646 -1
0 33.987854 14.272955 -60.933968 0.633711 0.499925 -1
0 33.987858 10.893326 -62.885201 0.565540 0.618001 -1
0 33.987858 14.272955 -64.836426 0.497368 0.499925 -1
0 32.696186 14.272947 -57.975574 0.737071 0.499925 -1
0 32.696186 8.331276 -61.406002 0.617220 0.707513 -1
0 30.779526 14.272959 -57.975574 0.737071 0.499925 -1
0 30.779514 8.331276 -61.405998 0.617220 0.707513 -1
0 33.987850 10.893326 -66.787651 0.429197 0.618001 -1
0 32.696186 8.331276 -68.266853 0.377517 0.707513 -1
0 30.779514 8.331276 -68.266853 0.377517 0.707513 -1
0 33.987854 14.272955 -68.738884 0.361026 0.499925 -1
0 32.696182 14.272947 -71.697281 0.257666 0.499925 -1
0 30.779518 14.272959 -71.697281 0.257666 0.499925 -1
0 33.987850 17.652576 -66.787651 0.429197 0.381849 -1
0 32.696186 20.214628 -68.266853 0.377517 0.292337 -1
0 30.779514 20.214628 -68.266853 0.377517 0.292337 -1
0 33.987858 17.652576 -62.885201 0.565540 0.381849 -1
0 32.696186 20.214628 -61.406002 0.617220 0.292337 -1
0 30.779514 20.214628 -61.405998 0.617220 0.292337 -1
0 -43.770481 14.270803 -64.761101 0.500000 0.500000 -1
0 -43.770470 18.105482 -50.449905 1.000000 0.366025 -1
0 -43.770473 24.747328 -54.284580 0.866026 0.133975 -1
0 -36.312130 18.105488 -50.449917 1.000000 0.366025 -1
0 -36.312141 14.270811 -64.761108 0.500000 0.500000 -1
0 -36.312141 24.747330 -54.284592 0.866025 0.133975 -1
0 -43.770470 18.105482 -50.449905 0.899194 0.000661 -1
0 -36.312141 24.747330 -54.284592 0.994192 0.027376 -1
0 -43.770473 24.747328 -54.284580 0.899194 0.027376 -1
0 -36.312130 18.105488 -50.449917 0.994192 0.000662 -1
0 -43.770470 10.436136 -50.449913 1.000000 0.633974 -1
0 -36.312134 10.436132 -50.449909 1.000000 0.633975 -1
0 -36.312134 10.436132 -50.449909 0.994192 0.000661 -1
0 -43.770470 10.436136 -50.449913 0.899194 0.000662 -1
0 -43.770466 3.794287 -54.284584 0.866025 0.866025 -1
0 -36.312141 3.794287 -54.284592 0.866025 0.866025 -1
0 -43.770466 3.794287 -54.284584 0.899195 0.027376 -1
0 -36.312141 3.794287 -54.284592 0.994192 0.027376 -1
0 -43.770470 -0.040386 -60.926434 0.633974 1.000000 -1
0 -36.312134 -0.040390 -60.926426 0.633975 1.000000 -1
0 -36.312134 -0.040390 -60.926426 0.994192 0.073646 -1
0 -43.770470 -0.040386 -60.926434 0.899194 0.073646 -1
0 -43.770473 -0.040390 -68.595772 0.366025 1.000000 -1
0 -36.312141 -0.040384 -68.595779 0.366025 1.000000 -1
0 -43.770473 -0.040390 -68.595772 0.899194 0.127075 -1
0 -36.312141 -0.040384 -68.595779 0.994192 0.127075 -1
0 -43.770481 3.794281 -75.237625 0.133975 0.866026 -1
0 -36.312141 3.794285 -75.237625 0.133975 0.866025 -1
0 -36.312141 3.794285 -75.237625 0.994192 0.173346 -1
0 -43.770481 3.794281 -75.237625 0.899194 0.173346 -1
0 -43.770473 10.436132 -79.072296 0.000000 0.633975 -1
0 -36.312134 10.436132 -79.072296 0.000000 0.633975 -1
0 -43.770473 10.436132 -79.072296 0.899194 0.200060 -1
0 -36.312134 10.436132 -79.072296 0.994192 0.200060 -1
0 -43.770485 18.105473 -79.072289 0.000000 0.366026 -1
0 -36.312141 18.105473 -79.072281 0.000000 0.366026 -1
0 -36.312141 18.105473 -79.072281 0.994192 0.200060 -1
0 -43.770485 18.105473 -79.072289 0.899194 0.200060 -1
0 -43.770485 24.747316 -75.237610 0.133975 0.133975 -1
0 -36.312138 24.747330 -75.237617 0.133975 0.133975 -1
0 -43.770485 24.747316 -75.237610 0.899194 0.173346 -1
0 -36.312138 24.747330 -75.237617 0.994192 0.173346 -1
0 -43.770473 28.581987 -68.595764 0.366026 0.000001 -1
0 -36.312141 28.581987 -68.595764 0.366026 0.000001 -1
0 -36.312141 28.581987 -68.595764 0.994192 0.127075 -1
0 -43.770473 28.581987 -68.595764 0.899194 0.127075 -1
0 -43.770470 28.582003 -60.926434 0.633975 0.000000 -1
0 -36.312134 28.582003 -60.926426 0.633975 0.000000 -1
0 -43.770470 28.582003 -60.926434 0.899194 0.073646 -1
0 -36.312134 28.582003 -60.926426 0.994192 0.073646 -1
0 -46.145485 14.272955 -64.836441 0.497368 0.499925 -1
0 -46.145477 10.893326 -62.885204 0.565540 0.618001 -1
0 -46.145477 14.272955 -60.933979 0.633711 0.499925 -1
0 -44.853813 8.331276 -61.406002 0.617220 0.707513 -1
0 -44.853806 14.272947 -57.975567 0.737071 0.499925 -1
0 -42.937145 14.272959 -57.975574 0.737071 0.499925 -1
0 -42.937145 8.331276 -61.406006 0.617220 0.707513 -1
0 -46.145489 10.893326 -66.787651 0.429197 0.618001 -1
0 -44.853821 8.331276 -68.266853 0.377517 0.707513 -1
0 -42.937141 8.331276 -68.266846 0.377517 0.707513 -1
0 -46.145489 14.272955 -68.738884 0.361026 0.499925 -1
0 -44.853817 14.272947 -71.697281 0.257666 0.499925 -1
0 -42.937145 14.272959 -71.697281 0.257666 0.499925 -1
0 -46.145489 17.652576 -66.787651 0.429197 0.381849 -1
0 -44.853821 20.214628 -68.266853 0.377517 0.292337 -1
0 -42.937141 20.214628 -68.266846 0.377517 0.292337 -1
0 -46.145477 17.652576 -62.885204 0.565540 0.381849 -1
0 -44.853813 20.214628 -61.406002 0.617220 0.292337 -1
0 -42.937145 20.214628 -61.406006 0.617220 0.292337 -1
150
1.000000 0.000000 -0.000001
1.000000 -0.000000 0.000000
1.000000 -0.000000 -0.000000
-1.000000 -0.000000 0.000000
-1.000000 0.000000 0.000000
-1.000000 -0.000000 -0.000000
0.000000 0.707107 0.707107
0.000000 0.707107 0.707107
0.000001 0.258819 0.965926
0.000000 0.258820 0.965926
1.000000 -0.000000 -0.000000
-1.000000 0.000000 -0.000000
0.000001 -0.258819 0.965926
0.000003 -0.258819 0.965926
1.000000 -0.000001 -0.000000
-1.000000 0.000001 -0.000000
0.000001 -0.707107 0.707107
-0.000000 -0.707107 0.707107
1.000000 -0.000000 0.000000
-1.000000 0.000000 -0.000000
0.000000 -0.965926 0.258819
0.000001 -0.965926 0.258819
1.000000 -0.000000 0.000000
-1.000000 0.000001 -0.000001
-0.000000 -0.965926 -0.258819
-0.000000 -0.965926 -0.258819
1.000000 -0.000000 0.000000
-1.000000 -0.000000 0.000000
-0.000000 -0.707107 -0.707107
0.000000 -0.707107 -0.707106
1.000000 -0.000000 -0.000000
-1.000000 -0.000000 0.000001
-0.000001 -0.258818 -0.965926
-0.000002 -0.258818 -0.965926
1.000000 -0.000000 0.000000
-1.000000 -0.000000 0.000000
-0.000000 0.258820 -0.965926
0.000000 0.258821 -0.965925
1.000000 0.000000 0.000000
-1.000000 -0.000000 0.000001
0.000001 0.707107 -0.707107
0.000002 0.707107 -0.707107
1.000000 0.000000 0.000000
-1.000000 0.000000 0.000000
0.000001 0.965926 -0.258819
0.000000 0.965926 -0.258820
1.000000 0.000001 -0.000001
-1.000000 -0.000000 -0.000001
-0.000000 0.965926 0.258818
-0.000000 0.965926 0.258818
1.000000 -0.000000 0.000001
1.000000 -0.000000 -0.000000
1.000000 0.000000 -0.000001
0.916456 0.000000 0.400135
0.579463 -0.000000 0.814999
0.579463 -0.705809 0.407499
0.916456 -0.346528 0.200067
0.000001 0.000000 1.000000
0.000001 -0.866025 0.500000
1.000000 -0.000001 -0.000001
0.916456 -0.346527 -0.200068
0.579464 -0.705809 -0.407499
-0.000001 -0.866025 -0.500000
1.000000 0.000000 -0.000001
0.579463 0.000000 -0.814998
0.916456 0.000001 -0.400136
0.000000 0.000000 -1.000000
1.000000 0.000001 -0.000001
0.916456 0.346527 -0.200068
0.579464 0.705809 -0.407499
0.000001 0.866025 -0.500000
1.000000 0.000000 -0.000000
0.579464 0.705809 0.407499
0.916456 0.346528 0.200067
0.000001 0.866025 0.500000
-1.000000 -0.000000 0.000000
-1.000000 -0.000000 0.000001
-1.000000 0.000000 0.000000
1.000000 0.000000 -0.000001
1.000000 -0.000000 -0.000000
1.000000 0.000000 -0.000000
0.000001 0.258819 0.965926
0.000001 0.707107 0.707107
0.000001 0.707107 0.707107
0.000001 0.258820 0.965926
-1.000000 -0.000000 0.000001
1.000000 -0.000001 -0.000001
0.000000 -0.258819 0.965926
-0.000001 -0.258819 0.965926
-1.000000 -0.000001 0.000001
1.000000 0.000000 0.000000
-0.000000 -0.707107 0.707107
0.000001 -0.707107 0.707107
-1.000000 -0.000001 0.000001
1.000000 0.000000 -0.000000
-0.000000 -0.965926 0.258819
-0.000001 -0.965926 0.258819
-1.000000 -0.000001 0.000001
1.000000 0.000000 -0.000000
0.000000 -0.965926 -0.258819
0.000000 -0.965926 -0.258819
-1.000000 0.000000 -0.000000
1.000000 -0.000000 0.000000
0.000000 -0.707107 -0.707107
0.000000 -0.707107 -0.707107
-1.000000 -0.000000 -0.000000
1.000000 0.000000 0.000000
0.000000 -0.258818 -0.965926
0.000000 -0.258818 -0.965926
-1.000000 -0.000001 0.000000
1.000000 0.000000 0.000000
0.000000 0.258820 -0.965926
0.000001 0.258820 -0.965926
-1.000000 0.000000 0.000001
1.000000 -0.000000 0.000000
-0.000001 0.707107 -0.707107
-0.000002 0.707107 -0.707107
-1.000000 0.000001 0.000001
1.000000 -0.000000 -0.000000
-0.000001 0.965926 -0.258820
0.000000 0.965926 -0.258820
-1.000000 0.000001 0.000000
1.000000 -0.000000 -0.000000
0.000000 0.965926 0.258818
-0.000000 0.965926 0.258819
-1.000000 0.000000 0.000002
-1.000000 -0.000001 0.000002
-1.000000 0.000000 0.000002
-0.579463 -0.705809 0.407500
-0.579462 -0.000000 0.814999
-0.916457 0.000000 0.400134
-0.916457 -0.346525 0.200068
0.000003 0.000000 1.000000
0.000001 -0.866025 0.500000
-1.000000 0.000000 0.000002
-0.916457 -0.346526 -0.200067
-0.579463 -0.705810 -0.407499
0.000002 -0.866026 -0.500000
-1.000000 -0.000000 0.000001
-0.579462 0.000000 -0.814999
-0.916456 0.000001 -0.400136
-0.000000 0.000001 -1.000000
-1.000000 -0.000000 0.000002
-0.916457 0.346526 -0.200067
-0.579463 0.705810 -0.407499
0.000000 0.866026 -0.500000
-1.000000 0.000001 0.000002
-0.579464 0.705809 0.407499
-0.916457 0.346525 0.200068
0.000001 0.866026 0.500000
156
0 0 1 2 0 1 2 2
0 3 4 5 3 4 5 2
0 6 7 8 6 7 8 1
0 7 9 8 7 9 8 1
0 1 10 2 1 10 2 2
0 5 4 11 5 4 11 2
0 8 9 12 8 9 12 1
0 8 12 13 8 12 13 1
0 10 14 2 10 14 2 2
0 11 4 15 11 4 15 2
0 13 12 16 13 12 16 1
0 12 17 16 12 17 16 1
0 14 18 2 14 18 2 2
0 15 4 19 15 4 19 2
0 16 17 20 16 17 20 1
0 16 20 21 16 20 21 1
0 18 22 2 18 22 2 2
0 19 4 23 19 4 23 2
0 21 20 24 21 20 24 1
0 20 25 24 20 25 24 1
0 22 26 2 22 26 2 2
0 23 4 27 23 4 27 2
0 24 25 28 24 25 28 1
0 24 28 29 24 28 29 1
0 26 30 2 26 30 2 2
0 27 4 31 27 4 31 2
0 29 28 32 29 28 32 1
0 28 33 32 28 33 32 1
0 30 34 2 30 34 2 2
0 31 4 35 31 4 35 2
0 32 33 36 32 33 36 1
0 32 36 37 32 36 37 1
0 34 38 2 34 38 2 2
0 35 4 39 35 4 39 2
0 37 36 40 37 36 40 1
0 36 41 40 36 41 40 1
0 38 42 2 38 42 2 2
0 39 4 43 39 4 43 2
0 40 41 44 40 41 44 1
0 40 44 45 40 44 45 1
0 42 46 2 42 46 2 2
0 43 4 47 43 4 47 2
0 45 44 48 45 44 48 1
0 44 49 48 44 49 48 1
0 46 0 2 46 0 2 2
0 47 4 3 47 4 3 2
0 48 49 7 48 49 7 1
0 48 7 6 48 7 6 1
0 50 51 52 50 51 52 2
0 50 53 54 53 54 55 1
0 50 54 51 53 55 56 1
0 53 55 54 54 57 55 1
0 55 56 54 57 58 55 1
0 51 57 52 51 59 52 2
0 51 54 57 56 55 60 1
0 54 58 57 55 61 60 1
0 54 56 59 55 58 62 1
0 54 59 58 55 62 61 1
0 57 60 52 59 63 52 2
0 57 58 61 60 61 64 1
0 57 61 60 60 64 65 1
0 58 59 61 61 62 64 1
0 59 62 61 62 66 64 1
0 60 63 52 63 67 52 2
0 60 61 63 65 64 68 1
0 61 64 63 64 69 68 1
0 61 62 65 64 66 70 1
0 61 65 64 64 70 69 1
0 63 66 52 67 71 52 2
0 63 64 67 68 69 72 1
0 63 67 66 68 72 73 1
0 64 65 67 69 70 72 1
0 65 68 67 70 74 72 1
0 66 50 52 71 50 52 2
0 66 67 50 73 72 53 1
0 67 53 50 72 54 53 1
0 67 68 55 72 74 57 1
0 67 55 53 72 57 54 1
0 69 70 71 75 76 77 2
0 72 73 74 78 79 80 2
0 75 76 77 81 82 83 1
0 75 78 76 81 84 82 1
0 69 79 70 75 85 76 2
0 80 73 72 86 79 78 2
0 81 78 75 87 84 81 1
0 82 81 75 88 87 81 1
0 69 83 79 75 89 85 2
0 84 73 80 90 79 86 2
0 85 81 82 91 87 88 1
0 85 86 81 91 92 87 1
0 69 87 83 75 93 89 2
0 88 73 84 94 79 90 2
0 89 86 85 95 92 91 1
0 90 89 85 96 95 91 1
0 69 91 87 75 97 93 2
0 92 73 88 98 79 94 2
0 93 89 90 99 95 96 1
0 93 94 89 99 100 95 1
0 69 95 91 75 101 97 2
0 96 73 92 102 79 98 2
0 97 94 93 103 100 99 1
0 98 97 93 104 103 99 1
0 69 99 95 75 105 101 2
0 100 73 96 106 79 102 2
0 101 97 98 107 103 104 1
0 101 102 97 107 108 103 1
0 69 103 99 75 109 105 2
0 104 73 100 110 79 106 2
0 105 102 101 111 108 107 1
0 106 105 101 112 111 107 1
0 69 107 103 75 113 109 2
0 108 73 104 114 79 110 2
0 109 105 106 115 111 112 1
0 109 110 105 115 116 111 1
0 69 111 107 75 117 113 2
0 112 73 108 118 79 114 2
0 113 110 109 119 116 115 1
0 114 113 109 120 119 115 1
0 69 115 111 75 121 117 2
0 116 73 112 122 79 118 2
0 117 113 114 123 119 120 1
0 117 118 113 123 124 119 1
0 69 71 115 75 77 121 2
0 74 73 116 80 79 122 2
0 76 118 117 82 124 123 1
0 77 76 117 83 82 123 1
0 119 120 121 125 126 127 2
0 122 123 121 128 129 130 1
0 120 122 121 131 128 130 1
0 122 124 123 128 132 129 1
0 122 125 124 128 133 132 1
0 119 126 120 125 134 126 2
0 126 122 120 135 128 131 1
0 126 127 122 135 136 128 1
0 128 125 122 137 133 128 1
0 127 128 122 136 137 128 1
0 119 129 126 125 138 134 2
0 130 127 126 139 136 135 1
0 129 130 126 140 139 135 1
0 130 128 127 139 137 136 1
0 130 131 128 139 141 137 1
0 119 132 129 125 142 138 2
0 132 130 129 143 139 140 1
0 132 133 130 143 144 139 1
0 134 131 130 145 141 139 1
0 133 134 130 144 145 139 1
0 119 135 132 125 146 142 2
0 136 133 132 147 144 143 1
0 135 136 132 148 147 143 1
0 136 134 133 147 145 144 1
0 136 137 134 147 149 145 1
0 119 121 135 125 127 146 2
0 121 136 135 130 147 148 1
0 121 123 136 130 129 147 1
0 124 137 136 132 149 147 1
0 123 124 136 129 132 147 1
"Duplicate04" 0 0
138
0 31.612862 24.747328 66.048721 0.866026 0.133975 -1
0 31.612858 18.105482 69.883400 1.000000 0.366025 -1
0 31.612873 14.270803 55.572208 0.500000 0.500000 -1
0 24.154530 24.747330 66.048714 0.866025 0.133975 -1
0 24.154522 14.270811 55.572193 0.500000 0.500000 -1
0 24.154522 18.105488 69.883385 1.000000 0.366025 -1
0 31.612862 24.747328 66.048721 0.899194 0.027376 -1
0 24.154530 24.747330 66.048714 0.994192 0.027376 -1
0 31.612858 18.105482 69.883400 0.899194 0.000661 -1
0 24.154522 18.105488 69.883385 0.994192 0.000662 -1
0 31.612858 10.436136 69.883385 1.000000 0.633974 -1
0 24.154518 10.436132 69.883392 1.000000 0.633975 -1
0 24.154518 10.436132 69.883392 0.994192 0.000661 -1
0 31.612858 10.436136 69.883385 0.899194 0.000662 -1
0 31.612858 3.794287 66.048706 0.866025 0.866025 -1
0 24.154526 3.794287 66.048714 0.866025 0.866025 -1
0 31.612858 3.794287 66.048706 0.899195 0.027376 -1
0 24.154526 3.794287 66.048714 0.994192 0.027376 -1
0 31.612858 -0.040386 59.406872 0.633974 1.000000 -1
0 24.154526 -0.040390 59.406872 0.633975 1.000000 -1
0 24.154526 -0.040390 59.406872 0.994192 0.073646 -1
0 31.612858 -0.040386 59.406872 0.899194 0.073646 -1
0 31.612854 -0.040390 51.737530 0.366025 1.000000 -1
0 24.154522 -0.040384 51.737522 0.366025 1.000000 -1
0 31.612854 -0.040390 51.737530 0.899194 0.127075 -1
0 24.154522 -0.040384 51.737522 0.994192 0.127075 -1
0 31.612869 3.794281 45.095684 0.133975 0.866026 -1
0 24.154530 3.794285 45.095684 0.133975 0.866025 -1
0 24.154530 3.794285 45.095684 0.994192 0.173346 -1
0 31.612869 3.794281 45.095684 0.899194 0.173346 -1
0 31.612850 10.436132 41.261002 0.000000 0.633975 -1
0 24.154518 10.436132 41.261009 0.000000 0.633975 -1
0 31.612850 10.436132 41.261002 0.899194 0.200060 -1
0 24.154518 10.436132 41.261009 0.994192 0.200060 -1
0 31.612862 18.105473 41.261017 0.000000 0.366026 -1
0 24.154530 18.105473 41.261021 0.000000 0.366026 -1
0 24.154530 18.105473 41.261021 0.994192 0.200060 -1
0 31.612862 18.105473 41.261017 0.899194 0.200060 -1
0 31.612862 24.747316 45.095688 0.133975 0.133975 -1
0 24.154522 24.747330 45.095684 0.133975 0.133975 -1
0 31.612862 24.747316 45.095688 0.899194 0.173346 -1
0 24.154522 24.747330 45.095684 0.994192 0.173346 -1
0 31.612862 28.581987 51.737541 0.366026 0.000001 -1
0 24.154530 28.581987 51.737541 0.366026 0.000001 -1
0 24.154530 28.581987 51.737541 0.994192 0.127075 -1
0 31.612862 28.581987 51.737541 0.899194 0.127075 -1
0 31.612858 28.582003 59.406872 0.633975 0.000000 -1
0 24.154526 28.582003 59.406872 0.633975 0.000000 -1
0 31.612858 28.582003 59.406872 0.899194 0.073646 -1
0 24.154526 28.582003 59.406872 0.994192 0.073646 -1
0 33.987865 14.272955 59.399323 0.633711 0.499925 -1
0 33.987858 10.893326 57.448101 0.565540 0.618001 -1
0 33.987862 14.272955 55.496876 0.497368 0.499925 -1
0 32.696194 14.272947 62.357735 0.737071 0.499925 -1
0 32.696201 8.331276 58.927299 0.617220 0.707513 -1
0 30.779530 14.272959 62.357735 0.737071 0.499925 -1
0 30.779533 8.331276 58.927311 0.617220 0.707513 -1
0 33.987862 10.893326 53.545650 0.429197 0.618001 -1
0 32.696201 8.331276 52.066452 0.377517 0.707513 -1
0 30.779530 8.331276 52.066452 0.377517 0.707513 -1
0 33.987862 14.272955 51.594421 0.361026 0.499925 -1
0 32.696190 14.272947 48.636024 0.257666 0.499925 -1
0 30.779522 14.272959 48.636021 0.257666 0.499925 -1
0 33.987862 17.652576 53.545650 0.429197 0.381849 -1
0 32.696201 20.214628 52.066452 0.377517 0.292337 -1
0 30.779530 20.214628 52.066452 0.377517 0.292337 -1
0 33.987858 17.652576 57.448101 0.565540 0.381849 -1
0 32.696201 20.214628 58.927299 0.617220 0.292337 -1
0 30.779533 20.214628 58.927311 0.617220 0.292337 -1
0 -43.770473 14.270803 55.572216 0.500000 0.500000 -1
0 -43.770462 18.105482 69.883408 1.000000 0.366025 -1
0 -43.770473 24.747328 66.048737 0.866026 0.133975 -1
0 -36.312134 18.105488 69.883385 1.000000 0.366025 -1
0 -36.312130 14.270811 55.572197 0.500000 0.500000 -1
0 -36.312130 24.747330 66.048714 0.866025 0.133975 -1
0 -43.770462 18.105482 69.883408 0.899194 0.000661 -1
0 -36.312130 24.747330 66.048714 0.994192 0.027376 -1
0 -43.770473 24.747328 66.048737 0.899194 0.027376 -1
0 -36.312134 18.105488 69.883385 0.994192 0.000662 -1
0 -43.770473 10.436136 69.883400 1.000000 0.633974 -1
0 -36.312134 10.436132 69.883408 1.000000 0.633975 -1
0 -36.312134 10.436132 69.883408 0.994192 0.000661 -1
0 -43.770473 10.436136 69.883400 0.899194 0.000662 -1
0 -43.770466 3.794287 66.048714 0.866025 0.866025 -1
0 -36.312130 3.794287 66.048714 0.866025 0.866025 -1
0 -43.770466 3.794287 66.048714 0.899195 0.027376 -1
0 -36.312130 3.794287 66.048714 0.994192 0.027376 -1
0 -43.770470 -0.040386 59.406876 0.633974 1.000000 -1
0 -36.312134 -0.040390 59.406868 0.633975 1.000000 -1
0 -36.312134 -0.040390 59.406868 0.994192 0.073646 -1
0 -43.770470 -0.040386 59.406876 0.899194 0.073646 -1
0 -43.770470 -0.040390 51.737549 0.366025 1.000000 -1
0 -36.312134 -0.040384 51.737534 0.366025 1.000000 -1
0 -43.770470 -0.040390 51.737549 0.899194 0.127075 -1
0 -36.312134 -0.040384 51.737534 0.994192 0.127075 -1
0 -43.770466 3.794281 45.095676 0.133975 0.866026 -1
0 -36.312130 3.794285 45.095680 0.133975 0.866025 -1
0 -36.312130 3.794285 45.095680 0.994192 0.173346 -1
0 -43.770466 3.794281 45.095676 0.899194 0.173346 -1
0 -43.770470 10.436132 41.261013 0.000000 0.633975 -1
0 -36.312134 10.436132 41.261009 0.000000 0.633975 -1
0 -43.770470 10.436132 41.261013 0.899194 0.200060 -1
0 -36.312134 10.436132 41.261009 0.994192 0.200060 -1
0 -43.770473 18.105473 41.261021 0.000000 0.366026 -1
0 -36.312138 18.105473 41.261028 0.000000 0.366026 -1
0 -36.312138 18.105473 41.261028 0.994192 0.200060 -1
0 -43.770473 18.105473 41.261021 0.899194 0.200060 -1
0 -43.770477 24.747316 45.095692 0.133975 0.133975 -1
0 -36.312130 24.747330 45.095680 0.133975 0.133975 -1
0 -43.770477 24.747316 45.095692 0.899194 0.173346 -1
0 -36.312130 24.747330 45.095680 0.994192 0.173346 -1
0 -43.770477 28.581987 51.737549 0.366026 0.000001 -1
0 -36.312134 28.581987 51.737541 0.366026 0.000001 -1
0 -36.312134 28.581987 51.737541 0.994192 0.127075 -1
0 -43.770477 28.581987 51.737549 0.899194 0.127075 -1
0 -43.770470 28.582003 59.406876 0.633975 0.000000 -1
0 -36.312134 28.582003 59.406868 0.633975 0.000000 -1
0 -43.770470 28.582003 59.406876 0.899194 0.073646 -1
0 -36.312134 28.582003 59.406868 0.994192 0.073646 -1
0 -46.145466 14.272955 55.496868 0.497368 0.499925 -1
0 -46.145466 10.893326 57.448101 0.565540 0.618001 -1
0 -46.145470 14.272955 59.399338 0.633711 0.499925 -1
0 -44.853813 8.331276 58.927319 0.617220 0.707513 -1
0 -44.853802 14.272947 62.357731 0.737071 0.499925 -1
0 -42.937138 14.272959 62.357727 0.737071 0.499925 -1
0 -42.937141 8.331276 58.927315 0.617220 0.707513 -1
0 -46.145473 10.893326 53.545658 0.429197 0.618001 -1
0 -44.853809 8.331276 52.066460 0.377517 0.707513 -1
0 -42.937138 8.331276 52.066463 0.377517 0.707513 -1
0 -46.145473 14.272955 51.594425 0.361026 0.499925 -1
0 -44.853802 14.272947 48.636032 0.257666 0.499925 -1
0 -42.937138 14.272959 48.636028 0.257666 0.499925 -1
0 -46.145473 17.652576 53.545658 0.429197 0.381849 -1
0 -44.853809 20.214628 52.066460 0.377517 0.292337 -1
0 -42.937138 20.214628 52.066463 0.377517 0.292337 -1
0 -46.145466 17.652576 57.448101 0.565540 0.381849 -1
0 -44.853813 20.214628 58.927319 0.617220 0.292337 -1
0 -42.937141 20.214628 58.927315 0.617220 0.292337 -1
150
1.000000 0.000001 0.000001
1.000000 0.000000 0.000001
1.000000 -0.000000 0.000000
-1.000000 0.000001 0.000000
-1.000000 0.000000 -0.000000
-1.000000 0.000001 -0.000000
-0.000001 0.707107 0.707107
-0.000001 0.707107 0.707107
-0.000001 0.258819 0.965926
-0.000002 0.258820 0.965926
1.000000 -0.000000 0.000001
-1.000000 -0.000000 -0.000000
0.000000 -0.258820 0.965926
0.000001 -0.258820 0.965926
1.000000 -0.000001 0.000001
-1.000000 -0.000001 -0.000000
0.000001 -0.707107 0.707107
0.000001 -0.707107 0.707107
1.000000 -0.000001 0.000000
-1.000000 -0.000000 0.000000
0.000000 -0.965926 0.258819
0.000000 -0.965926 0.258820
1.000000 -0.000001 0.000000
-1.000000 0.000000 -0.000000
-0.000000 -0.965926 -0.258819
-0.000000 -0.965926 -0.258820
1.000000 -0.000000 -0.000000
-1.000000 -0.000001 -0.000000
-0.000000 -0.707107 -0.707107
-0.000000 -0.707107 -0.707106
1.000000 0.000000 -0.000002
-1.000000 0.000000 0.000000
-0.000001 -0.258818 -0.965926
-0.000001 -0.258818 -0.965926
1.000000 -0.000001 -0.000001
-1.000000 0.000000 -0.000000
-0.000000 0.258820 -0.965926
-0.000000 0.258820 -0.965926
1.000000 0.000001 -0.000001
-1.000000 0.000000 0.000000
0.000001 0.707107 -0.707107
0.000002 0.707107 -0.707107
1.000000 0.000001 0.000000
-1.000000 0.000001 0.000000
0.000000 0.965926 -0.258819
0.000000 0.965926 -0.258820
1.000000 0.000001 0.000000
-1.000000 0.000000 0.000000
-0.000000 0.965926 0.258818
0.000000 0.965926 0.258818
1.000000 0.000000 -0.000001
1.000000 -0.000001 -0.000000
1.000000 0.000000 -0.000000
0.916457 0.000000 0.400132
0.579464 -0.000000 0.814998
0.579465 -0.705808 0.407499
0.916458 -0.346524 0.200066
0.000003 0.000000 1.000000
0.000003 -0.866025 0.500000
1.000000 -0.000000 0.000000
0.916457 -0.346525 -0.200067
0.579464 -0.705808 -0.407499
-0.000000 -0.866025 -0.500000
1.000000 0.000000 0.000000
0.579464 0.000000 -0.814998
0.916456 0.000001 -0.400136
0.000002 0.000000 -1.000000
1.000000 0.000000 0.000000
0.916457 0.346525 -0.200067
0.579465 0.705808 -0.407499
0.000001 0.866025 -0.500000
1.000000 0.000001 -0.000000
0.579466 0.705808 0.407499
0.916458 0.346524 0.200065
0.000003 0.866025 0.500000
-1.000000 -0.000000 0.000000
-1.000000 0.000000 0.000001
-1.000000 -0.000000 0.000000
1.000000 -0.000000 0.000000
1.000000 0.000000 -0.000000
1.000000 -0.000000 0.000000
0.000002 0.258820 0.965926
0.000002 0.707107 0.707107
0.000002 0.707107 0.707107
0.000003 0.258821 0.965925
-1.000000 0.000000 0.000000
1.000000 0.000000 0.000000
0.000000 -0.258820 0.965926
-0.000001 -0.258820 0.965926
-1.000000 -0.000001 0.000000
1.000000 -0.000000 -0.000000
-0.000000 -0.707107 0.707106
0.000000 -0.707107 0.707106
-1.000000 -0.000000 0.000000
1.000000 -0.000000 -0.000000
0.000000 -0.965926 0.258819
-0.000000 -0.965926 0.258820
-1.000000 -0.000000 -0.000000
1.000000 -0.000000 0.000000
0.000000 -0.965926 -0.258818
0.000000 -0.965926 -0.258819
-1.000000 -0.000000 -0.000000
1.000000 0.000000 -0.000000
0.000000 -0.707107 -0.707107
0.000001 -0.707107 -0.707107
-1.000000 -0.000001 -0.000000
1.000000 0.000000 -0.000000
0.000000 -0.258818 -0.965926
-0.000000 -0.258818 -0.965926
-1.000000 -0.000000 -0.000000
1.000000 -0.000000 -0.000001
-0.000000 0.258819 -0.965926
0.000001 0.258820 -0.965926
-1.000000 -0.000000 -0.000000
1.000000 -0.000000 -0.000000
-0.000001 0.707107 -0.707107
-0.000002 0.707107 -0.707107
-1.000000 -0.000000 0.000001
1.000000 0.000000 0.000000
-0.000001 0.965926 -0.258819
-0.000000 0.965926 -0.258820
-1.000000 0.000000 0.000000
1.000000 0.000000 -0.000000
0.000000 0.965926 0.258818
0.000000 0.965926 0.258818
-1.000000 -0.000000 0.000001
-1.000000 0.000000 0.000000
-1.000000 0.000000 -0.000001
-0.579465 -0.705808 0.407499
-0.579462 -0.000000 0.814999
-0.916458 0.000000 0.400131
-0.916459 -0.346522 0.200064
0.000002 0.000000 1.000000
0.000001 -0.866025 0.500001
-1.000000 0.000001 0.000002
-0.916457 -0.346525 -0.200067
-0.579464 -0.705809 -0.407499
0.000001 -0.866026 -0.500000
-1.000000 -0.000000 0.000002
-0.579463 0.000000 -0.814998
-0.916456 0.000001 -0.400136
-0.000002 0.000000 -1.000000
-1.000000 -0.000001 0.000002
-0.916457 0.346525 -0.200067
-0.579464 0.705809 -0.407500
-0.000001 0.866026 -0.500000
-1.000000 -0.000000 0.000000
-0.579465 0.705808 0.407499
-0.916459 0.346522 0.200064
0.000001 0.866025 0.500001
156
0 0 1 2 0 1 2 2
0 3 4 5 3 4 5 2
0 6 7 8 6 7 8 1
0 7 9 8 7 9 8 1
0 1 10 2 1 10 2 2
0 5 4 11 5 4 11 2
0 8 9 12 8 9 12 1
0 8 12 13 8 12 13 1
0 10 14 2 10 14 2 2
0 11 4 15 11 4 15 2
0 13 12 16 13 12 16 1
0 12 17 16 12 17 16 1
0 14 18 2 14 18 2 2
0 15 4 19 15 4 19 2
0 16 17 20 16 17 20 1
0 16 20 21 16 20 21 1
0 18 22 2 18 22 2 2
0 19 4 23 19 4 23 2
0 21 20 24 21 20 24 1
0 20 25 24 20 25 24 1
0 22 26 2 22 26 2 2
0 23 4 27 23 4 27 2
0 24 25 28 24 25 28 1
0 24 28 29 24 28 29 1
0 26 30 2 26 30 2 2
0 27 4 31 27 4 31 2
0 29 28 32 29 28 32 1
0 28 33 32 28 33 32 1
0 30 34 2 30 34 2 2
0 31 4 35 31 4 35 2
0 32 33 36 32 33 36 1
0 32 36 37 32 36 37 1
0 34 38 2 34 38 2 2
0 35 4 39 35 4 39 2
0 37 36 40 37 36 40 1
0 36 41 40 36 41 40 1
0 38 42 2 38 42 2 2
0 39 4 43 39 4 43 2
0 40 41 44 40 41 44 1
0 40 44 45 40 44 45 1
0 42 46 2 42 46 2 2
0 43 4 47 43 4 47 2
0 45 44 48 45 44 48 1
0 44 49 48 44 49 48 1
0 46 0 2 46 0 2 2
0 47 4 3 47 4 3 2
0 48 49 7 48 49 7 1
0 48 7 6 48 7 6 1
0 50 51 52 50 51 52 2
0 50 53 54 53 54 55 1
0 50 54 51 53 55 56 1
0 53 55 54 54 57 55 1
0 55 56 54 57 58 55 1
0 51 57 52 51 59 52 2
0 51 54 57 56 55 60 1
0 54 58 57 55 61 60 1
0 54 56 59 55 58 62 1
0 54 59 58 55 62 61 1
0 57 60 52 59 63 52 2
0 57 58 61 60 61 64 1
0 57 61 60 60 64 65 1
0 58 59 61 61 62 64 1
0 59 62 61 62 66 64 1
0 60 63 52 63 67 52 2
0 60 61 63 65 64 68 1
0 61 64 63 64 69 68 1
0 61 62 65 64 66 70 1
0 61 65 64 64 70 69 1
0 63 66 52 67 71 52 2
0 63 64 67 68 69 72 1
0 63 67 66 68 72 73 1
0 64 65 67 69 70 72 1
0 65 68 67 70 74 72 1
0 66 50 52 71 50 52 2
0 66 67 50 73 72 53 1
0 67 53 50 72 54 53 1
0 67 68 55 72 74 57 1
0 67 55 53 72 57 54 1
0 69 70 71 75 76 77 2
0 72 73 74 78 79 80 2
0 75 76 77 81 82 83 1
0 75 78 76 81 84 82 1
0 69 79 70 75 85 76 2
0 80 73 72 86 79 78 2
0 81 78 75 87 84 81 1
0 82 81 75 88 87 81 1
0 69 83 79 75 89 85 2
0 84 73 80 90 79 86 2
0 85 81 82 91 87 88 1
0 85 86 81 91 92 87 1
0 69 87 83 75 93 89 2
0 88 73 84 94 79 90 2
0 89 86 85 95 92 91 1
0 90 89 85 96 95 91 1
0 69 91 87 75 97 93 2
0 92 73 88 98 79 94 2
0 93 89 90 99 95 96 1
0 93 94 89 99 100 95 1
0 69 95 91 75 101 97 2
0 96 73 92 102 79 98 2
0 97 94 93 103 100 99 1
0 98 97 93 104 103 99 1
0 69 99 95 75 105 101 2
0 100 73 96 106 79 102 2
0 101 97 98 107 103 104 1
0 101 102 97 107 108 103 1
0 69 103 99 75 109 105 2
0 104 73 100 110 79 106 2
0 105 102 101 111 108 107 1
0 106 105 101 112 111 107 1
0 69 107 103 75 113 109 2
0 108 73 104 114 79 110 2
0 109 105 106 115 111 112 1
0 109 110 105 115 116 111 1
0 69 111 107 75 117 113 2
0 112 73 108 118 79 114 2
0 113 110 109 119 116 115 1
0 114 113 109 120 119 115 1
0 69 115 111 75 121 117 2
0 116 73 112 122 79 118 2
0 117 113 114 123 119 120 1
0 117 118 113 123 124 119 1
0 69 71 115 75 77 121 2
0 74 73 116 80 79 122 2
0 76 118 117 82 124 123 1
0 77 76 117 83 82 123 1
0 119 120 121 125 126 127 2
0 122 123 121 128 129 130 1
0 120 122 121 131 128 130 1
0 122 124 123 128 132 129 1
0 122 125 124 128 133 132 1
0 119 126 120 125 134 126 2
0 126 122 120 135 128 131 1
0 126 127 122 135 136 128 1
0 128 125 122 137 133 128 1
0 127 128 122 136 137 128 1
0 119 129 126 125 138 134 2
0 130 127 126 139 136 135 1
0 129 130 126 140 139 135 1
0 130 128 127 139 137 136 1
0 130 131 128 139 141 137 1
0 119 132 129 125 142 138 2
0 132 130 129 143 139 140 1
0 132 133 130 143 144 139 1
0 134 131 130 145 141 139 1
0 133 134 130 144 145 139 1
0 119 135 132 125 146 142 2
0 136 133 132 147 144 143 1
0 135 136 132 148 147 143 1
0 136 134 133 147 145 144 1
0 136 137 134 147 149 145 1
0 119 121 135 125 127 146 2
0 121 136 135 130 147 148 1
0 121 123 136 130 129 147 1
0 124 137 136 132 149 147 1
0 123 124 136 129 132 147 1
"Cylinder01" 0 2
65
0 -6.078806 12.313799 76.338547 0.123755 0.262241 -1
0 -30.196331 12.313799 72.665474 0.139266 0.262241 -1
0 -6.078812 12.313799 -5.779418 0.470531 0.262241 -1
0 -6.078809 46.919868 63.381283 0.169781 0.501326 -1
0 -6.078809 51.247124 -5.779416 0.488689 0.501255 -1
0 -28.580799 48.699081 46.585403 0.247168 0.411544 -1
0 -6.078806 12.313799 76.338547 0.616341 0.923084 -1
0 -6.078809 32.424911 93.720566 0.615834 0.842850 -1
0 -30.196331 12.313799 72.665474 0.531998 0.923084 -1
0 -30.196331 32.424911 83.474457 0.511584 0.842850 -1
0 -6.078809 32.424911 93.720566 0.029519 0.178818 -1
0 -6.078801 32.336025 93.720566 0.029519 0.179181 -1
0 -38.515694 32.336025 83.474442 0.072787 0.179181 -1
0 -30.196331 32.424911 83.474457 0.072787 0.178818 -1
0 -6.078801 32.336025 93.720566 0.029884 0.501358 -1
0 -38.515694 32.336025 83.474442 0.057414 0.386197 -1
0 -34.551502 12.313799 71.203316 0.145440 0.262241 -1
0 -32.644238 50.135357 33.026985 0.309676 0.395320 -1
0 -41.868965 32.424911 75.203308 0.461128 0.842850 -1
0 -34.551502 12.313799 71.203316 0.516767 0.923084 -1
0 -41.868965 32.424911 75.203308 0.107715 0.178818 -1
0 -44.373165 32.336025 75.203316 0.107715 0.179181 -1
0 -44.373165 32.336025 75.203316 0.149019 0.348575 -1
0 -34.702648 12.313799 -83.362724 0.798157 0.262241 -1
0 -32.785267 51.247124 -87.029388 0.822902 0.399842 -1
0 -34.702656 32.424911 -85.029404 0.805196 0.180120 -1
0 -44.576488 32.336025 -85.029404 0.805196 0.180483 -1
0 -44.576488 32.336025 -85.029404 0.813648 0.352806 -1
0 -30.328526 12.313799 -86.016037 0.809362 0.262241 -1
0 -28.704151 51.247124 -89.682709 0.835149 0.416119 -1
0 -30.328529 32.424911 -87.682709 0.816400 0.180120 -1
0 -38.693508 32.336025 -87.682701 0.816400 0.180483 -1
0 -38.693508 32.336025 -87.682701 0.825899 0.376272 -1
0 18.170895 12.313799 -86.016037 0.809362 0.262241 -1
0 16.546528 51.247124 -89.682693 0.835273 0.596633 -1
0 -30.328526 12.313799 -86.016037 0.300623 0.934903 -1
0 -30.328529 32.424911 -87.682709 0.300623 0.851137 -1
0 18.170895 12.313799 -86.016037 0.082599 0.934903 -1
0 18.170898 32.424911 -87.682693 0.082599 0.851137 -1
0 26.535866 32.336025 -87.682709 0.816400 0.180483 -1
0 18.170898 32.424911 -87.682693 0.816400 0.180120 -1
0 -38.693508 32.336025 -87.682701 0.338227 0.851507 -1
0 -28.704151 51.247124 -89.682709 0.293321 0.772739 -1
0 26.535866 32.336025 -87.682709 0.044995 0.851507 -1
0 16.546528 51.247124 -89.682693 0.089901 0.772739 -1
0 22.545017 12.313799 -83.362732 0.798157 0.262241 -1
0 20.627640 51.247124 -87.029388 0.823049 0.612916 -1
0 22.545017 32.424911 -85.029404 0.805196 0.180120 -1
0 32.418850 32.336025 -85.029388 0.805196 0.180483 -1
0 26.535866 32.336025 -87.682709 0.826078 0.636485 -1
0 32.418850 32.336025 -85.029388 0.813859 0.659956 -1
0 22.393879 12.313799 71.203308 0.145440 0.262241 -1
0 20.486626 50.135357 33.026978 0.309821 0.607270 -1
0 29.711334 32.424911 75.203308 0.107715 0.178818 -1
0 32.215572 32.336025 75.203293 0.107716 0.179181 -1
0 32.215572 32.336025 75.203293 0.149228 0.654102 -1
0 18.038704 12.313799 72.665466 0.139266 0.262241 -1
0 16.423183 48.699081 46.585407 0.247291 0.591074 -1
0 22.393879 12.313799 71.203308 0.715915 0.923084 -1
0 29.711334 32.424911 75.203308 0.770540 0.842850 -1
0 18.038712 32.424911 83.474449 0.720084 0.842850 -1
0 18.038704 12.313799 72.665466 0.700684 0.923084 -1
0 18.038712 32.424911 83.474449 0.072787 0.178818 -1
0 26.358078 32.336025 83.474449 0.072787 0.179181 -1
0 26.358078 32.336025 83.474449 0.057591 0.623207 -1
46
0.000000 -1.000000 0.000000
-0.000000 0.998048 0.062446
0.000000 0.999416 0.034179
0.055168 0.995866 0.072165
0.110420 -0.592554 0.797927
-0.086431 -0.985736 0.144409
-0.331924 -0.456338 0.825580
-0.256842 -0.850890 0.458278
0.069669 0.924692 -0.374287
-0.817166 0.513739 0.261367
-0.028281 0.911986 0.409246
-0.348835 0.887903 0.299904
0.024929 0.998645 0.045675
-0.453155 -0.851019 0.265364
-0.747120 -0.380271 0.545166
-0.881489 -0.432918 0.188570
-0.667906 0.732110 0.133854
-0.014132 0.999889 0.004645
-0.853410 -0.139821 -0.502137
-0.553582 -0.766345 -0.325979
-0.641803 -0.641545 -0.420129
-0.776388 0.435948 -0.455161
0.000000 1.000000 0.000000
-0.336374 -0.764238 -0.550266
-0.268532 -0.079557 -0.959980
-0.288773 -0.715401 -0.636248
-0.244814 0.040029 -0.968743
0.268531 -0.079556 -0.959980
0.335661 -0.763954 -0.551095
0.345688 -0.696948 -0.628302
0.281966 0.047601 -0.958243
0.014132 0.999889 0.004645
0.519551 -0.798268 -0.304688
0.871257 -0.040537 -0.489151
0.616343 -0.654291 -0.438206
0.759551 0.418733 -0.497739
-0.024929 0.998645 0.045675
0.819192 -0.336719 0.464267
0.454994 -0.863616 0.217134
0.888154 -0.427861 0.167682
0.670368 0.731858 0.122435
-0.055168 0.995866 0.072165
0.150583 -0.902265 0.404032
0.208892 -0.462974 0.861406
0.605693 -0.252880 0.754445
0.310512 0.891138 0.330840
72
0 0 1 2 0 0 0 2
0 3 4 5 1 2 3 2
0 6 7 8 4 5 6 1
0 7 9 8 5 7 6 1
0 10 11 12 5 8 9 1
0 10 12 13 5 9 7 1
0 14 3 15 8 10 9 1
0 3 5 15 10 11 9 1
0 1 16 2 0 0 0 2
0 5 4 17 3 2 12 2
0 8 9 18 6 7 13 1
0 8 18 19 6 13 14 1
0 13 12 20 7 9 13 1
0 12 21 20 9 15 13 1
0 15 5 17 9 11 16 1
0 15 17 22 9 16 15 1
0 16 23 2 0 0 0 2
0 17 4 24 12 2 17 2
0 16 20 23 14 13 18 1
0 20 25 23 13 19 18 1
0 20 21 26 13 15 20 1
0 20 26 25 13 20 19 1
0 22 17 27 15 16 20 1
0 17 24 27 16 21 20 1
0 23 28 2 0 0 0 2
0 24 4 29 17 2 22 2
0 23 25 30 18 19 23 1
0 23 30 28 18 23 24 1
0 25 26 30 19 20 23 1
0 26 31 30 20 25 23 1
0 27 24 29 20 21 26 1
0 27 29 32 20 26 25 1
0 28 33 2 0 0 0 2
0 29 4 34 22 2 22 2
0 35 36 37 24 23 27 1
0 36 38 37 23 28 27 1
0 30 31 39 23 25 29 1
0 30 39 40 23 29 28 1
0 41 42 43 25 26 29 1
0 42 44 43 26 30 29 1
0 33 45 2 0 0 0 2
0 34 4 46 22 2 31 2
0 33 40 47 27 28 32 1
0 33 47 45 27 32 33 1
0 40 39 47 28 29 32 1
0 39 48 47 29 34 32 1
0 49 34 46 29 30 35 1
0 49 46 50 29 35 34 1
0 45 51 2 0 0 0 2
0 46 4 52 31 2 36 2
0 45 47 51 33 32 37 1
0 47 53 51 32 38 37 1
0 47 48 54 32 34 39 1
0 47 54 53 32 39 38 1
0 50 46 55 34 35 39 1
0 46 52 55 35 40 39 1
0 51 56 2 0 0 0 2
0 52 4 57 36 2 41 2
0 58 59 60 37 38 42 1
0 58 60 61 37 42 43 1
0 53 54 62 38 39 42 1
0 54 63 62 39 44 42 1
0 55 52 57 39 40 45 1
0 55 57 64 39 45 44 1
0 56 0 2 0 0 0 2
0 57 4 3 41 2 1 2
0 61 60 6 43 42 4 1
0 60 7 6 42 5 4 1
0 62 63 11 42 44 8 1
0 62 11 10 42 8 5 1
0 64 57 14 44 45 8 1
0 57 3 14 45 10 8 1
"turret" 0 2
61
0 -24.750158 54.999996 4.508011 0.422374 0.083652 -1
0 -24.750158 57.166676 4.508011 0.422374 0.074042 -1
0 -31.107878 53.166676 -13.167416 0.500935 0.091783 -1
0 -24.892096 50.999996 -13.919779 0.504279 0.101393 -1
0 -16.941353 65.666672 -6.090534 0.469481 0.036343 -1
0 -20.948305 65.666672 -19.083599 0.527230 0.036343 -1
0 -24.892107 50.999996 -28.438330 0.568809 0.101393 -1
0 -31.107893 53.166676 -35.051807 0.598204 0.091783 -1
0 -20.948317 65.666672 -35.170635 0.598732 0.036343 -1
0 -16.627600 56.500008 -59.194866 0.705512 0.076999 -1
0 -13.687537 50.999996 -44.455334 0.640000 0.101393 -1
0 -11.822124 65.666672 -52.918003 0.677613 0.036343 -1
0 6.425429 50.999996 -44.455334 0.640000 0.101393 -1
0 9.365490 56.500008 -59.194866 0.705512 0.076999 -1
0 4.560011 65.666672 -52.918003 0.677613 0.036343 -1
0 23.845776 53.166676 -35.051815 0.598204 0.091783 -1
0 17.629988 50.999996 -28.438330 0.568809 0.101393 -1
0 13.686199 65.666672 -35.170643 0.598732 0.036343 -1
0 17.629988 50.999996 -13.919773 0.504279 0.101393 -1
0 23.845776 53.166676 -13.167416 0.500935 0.091783 -1
0 13.686203 65.666672 -19.083595 0.527230 0.036343 -1
0 17.488054 57.166676 4.508009 0.422374 0.074042 -1
0 17.488054 54.999996 4.508009 0.422374 0.083652 -1
0 9.679254 65.666672 -6.090536 0.469481 0.036343 -1
0 6.761742 50.999996 0.207496 0.441488 0.101393 -1
0 9.800136 54.833344 8.127190 0.406287 0.084391 -1
0 17.488054 57.166676 4.508009 0.430192 0.587449 -1
0 9.679254 65.666672 -6.090536 0.453600 0.563062 -1
0 4.833945 65.666672 -3.430105 0.448058 0.547537 -1
0 9.800136 54.833344 8.127190 0.422705 0.562841 -1
0 1.798638 54.833344 8.127192 0.406287 0.084391 -1
0 0.570338 50.999996 0.207496 0.441488 0.101393 -1
0 1.798638 54.833344 8.127192 0.423097 0.537390 -1
0 -0.208993 65.666672 -3.430105 0.448304 0.531497 -1
0 0.570341 50.999996 -6.017967 0.469158 0.101393 -1
0 1.798641 53.166676 -1.256699 0.447996 0.091783 -1
0 -0.208993 65.666672 -3.430105 0.457656 0.036343 -1
0 -0.208992 65.666672 -10.328127 0.488315 0.036343 -1
0 -9.060747 53.166676 -1.256699 0.447996 0.091783 -1
0 -7.832446 50.999996 -6.017967 0.469158 0.101393 -1
0 -7.053115 65.666672 -10.328129 0.488315 0.036343 -1
0 -7.832446 50.999996 0.207496 0.441488 0.101393 -1
0 -9.060744 54.833344 8.127192 0.406287 0.084391 -1
0 -7.053112 65.666672 -3.430105 0.457656 0.036343 -1
0 -17.062239 54.833344 8.127192 0.406287 0.084391 -1
0 -14.023849 50.999996 0.207496 0.441488 0.101393 -1
0 -9.060744 54.833344 8.127192 0.423629 0.502849 -1
0 -7.053112 65.666672 -3.430105 0.448640 0.509727 -1
0 -17.062239 54.833344 8.127192 0.424021 0.477398 -1
0 -12.096051 65.666672 -3.430105 0.448887 0.493687 -1
0 -12.096051 65.666672 -3.430105 0.457656 0.036343 -1
0 -16.941353 65.666672 -6.090534 0.454904 0.478388 -1
0 -24.750158 57.166676 4.508011 0.432260 0.453099 -1
0 -0.208992 65.666672 -10.328127 0.460378 0.532618 -1
0 -7.053115 65.666672 -10.328129 0.461176 0.497992 -1
0 -20.948305 65.666672 -19.083599 0.508103 0.428286 -1
0 13.686203 65.666672 -19.083595 0.504064 0.603510 -1
0 13.686199 65.666672 -35.170643 0.587308 0.604600 -1
0 -20.948317 65.666672 -35.170635 0.591348 0.429376 -1
0 4.560011 65.666672 -52.918003 0.680208 0.559631 -1
0 -11.822124 65.666672 -52.918003 0.682118 0.476750 -1
42
-0.528505 -0.777632 0.340546
-0.648333 0.471545 0.597754
-0.984724 -0.031815 0.171192
-0.244952 -0.959339 0.140237
-0.319858 0.907974 0.270692
-0.228442 0.972980 0.033526
-0.290592 -0.949587 -0.117648
-0.909038 -0.324710 -0.261177
-0.475762 0.872124 -0.114237
-0.450746 -0.330080 -0.829382
-0.188642 -0.931809 -0.310074
-0.272024 0.845299 -0.459861
0.117385 -0.951571 -0.284135
0.453993 -0.313947 -0.833863
0.279786 0.842224 -0.460845
0.920336 -0.296372 -0.255238
0.262882 -0.962413 -0.068227
0.333834 0.938992 -0.082753
0.471651 -0.873325 0.121853
0.949135 -0.251573 0.189350
0.452038 0.890746 0.047253
0.682292 0.281660 0.674644
0.540743 -0.782049 0.309832
0.227943 0.957726 0.175510
0.103307 -0.934939 0.339436
0.225301 -0.142060 0.963877
0.061691 0.893657 0.444491
-0.859977 0.074663 0.504841
-0.499103 -0.835918 0.228337
-0.502497 0.790788 0.349502
-0.296217 -0.947403 0.121173
-0.831207 0.102817 0.546373
-0.308744 0.915706 0.257214
0.841811 -0.003342 0.539762
0.096487 -0.994018 0.051169
0.214216 0.960873 0.175595
0.657047 -0.693492 0.295564
0.867902 0.058145 0.493321
0.610810 0.663897 0.431452
-0.203547 0.062469 0.977070
-0.181142 -0.979057 0.092921
-0.084677 0.937291 0.338105
74
0 0 1 2 0 1 2 1
0 0 2 3 0 2 3 1
0 1 4 2 1 4 2 1
0 4 5 2 4 5 2 1
0 3 2 6 3 2 6 1
0 2 7 6 2 7 6 1
0 2 5 8 2 5 8 1
0 2 8 7 2 8 7 1
0 6 7 9 6 7 9 1
0 6 9 10 6 9 10 1
0 7 8 9 7 8 9 1
0 8 11 9 8 11 9 1
0 10 9 12 10 9 12 1
0 9 13 12 9 13 12 1
0 9 11 14 9 11 14 1
0 9 14 13 9 14 13 1
0 12 13 15 12 13 15 1
0 12 15 16 12 15 16 1
0 13 14 15 13 14 15 1
0 14 17 15 14 17 15 1
0 16 15 18 16 15 18 1
0 15 19 18 15 19 18 1
0 15 17 20 15 17 20 1
0 15 20 19 15 20 19 1
0 18 19 21 18 19 21 1
0 18 21 22 18 21 22 1
0 19 20 21 19 20 21 1
0 20 23 21 20 23 21 1
0 22 21 24 22 21 24 1
0 21 25 24 21 25 24 1
0 26 27 28 21 23 26 1
0 26 28 29 21 26 25 1
0 24 25 30 24 25 27 1
0 24 30 31 24 27 28 1
0 29 28 32 25 26 27 1
0 28 33 32 26 29 27 1
0 31 30 34 28 27 30 1
0 30 35 34 27 31 30 1
0 30 36 37 27 29 32 1
0 30 37 35 27 32 31 1
0 34 35 38 30 31 33 1
0 34 38 39 30 33 34 1
0 35 37 38 31 32 33 1
0 37 40 38 32 35 33 1
0 39 38 41 34 33 36 1
0 38 42 41 33 37 36 1
0 38 40 43 33 35 38 1
0 38 43 42 33 38 37 1
0 41 42 44 36 37 39 1
0 41 44 45 36 39 40 1
0 46 47 48 37 38 39 1
0 47 49 48 38 41 39 1
0 45 44 0 40 39 0 1
0 44 1 0 39 1 0 1
0 44 50 4 39 41 4 1
0 48 51 52 39 4 1 1
0 33 28 53 29 26 32 1
0 47 54 49 38 35 41 1
0 49 54 51 41 35 4 1
0 51 54 55 4 35 5 1
0 27 53 28 23 32 26 1
0 56 53 27 20 32 23 1
0 53 56 55 32 20 5 1
0 54 53 55 35 32 5 1
0 55 56 57 5 20 17 1
0 55 57 58 5 17 8 1
0 58 57 59 8 17 14 1
0 58 59 60 8 14 11 1
0 24 31 34 24 28 30 1
0 41 45 39 36 40 34 1
0 45 0 39 40 0 34 1
0 0 3 39 0 3 34 1
0 22 24 34 22 24 30 1
0 18 22 34 18 22 30 1
"gun" 0 2
49
0 -4.788576 58.980450 49.220566 0.210585 0.065749 -1
0 -4.483052 58.242874 49.220566 0.210585 0.069144 -1
0 -3.745467 58.980450 49.220566 0.210585 0.065749 -1
0 -4.788572 58.980450 43.087227 0.245256 0.065749 -1
0 -4.483057 58.242874 43.087227 0.245256 0.069144 -1
0 -4.595080 58.980450 40.287243 0.265182 0.065902 -1
0 -4.346237 58.379692 40.287235 0.265182 0.067917 -1
0 -5.164480 58.980450 18.487240 0.384308 0.065902 -1
0 -4.748864 57.977070 18.487238 0.384308 0.069267 -1
0 -7.654573 58.980450 12.353901 0.402421 0.065845 -1
0 -6.509625 56.216305 12.353899 0.402421 0.076709 -1
0 -7.654575 58.980450 -7.446096 0.504898 0.065845 -1
0 -6.509626 56.216305 -7.446096 0.504898 0.076709 -1
0 -3.745467 57.937355 49.220566 0.210585 0.070550 -1
0 -3.745472 57.937355 43.087227 0.245256 0.070550 -1
0 -3.745472 58.130844 40.287235 0.265182 0.068751 -1
0 -3.745474 57.561451 18.487240 0.384308 0.070661 -1
0 -3.745476 55.071358 12.353901 0.402421 0.081209 -1
0 -3.745477 55.071358 -7.446098 0.504898 0.081209 -1
0 -3.007894 58.242874 49.220566 0.210585 0.069144 -1
0 -3.007889 58.242874 43.087227 0.245256 0.069144 -1
0 -3.144711 58.379692 40.287228 0.265182 0.067917 -1
0 -2.742087 57.977070 18.487238 0.384308 0.069267 -1
0 -0.981326 56.216305 12.353901 0.402421 0.076709 -1
0 -0.981327 56.216305 -7.446098 0.504898 0.076709 -1
0 -2.702373 58.980450 49.220566 0.210585 0.065749 -1
0 -2.702375 58.980450 43.087227 0.245256 0.065749 -1
0 -2.895858 58.980450 40.287235 0.265182 0.065902 -1
0 -2.326470 58.980450 18.487238 0.384308 0.065902 -1
0 0.163622 58.980450 12.353899 0.402421 0.065845 -1
0 0.163622 58.980450 -7.446096 0.504898 0.065845 -1
0 -3.007894 59.718040 49.220566 0.210585 0.062354 -1
0 -3.007889 59.718040 43.087227 0.245256 0.062354 -1
0 -3.144711 59.581223 40.287228 0.265182 0.063886 -1
0 -2.742087 59.983845 18.487238 0.384308 0.062536 -1
0 -0.981326 61.744610 12.353901 0.402421 0.054981 -1
0 -0.981327 61.744610 -7.446098 0.504898 0.054981 -1
0 -3.745467 60.023556 49.220566 0.210585 0.060948 -1
0 -3.745472 60.023556 43.087227 0.245256 0.060948 -1
0 -3.745472 59.830067 40.287235 0.265182 0.063052 -1
0 -3.745474 60.399460 18.487240 0.384308 0.061142 -1
0 -3.745476 62.889565 12.353901 0.402421 0.050480 -1
0 -3.745477 62.889565 -7.446098 0.504898 0.050480 -1
0 -4.483052 59.718040 49.220566 0.210585 0.062354 -1
0 -4.483057 59.718040 43.087227 0.245256 0.062354 -1
0 -4.346237 59.581223 40.287235 0.265182 0.063886 -1
0 -4.748864 59.983845 18.487238 0.384308 0.062536 -1
0 -6.509625 61.744610 12.353899 0.402421 0.054981 -1
0 -6.509626 61.744610 -7.446096 0.504898 0.054981 -1
49
0.000000 0.000000 1.000000
-1.000000 -0.000004 -0.000001
-0.999405 -0.000004 -0.034497
-0.707105 -0.707109 0.000000
-0.706686 -0.706686 -0.034496
-0.999770 -0.000004 -0.021446
-0.706944 -0.706944 -0.021446
-0.978686 -0.000003 0.205363
-0.692035 -0.692036 0.205363
-0.981269 -0.000001 0.192641
-0.693862 -0.693862 0.192642
-1.000000 -0.000001 0.000000
-0.707106 -0.707107 0.000000
0.000001 -0.999405 -0.034496
0.000003 -1.000000 -0.000000
0.000001 -0.999770 -0.021446
0.000000 -0.978686 0.205363
-0.000000 -0.981269 0.192641
-0.000000 -1.000000 -0.000000
0.707107 -0.707106 0.000000
0.706687 -0.706685 -0.034496
0.706943 -0.706946 -0.021446
0.692035 -0.692035 0.205363
0.693862 -0.693862 0.192641
0.707106 -0.707107 -0.000000
0.999405 -0.000004 -0.034496
1.000000 -0.000004 -0.000000
0.999770 -0.000004 -0.021445
0.978686 -0.000003 0.205363
0.981269 -0.000001 0.192641
1.000000 -0.000001 -0.000000
0.707108 0.707105 0.000000
0.706688 0.706684 -0.034496
0.706944 0.706944 -0.021446
0.692036 0.692035 0.205363
0.693863 0.693861 0.192642
0.707108 0.707106 -0.000000
0.000001 0.999405 -0.034496
0.000003 1.000000 -0.000000
0.000001 0.999770 -0.021446
0.000000 0.978686 0.205363
-0.000000 0.981269 0.192642
-0.000000 1.000000 -0.000000
-0.707106 0.707108 0.000000
-0.706687 0.706685 -0.034496
-0.706945 0.706943 -0.021446
-0.692036 0.692035 0.205363
-0.693863 0.693861 0.192642
-0.707108 0.707106 0.000000
88
0 0 1 2 0 0 0 2
0 0 3 1 1 2 3 1
0 3 4 1 2 4 3 1
0 3 5 6 2 5 6 1
0 3 6 4 2 6 4 1
0 5 7 6 5 7 6 1
0 7 8 6 7 8 6 1
0 7 9 10 7 9 10 1
0 7 10 8 7 10 8 1
0 9 11 10 9 11 10 1
0 11 12 10 11 12 10 1
0 1 13 2 0 0 0 2
0 1 4 14 3 4 13 1
0 1 14 13 3 13 14 1
0 4 6 14 4 6 13 1
0 6 15 14 6 15 13 1
0 6 8 16 6 8 16 1
0 6 16 15 6 16 15 1
0 8 10 16 8 10 16 1
0 10 17 16 10 17 16 1
0 10 12 18 10 12 18 1
0 10 18 17 10 18 17 1
0 13 19 2 0 0 0 2
0 13 14 19 14 13 19 1
0 14 20 19 13 20 19 1
0 14 15 21 13 15 21 1
0 14 21 20 13 21 20 1
0 15 16 21 15 16 21 1
0 16 22 21 16 22 21 1
0 16 17 23 16 17 23 1
0 16 23 22 16 23 22 1
0 17 18 23 17 18 23 1
0 18 24 23 18 24 23 1
0 19 25 2 0 0 0 2
0 19 20 26 19 20 25 1
0 19 26 25 19 25 26 1
0 20 21 26 20 21 25 1
0 21 27 26 21 27 25 1
0 21 22 28 21 22 28 1
0 21 28 27 21 28 27 1
0 22 23 28 22 23 28 1
0 23 29 28 23 29 28 1
0 23 24 30 23 24 30 1
0 23 30 29 23 30 29 1
0 25 31 2 0 0 0 2
0 25 26 31 26 25 31 1
0 26 32 31 25 32 31 1
0 26 27 33 25 27 33 1
0 26 33 32 25 33 32 1
0 27 28 33 27 28 33 1
0 28 34 33 28 34 33 1
0 28 29 35 28 29 35 1
0 28 35 34 28 35 34 1
0 29 30 35 29 30 35 1
0 30 36 35 30 36 35 1
0 31 37 2 0 0 0 2
0 31 32 38 31 32 37 1
0 31 38 37 31 37 38 1
0 32 33 38 32 33 37 1
0 33 39 38 33 39 37 1
0 33 34 40 33 34 40 1
0 33 40 39 33 40 39 1
0 34 35 40 34 35 40 1
0 35 41 40 35 41 40 1
0 35 36 42 35 36 42 1
0 35 42 41 35 42 41 1
0 37 43 2 0 0 0 2
0 37 38 43 38 37 43 1
0 38 44 43 37 44 43 1
0 38 39 45 37 39 45 1
0 38 45 44 37 45 44 1
0 39 40 45 39 40 45 1
0 40 46 45 40 46 45 1
0 40 41 47 40 41 47 1
0 40 47 46 40 47 46 1
0 41 42 47 41 42 47 1
0 42 48 47 42 48 47 1
0 43 0 2 0 0 0 2
0 43 44 3 43 44 2 1
0 43 3 0 43 2 1 1
0 44 45 3 44 45 2 1
0 45 5 3 45 5 2 1
0 45 46 7 45 46 7 1
0 45 7 5 45 7 5 1
0 46 47 7 46 47 7 1
0 47 9 7 47 9 7 1
0 47 48 11 47 48 11 1
0 47 11 9 47 11 9 1
"Cylinder06" 0 2
25
0 17.102089 51.689983 52.368637 0.216570 0.596184 -1
0 9.095145 53.356647 49.052055 0.233443 0.558647 -1
0 12.411730 51.689983 57.059006 0.192569 0.574246 -1
0 17.102089 44.689983 52.368637 0.699005 0.788869 -1
0 17.102089 51.689983 52.368637 0.699005 0.771509 -1
0 12.411730 44.689983 57.059006 0.680443 0.788869 -1
0 12.411730 51.689983 57.059006 0.680443 0.771509 -1
0 5.778554 51.689983 57.059006 0.192511 0.543171 -1
0 5.778554 51.689983 57.059006 0.654191 0.771509 -1
0 5.778554 44.689983 57.059006 0.654191 0.788869 -1
0 1.088189 51.689983 52.368645 0.216431 0.521161 -1
0 1.088189 44.689983 52.368645 0.635628 0.788869 -1
0 1.088189 51.689983 52.368645 0.635628 0.771509 -1
0 1.088188 51.689983 45.735466 0.250316 0.521110 -1
0 1.088188 51.689983 45.735466 0.635628 0.771509 -1
0 1.088188 44.689983 45.735466 0.635628 0.788869 -1
0 5.778554 51.689983 41.045105 0.274317 0.543048 -1
0 5.778554 44.689983 41.045105 0.654191 0.788869 -1
0 5.778554 51.689983 41.045105 0.654191 0.771509 -1
0 12.411731 51.689983 41.045105 0.274374 0.574123 -1
0 12.411731 51.689983 41.045105 0.680443 0.771509 -1
0 12.411731 44.689983 41.045105 0.680443 0.788869 -1
0 17.102093 51.689983 45.735466 0.250455 0.596133 -1
0 17.102093 44.689983 45.735466 0.699005 0.788869 -1
0 17.102093 51.689983 45.735466 0.699005 0.771509 -1
17
0.174472 0.982006 0.072269
0.000000 1.000000 0.000000
0.072269 0.982006 0.174472
0.923880 0.000000 0.382683
0.382684 0.000000 0.923879
-0.072269 0.982006 0.174472
-0.382683 0.000000 0.923880
-0.174472 0.982006 0.072269
-0.923879 0.000000 0.382684
-0.174472 0.982006 -0.072269
-0.923879 0.000000 -0.382684
-0.072269 0.982006 -0.174472
-0.382683 0.000000 -0.923880
0.072269 0.982006 -0.174472
0.382683 0.000000 -0.923880
0.174472 0.982006 -0.072269
0.923880 0.000000 -0.382683
24
0 0 1 2 0 1 2 2
0 3 4 5 3 3 4 1
0 4 6 5 3 4 4 1
0 2 1 7 2 1 5 2
0 5 6 8 4 4 6 1
0 5 8 9 4 6 6 1
0 7 1 10 5 1 7 2
0 9 8 11 6 6 8 1
0 8 12 11 6 8 8 1
0 10 1 13 7 1 9 2
0 11 12 14 8 8 10 1
0 11 14 15 8 10 10 1
0 13 1 16 9 1 11 2
0 15 14 17 10 10 12 1
0 14 18 17 10 12 12 1
0 16 1 19 11 1 13 2
0 17 18 20 12 12 14 1
0 17 20 21 12 14 14 1
0 19 1 22 13 1 15 2
0 21 20 23 14 14 16 1
0 20 24 23 14 16 16 1
0 22 1 0 15 1 0 2
0 23 24 4 16 16 3 1
0 23 4 3 16 3 3 1
"turretpivot" 1 -1
20
1 -2.881840 52.647133 -28.279413 0.000000 0.000000 -1
1 -2.881840 50.980465 -28.279413 0.000000 1.000000 -1
1 -4.548507 52.647133 -28.279415 1.000000 0.000000 -1
1 -4.548507 50.980465 -28.279415 1.000000 1.000000 -1
1 -4.548507 52.647133 -28.279415 0.000000 0.000000 -1
1 -4.548507 50.980465 -28.279415 0.000000 1.000000 -1
1 -4.548505 52.647133 -26.612747 1.000000 0.000000 -1
1 -4.548505 50.980465 -26.612747 1.000000 1.000000 -1
1 -4.548505 52.647133 -26.612747 0.000000 0.000000 -1
1 -4.548505 50.980465 -26.612747 0.000000 1.000000 -1
1 -2.881838 52.647133 -26.612747 1.000000 0.000000 -1
1 -2.881838 50.980465 -26.612747 1.000000 1.000000 -1
1 -2.881838 52.647133 -26.612747 0.000000 0.000000 -1
1 -2.881838 50.980465 -26.612747 0.000000 1.000000 -1
1 -2.881840 52.647133 -28.279413 1.000000 0.000000 -1
1 -2.881840 50.980465 -28.279413 1.000000 1.000000 -1
1 -2.881840 52.647133 -28.279413 0.000000 1.000000 -1
1 -4.548507 52.647133 -28.279415 1.000000 1.000000 -1
1 -2.881840 50.980465 -28.279413 0.000000 0.000000 -1
1 -4.548507 50.980465 -28.279415 1.000000 0.000000 -1
6
0.000001 0.000000 -1.000000
-1.000000 0.000000 0.000001
0.000000 0.000000 1.000000
1.000000 0.000000 -0.000001
0.000000 1.000000 0.000000
0.000000 -1.000000 0.000000
12
1 0 1 2 0 0 0 1
1 1 3 2 0 0 0 1
1 4 5 6 1 1 1 2
1 5 7 6 1 1 1 2
1 8 9 10 2 2 2 1
1 9 11 10 2 2 2 1
1 12 13 14 3 3 3 2
1 13 15 14 3 3 3 2
1 12 16 6 4 4 4 3
1 16 17 6 4 4 4 3
1 18 13 19 5 5 5 3
1 13 7 19 5 5 5 3
"gunpivot" 0 -1
20
0 -2.131840 59.647133 -1.612749 0.000000 0.000000 -1
0 -2.131840 58.313801 -1.612749 0.000000 1.000000 -1
0 -3.798507 59.647133 -1.612749 1.000000 0.000000 -1
0 -3.798507 58.313801 -1.612749 1.000000 1.000000 -1
0 -3.798507 59.647133 -1.612749 0.000000 0.000000 -1
0 -3.798507 58.313801 -1.612749 0.000000 1.000000 -1
0 -3.798507 59.647133 0.053917 1.000000 0.000000 -1
0 -3.798507 58.313801 0.053917 1.000000 1.000000 -1
0 -3.798507 59.647133 0.053917 0.000000 0.000000 -1
0 -3.798507 58.313801 0.053917 0.000000 1.000000 -1
0 -2.131840 59.647133 0.053917 1.000000 0.000000 -1
0 -2.131840 58.313801 0.053917 1.000000 1.000000 -1
0 -2.131840 59.647133 0.053917 0.000000 0.000000 -1
0 -2.131840 58.313801 0.053917 0.000000 1.000000 -1
0 -2.131840 59.647133 -1.612749 1.000000 0.000000 -1
0 -2.131840 58.313801 -1.612749 1.000000 1.000000 -1
0 -2.131840 59.647133 -1.612749 0.000000 1.000000 -1
0 -3.798507 59.647133 -1.612749 1.000000 1.000000 -1
0 -2.131840 58.313801 -1.612749 0.000000 0.000000 -1
0 -3.798507 58.313801 -1.612749 1.000000 0.000000 -1
6
0.000000 0.000000 -1.000000
-1.000000 0.000000 -0.000000
0.000000 0.000000 1.000000
1.000000 0.000000 0.000000
0.000000 1.000000 0.000000
0.000000 -1.000000 0.000000
12
0 0 1 2 0 0 0 1
0 1 3 2 0 0 0 1
0 4 5 6 1 1 1 2
0 5 7 6 1 1 1 2
0 8 9 10 2 2 2 1
0 9 11 10 2 2 2 1
0 12 13 14 3 3 3 2
0 13 15 14 3 3 3 2
0 12 16 6 4 4 4 3
0 16 17 6 4 4 4 3
0 18 13 19 5 5 5 3
0 13 7 19 5 5 5 3

Materials: 3
"Material01"
0.800000 0.800000 0.800000 1.000000
0.800000 0.800000 0.800000 1.000000
0.000000 0.000000 0.000000 1.000000
0.000000 0.000000 0.000000 1.000000
0.000000
1.000000
".\bigtire.bmp"
""
"Material02"
0.800000 0.800000 0.800000 1.000000
0.800000 0.800000 0.800000 1.000000
0.000000 0.000000 0.000000 1.000000
0.000000 0.000000 0.000000 1.000000
0.000000
1.000000
".\tan.bmp"
""
"Material03"
0.800000 0.800000 0.800000 1.000000
0.800000 0.800000 0.800000 1.000000
0.000000 0.000000 0.000000 1.000000
0.000000 0.000000 0.000000 1.000000
0.000000
1.000000
".\camo.bmp"
""

Bones: 0
