EESchema Schematic File Version 2
LIBS:adc_main_shield-rescue
LIBS:ruwai
LIBS:power
LIBS:device
LIBS:transistors
LIBS:conn
LIBS:linear
LIBS:regul
LIBS:74xx
LIBS:cmos4000
LIBS:adc-dac
LIBS:memory
LIBS:xilinx
LIBS:microcontrollers
LIBS:dsp
LIBS:microchip
LIBS:analog_switches
LIBS:motorola
LIBS:texas
LIBS:intel
LIBS:audio
LIBS:interface
LIBS:digital-audio
LIBS:philips
LIBS:display
LIBS:cypress
LIBS:siliconi
LIBS:opto
LIBS:atmel
LIBS:contrib
LIBS:valves
LIBS:adc_main_shield-cache
EELAYER 25 0
EELAYER END
$Descr A4 11693 8268
encoding utf-8
Sheet 4 6
Title "Ruwai ADC Main Shield"
Date "2017-09-12"
Rev "3"
Comp "Copyright Mertl Research GmbH 2014 "
Comment1 ""
Comment2 ""
Comment3 ""
Comment4 "This documentation describes Open Hardware and is licensed under the CERN OHL v. 1.2."
$EndDescr
$Comp
L TPS73250 U5
U 1 1 54698143
P 5800 2100
F 0 "U5" H 5500 1850 60  0000 C CNN
F 1 "TPS73250" H 5650 2350 60  0000 C CNN
F 2 "Ruwai:SOT23-5" H 6150 1850 60  0001 C CNN
F 3 "" H 5850 2050 60  0000 C CNN
F 4 "Texas Instruments" H 5800 1700 60  0001 L CNN "Manu"
F 5 "TPS73250DBVR" H 5800 1600 60  0001 L CNN "Manu#"
F 6 "SOT23 5-pin" H 5800 1500 60  0001 L CNN "Package"
F 7 "Single Output LDO, 250mA, Fixed(5.0V), Fast Transient Response, Reverse Current Protection" H 5800 1400 60  0001 L CNN "Desc"
	1    5800 2100
	1    0    0    -1  
$EndComp
$Comp
L Resistor R11
U 1 1 5469814E
P 4650 1700
F 0 "R11" V 4730 1700 40  0000 C CNN
F 1 "2.7k" V 4657 1701 40  0000 C CNN
F 2 "Ruwai:Resistor_SMD0805_ReflowWave" V 4580 1700 30  0001 C CNN
F 3 "" V 4730 1700 30  0000 C CNN
F 4 "Yageo" H 4650 1200 60  0001 L CNN "Manu"
F 5 "RC0805FR-072K7L" H 4650 1100 60  0001 L CNN "Manu#"
F 6 "0805" H 4650 1000 60  0001 L CNN "Package"
F 7 "Custom Description" H 4650 900 60  0001 L CNN "Desc"
	1    4650 1700
	0    1    1    0   
$EndComp
$Comp
L Resistor R12
U 1 1 54698159
P 5000 2700
F 0 "R12" V 5080 2700 40  0000 C CNN
F 1 "2.2k" V 5007 2701 40  0000 C CNN
F 2 "Ruwai:Resistor_SMD0805_ReflowWave" V 4930 2700 30  0001 C CNN
F 3 "" V 5080 2700 30  0000 C CNN
F 4 "Yageo" H 5000 2200 60  0001 L CNN "Manu"
F 5 "RC0805FR-072K2L" H 5000 2100 60  0001 L CNN "Manu#"
F 6 "0805" H 5000 2000 60  0001 L CNN "Package"
F 7 "Custom Description" H 5000 1900 60  0001 L CNN "Desc"
	1    5000 2700
	1    0    0    -1  
$EndComp
$Comp
L Resistor R9
U 1 1 54698164
P 7800 2700
F 0 "R9" V 7880 2700 40  0000 C CNN
F 1 "6.8k" V 7807 2701 40  0000 C CNN
F 2 "Ruwai:Resistor_SMD0805_ReflowWave" V 7730 2700 30  0001 C CNN
F 3 "" V 7880 2700 30  0000 C CNN
F 4 "Yageo" H 7800 2200 60  0001 L CNN "Manu"
F 5 "RC0805FR-076K8L" H 7800 2100 60  0001 L CNN "Manu#"
F 6 "0805" H 7800 2000 60  0001 L CNN "Package"
F 7 "Custom Description" H 7800 1900 60  0001 L CNN "Desc"
	1    7800 2700
	1    0    0    -1  
$EndComp
$Comp
L Resistor R10
U 1 1 5469816F
P 7050 1600
F 0 "R10" V 7130 1600 40  0000 C CNN
F 1 "1" V 7057 1601 40  0000 C CNN
F 2 "Ruwai:Resistor_SMD0102_ReflowWave" V 6980 1600 30  0001 C CNN
F 3 "" V 7130 1600 30  0000 C CNN
F 4 "Yageo" H 7050 1100 60  0001 L CNN "Manu"
F 5 "RC0805FR-071RL" H 7050 1000 60  0001 L CNN "Manu#"
F 6 "0805" H 7050 900 60  0001 L CNN "Package"
F 7 "Custom Description" H 7050 800 60  0001 L CNN "Desc"
	1    7050 1600
	1    0    0    -1  
$EndComp
$Comp
L Capacitor C23
U 1 1 5469817A
P 4250 2700
F 0 "C23" H 4250 2800 40  0000 L CNN
F 1 "10nF" H 4256 2615 40  0000 L CNN
F 2 "Ruwai:Capacitor_SMD0805_ReflowWave" H 4288 2550 30  0001 C CNN
F 3 "" H 4250 2800 60  0000 C CNN
F 4 "Kemet" H 4300 2300 60  0001 L CNN "Manu"
F 5 "C0805C103J3GACTU" H 4300 2200 60  0001 L CNN "Manu#"
F 6 "0805" H 4300 2100 60  0001 L CNN "Package"
F 7 "Custom Description" H 4250 2350 60  0001 L CNN "Desc"
	1    4250 2700
	1    0    0    -1  
$EndComp
$Comp
L Capacitor C22
U 1 1 54698185
P 3900 2700
F 0 "C22" H 3900 2800 40  0000 L CNN
F 1 "2.2uF" H 3906 2615 40  0000 L CNN
F 2 "Ruwai:Capacitor_SMD0805_ReflowWave" H 3938 2550 30  0001 C CNN
F 3 "" H 3900 2800 60  0000 C CNN
F 4 "Murata" H 3950 2300 60  0001 L CNN "Manu"
F 5 "GRM21BR71E225KA73L" H 3950 2200 60  0001 L CNN "Manu#"
F 6 "0805" H 3950 2100 60  0001 L CNN "Package"
F 7 "Custom description." H 3900 2350 60  0001 L CNN "Desc"
	1    3900 2700
	1    0    0    -1  
$EndComp
$Comp
L Capacitor C24
U 1 1 54698190
P 6650 2700
F 0 "C24" H 6650 2800 40  0000 L CNN
F 1 "10nF" H 6656 2615 40  0000 L CNN
F 2 "Ruwai:Capacitor_SMD0805_ReflowWave" H 6688 2550 30  0001 C CNN
F 3 "" H 6650 2800 60  0000 C CNN
F 4 "Kemet" H 6700 2300 60  0001 L CNN "Manu"
F 5 "C0805C103J3GACTU" H 6700 2200 60  0001 L CNN "Manu#"
F 6 "0805" H 6700 2100 60  0001 L CNN "Package"
F 7 "Custom Description" H 6650 2350 60  0001 L CNN "Desc"
	1    6650 2700
	1    0    0    -1  
$EndComp
$Comp
L Capacitor C25
U 1 1 5469819B
P 7050 2700
F 0 "C25" H 7050 2800 40  0000 L CNN
F 1 "2.2uF" H 7056 2615 40  0000 L CNN
F 2 "Ruwai:Capacitor_SMD0805_ReflowWave" H 7088 2550 30  0001 C CNN
F 3 "" H 7050 2800 60  0000 C CNN
F 4 "Murata" H 7100 2300 60  0001 L CNN "Manu"
F 5 "GRM21BR71E225KA73L" H 7100 2200 60  0001 L CNN "Manu#"
F 6 "0805" H 7100 2100 60  0001 L CNN "Package"
F 7 "Custom Description" H 7050 2350 60  0001 L CNN "Desc"
	1    7050 2700
	1    0    0    -1  
$EndComp
$Comp
L GND-RESCUE-adc_main_shield #PWR056
U 1 1 546981A2
P 5000 3100
F 0 "#PWR056" H 5000 3100 30  0001 C CNN
F 1 "GND" H 5000 3030 30  0001 C CNN
F 2 "" H 5000 3100 60  0000 C CNN
F 3 "" H 5000 3100 60  0000 C CNN
	1    5000 3100
	1    0    0    -1  
$EndComp
$Comp
L GND-RESCUE-adc_main_shield #PWR057
U 1 1 546981A8
P 4250 3100
F 0 "#PWR057" H 4250 3100 30  0001 C CNN
F 1 "GND" H 4250 3030 30  0001 C CNN
F 2 "" H 4250 3100 60  0000 C CNN
F 3 "" H 4250 3100 60  0000 C CNN
	1    4250 3100
	1    0    0    -1  
$EndComp
$Comp
L GND-RESCUE-adc_main_shield #PWR058
U 1 1 546981AE
P 3900 3100
F 0 "#PWR058" H 3900 3100 30  0001 C CNN
F 1 "GND" H 3900 3030 30  0001 C CNN
F 2 "" H 3900 3100 60  0000 C CNN
F 3 "" H 3900 3100 60  0000 C CNN
	1    3900 3100
	1    0    0    -1  
$EndComp
$Comp
L GND-RESCUE-adc_main_shield #PWR059
U 1 1 546981B4
P 6650 3100
F 0 "#PWR059" H 6650 3100 30  0001 C CNN
F 1 "GND" H 6650 3030 30  0001 C CNN
F 2 "" H 6650 3100 60  0000 C CNN
F 3 "" H 6650 3100 60  0000 C CNN
	1    6650 3100
	1    0    0    -1  
$EndComp
$Comp
L GND-RESCUE-adc_main_shield #PWR060
U 1 1 546981BA
P 7050 3100
F 0 "#PWR060" H 7050 3100 30  0001 C CNN
F 1 "GND" H 7050 3030 30  0001 C CNN
F 2 "" H 7050 3100 60  0000 C CNN
F 3 "" H 7050 3100 60  0000 C CNN
	1    7050 3100
	1    0    0    -1  
$EndComp
$Comp
L GND-RESCUE-adc_main_shield #PWR061
U 1 1 546981C0
P 7800 3100
F 0 "#PWR061" H 7800 3100 30  0001 C CNN
F 1 "GND" H 7800 3030 30  0001 C CNN
F 2 "" H 7800 3100 60  0000 C CNN
F 3 "" H 7800 3100 60  0000 C CNN
	1    7800 3100
	1    0    0    -1  
$EndComp
$Comp
L GND-RESCUE-adc_main_shield #PWR062
U 1 1 546981D3
P 4750 3100
F 0 "#PWR062" H 4750 3100 30  0001 C CNN
F 1 "GND" H 4750 3030 30  0001 C CNN
F 2 "" H 4750 3100 60  0000 C CNN
F 3 "" H 4750 3100 60  0000 C CNN
	1    4750 3100
	1    0    0    -1  
$EndComp
$Comp
L inductor L7
U 1 1 546981E3
P 3500 2000
F 0 "L7" H 3500 2050 40  0000 C BNN
F 1 "1uH" H 3500 1950 40  0000 C CNN
F 2 "Ruwai:Inductor_SMD0805_ReflowWave" H 3400 2000 60  0001 C CNN
F 3 "" H 3400 2000 60  0000 C CNN
F 4 "Taiyo Yuden" H 3500 2000 60  0001 C CNN "Manu"
F 5 "BRL2012T1R0M" H 3500 2000 60  0001 C CNN "Manu#"
F 6 "0805" H 3500 2000 60  0001 C CNN "Package"
F 7 "Custom description." H 3500 2000 60  0001 C CNN "Desc"
	1    3500 2000
	1    0    0    -1  
$EndComp
$Comp
L Resistor R5
U 1 1 5469A78D
P 8500 5600
F 0 "R5" V 8580 5600 40  0000 C CNN
F 1 "330" V 8507 5601 40  0000 C CNN
F 2 "Ruwai:Resistor_SMD0805_ReflowWave" V 8430 5600 30  0001 C CNN
F 3 "" V 8580 5600 30  0000 C CNN
F 4 "Yageo" H 8500 5100 60  0001 L CNN "Manu"
F 5 "RC0805FR-07330RL" H 8500 5000 60  0001 L CNN "Manu#"
F 6 "0805" H 8500 4900 60  0001 L CNN "Package"
F 7 "Custom Description" H 8500 4800 60  0001 L CNN "Desc"
	1    8500 5600
	1    0    0    -1  
$EndComp
$Comp
L Resistor R6
U 1 1 5469A798
P 7850 4500
F 0 "R6" V 7930 4500 40  0000 C CNN
F 1 "1" V 7857 4501 40  0000 C CNN
F 2 "Ruwai:Resistor_SMD0102_ReflowWave" V 7780 4500 30  0001 C CNN
F 3 "" V 7930 4500 30  0000 C CNN
F 4 "Yageo" H 7850 4000 60  0001 L CNN "Manu"
F 5 "RC0805FR-071RL" H 7850 3900 60  0001 L CNN "Manu#"
F 6 "0805" H 7850 3800 60  0001 L CNN "Package"
F 7 "Custom Description" H 7850 3700 60  0001 L CNN "Desc"
	1    7850 4500
	1    0    0    -1  
$EndComp
$Comp
L Capacitor C15
U 1 1 5469A7A3
P 5700 5600
F 0 "C15" H 5700 5700 40  0000 L CNN
F 1 "10nF" H 5706 5515 40  0000 L CNN
F 2 "Ruwai:Capacitor_SMD0805_ReflowWave" H 5738 5450 30  0001 C CNN
F 3 "" H 5700 5700 60  0000 C CNN
F 4 "Kemet" H 5750 5200 60  0001 L CNN "Manu"
F 5 "C0805C103J3GACTU" H 5750 5100 60  0001 L CNN "Manu#"
F 6 "0805" H 5750 5000 60  0001 L CNN "Package"
F 7 "Custom Description" H 5700 5250 60  0001 L CNN "Desc"
	1    5700 5600
	1    0    0    -1  
$EndComp
$Comp
L Capacitor C14
U 1 1 5469A7AE
P 5350 5600
F 0 "C14" H 5350 5700 40  0000 L CNN
F 1 "2.2uF" H 5356 5515 40  0000 L CNN
F 2 "Ruwai:Capacitor_SMD0805_ReflowWave" H 5388 5450 30  0001 C CNN
F 3 "" H 5350 5700 60  0000 C CNN
F 4 "Murata" H 5400 5200 60  0001 L CNN "Manu"
F 5 "GRM21BR71E225KA73L" H 5400 5100 60  0001 L CNN "Manu#"
F 6 "0805" H 5400 5000 60  0001 L CNN "Package"
F 7 "Custom Description" H 5350 5250 60  0001 L CNN "Desc"
	1    5350 5600
	1    0    0    -1  
$EndComp
$Comp
L Capacitor C16
U 1 1 5469A7B9
P 7550 5600
F 0 "C16" H 7550 5700 40  0000 L CNN
F 1 "10nF" H 7556 5515 40  0000 L CNN
F 2 "Ruwai:Capacitor_SMD0805_ReflowWave" H 7588 5450 30  0001 C CNN
F 3 "" H 7550 5700 60  0000 C CNN
F 4 "Kemet" H 7600 5200 60  0001 L CNN "Manu"
F 5 "C0805C103J3GACTU" H 7600 5100 60  0001 L CNN "Manu#"
F 6 "0805" H 7600 5000 60  0001 L CNN "Package"
F 7 "Custom Description" H 7550 5250 60  0001 L CNN "Desc"
	1    7550 5600
	1    0    0    -1  
$EndComp
$Comp
L Capacitor C17
U 1 1 5469A7C4
P 7850 5600
F 0 "C17" H 7850 5700 40  0000 L CNN
F 1 "2.2uF" H 7856 5515 40  0000 L CNN
F 2 "Ruwai:Capacitor_SMD0805_ReflowWave" H 7888 5450 30  0001 C CNN
F 3 "" H 7850 5700 60  0000 C CNN
F 4 "Murata" H 7900 5200 60  0001 L CNN "Manu"
F 5 "GRM21BR71E225KA73L" H 7900 5100 60  0001 L CNN "Manu#"
F 6 "0805" H 7900 5000 60  0001 L CNN "Package"
F 7 "Custom Description" H 7850 5250 60  0001 L CNN "Desc"
	1    7850 5600
	1    0    0    -1  
$EndComp
$Comp
L GND-RESCUE-adc_main_shield #PWR063
U 1 1 5469A7CB
P 5700 6000
F 0 "#PWR063" H 5700 6000 30  0001 C CNN
F 1 "GND" H 5700 5930 30  0001 C CNN
F 2 "" H 5700 6000 60  0000 C CNN
F 3 "" H 5700 6000 60  0000 C CNN
	1    5700 6000
	1    0    0    -1  
$EndComp
$Comp
L GND-RESCUE-adc_main_shield #PWR064
U 1 1 5469A7D1
P 5350 6000
F 0 "#PWR064" H 5350 6000 30  0001 C CNN
F 1 "GND" H 5350 5930 30  0001 C CNN
F 2 "" H 5350 6000 60  0000 C CNN
F 3 "" H 5350 6000 60  0000 C CNN
	1    5350 6000
	1    0    0    -1  
$EndComp
$Comp
L GND-RESCUE-adc_main_shield #PWR065
U 1 1 5469A7D7
P 7550 6000
F 0 "#PWR065" H 7550 6000 30  0001 C CNN
F 1 "GND" H 7550 5930 30  0001 C CNN
F 2 "" H 7550 6000 60  0000 C CNN
F 3 "" H 7550 6000 60  0000 C CNN
	1    7550 6000
	1    0    0    -1  
$EndComp
$Comp
L GND-RESCUE-adc_main_shield #PWR066
U 1 1 5469A7DD
P 7850 6000
F 0 "#PWR066" H 7850 6000 30  0001 C CNN
F 1 "GND" H 7850 5930 30  0001 C CNN
F 2 "" H 7850 6000 60  0000 C CNN
F 3 "" H 7850 6000 60  0000 C CNN
	1    7850 6000
	1    0    0    -1  
$EndComp
$Comp
L GND-RESCUE-adc_main_shield #PWR067
U 1 1 5469A7E3
P 8500 6000
F 0 "#PWR067" H 8500 6000 30  0001 C CNN
F 1 "GND" H 8500 5930 30  0001 C CNN
F 2 "" H 8500 6000 60  0000 C CNN
F 3 "" H 8500 6000 60  0000 C CNN
	1    8500 6000
	1    0    0    -1  
$EndComp
$Comp
L GND-RESCUE-adc_main_shield #PWR068
U 1 1 5469A7FF
P 6000 6000
F 0 "#PWR068" H 6000 6000 30  0001 C CNN
F 1 "GND" H 6000 5930 30  0001 C CNN
F 2 "" H 6000 6000 60  0000 C CNN
F 3 "" H 6000 6000 60  0000 C CNN
	1    6000 6000
	1    0    0    -1  
$EndComp
$Comp
L Resistor R21
U 1 1 5469A81C
P 4950 4900
F 0 "R21" V 5030 4900 40  0000 C CNN
F 1 "10" V 4957 4901 40  0000 C CNN
F 2 "Ruwai:Resistor_SMD0805_ReflowWave" V 4880 4900 30  0001 C CNN
F 3 "" V 5030 4900 30  0000 C CNN
F 4 "Yageo" H 4950 4400 60  0001 L CNN "Manu"
F 5 "RC0805FR-0710RL" H 4950 4300 60  0001 L CNN "Manu#"
F 6 "0805" H 4950 4200 60  0001 L CNN "Package"
F 7 "Custom Description" H 4950 4100 60  0001 L CNN "Desc"
	1    4950 4900
	0    1    1    0   
$EndComp
$Comp
L inductor L5
U 1 1 5469A82A
P 3150 4900
F 0 "L5" H 3150 4950 40  0000 C BNN
F 1 "10uH" H 3150 4850 40  0000 C CNN
F 2 "Ruwai:Inductor_SMD0805_ReflowWave" H 3050 4900 60  0001 C CNN
F 3 "" H 3050 4900 60  0000 C CNN
F 4 "Taiyo Yuden" H 3150 4900 60  0001 C CNN "Manu"
F 5 "BRL2012T100M" H 3150 4900 60  0001 C CNN "Manu#"
F 6 "0805" H 3150 4900 60  0001 C CNN "Package"
F 7 "Custom description" H 3150 4900 60  0001 C CNN "Desc"
	1    3150 4900
	1    0    0    -1  
$EndComp
Wire Wire Line
	3900 2900 3900 3100
Wire Wire Line
	4250 2900 4250 3100
Wire Wire Line
	5000 2950 5000 3100
Wire Wire Line
	6650 2900 6650 3100
Wire Wire Line
	7050 2900 7050 3100
Wire Wire Line
	7800 2950 7800 3100
Wire Wire Line
	5150 2200 5000 2200
Wire Wire Line
	5000 1700 5000 2450
Wire Wire Line
	5000 1700 4900 1700
Connection ~ 5000 2200
Wire Wire Line
	5150 2100 4750 2100
Wire Wire Line
	4750 2100 4750 3100
Wire Wire Line
	4250 1700 4250 2500
Wire Wire Line
	4250 1700 4400 1700
Wire Wire Line
	3700 2000 5150 2000
Connection ~ 4250 2000
Wire Wire Line
	3900 2500 3900 2000
Connection ~ 3900 2000
Wire Wire Line
	3100 2000 3300 2000
Wire Wire Line
	6450 2200 6650 2200
Wire Wire Line
	6650 2200 6650 2500
Wire Wire Line
	6450 2000 7250 2000
Wire Wire Line
	7650 2000 7800 2000
Wire Wire Line
	7800 2000 7800 2450
Wire Wire Line
	7050 1850 7050 2500
Connection ~ 7050 2000
Wire Wire Line
	7050 1350 7050 1200
Wire Wire Line
	7050 1200 7300 1200
Wire Wire Line
	5350 5800 5350 6000
Wire Wire Line
	5700 5800 5700 6000
Wire Wire Line
	7550 5800 7550 6000
Wire Wire Line
	7850 5800 7850 6000
Wire Wire Line
	8500 5850 8500 6000
Wire Wire Line
	7400 5100 7550 5100
Wire Wire Line
	7550 5100 7550 5400
Wire Wire Line
	7400 4900 8000 4900
Wire Wire Line
	8500 4900 8500 5350
Wire Wire Line
	7850 4750 7850 5400
Connection ~ 7850 4900
Wire Wire Line
	7850 4250 7850 4100
Wire Wire Line
	7850 4100 8100 4100
Wire Wire Line
	8400 4900 8500 4900
Wire Wire Line
	6100 5100 6000 5100
Wire Wire Line
	6000 5000 6000 6000
Wire Wire Line
	6100 5000 6000 5000
Connection ~ 6000 5100
Wire Wire Line
	5700 4900 5700 5400
Wire Wire Line
	5200 4900 6100 4900
Wire Wire Line
	5350 5400 5350 4900
Connection ~ 5700 4900
Connection ~ 5350 4900
Wire Wire Line
	4450 4900 4700 4900
Wire Wire Line
	2600 4900 2950 4900
Wire Wire Line
	3350 4900 3500 4900
Wire Wire Line
	3900 4900 4050 4900
$Comp
L TPS79118 U4
U 1 1 5469AEDD
P 6750 5000
F 0 "U4" H 6450 4750 60  0000 C CNN
F 1 "TPS79118" H 6600 5250 60  0000 C CNN
F 2 "Ruwai:SOT23-5" H 7100 4750 60  0001 C CNN
F 3 "" H 6800 4950 60  0000 C CNN
F 4 "Texas Instruments" H 6750 4600 60  0001 L CNN "Manu"
F 5 "TPS79118DBVT" H 6750 4500 60  0001 L CNN "Manu#"
F 6 "SOT23 5-pin" H 6750 4400 60  0001 L CNN "Package"
F 7 "Single Output LDO, 100mA, Fixed(1.8V), High PSRR, Low Noise " H 6750 4300 60  0001 L CNN "Desc"
	1    6750 5000
	1    0    0    -1  
$EndComp
Text HLabel 3100 2000 0    60   Input ~ 0
5.1V
Text HLabel 2600 4900 0    60   Input ~ 0
5.1V
Text HLabel 7300 1200 2    60   Output ~ 0
5V_ADC
Text HLabel 8100 4100 2    60   Output ~ 0
1.8V_ADC
$Comp
L PWR_FLAG #FLG069
U 1 1 546E397D
P 7200 1150
F 0 "#FLG069" H 7200 1245 30  0001 C CNN
F 1 "PWR_FLAG" H 7200 1330 30  0000 C CNN
F 2 "" H 7200 1150 60  0000 C CNN
F 3 "" H 7200 1150 60  0000 C CNN
	1    7200 1150
	1    0    0    -1  
$EndComp
Wire Wire Line
	7200 1150 7200 1200
Connection ~ 7200 1200
$Comp
L PWR_FLAG #FLG070
U 1 1 546E3B0D
P 8000 4050
F 0 "#FLG070" H 8000 4145 30  0001 C CNN
F 1 "PWR_FLAG" H 8000 4230 30  0000 C CNN
F 2 "" H 8000 4050 60  0000 C CNN
F 3 "" H 8000 4050 60  0000 C CNN
	1    8000 4050
	1    0    0    -1  
$EndComp
Wire Wire Line
	8000 4050 8000 4100
Connection ~ 8000 4100
$Comp
L PWR_FLAG #FLG071
U 1 1 546E7468
P 5150 1900
F 0 "#FLG071" H 5150 1995 30  0001 C CNN
F 1 "PWR_FLAG" H 5150 2080 30  0000 C CNN
F 2 "" H 5150 1900 60  0000 C CNN
F 3 "" H 5150 1900 60  0000 C CNN
	1    5150 1900
	1    0    0    -1  
$EndComp
Wire Wire Line
	5150 2000 5150 1900
$Comp
L PWR_FLAG #FLG072
U 1 1 546E7554
P 6000 4800
F 0 "#FLG072" H 6000 4895 30  0001 C CNN
F 1 "PWR_FLAG" H 6000 4980 30  0000 C CNN
F 2 "" H 6000 4800 60  0000 C CNN
F 3 "" H 6000 4800 60  0000 C CNN
	1    6000 4800
	1    0    0    -1  
$EndComp
Wire Wire Line
	6000 4800 6000 4900
Connection ~ 6000 4900
$Comp
L LED D4
U 1 1 546CBD35
P 7450 2000
F 0 "D4" H 7425 2085 40  0000 C CNN
F 1 "LED green" H 7450 1910 40  0000 C CNN
F 2 "Ruwai:LED-0805" H 7450 2000 60  0001 C CNN
F 3 "" H 7450 2000 60  0000 C CNN
F 4 "Knightbright" H 7450 2000 60  0001 C CNN "Manu"
F 5 "KP-2012SGC" H 7450 2000 60  0001 C CNN "Manu#"
F 6 "0805" H 7450 2000 60  0001 C CNN "Package"
F 7 "LED green" H 7450 2000 60  0001 C CNN "Desc"
	1    7450 2000
	1    0    0    -1  
$EndComp
$Comp
L LED D2
U 1 1 546CC06C
P 8200 4900
F 0 "D2" H 8175 4985 40  0000 C CNN
F 1 "LED green" H 8200 4810 40  0000 C CNN
F 2 "Ruwai:LED-0805" H 8200 4900 60  0001 C CNN
F 3 "" H 8200 4900 60  0000 C CNN
F 4 "Knightbright" H 8200 4900 60  0001 C CNN "Manu"
F 5 "KP-2012SGC" H 8200 4900 60  0001 C CNN "Manu#"
F 6 "0805" H 8200 4900 60  0001 C CNN "Package"
F 7 "LED green" H 8200 4900 60  0001 C CNN "Desc"
	1    8200 4900
	1    0    0    -1  
$EndComp
$Comp
L DIODE D8
U 1 1 546E7974
P 3700 4900
F 0 "D8" H 3700 5000 40  0000 C CNN
F 1 "S1K" H 3700 4800 40  0000 C CNN
F 2 "Ruwai:diode_SMA_reflow" H 3700 4900 60  0001 C CNN
F 3 "" H 3700 4900 60  0000 C CNN
F 4 "Taiwan Semiconductor" H 3700 4900 60  0001 C CNN "Manu"
F 5 "HS1K R3" H 3700 4900 60  0001 C CNN "Manu#"
F 6 "SMA" H 3700 4900 60  0001 C CNN "Package"
F 7 "Custom description." H 3700 4900 60  0001 C CNN "Desc"
	1    3700 4900
	1    0    0    -1  
$EndComp
$Comp
L DIODE D9
U 1 1 546E7AD6
P 4250 4900
F 0 "D9" H 4250 5000 40  0000 C CNN
F 1 "S1K" H 4250 4800 40  0000 C CNN
F 2 "Ruwai:diode_SMA_reflow" H 4250 4900 60  0001 C CNN
F 3 "" H 4250 4900 60  0000 C CNN
F 4 "Taiwan Semiconductor" H 4250 4900 60  0001 C CNN "Manu"
F 5 "HS1K R3" H 4250 4900 60  0001 C CNN "Manu#"
F 6 "SMA" H 4250 4900 60  0001 C CNN "Package"
F 7 "Custom description." H 4250 4900 60  0001 C CNN "Desc"
	1    4250 4900
	1    0    0    -1  
$EndComp
$EndSCHEMATC
