(module Traco_THL_10WI (layer F.Cu) (tedit 54D729D2)
  (fp_text reference THL_10WI (at -9.4 -13.6) (layer F.SilkS)
    (effects (font (size 1 1) (thickness 0.15)))
  )
  (fp_text value VAL** (at -8.89 13.97) (layer F.SilkS)
    (effects (font (size 1.5 1.5) (thickness 0.15)))
  )
  (fp_line (start -12.7 12.7) (end -12.7 -12.7) (layer F.CrtYd) (width 0.15))
  (fp_line (start 12.7 12.7) (end -12.7 12.7) (layer F.CrtYd) (width 0.15))
  (fp_line (start 12.7 -12.7) (end 12.7 12.7) (layer F.CrtYd) (width 0.15))
  (fp_line (start -12.7 -12.7) (end 12.7 -12.7) (layer F.CrtYd) (width 0.15))
  (fp_line (start -12.7 -12.7) (end -12.7 12.7) (layer F.SilkS) (width 0.3))
  (fp_line (start -12.7 12.7) (end 12.7 12.7) (layer F.SilkS) (width 0.3))
  (fp_line (start 12.7 12.7) (end 12.7 -12.7) (layer F.SilkS) (width 0.3))
  (fp_line (start 12.7 -12.7) (end -12.7 -12.7) (layer F.SilkS) (width 0.3))
  (pad 4 thru_hole circle (at 0 10.16) (size 2.5 2.5) (drill 1.2) (layers *.Cu *.Mask F.SilkS))
  (pad 5 thru_hole circle (at 10.16 10.16) (size 2.5 2.5) (drill 1.2) (layers *.Cu *.Mask F.SilkS))
  (pad 3 thru_hole circle (at -10.16 10.16) (size 2.5 2.5) (drill 1.2) (layers *.Cu *.Mask F.SilkS))
  (pad 6 thru_hole circle (at 10.16 -10.16) (size 2.5 2.5) (drill 1.2) (layers *.Cu *.Mask F.SilkS))
  (pad 2 thru_hole circle (at 2.54 -10.16) (size 2.5 2.5) (drill 1.2) (layers *.Cu *.Mask F.SilkS))
  (pad 1 thru_hole circle (at -2.54 -10.16) (size 2.5 2.5) (drill 1.2) (layers *.Cu *.Mask F.SilkS))
)
