"ref","value","manufacturer","manufacturer part number","description","quantity"
"C-SENS1","connector","Samtec","ACPK-16-02-G-S-M-1","Acclimate IP68 Sealed Circular Plug Cable Assembly, 16 mm Shell, Field Termination Kit, Socket, Orange",1
"C-SENS2","connector","Samtec","DCA-ACP-16-M-1","Acclimate Dustcap for ACP-16, Orange",1
