EESchema Schematic File Version 2
LIBS:power_supply_shield-rescue
LIBS:ruwai
LIBS:power
LIBS:device
LIBS:transistors
LIBS:conn
LIBS:linear
LIBS:regul
LIBS:74xx
LIBS:cmos4000
LIBS:adc-dac
LIBS:memory
LIBS:xilinx
LIBS:microcontrollers
LIBS:dsp
LIBS:microchip
LIBS:analog_switches
LIBS:motorola
LIBS:texas
LIBS:intel
LIBS:audio
LIBS:interface
LIBS:digital-audio
LIBS:philips
LIBS:display
LIBS:cypress
LIBS:siliconi
LIBS:opto
LIBS:atmel
LIBS:contrib
LIBS:valves
LIBS:power_supply_shield-cache
EELAYER 25 0
EELAYER END
$Descr A4 11693 8268
encoding utf-8
Sheet 2 4
Title "Ruwai ADC Main Shield"
Date "2017-09-17"
Rev "3"
Comp "Copyright Mertl Research GmbH 2014 "
Comment1 ""
Comment2 ""
Comment3 ""
Comment4 "This documentation describes Open Hardware and is licensed under the CERN OHL v. 1.2."
$EndDescr
$Comp
L ferrite_bead L23
U 1 1 5480677D
P 7100 1400
F 0 "L23" H 6970 1450 40  0000 L BNN
F 1 "600" H 7230 1300 40  0000 R BNN
F 2 "Ruwai:Inductor_SMD0805_ReflowWave" H 7100 1330 30  0001 C CNN
F 3 "" H 7100 1480 30  0000 C CNN
F 4 "Murata" H 7100 1150 60  0001 L CNN "Manu"
F 5 "BLM21BD601SN1D" H 7100 1050 60  0001 L CNN "Manu#"
F 6 "0805" H 7100 950 60  0001 L CNN "Package"
F 7 "Custom Description" H 7100 850 60  0001 L CNN "Desc"
	1    7100 1400
	1    0    0    -1  
$EndComp
$Comp
L PGA_GND #PWR01
U 1 1 548069C6
P 7550 1700
F 0 "#PWR01" H 7550 1700 40  0001 C CNN
F 1 "PGA_GND" H 7550 1630 40  0000 C CNN
F 2 "" H 7550 1700 60  0000 C CNN
F 3 "" H 7550 1700 60  0000 C CNN
	1    7550 1700
	1    0    0    -1  
$EndComp
NoConn ~ 6550 1800
NoConn ~ 6550 1900
NoConn ~ 6550 2100
$Comp
L Capacitor C13
U 1 1 54806D6C
P 7500 2600
F 0 "C13" H 7500 2700 40  0000 L CNN
F 1 "10uF" H 7506 2515 40  0000 L CNN
F 2 "Ruwai:Capacitor_SMD1206_ReflowWave" H 7538 2450 30  0001 C CNN
F 3 "" H 7500 2700 60  0000 C CNN
F 4 "Murata" H 7550 2200 60  0001 L CNN "Manu"
F 5 "GRM31CR71E106KA12L" H 7550 2100 60  0001 L CNN "Manu#"
F 6 "1206" H 7550 2000 60  0001 L CNN "Package"
F 7 "Custom Description" H 7500 2250 60  0001 L CNN "Desc"
	1    7500 2600
	1    0    0    -1  
$EndComp
$Comp
L Capacitor C12
U 1 1 54806DD7
P 2350 2100
F 0 "C12" H 2350 2200 40  0000 L CNN
F 1 "10uF" H 2356 2015 40  0000 L CNN
F 2 "Ruwai:Capacitor_SMD1206_ReflowWave" H 2388 1950 30  0001 C CNN
F 3 "" H 2350 2200 60  0000 C CNN
F 4 "Murata" H 2400 1700 60  0001 L CNN "Manu"
F 5 "GRM31CR71E106KA12L" H 2400 1600 60  0001 L CNN "Manu#"
F 6 "1206" H 2400 1500 60  0001 L CNN "Package"
F 7 "Custom Description" H 2350 1750 60  0001 L CNN "Desc"
	1    2350 2100
	1    0    0    -1  
$EndComp
$Comp
L Resistor R10
U 1 1 54806E05
P 2700 1800
F 0 "R10" V 2780 1800 40  0000 C CNN
F 1 "10m" V 2707 1801 40  0000 C CNN
F 2 "Ruwai:Resistor_SMD1206_ReflowWave" V 2630 1800 30  0001 C CNN
F 3 "" V 2780 1800 30  0000 C CNN
F 4 "Panasonic" H 2700 1300 60  0001 L CNN "Manu"
F 5 "ERJMP2MF10MU" H 2700 1200 60  0001 L CNN "Manu#"
F 6 "1206" H 2700 1100 60  0001 L CNN "Package"
F 7 "Custom Description" H 2700 1000 60  0001 L CNN "Desc"
	1    2700 1800
	0    -1   -1   0   
$EndComp
$Comp
L GND-RESCUE-power_supply_shield #PWR02
U 1 1 54806EF6
P 7500 2950
F 0 "#PWR02" H 7500 2950 30  0001 C CNN
F 1 "GND" H 7500 2880 30  0001 C CNN
F 2 "" H 7500 2950 60  0000 C CNN
F 3 "" H 7500 2950 60  0000 C CNN
	1    7500 2950
	1    0    0    -1  
$EndComp
$Comp
L GND-RESCUE-power_supply_shield #PWR03
U 1 1 5480733B
P 2350 2400
F 0 "#PWR03" H 2350 2400 30  0001 C CNN
F 1 "GND" H 2350 2330 30  0001 C CNN
F 2 "" H 2350 2400 60  0000 C CNN
F 3 "" H 2350 2400 60  0000 C CNN
	1    2350 2400
	1    0    0    -1  
$EndComp
Text HLabel 7700 1400 2    60   Input ~ 0
+15V_PGA
Text HLabel 7700 1600 2    60   Input ~ 0
-15V_PGA
Text HLabel 8000 2300 2    60   Input ~ 0
5.1V
Text HLabel 2100 1800 0    60   Input ~ 0
5.1V
NoConn ~ 3350 1400
NoConn ~ 3350 1500
NoConn ~ 3350 1600
NoConn ~ 3350 1700
$Comp
L GND-RESCUE-power_supply_shield #PWR04
U 1 1 548079C2
P 3150 2400
F 0 "#PWR04" H 3150 2400 30  0001 C CNN
F 1 "GND" H 3150 2330 30  0001 C CNN
F 2 "" H 3150 2400 60  0000 C CNN
F 3 "" H 3150 2400 60  0000 C CNN
	1    3150 2400
	1    0    0    -1  
$EndComp
NoConn ~ 3350 2500
NoConn ~ 3350 2600
NoConn ~ 3350 2700
NoConn ~ 3350 2800
NoConn ~ 3350 2900
NoConn ~ 3350 3000
NoConn ~ 3350 3100
NoConn ~ 3350 3200
NoConn ~ 3350 3400
NoConn ~ 3350 3500
NoConn ~ 3350 3600
NoConn ~ 3350 3700
NoConn ~ 3350 3800
NoConn ~ 3350 3900
NoConn ~ 3350 4000
NoConn ~ 3350 4100
$Comp
L GND-RESCUE-power_supply_shield #PWR05
U 1 1 54807BB6
P 3150 4700
F 0 "#PWR05" H 3150 4700 30  0001 C CNN
F 1 "GND" H 3150 4630 30  0001 C CNN
F 2 "" H 3150 4700 60  0000 C CNN
F 3 "" H 3150 4700 60  0000 C CNN
	1    3150 4700
	1    0    0    -1  
$EndComp
NoConn ~ 3350 4800
NoConn ~ 3350 4900
NoConn ~ 3350 5000
NoConn ~ 3350 5100
NoConn ~ 3350 5200
NoConn ~ 3350 5300
NoConn ~ 3350 5400
NoConn ~ 3350 5500
NoConn ~ 3350 5600
NoConn ~ 3350 5700
NoConn ~ 3350 5800
NoConn ~ 3350 5900
NoConn ~ 3350 6000
NoConn ~ 3350 6100
NoConn ~ 3350 6200
NoConn ~ 3350 6300
NoConn ~ 6550 6300
NoConn ~ 6550 6100
NoConn ~ 6550 6000
NoConn ~ 6550 5900
NoConn ~ 6550 5800
NoConn ~ 6550 5700
NoConn ~ 6550 5600
NoConn ~ 6550 5500
NoConn ~ 6550 5400
NoConn ~ 6550 5300
NoConn ~ 6550 5200
NoConn ~ 6550 5100
NoConn ~ 6550 5000
NoConn ~ 6550 4900
NoConn ~ 6550 4800
$Comp
L ferrite_bead L4
U 1 1 54807E3A
P 7100 4350
F 0 "L4" H 6970 4400 40  0000 L BNN
F 1 "220" H 7230 4250 40  0000 R BNN
F 2 "Ruwai:Inductor_SMD0805_ReflowWave" H 7100 4280 30  0001 C CNN
F 3 "" H 7100 4430 30  0000 C CNN
F 4 "Murata" H 7100 4100 60  0001 L CNN "Manu"
F 5 "BLM21PG221SN1D" H 7100 4000 60  0001 L CNN "Manu#"
F 6 "0805" H 7100 3900 60  0001 L CNN "Package"
F 7 "Custom Description" H 7100 3800 60  0001 L CNN "Desc"
	1    7100 4350
	1    0    0    -1  
$EndComp
$Comp
L Capacitor C20
U 1 1 548082A1
P 8200 4650
F 0 "C20" H 8200 4750 40  0000 L CNN
F 1 "10uF" H 8206 4565 40  0000 L CNN
F 2 "Ruwai:Capacitor_SMD1206_ReflowWave" H 8238 4500 30  0001 C CNN
F 3 "" H 8200 4750 60  0000 C CNN
F 4 "Murata" H 8250 4250 60  0001 L CNN "Manu"
F 5 "GRM31CR71E106KA12L" H 8250 4150 60  0001 L CNN "Manu#"
F 6 "1206" H 8250 4050 60  0001 L CNN "Package"
F 7 "Custom Description" H 8200 4300 60  0001 L CNN "Desc"
	1    8200 4650
	1    0    0    -1  
$EndComp
$Comp
L GND-RESCUE-power_supply_shield #PWR06
U 1 1 54808337
P 8200 4950
F 0 "#PWR06" H 8200 4950 30  0001 C CNN
F 1 "GND" H 8200 4880 30  0001 C CNN
F 2 "" H 8200 4950 60  0000 C CNN
F 3 "" H 8200 4950 60  0000 C CNN
	1    8200 4950
	1    0    0    -1  
$EndComp
Text HLabel 8350 4350 2    60   Input ~ 0
5.1V
NoConn ~ 6550 4100
NoConn ~ 6550 4000
NoConn ~ 6550 3900
NoConn ~ 6550 3800
NoConn ~ 6550 3700
NoConn ~ 6550 3600
$Comp
L RUWAI_POWER_SUPPLY_SHIELD SHIELD1
U 1 1 5480C217
P 4950 3800
F 0 "SHIELD1" H 3850 1150 60  0000 C CNN
F 1 "RUWAI_POWER_SUPPLY_SHIELD" H 4350 6400 60  0000 C CNN
F 2 "Ruwai:RUWAI_POWER_SUPPLY_SHIELD" H 4950 1150 60  0001 L CNN
F 3 "" H 4950 3800 60  0000 C CNN
F 4 "Manufacturer" H 4950 1000 60  0001 L CNN "Manu"
F 5 "Manufacturer part number" H 4950 900 60  0001 L CNN "Manu#"
F 6 "The package of the part." H 4950 800 60  0001 L CNN "Package"
F 7 "Custom Description" H 4950 700 60  0001 L CNN "Desc"
	1    4950 3800
	1    0    0    -1  
$EndComp
NoConn ~ 6550 3500
NoConn ~ 6550 3400
$Comp
L testpoint TP18
U 1 1 5480D129
P 2150 1200
F 0 "TP18" H 2080 1070 60  0000 C CNN
F 1 "5.1V" H 2080 1340 60  0000 C CNN
F 2 "Ruwai:testpoint_1" H 2150 1200 60  0001 C CNN
F 3 "" H 2150 1200 60  0000 C CNN
F 4 "RS" H 2150 900 60  0001 L CNN "Manu"
F 5 "200-101" H 2150 800 60  0001 L CNN "Manu#"
F 6 "1mm" H 2150 700 60  0001 L CNN "Package"
F 7 "Custom Description" H 2150 600 60  0001 L CNN "Desc"
	1    2150 1200
	1    0    0    -1  
$EndComp
$Comp
L testpoint TP17
U 1 1 5480D5CB
P 2900 1200
F 0 "TP17" H 2830 1070 60  0000 C CNN
F 1 "5.1V_ARD" H 2830 1340 60  0000 C CNN
F 2 "Ruwai:testpoint_1" H 2900 1200 60  0001 C CNN
F 3 "" H 2900 1200 60  0000 C CNN
F 4 "RS" H 2900 900 60  0001 L CNN "Manu"
F 5 "200-101" H 2900 800 60  0001 L CNN "Manu#"
F 6 "1mm" H 2900 700 60  0001 L CNN "Package"
F 7 "Custom Description" H 2900 600 60  0001 L CNN "Desc"
	1    2900 1200
	1    0    0    -1  
$EndComp
$Comp
L testpoint TP11
U 1 1 5480DBA2
P 2800 2100
F 0 "TP11" H 2730 1970 60  0000 C CNN
F 1 "VIN" H 2730 2240 60  0000 C CNN
F 2 "Ruwai:testpoint_1" H 2800 2100 60  0001 C CNN
F 3 "" H 2800 2100 60  0000 C CNN
F 4 "RS" H 2800 1800 60  0001 L CNN "Manu"
F 5 "200-101" H 2800 1700 60  0001 L CNN "Manu#"
F 6 "1mm" H 2800 1600 60  0001 L CNN "Package"
F 7 "Custom Description" H 2800 1500 60  0001 L CNN "Desc"
	1    2800 2100
	1    0    0    -1  
$EndComp
$Comp
L GND-RESCUE-power_supply_shield #PWR07
U 1 1 548069F5
P 7000 2150
F 0 "#PWR07" H 7000 2150 30  0001 C CNN
F 1 "GND" H 7000 2080 30  0001 C CNN
F 2 "" H 7000 2150 60  0000 C CNN
F 3 "" H 7000 2150 60  0000 C CNN
	1    7000 2150
	1    0    0    -1  
$EndComp
$Comp
L testpoint TP1
U 1 1 5480E349
P 7700 2050
F 0 "TP1" H 7630 1920 60  0000 C CNN
F 1 "5.1V" H 7630 2190 60  0000 C CNN
F 2 "Ruwai:testpoint_1" H 7700 2050 60  0001 C CNN
F 3 "" H 7700 2050 60  0000 C CNN
F 4 "RS" H 7700 1750 60  0001 L CNN "Manu"
F 5 "200-101" H 7700 1650 60  0001 L CNN "Manu#"
F 6 "1mm" H 7700 1550 60  0001 L CNN "Package"
F 7 "Custom Description" H 7700 1450 60  0001 L CNN "Desc"
	1    7700 2050
	-1   0    0    1   
$EndComp
$Comp
L Resistor R9
U 1 1 54840C1F
P 7100 2300
F 0 "R9" V 7180 2300 40  0000 C CNN
F 1 "10m" V 7107 2301 40  0000 C CNN
F 2 "Ruwai:Resistor_SMD1206_ReflowWave" V 7030 2300 30  0001 C CNN
F 3 "" V 7180 2300 30  0000 C CNN
F 4 "Panasonic" H 7100 1800 60  0001 L CNN "Manu"
F 5 "ERJMP2MF10MU" H 7100 1700 60  0001 L CNN "Manu#"
F 6 "1206" H 7100 1600 60  0001 L CNN "Package"
F 7 "Custom Description" H 7100 1500 60  0001 L CNN "Desc"
	1    7100 2300
	0    -1   -1   0   
$EndComp
$Comp
L Resistor R6
U 1 1 54840ECF
P 7850 4350
F 0 "R6" V 7930 4350 40  0000 C CNN
F 1 "10m" V 7857 4351 40  0000 C CNN
F 2 "Ruwai:Resistor_SMD1206_ReflowWave" V 7780 4350 30  0001 C CNN
F 3 "" V 7930 4350 30  0000 C CNN
F 4 "Panasonic" H 7850 3850 60  0001 L CNN "Manu"
F 5 "ERJMP2MF10MU" H 7850 3750 60  0001 L CNN "Manu#"
F 6 "1206" H 7850 3650 60  0001 L CNN "Package"
F 7 "Custom Description" H 7850 3550 60  0001 L CNN "Desc"
	1    7850 4350
	0    -1   -1   0   
$EndComp
$Comp
L ferrite_bead L24
U 1 1 5484131B
P 7100 1600
F 0 "L24" H 6970 1650 40  0000 L BNN
F 1 "600" H 7230 1500 40  0000 R BNN
F 2 "Ruwai:Inductor_SMD0805_ReflowWave" H 7100 1530 30  0001 C CNN
F 3 "" H 7100 1680 30  0000 C CNN
F 4 "Murata" H 7100 1350 60  0001 L CNN "Manu"
F 5 "BLM21BD601SN1D" H 7100 1250 60  0001 L CNN "Manu#"
F 6 "0805" H 7100 1150 60  0001 L CNN "Package"
F 7 "Custom Description" H 7100 1050 60  0001 L CNN "Desc"
	1    7100 1600
	1    0    0    -1  
$EndComp
$Comp
L ferrite_bead L9
U 1 1 54841775
P 7100 4600
F 0 "L9" H 6970 4650 40  0000 L BNN
F 1 "220" H 7230 4500 40  0000 R BNN
F 2 "Ruwai:Inductor_SMD0805_ReflowWave" H 7100 4530 30  0001 C CNN
F 3 "" H 7100 4680 30  0000 C CNN
F 4 "Murata" H 7100 4350 60  0001 L CNN "Manu"
F 5 "BLM21PG221SN1D" H 7100 4250 60  0001 L CNN "Manu#"
F 6 "0805" H 7100 4150 60  0001 L CNN "Package"
F 7 "Custom Description" H 7100 4050 60  0001 L CNN "Desc"
	1    7100 4600
	1    0    0    -1  
$EndComp
Text HLabel 7100 6200 2    60   Input ~ 0
temp
$Comp
L PWR_FLAG #FLG08
U 1 1 54850946
P 3250 1200
F 0 "#FLG08" H 3250 1295 30  0001 C CNN
F 1 "PWR_FLAG" H 3250 1380 30  0000 C CNN
F 2 "" H 3250 1200 60  0000 C CNN
F 3 "" H 3250 1200 60  0000 C CNN
	1    3250 1200
	0    1    1    0   
$EndComp
Wire Wire Line
	6750 1700 6750 2200
Connection ~ 6750 2100
Wire Wire Line
	6550 1400 6900 1400
Wire Wire Line
	7300 1400 7700 1400
Wire Wire Line
	6550 1600 6900 1600
Wire Wire Line
	7300 1600 7700 1600
Wire Wire Line
	6550 1500 7550 1500
Wire Wire Line
	7550 1500 7550 1700
Wire Wire Line
	6550 1700 6750 1700
Wire Wire Line
	6550 2300 6850 2300
Wire Wire Line
	7350 2300 8000 2300
Wire Wire Line
	7500 2050 7500 2400
Connection ~ 7500 2300
Wire Wire Line
	7500 2800 7500 2950
Wire Wire Line
	2950 1800 3350 1800
Wire Wire Line
	2100 1800 2450 1800
Wire Wire Line
	2350 1200 2350 1900
Connection ~ 2350 1800
Wire Wire Line
	2350 2300 2350 2400
Wire Wire Line
	3350 2000 3150 2000
Wire Wire Line
	3150 1900 3150 2400
Wire Wire Line
	3350 1900 3150 1900
Connection ~ 3150 2000
Wire Wire Line
	3350 4500 3150 4500
Wire Wire Line
	3150 4500 3150 4700
Wire Wire Line
	3350 4600 3150 4600
Connection ~ 3150 4600
Wire Wire Line
	6550 4500 6700 4500
Wire Wire Line
	6700 4500 6700 4350
Wire Wire Line
	6700 4350 6900 4350
Wire Wire Line
	6550 4600 6900 4600
Wire Wire Line
	7450 4600 7300 4600
Wire Wire Line
	7450 3850 7450 4600
Wire Wire Line
	7300 4350 7600 4350
Connection ~ 7450 4350
Wire Wire Line
	8100 4350 8350 4350
Wire Wire Line
	8200 4950 8200 4850
Wire Wire Line
	8200 3850 8200 4450
Connection ~ 8200 4350
Connection ~ 3100 1800
Wire Wire Line
	6750 2200 6550 2200
Wire Wire Line
	7000 2100 7000 2150
Wire Wire Line
	7500 2050 7600 2050
Wire Wire Line
	2350 1200 2250 1200
Wire Wire Line
	3000 1200 3250 1200
Wire Wire Line
	3100 1200 3100 1800
Wire Wire Line
	6750 2100 7000 2100
Wire Wire Line
	2900 2100 3350 2100
Wire Wire Line
	6550 2000 6750 2000
Connection ~ 6750 2000
Wire Wire Line
	6550 6200 7100 6200
Connection ~ 3100 1200
$Comp
L PWR_FLAG #FLG09
U 1 1 54851029
P 6800 4200
F 0 "#FLG09" H 6800 4295 30  0001 C CNN
F 1 "PWR_FLAG" H 6800 4380 30  0000 C CNN
F 2 "" H 6800 4200 60  0000 C CNN
F 3 "" H 6800 4200 60  0000 C CNN
	1    6800 4200
	1    0    0    -1  
$EndComp
$Comp
L PWR_FLAG #FLG010
U 1 1 5485104E
P 6800 4750
F 0 "#FLG010" H 6800 4845 30  0001 C CNN
F 1 "PWR_FLAG" H 6800 4930 30  0000 C CNN
F 2 "" H 6800 4750 60  0000 C CNN
F 3 "" H 6800 4750 60  0000 C CNN
	1    6800 4750
	-1   0    0    1   
$EndComp
Wire Wire Line
	6800 4200 6800 4350
Connection ~ 6800 4350
Wire Wire Line
	6800 4750 6800 4600
Connection ~ 6800 4600
$Comp
L PWR_FLAG #FLG011
U 1 1 5485117E
P 3000 2400
F 0 "#FLG011" H 3000 2495 30  0001 C CNN
F 1 "PWR_FLAG" H 3000 2580 30  0000 C CNN
F 2 "" H 3000 2400 60  0000 C CNN
F 3 "" H 3000 2400 60  0000 C CNN
	1    3000 2400
	-1   0    0    1   
$EndComp
Wire Wire Line
	3000 2400 3000 2100
Connection ~ 3000 2100
$Comp
L testpoint TP5
U 1 1 548474D9
P 7700 3850
F 0 "TP5" H 7630 3720 60  0000 C CNN
F 1 "5.1V_S1" H 7630 3990 60  0000 C CNN
F 2 "Ruwai:testpoint_1" H 7700 3850 60  0001 C CNN
F 3 "" H 7700 3850 60  0000 C CNN
F 4 "RS" H 7700 3550 60  0001 L CNN "Manu"
F 5 "200-101" H 7700 3450 60  0001 L CNN "Manu#"
F 6 "1mm" H 7700 3350 60  0001 L CNN "Package"
F 7 "Custom Description" H 7700 3250 60  0001 L CNN "Desc"
	1    7700 3850
	-1   0    0    1   
$EndComp
$Comp
L testpoint TP14
U 1 1 5484757F
P 8450 3850
F 0 "TP14" H 8380 3720 60  0000 C CNN
F 1 "5.1V" H 8380 3990 60  0000 C CNN
F 2 "Ruwai:testpoint_1" H 8450 3850 60  0001 C CNN
F 3 "" H 8450 3850 60  0000 C CNN
F 4 "RS" H 8450 3550 60  0001 L CNN "Manu"
F 5 "200-101" H 8450 3450 60  0001 L CNN "Manu#"
F 6 "1mm" H 8450 3350 60  0001 L CNN "Package"
F 7 "Custom Description" H 8450 3250 60  0001 L CNN "Desc"
	1    8450 3850
	-1   0    0    1   
$EndComp
Wire Wire Line
	7450 3850 7600 3850
Wire Wire Line
	8200 3850 8350 3850
Connection ~ 6650 2300
Wire Wire Line
	6650 2300 6650 2700
Wire Wire Line
	6650 2700 6750 2700
$Comp
L testpoint TP16
U 1 1 5480DE2F
P 6850 2700
F 0 "TP16" H 6780 2570 60  0000 C CNN
F 1 "S-PLUS" H 6780 2840 60  0000 C CNN
F 2 "Ruwai:testpoint_1" H 6850 2700 60  0001 C CNN
F 3 "" H 6850 2700 60  0000 C CNN
F 4 "RS" H 6850 2400 60  0001 L CNN "Manu"
F 5 "200-101" H 6850 2300 60  0001 L CNN "Manu#"
F 6 "1mm" H 6850 2200 60  0001 L CNN "Package"
F 7 "Custom Description" H 6850 2100 60  0001 L CNN "Desc"
	1    6850 2700
	-1   0    0    1   
$EndComp
$Comp
L CONN_01X01 P3
U 1 1 54885BAE
P 9650 3150
F 0 "P3" H 9650 3250 50  0000 C CNN
F 1 "CONN_01X01" V 9750 3150 50  0000 C CNN
F 2 "Wire_Pads:SolderWirePad_single_1mmDrill" H 9650 3150 60  0001 C CNN
F 3 "" H 9650 3150 60  0000 C CNN
	1    9650 3150
	-1   0    0    1   
$EndComp
$Comp
L GND-RESCUE-power_supply_shield #PWR012
U 1 1 54885CE5
P 10100 3350
F 0 "#PWR012" H 10100 3350 30  0001 C CNN
F 1 "GND" H 10100 3280 30  0001 C CNN
F 2 "" H 10100 3350 60  0000 C CNN
F 3 "" H 10100 3350 60  0000 C CNN
	1    10100 3350
	1    0    0    -1  
$EndComp
Wire Wire Line
	9850 3150 10100 3150
Wire Wire Line
	10100 3150 10100 3350
Text Notes 9100 2900 0    60   ~ 0
GND for BeagleBone serial communication.\nPlace near TXD3/RXD3.\n
$EndSCHEMATC
