(module Resistor_SMD0102_HandSoldering (layer F.Cu) (tedit 54D7190B)
  (descr "Capacitor, SMD, MicroMELF, Hand soldering,")
  (tags "Capacitor, SMD, MicroMELF, Hand soldering,")
  (attr smd)
  (fp_text reference R (at 0.1 -1.7) (layer F.SilkS)
    (effects (font (size 0.65 0.65) (thickness 0.125)))
  )
  (fp_text value 0102 (at 0.20066 2.60096) (layer F.SilkS) hide
    (effects (font (thickness 0.3048)))
  )
  (fp_line (start 2.1 1.3) (end -2.1 1.3) (layer F.CrtYd) (width 0.15))
  (fp_line (start -2.1 -1.3) (end 2.1 -1.3) (layer F.CrtYd) (width 0.15))
  (fp_line (start -2.1 1.3) (end -2.1 -1.3) (layer F.CrtYd) (width 0.15))
  (fp_line (start 2.1 -1.3) (end 2.1 1.3) (layer F.CrtYd) (width 0.15))
  (fp_line (start 0 -1.143) (end -1.016 -1.143) (layer F.SilkS) (width 0.381))
  (fp_line (start 0 -1.143) (end 1.016 -1.143) (layer F.SilkS) (width 0.381))
  (fp_line (start 0 1.143) (end -1.016 1.143) (layer F.SilkS) (width 0.381))
  (fp_line (start 0 1.143) (end 1.016 1.143) (layer F.SilkS) (width 0.381))
  (pad 1 smd rect (at -1 0) (size 1.2 1.2) (layers F.Cu F.Paste F.Mask))
  (pad 2 smd rect (at 1 0) (size 1.2 1.2) (layers F.Cu F.Paste F.Mask))
  (model ${KIPRJMOD}/../../modules/packages_3d/mertl-research/res_mmu_0102/resistor_smd0102.wrl
    (at (xyz 0 0 0))
    (scale (xyz 0.3937 0.3937 0.3937))
    (rotate (xyz 0 0 0))
  )
)
