EESchema Schematic File Version 2
LIBS:ruwai
LIBS:power
LIBS:device
LIBS:transistors
LIBS:conn
LIBS:linear
LIBS:regul
LIBS:74xx
LIBS:cmos4000
LIBS:adc-dac
LIBS:memory
LIBS:xilinx
LIBS:microcontrollers
LIBS:dsp
LIBS:microchip
LIBS:analog_switches
LIBS:motorola
LIBS:texas
LIBS:intel
LIBS:audio
LIBS:interface
LIBS:digital-audio
LIBS:philips
LIBS:display
LIBS:cypress
LIBS:siliconi
LIBS:opto
LIBS:atmel
LIBS:contrib
LIBS:valves
LIBS:adc_ai_pga-cache
EELAYER 25 0
EELAYER END
$Descr A4 11693 8268
encoding utf-8
Sheet 1 6
Title "Ruwai ADC analog interface with PGA"
Date "2017-09-15"
Rev "3"
Comp "copyright Mertl Research GmbH 2014"
Comment1 ""
Comment2 ""
Comment3 ""
Comment4 "This documentation describes Open Hardware and is licensed under the CERN OHL v. 1.2."
$EndDescr
$Sheet
S 5450 1600 1050 1250
U 546F1642
F0 "channel 1" 60
F1 "channel_1.sch" 60
F2 "5V_PGA" I L 5450 1850 60 
F3 "SDA_3" I L 5450 2250 60 
F4 "SCL_3" I L 5450 2350 60 
F5 "3.3V_P" I L 5450 1750 60 
F6 "ADC_VCOM" I L 5450 2450 60 
F7 "+15V_PGA" I L 5450 2000 60 
F8 "-15V_PGA" I L 5450 2100 60 
F9 "AINP1" I L 5450 2650 60 
F10 "AINN1" I L 5450 2750 60 
F11 "PGA1_OUTP" O R 6500 2650 60 
F12 "PGA1_OUTN" O R 6500 2750 60 
$EndSheet
$Sheet
S 8750 1600 1050 1250
U 546F1649
F0 "channel 2" 60
F1 "channel_2.sch" 60
F2 "5V_PGA" I L 8750 1850 60 
F3 "SDA_3" I L 8750 2250 60 
F4 "SCL_3" I L 8750 2350 60 
F5 "3.3V_P" I L 8750 1750 60 
F6 "ADC_VCOM" I L 8750 2450 60 
F7 "+15V_PGA" I L 8750 2000 60 
F8 "-15V_PGA" I L 8750 2100 60 
F9 "PGA2_OUTP" O R 9800 2650 60 
F10 "PGA2_OUTN" O R 9800 2750 60 
F11 "AINP2" I L 8750 2650 60 
F12 "AINN2" I L 8750 2750 60 
$EndSheet
$Sheet
S 5450 4300 1050 1250
U 546F164C
F0 "channel 3" 60
F1 "channel_3.sch" 60
F2 "5V_PGA" I L 5450 4550 60 
F3 "SDA_3" I L 5450 4950 60 
F4 "SCL_3" I L 5450 5050 60 
F5 "3.3V_P" I L 5450 4450 60 
F6 "ADC_VCOM" I L 5450 5150 60 
F7 "+15V_PGA" I L 5450 4700 60 
F8 "-15V_PGA" I L 5450 4800 60 
F9 "PGA3_OUTP" O R 6500 5350 60 
F10 "PGA3_OUTN" O R 6500 5450 60 
F11 "AINP3" I L 5450 5350 60 
F12 "AINN3" I L 5450 5450 60 
$EndSheet
$Sheet
S 1650 1200 1150 2200
U 5473049E
F0 "interface" 60
F1 "interface.sch" 60
F2 "3.3V_P" O R 2800 1450 60 
F3 "SDA_3" B R 2800 1850 60 
F4 "SCL_3" O R 2800 1950 60 
F5 "+15V_PGA" O R 2800 1600 60 
F6 "-15V_PGA" O R 2800 1700 60 
F7 "ADC_VCOM" O R 2800 2050 60 
F8 "5V_PGA" O R 2800 1350 60 
F9 "CH1_P" I L 1650 2250 60 
F10 "CH1_N" I L 1650 2350 60 
F11 "CH2_P" I L 1650 2450 60 
F12 "CH2_N" I L 1650 2550 60 
F13 "CH3_P" I L 1650 2650 60 
F14 "CH3_N" I L 1650 2750 60 
F15 "CH4_P" I L 1650 2850 60 
F16 "CH4_N" I L 1650 2950 60 
F17 "AIN1_N" O R 2800 2350 60 
F18 "AIN1_P" O R 2800 2250 60 
F19 "AIN2_N" O R 2800 2550 60 
F20 "AIN2_P" O R 2800 2450 60 
F21 "AIN4_P" O R 2800 2850 60 
F22 "AIN4_N" O R 2800 2950 60 
F23 "AIN3_P" O R 2800 2650 60 
F24 "AIN3_N" O R 2800 2750 60 
$EndSheet
$Sheet
S 8750 4300 1050 1250
U 546F164F
F0 "channel 4" 60
F1 "channel_4.sch" 60
F2 "5V_PGA" I L 8750 4550 60 
F3 "SDA_3" I L 8750 4950 60 
F4 "SCL_3" I L 8750 5050 60 
F5 "3.3V_P" I L 8750 4450 60 
F6 "ADC_VCOM" I L 8750 5150 60 
F7 "+15V_PGA" I L 8750 4700 60 
F8 "-15V_PGA" I L 8750 4800 60 
F9 "PGA4_OUTP" O R 9800 5350 60 
F10 "PGA4_OUTN" O R 9800 5450 60 
F11 "AINP4" I L 8750 5350 60 
F12 "AINN4" I L 8750 5450 60 
$EndSheet
Text Label 3050 1350 0    60   ~ 0
5V_PGA
Text Label 3050 1450 0    60   ~ 0
3.3V_P
Text Label 3050 1600 0    60   ~ 0
+15V_PGA
Text Label 3050 1700 0    60   ~ 0
-15V_PGA
Text Label 3050 1850 0    60   ~ 0
SDA_3
Text Label 3050 1950 0    60   ~ 0
SCL_3
Text Label 3050 2050 0    60   ~ 0
ADC_VCOM
Wire Wire Line
	1650 2250 1400 2250
Wire Wire Line
	1650 2350 1400 2350
Wire Wire Line
	1650 2450 1400 2450
Wire Wire Line
	1650 2550 1400 2550
Wire Wire Line
	1650 2650 1400 2650
Wire Wire Line
	1650 2750 1400 2750
Wire Wire Line
	1650 2850 1400 2850
Wire Wire Line
	1650 2950 1400 2950
Wire Wire Line
	2800 1350 3050 1350
Wire Wire Line
	2800 1450 3050 1450
Wire Wire Line
	2800 1600 3050 1600
Wire Wire Line
	2800 1700 3050 1700
Wire Wire Line
	2800 1850 3050 1850
Wire Wire Line
	2800 1950 3050 1950
Wire Wire Line
	2800 2050 3050 2050
Wire Wire Line
	2800 2250 3050 2250
Wire Wire Line
	2800 2350 3050 2350
Wire Wire Line
	2800 2450 3050 2450
Wire Wire Line
	2800 2550 3050 2550
Wire Wire Line
	2800 2650 3050 2650
Wire Wire Line
	2800 2750 3050 2750
Wire Wire Line
	2800 2850 3050 2850
Wire Wire Line
	2800 2950 3050 2950
Text Label 3050 2250 0    60   ~ 0
AIN1_P
Text Label 3050 2350 0    60   ~ 0
AIN1_N
Text Label 3050 2450 0    60   ~ 0
AIN2_P
Text Label 3050 2550 0    60   ~ 0
AIN2_N
Text Label 3050 2650 0    60   ~ 0
AIN3_P
Text Label 3050 2750 0    60   ~ 0
AIN3_N
Text Label 3050 2850 0    60   ~ 0
AIN4_P
Text Label 3050 2950 0    60   ~ 0
AIN4_N
Wire Wire Line
	5450 1750 5200 1750
Wire Wire Line
	5450 1850 5200 1850
Wire Wire Line
	5450 2000 5200 2000
Wire Wire Line
	5450 2100 5200 2100
Wire Wire Line
	5450 2250 5200 2250
Wire Wire Line
	5450 2350 5200 2350
Wire Wire Line
	5450 2450 5200 2450
Wire Wire Line
	5450 2650 5200 2650
Wire Wire Line
	5450 2750 5200 2750
Wire Wire Line
	6500 2650 6750 2650
Wire Wire Line
	6500 2750 6750 2750
Text Label 5200 1750 2    60   ~ 0
3.3V_P
Text Label 5200 1850 2    60   ~ 0
5V_PGA
Text Label 5200 2000 2    60   ~ 0
+15V_PGA
Text Label 5200 2100 2    60   ~ 0
-15V_PGA
Text Label 5200 2250 2    60   ~ 0
SDA_3
Text Label 5200 2350 2    60   ~ 0
SCL_3
Text Label 5200 2450 2    60   ~ 0
ADC_VCOM
Text Label 5200 2650 2    60   ~ 0
AIN1_P
Text Label 5200 2750 2    60   ~ 0
AIN1_N
Text Label 6750 2650 0    60   ~ 0
PGA1_OUTP
Text Label 6750 2750 0    60   ~ 0
PGA1_OUTN
Text Label 1400 2250 2    60   ~ 0
PGA1_OUTP
Text Label 1400 2350 2    60   ~ 0
PGA1_OUTN
Text Label 1400 2450 2    60   ~ 0
PGA2_OUTP
Text Label 1400 2550 2    60   ~ 0
PGA2_OUTN
Text Label 1400 2650 2    60   ~ 0
PGA3_OUTP
Text Label 1400 2750 2    60   ~ 0
PGA3_OUTN
Text Label 1400 2850 2    60   ~ 0
PGA4_OUTP
Text Label 1400 2950 2    60   ~ 0
PGA4_OUTN
Wire Wire Line
	8750 1750 8500 1750
Wire Wire Line
	8750 1850 8500 1850
Wire Wire Line
	8750 2000 8500 2000
Wire Wire Line
	8750 2100 8500 2100
Wire Wire Line
	8750 2250 8500 2250
Wire Wire Line
	8750 2350 8500 2350
Wire Wire Line
	8750 2450 8500 2450
Wire Wire Line
	8750 2650 8500 2650
Wire Wire Line
	8750 2750 8500 2750
Text Label 8500 1750 2    60   ~ 0
3.3V_P
Text Label 8500 1850 2    60   ~ 0
5V_PGA
Text Label 8500 2000 2    60   ~ 0
+15V_PGA
Text Label 8500 2100 2    60   ~ 0
-15V_PGA
Text Label 8500 2250 2    60   ~ 0
SDA_3
Text Label 8500 2350 2    60   ~ 0
SCL_3
Text Label 8500 2450 2    60   ~ 0
ADC_VCOM
Text Label 8500 2650 2    60   ~ 0
AIN2_P
Text Label 8500 2750 2    60   ~ 0
AIN2_N
Wire Wire Line
	9800 2650 10050 2650
Wire Wire Line
	9800 2750 10050 2750
Text Label 10050 2650 0    60   ~ 0
PGA2_OUTP
Text Label 10050 2750 0    60   ~ 0
PGA2_OUTN
Wire Wire Line
	5450 4450 5200 4450
Wire Wire Line
	5450 4550 5200 4550
Wire Wire Line
	5450 4700 5200 4700
Wire Wire Line
	5450 4800 5200 4800
Wire Wire Line
	5450 4950 5200 4950
Wire Wire Line
	5450 5050 5200 5050
Wire Wire Line
	5450 5150 5200 5150
Wire Wire Line
	5450 5350 5200 5350
Wire Wire Line
	5450 5450 5200 5450
Text Label 5200 4450 2    60   ~ 0
3.3V_P
Text Label 5200 4550 2    60   ~ 0
5V_PGA
Text Label 5200 4700 2    60   ~ 0
+15V_PGA
Text Label 5200 4800 2    60   ~ 0
-15V_PGA
Text Label 5200 4950 2    60   ~ 0
SDA_3
Text Label 5200 5050 2    60   ~ 0
SCL_3
Text Label 5200 5150 2    60   ~ 0
ADC_VCOM
Text Label 5200 5350 2    60   ~ 0
AIN3_P
Text Label 5200 5450 2    60   ~ 0
AIN3_N
Wire Wire Line
	6500 5350 6750 5350
Wire Wire Line
	6500 5450 6750 5450
Text Label 6750 5350 0    60   ~ 0
PGA3_OUTP
Text Label 6750 5450 0    60   ~ 0
PGA3_OUTN
Wire Wire Line
	8750 4450 8500 4450
Wire Wire Line
	8750 4550 8500 4550
Wire Wire Line
	8750 4700 8500 4700
Wire Wire Line
	8750 4800 8500 4800
Wire Wire Line
	8750 4950 8500 4950
Wire Wire Line
	8750 5050 8500 5050
Wire Wire Line
	8750 5150 8500 5150
Wire Wire Line
	8750 5350 8500 5350
Wire Wire Line
	8750 5450 8500 5450
Text Label 8500 4450 2    60   ~ 0
3.3V_P
Text Label 8500 4550 2    60   ~ 0
5V_PGA
Text Label 8500 4700 2    60   ~ 0
+15V_PGA
Text Label 8500 4800 2    60   ~ 0
-15V_PGA
Text Label 8500 4950 2    60   ~ 0
SDA_3
Text Label 8500 5050 2    60   ~ 0
SCL_3
Text Label 8500 5150 2    60   ~ 0
ADC_VCOM
Text Label 8500 5350 2    60   ~ 0
AIN4_P
Text Label 8500 5450 2    60   ~ 0
AIN4_N
Wire Wire Line
	9800 5350 10050 5350
Wire Wire Line
	9800 5450 10050 5450
Text Label 10050 5350 0    60   ~ 0
PGA4_OUTP
Text Label 10050 5450 0    60   ~ 0
PGA4_OUTN
$EndSCHEMATC
