(module Inductor_SMD0805_HandSoldering (layer F.Cu) (tedit 54D7157C)
  (descr "Inductor, SMD, 0805, Hand soldering,")
  (tags "Inductor, SMD, 0805, Hand soldering,")
  (attr smd)
  (fp_text reference L (at 0 -2) (layer F.SilkS)
    (effects (font (size 0.65 0.65) (thickness 0.125)))
  )
  (fp_text value SMD0805_HS (at 0.20066 2.60096) (layer F.SilkS) hide
    (effects (font (thickness 0.3048)))
  )
  (fp_line (start -1.9 1.3) (end -1.9 -1.3) (layer F.CrtYd) (width 0.15))
  (fp_line (start 1.9 1.3) (end -1.9 1.3) (layer F.CrtYd) (width 0.15))
  (fp_line (start 1.9 -1.3) (end 1.9 1.3) (layer F.CrtYd) (width 0.15))
  (fp_line (start -1.9 -1.3) (end 1.9 -1.3) (layer F.CrtYd) (width 0.15))
  (fp_line (start 0 -1.143) (end -1.016 -1.143) (layer F.SilkS) (width 0.381))
  (fp_line (start 0 -1.143) (end 1.016 -1.143) (layer F.SilkS) (width 0.381))
  (fp_line (start 0 1.143) (end -1.016 1.143) (layer F.SilkS) (width 0.381))
  (fp_line (start 0 1.143) (end 1.016 1.143) (layer F.SilkS) (width 0.381))
  (pad 1 smd rect (at -1 0) (size 1.2 1.25) (layers F.Cu F.Paste F.Mask))
  (pad 2 smd rect (at 1 0) (size 1.2 1.25) (layers F.Cu F.Paste F.Mask))
  (model ${KIPRJMOD}/../../modules/packages_3d/walter_lain/inductor_smd_0805.wrl
    (at (xyz 0 0 0))
    (scale (xyz 1 1 1))
    (rotate (xyz 0 0 0))
  )
)
