EESchema Schematic File Version 2
LIBS:adc_main_shield-rescue
LIBS:ruwai
LIBS:power
LIBS:device
LIBS:transistors
LIBS:conn
LIBS:linear
LIBS:regul
LIBS:74xx
LIBS:cmos4000
LIBS:adc-dac
LIBS:memory
LIBS:xilinx
LIBS:microcontrollers
LIBS:dsp
LIBS:microchip
LIBS:analog_switches
LIBS:motorola
LIBS:texas
LIBS:intel
LIBS:audio
LIBS:interface
LIBS:digital-audio
LIBS:philips
LIBS:display
LIBS:cypress
LIBS:siliconi
LIBS:opto
LIBS:atmel
LIBS:contrib
LIBS:valves
LIBS:adc_main_shield-cache
EELAYER 25 0
EELAYER END
$Descr A4 11693 8268
encoding utf-8
Sheet 1 6
Title "Ruwai ADC Main Shield"
Date "2017-09-12"
Rev "3"
Comp "Copyright Mertl Research GmbH 2014 "
Comment1 ""
Comment2 ""
Comment3 ""
Comment4 "This documentation describes Open Hardware and is licensed under the CERN OHL v. 1.2."
$EndDescr
$Sheet
S 2550 1250 1600 2150
U 5468E249
F0 "level shifting" 60
F1 "level_shifting.sch" 60
F2 "3.3V_P" I L 2550 1550 60 
F3 "SDA_3" B R 4150 3050 60 
F4 "5V" I L 2550 1400 60 
F5 "SYNC_ARD" I L 2550 2900 60 
F6 "SYNC_3" O R 4150 2900 60 
F7 "DRDY_3" I R 4150 1850 60 
F8 "DRDY_ARD" O L 2550 1850 60 
F9 "MODE0_ARD" I L 2550 2600 60 
F10 "MODE0_3" O R 4150 2600 60 
F11 "MODE1_3" O R 4150 2750 60 
F12 "MODE1_ARD" I L 2550 2750 60 
F13 "FORMAT0_3" O R 4150 2000 60 
F14 "FORMAT0_ARD" I L 2550 2000 60 
F15 "DOUT1_3" I R 4150 2150 60 
F16 "DOUT1_ARD" O L 2550 2150 60 
F17 "SCLK_3" O R 4150 2300 60 
F18 "SCLK_ARD" I L 2550 2300 60 
F19 "CLKDIV_3" O R 4150 2450 60 
F20 "CLKDIV_ARD" I L 2550 2450 60 
F21 "SDA_ARD" B L 2550 3050 60 
F22 "SCL_ARD" I L 2550 3200 60 
F23 "SCL_3" O R 4150 3200 60 
$EndSheet
$Sheet
S 7850 3450 1250 2700
U 5468E24F
F0 "ADC" 60
F1 "adc.sch" 60
F2 "AOUT1_N" I L 7850 4150 60 
F3 "AOUT1_P" I L 7850 4050 60 
F4 "AOUT2_N" I L 7850 4350 60 
F5 "AOUT2_P" I L 7850 4250 60 
F6 "AOUT3_N" I L 7850 4550 60 
F7 "AOUT3_P" I L 7850 4450 60 
F8 "AOUT4_N" I L 7850 4750 60 
F9 "AOUT4_P" I L 7850 4650 60 
F10 "CLKDIV_3" I L 7850 5250 60 
F11 "SYNC_3" I L 7850 5350 60 
F12 "DIN_ADC" I L 7850 5050 60 
F13 "DOUT1_3" O R 9100 4050 60 
F14 "DOUT_ADC_STACK" I L 7850 4950 60 
F15 "3.3V_P" I L 7850 3700 60 
F16 "1.8V_ADC" I L 7850 3800 60 
F17 "5V_ADC" I L 7850 3600 60 
F18 "GPS_CLK_3" I L 7850 5450 60 
F19 "SCLK_3" I L 7850 5550 60 
F20 "DRDY_3" O R 9100 4150 60 
F21 "FORMAT0_3" I L 7850 5650 60 
F22 "MODE0_3" I L 7850 5750 60 
F23 "MODE1_3" I L 7850 5850 60 
F24 "SCL_3" I L 7850 5950 60 
F25 "SDA_3" B L 7850 6050 60 
F26 "ADC_VCOM" O R 9100 4350 60 
$EndSheet
$Sheet
S 9100 1100 900  900 
U 546971C1
F0 "power supply ADC" 60
F1 "power_supply_adc.sch" 60
F2 "5.1V" I L 9100 1250 60 
F3 "5V_ADC" O R 10000 1250 60 
F4 "1.8V_ADC" O R 10000 1400 60 
$EndSheet
$Sheet
S 6400 1100 950  900 
U 5468E24C
F0 "power supply" 60
F1 "power_supply.sch" 60
F2 "5V" O R 7350 1250 60 
F3 "5.1V" I L 6400 1250 60 
F4 "3.3V_P" O R 7350 1400 60 
F5 "5V_PGA" O R 7350 1550 60 
$EndSheet
Wire Wire Line
	7850 5250 7650 5250
Wire Wire Line
	7850 5350 7650 5350
Text Label 7650 5250 2    60   ~ 0
CLKDIV_3
Text Label 7650 5350 2    60   ~ 0
SYNC_3
$Sheet
S 2550 4400 1700 2550
U 5468E254
F0 "interface" 60
F1 "interface.sch" 60
F2 "3.3V_P" I L 2550 5700 60 
F3 "SDA_3" B L 2550 5600 60 
F4 "SCL_3" I L 2550 5500 60 
F5 "ADC_VCOM" I L 2550 5400 60 
F6 "5V_PGA" I L 2550 5300 60 
F7 "AOUT1_P" O R 4250 6100 60 
F8 "AOUT1_N" O R 4250 6200 60 
F9 "AOUT2_P" O R 4250 6300 60 
F10 "AOUT2_N" O R 4250 6400 60 
F11 "AOUT3_P" O R 4250 6500 60 
F12 "AOUT3_N" O R 4250 6600 60 
F13 "AOUT4_P" O R 4250 6700 60 
F14 "AOUT4_N" O R 4250 6800 60 
F15 "DOUT_ADC_STACK" I L 2550 5050 60 
F16 "DIN_ADC" O R 4250 5800 60 
F17 "GPS_CLK_3" O R 4250 5900 60 
F18 "5.1V" O R 4250 4550 60 
F19 "DOUT1_ARD" O R 4250 5150 60 
F20 "SCLK_ARD" O R 4250 5250 60 
F21 "CLKDIV_ARD" O R 4250 5350 60 
F22 "SYNC_ARD" O R 4250 5450 60 
F23 "MODE0_ARD" O R 4250 5550 60 
F24 "MODE1_ARD" O R 4250 5050 60 
F25 "FORMAT0_ARD" O R 4250 4950 60 
F26 "SCL_ARD" O R 4250 4750 60 
F27 "SDA_ARD" B R 4250 4850 60 
F28 "DRDY_ARD" I L 2550 4750 60 
$EndSheet
Wire Wire Line
	2550 1400 2350 1400
Wire Wire Line
	2550 1550 2350 1550
Wire Wire Line
	2550 1850 2350 1850
Wire Wire Line
	2550 2000 2350 2000
Wire Wire Line
	2550 2150 2350 2150
Wire Wire Line
	2550 2300 2350 2300
Wire Wire Line
	2550 2450 2350 2450
Wire Wire Line
	2550 2600 2350 2600
Wire Wire Line
	2550 2750 2350 2750
Wire Wire Line
	2550 2900 2350 2900
Wire Wire Line
	2550 3050 2350 3050
Wire Wire Line
	2550 3200 2350 3200
Wire Wire Line
	4150 1850 4350 1850
Wire Wire Line
	4150 2000 4350 2000
Wire Wire Line
	4150 2150 4350 2150
Wire Wire Line
	4150 2300 4350 2300
Wire Wire Line
	4150 2450 4350 2450
Wire Wire Line
	4150 2600 4350 2600
Wire Wire Line
	4150 2750 4350 2750
Wire Wire Line
	4150 2900 4350 2900
Wire Wire Line
	4150 3050 4350 3050
Wire Wire Line
	4150 3200 4350 3200
Wire Wire Line
	6400 1250 6200 1250
Wire Wire Line
	7350 1250 7600 1250
Wire Wire Line
	7350 1400 7600 1400
Wire Wire Line
	7350 1550 7600 1550
Text Label 2350 1400 2    60   ~ 0
5V
Text Label 2350 1550 2    60   ~ 0
3.3V_P
Text Label 2350 1850 2    60   ~ 0
DRDY_ARD
Text Label 2350 2000 2    60   ~ 0
FORMAT0_ARD
Text Label 2350 2150 2    60   ~ 0
DOUT1_ARD
Text Label 2350 2300 2    60   ~ 0
SCLK_ARD
Text Label 2350 2450 2    60   ~ 0
CLKDIV_ARD
Text Label 2350 2600 2    60   ~ 0
MODE0_ARD
Text Label 2350 2750 2    60   ~ 0
MODE1_ARD
Text Label 2350 2900 2    60   ~ 0
SYNC_ARD
Text Label 2350 3050 2    60   ~ 0
SDA_ARD
Text Label 2350 3200 2    60   ~ 0
SCL_ARD
Text Label 4350 1850 0    60   ~ 0
DRDY_3
Text Label 4350 2000 0    60   ~ 0
FORMAT0_3
Text Label 4350 2150 0    60   ~ 0
DOUT1_3
Text Label 4350 2300 0    60   ~ 0
SCLK_3
Text Label 4350 2450 0    60   ~ 0
CLKDIV_3
Text Label 4350 2600 0    60   ~ 0
MODE0_3
Text Label 4350 2750 0    60   ~ 0
MODE1_3
Text Label 4350 2900 0    60   ~ 0
SYNC_3
Text Label 4350 3050 0    60   ~ 0
SDA_3
Text Label 4350 3200 0    60   ~ 0
SCL_3
Wire Wire Line
	2550 4750 2350 4750
Wire Wire Line
	2550 5050 2350 5050
Wire Wire Line
	2550 5300 2350 5300
Wire Wire Line
	2550 5400 2350 5400
Wire Wire Line
	2550 5500 2350 5500
Wire Wire Line
	2550 5600 2350 5600
Wire Wire Line
	2550 5700 2350 5700
Wire Wire Line
	4250 4550 4450 4550
Wire Wire Line
	4250 4750 4450 4750
Wire Wire Line
	4250 4850 4450 4850
Wire Wire Line
	4250 4950 4450 4950
Wire Wire Line
	4250 5050 4450 5050
Wire Wire Line
	4250 5150 4450 5150
Wire Wire Line
	4250 5250 4450 5250
Wire Wire Line
	4250 5350 4450 5350
Wire Wire Line
	4250 5450 4450 5450
Wire Wire Line
	4250 5550 4450 5550
Wire Wire Line
	4250 5800 4450 5800
Wire Wire Line
	4250 5900 4450 5900
Wire Wire Line
	4250 6100 4450 6100
Wire Wire Line
	4250 6200 4450 6200
Wire Wire Line
	4250 6300 4450 6300
Wire Wire Line
	4250 6400 4450 6400
Wire Wire Line
	4250 6500 4450 6500
Wire Wire Line
	4250 6600 4450 6600
Wire Wire Line
	4250 6700 4450 6700
Wire Wire Line
	4250 6800 4450 6800
Text Label 2350 4750 2    60   ~ 0
DRDY_ARD
Text Label 2350 5050 2    60   ~ 0
DOUT_ADC_STACK
Text Label 2350 5300 2    60   ~ 0
5V_PGA
Text Label 2350 5400 2    60   ~ 0
ADC_VCOM
Text Label 2350 5500 2    60   ~ 0
SCL_3
Text Label 2350 5600 2    60   ~ 0
SDA_3
Text Label 2350 5700 2    60   ~ 0
3.3V_P
Text Label 4450 4550 0    60   ~ 0
5.1V
Text Label 4450 4750 0    60   ~ 0
SCL_ARD
Text Label 4450 4850 0    60   ~ 0
SDA_ARD
Text Label 4450 4950 0    60   ~ 0
FORMAT0_ARD
Text Label 4450 5050 0    60   ~ 0
MODE1_ARD
Text Label 4450 5150 0    60   ~ 0
DOUT1_ARD
Text Label 4450 5250 0    60   ~ 0
SCLK_ARD
Text Label 4450 5350 0    60   ~ 0
CLKDIV_ARD
Text Label 4450 5450 0    60   ~ 0
SYNC_ARD
Text Label 4450 5550 0    60   ~ 0
MODE0_ARD
Text Label 4450 5800 0    60   ~ 0
DIN_ADC
Text Label 4450 5900 0    60   ~ 0
GPS_CLK_3
Text Label 4450 6100 0    60   ~ 0
AOUT1_P
Text Label 4450 6200 0    60   ~ 0
AOUT1_N
Text Label 4450 6300 0    60   ~ 0
AOUT2_P
Text Label 4450 6400 0    60   ~ 0
AOUT2_N
Text Label 4450 6500 0    60   ~ 0
AOUT3_P
Text Label 4450 6600 0    60   ~ 0
AOUT3_N
Text Label 4450 6700 0    60   ~ 0
AOUT4_P
Text Label 4450 6800 0    60   ~ 0
AOUT4_N
Text Label 6200 1250 2    60   ~ 0
5.1V
Text Label 7600 1250 0    60   ~ 0
5V
Text Label 7600 1400 0    60   ~ 0
3.3V_P
Text Label 7600 1550 0    60   ~ 0
5V_PGA
Wire Wire Line
	9100 1250 8900 1250
Wire Wire Line
	10000 1250 10200 1250
Wire Wire Line
	10000 1400 10200 1400
Text Label 8900 1250 2    60   ~ 0
5.1V
Text Label 10200 1250 0    60   ~ 0
5V_ADC
Text Label 10200 1400 0    60   ~ 0
1.8V_ADC
Wire Wire Line
	7850 3600 7650 3600
Wire Wire Line
	7850 3700 7650 3700
Wire Wire Line
	7850 3800 7650 3800
Wire Wire Line
	7850 4050 7650 4050
Wire Wire Line
	7850 4150 7650 4150
Wire Wire Line
	7850 4250 7650 4250
Wire Wire Line
	7850 4350 7650 4350
Wire Wire Line
	7850 4450 7650 4450
Wire Wire Line
	7650 4550 7850 4550
Wire Wire Line
	7850 4650 7650 4650
Wire Wire Line
	7850 4750 7650 4750
Wire Wire Line
	7850 4950 7650 4950
Wire Wire Line
	7850 5050 7650 5050
Wire Wire Line
	7850 5450 7650 5450
Wire Wire Line
	7850 5550 7650 5550
Wire Wire Line
	7850 5650 7650 5650
Wire Wire Line
	7850 5750 7650 5750
Wire Wire Line
	7850 5850 7650 5850
Wire Wire Line
	7850 5950 7650 5950
Wire Wire Line
	7850 6050 7650 6050
Wire Wire Line
	9100 4050 9300 4050
Wire Wire Line
	9100 4150 9300 4150
Wire Wire Line
	9100 4350 9300 4350
Text Label 7650 3600 2    60   ~ 0
5V_ADC
Text Label 7650 3700 2    60   ~ 0
3.3V_P
Text Label 7650 3800 2    60   ~ 0
1.8V_ADC
Text Label 7650 4050 2    60   ~ 0
AOUT1_P
Text Label 7650 4150 2    60   ~ 0
AOUT1_N
Text Label 7650 4250 2    60   ~ 0
AOUT2_P
Text Label 7650 4350 2    60   ~ 0
AOUT2_N
Text Label 7650 4450 2    60   ~ 0
AOUT3_P
Text Label 7650 4550 2    60   ~ 0
AOUT3_N
Text Label 7650 4650 2    60   ~ 0
AOUT4_P
Text Label 7650 4750 2    60   ~ 0
AOUT4_N
Text Label 7650 4950 2    60   ~ 0
DOUT_ADC_STACK
Text Label 7650 5050 2    60   ~ 0
DIN_ADC
Text Label 7650 5450 2    60   ~ 0
GPS_CLK_3
Text Label 7650 5550 2    60   ~ 0
SCLK_3
Text Label 7650 5650 2    60   ~ 0
FORMAT0_3
Text Label 7650 5750 2    60   ~ 0
MODE0_3
Text Label 7650 5850 2    60   ~ 0
MODE1_3
Text Label 7650 5950 2    60   ~ 0
SCL_3
Text Label 7650 6050 2    60   ~ 0
SDA_3
Text Label 9300 4050 0    60   ~ 0
DOUT1_3
Text Label 9300 4150 0    60   ~ 0
DRDY_3
Text Label 9300 4350 0    60   ~ 0
ADC_VCOM
$EndSCHEMATC
