EESchema Schematic File Version 2
LIBS:ruwai_gps_timing_shield-rescue
LIBS:ruwai
LIBS:74xgxx
LIBS:74xx
LIBS:ac-dc
LIBS:actel
LIBS:adc-dac
LIBS:analog_switches
LIBS:atmel
LIBS:audio
LIBS:brooktre
LIBS:cmos4000
LIBS:cmos_ieee
LIBS:conn
LIBS:contrib
LIBS:cypress
LIBS:dc-dc
LIBS:device
LIBS:digital-audio
LIBS:display
LIBS:dsp
LIBS:elec-unifil
LIBS:ftdi
LIBS:gennum
LIBS:hc11
LIBS:intel
LIBS:interface
LIBS:ir
LIBS:linear
LIBS:memory
LIBS:microchip
LIBS:microchip_pic10mcu
LIBS:microchip_pic12mcu
LIBS:microchip_pic16mcu
LIBS:microchip_pic18mcu
LIBS:microchip_pic32mcu
LIBS:microcontrollers
LIBS:motor_drivers
LIBS:motorola
LIBS:msp430
LIBS:nordicsemi
LIBS:nxp_armmcu
LIBS:onsemi
LIBS:opto
LIBS:philips
LIBS:power
LIBS:powerint
LIBS:pspice
LIBS:references
LIBS:regul
LIBS:relays
LIBS:rfcom
LIBS:sensors
LIBS:silabs
LIBS:siliconi
LIBS:stm8
LIBS:stm32
LIBS:supertex
LIBS:switches
LIBS:texas
LIBS:transf
LIBS:transistors
LIBS:ttl_ieee
LIBS:valves
LIBS:video
LIBS:xilinx
LIBS:ruwai_gps_timing_shield-cache
EELAYER 25 0
EELAYER END
$Descr A4 11693 8268
encoding utf-8
Sheet 4 6
Title "Ruwai GPS Timing Shield"
Date "2017-09-12"
Rev "3"
Comp "Copyright 2014 Mertl Research GmbH"
Comment1 ""
Comment2 ""
Comment3 ""
Comment4 "This documentation describes Open Hardware and is licensed under the CERN OHL v. 1.2."
$EndDescr
$Comp
L TPS73250 U4
U 1 1 53A3101D
P 3350 1650
F 0 "U4" H 3050 1400 60  0000 C CNN
F 1 "TPS73250" H 3200 1900 60  0000 C CNN
F 2 "Ruwai:SOT23-5" H 3700 1400 60  0001 C CNN
F 3 "" H 3400 1600 60  0000 C CNN
F 4 "Texas Instruments" H 3650 3400 60  0001 C CNN "Manu"
F 5 "TPS73250DBVR" H 3650 3500 60  0001 C CNN "Manu#"
F 6 "SOT23 5-pin" H 3650 3600 60  0001 C CNN "Package"
F 7 "Single Output LDO, 250mA, Fixed(5.0V), Fast Transient Response, Reverse Current Protection" H 3650 4500 60  0001 C CNN "Desc"
	1    3350 1650
	1    0    0    -1  
$EndComp
$Comp
L Resistor R19
U 1 1 53A312B0
P 2200 1350
F 0 "R19" V 2280 1350 40  0000 C CNN
F 1 "2.7k" V 2207 1351 40  0000 C CNN
F 2 "Ruwai:Resistor_SMD0805_HandSoldering" V 2130 1350 30  0001 C CNN
F 3 "" H 2200 1350 30  0000 C CNN
F 4 "Yageo" H 3650 3400 60  0001 C CNN "Manu"
F 5 "RC0805FR-072K7L" H 3650 3500 60  0001 C CNN "Manu#"
F 6 "0805" H 3650 3600 60  0001 C CNN "Package"
F 7 " " H 3650 4500 60  0001 C CNN "Desc"
	1    2200 1350
	0    1    1    0   
$EndComp
$Comp
L Capacitor C15
U 1 1 53A31329
P 1850 2100
AR Path="/53A31329" Ref="C15"  Part="1" 
AR Path="/53A17A2E/53A31329" Ref="C15"  Part="1" 
F 0 "C15" H 1850 2200 40  0000 L CNN
F 1 "10uF" H 1856 2015 40  0000 L CNN
F 2 "Ruwai:Capacitor_SMD1206_ReflowWave" H 1888 1950 30  0001 C CNN
F 3 "" H 1850 2100 60  0000 C CNN
F 4 "Murata" H 3650 3400 60  0001 C CNN "Manu"
F 5 "GRM31CR71E106KA12L" H 3650 3500 60  0001 C CNN "Manu#"
F 6 "1206" H 3650 3600 60  0001 C CNN "Package"
F 7 " " H 3650 4500 60  0001 C CNN "Desc"
	1    1850 2100
	-1   0    0    1   
$EndComp
$Comp
L Resistor R44
U 1 1 53A313F7
P 2550 2100
F 0 "R44" V 2630 2100 40  0000 C CNN
F 1 "2.2k" V 2557 2101 40  0000 C CNN
F 2 "Ruwai:Resistor_SMD0102_HandSoldering" V 2480 2100 30  0001 C CNN
F 3 "" H 2550 2100 30  0000 C CNN
F 4 "Yageo" H 3650 3400 60  0001 C CNN "Manu"
F 5 "RC0805FR-072K2L" H 3650 3500 60  0001 C CNN "Manu#"
F 6 "0805" H 3650 3600 60  0001 C CNN "Package"
F 7 " " H 3650 4500 60  0001 C CNN "Desc"
	1    2550 2100
	-1   0    0    1   
$EndComp
Text HLabel 1550 1550 0    60   Input ~ 0
5V_CONN
$Comp
L GND-RESCUE-ruwai_gps_timing_shield #PWR031
U 1 1 53A31522
P 2550 2500
F 0 "#PWR031" H 2550 2500 30  0001 C CNN
F 1 "GND" H 2550 2430 30  0001 C CNN
F 2 "" H 2550 2500 60  0000 C CNN
F 3 "" H 2550 2500 60  0000 C CNN
	1    2550 2500
	1    0    0    -1  
$EndComp
$Comp
L GND-RESCUE-ruwai_gps_timing_shield #PWR032
U 1 1 53A3153D
P 1850 2500
F 0 "#PWR032" H 1850 2500 30  0001 C CNN
F 1 "GND" H 1850 2430 30  0001 C CNN
F 2 "" H 1850 2500 60  0000 C CNN
F 3 "" H 1850 2500 60  0000 C CNN
	1    1850 2500
	1    0    0    -1  
$EndComp
$Comp
L GND-RESCUE-ruwai_gps_timing_shield #PWR033
U 1 1 53A31556
P 2300 2500
F 0 "#PWR033" H 2300 2500 30  0001 C CNN
F 1 "GND" H 2300 2430 30  0001 C CNN
F 2 "" H 2300 2500 60  0000 C CNN
F 3 "" H 2300 2500 60  0000 C CNN
	1    2300 2500
	1    0    0    -1  
$EndComp
$Comp
L Capacitor C30
U 1 1 53A31B6D
P 4100 2100
AR Path="/53A31B6D" Ref="C30"  Part="1" 
AR Path="/53A17A2E/53A31B6D" Ref="C30"  Part="1" 
F 0 "C30" H 4100 2200 40  0000 L CNN
F 1 "10nF" H 4106 2015 40  0000 L CNN
F 2 "Ruwai:Capacitor_SMD0805_ReflowWave" H 4138 1950 30  0001 C CNN
F 3 "" H 4100 2100 60  0000 C CNN
F 4 "Kemet" H 3650 3400 60  0001 C CNN "Manu"
F 5 "C0805C103J3GACTU" H 3650 3500 60  0001 C CNN "Manu#"
F 6 "0805" H 3650 3600 60  0001 C CNN "Package"
F 7 " " H 3650 4500 60  0001 C CNN "Desc"
	1    4100 2100
	-1   0    0    1   
$EndComp
$Comp
L GND-RESCUE-ruwai_gps_timing_shield #PWR034
U 1 1 53A31E19
P 4100 2500
F 0 "#PWR034" H 4100 2500 30  0001 C CNN
F 1 "GND" H 4100 2430 30  0001 C CNN
F 2 "" H 4100 2500 60  0000 C CNN
F 3 "" H 4100 2500 60  0000 C CNN
	1    4100 2500
	1    0    0    -1  
$EndComp
$Comp
L Capacitor C16
U 1 1 53A31E2C
P 4700 2100
AR Path="/53A31E2C" Ref="C16"  Part="1" 
AR Path="/53A17A2E/53A31E2C" Ref="C16"  Part="1" 
F 0 "C16" H 4700 2200 40  0000 L CNN
F 1 "2.2uF" H 4706 2015 40  0000 L CNN
F 2 "Ruwai:Capacitor_SMD0805_HandSoldering" H 4738 1950 30  0001 C CNN
F 3 "" H 4700 2100 60  0000 C CNN
F 4 "Murata" H 3650 3400 60  0001 C CNN "Manu"
F 5 "GRM21BR71E225KA73L" H 3650 3500 60  0001 C CNN "Manu#"
F 6 "0805" H 3650 3600 60  0001 C CNN "Package"
F 7 " " H 3650 4500 60  0001 C CNN "Desc"
	1    4700 2100
	-1   0    0    1   
$EndComp
$Comp
L Capacitor C17
U 1 1 53A31E5D
P 5000 2100
AR Path="/53A31E5D" Ref="C17"  Part="1" 
AR Path="/53A17A2E/53A31E5D" Ref="C17"  Part="1" 
F 0 "C17" H 5000 2200 40  0000 L CNN
F 1 "1nF" H 5006 2015 40  0000 L CNN
F 2 "Ruwai:Capacitor_SMD0805_HandSoldering" H 5038 1950 30  0001 C CNN
F 3 "" H 5000 2100 60  0000 C CNN
F 4 "Kemet" H 3650 3400 60  0001 C CNN "Manu"
F 5 "C0805C102J5GACTU" H 3650 3500 60  0001 C CNN "Manu#"
F 6 "0805" H 3650 3600 60  0001 C CNN "Package"
F 7 " " H 3650 4500 60  0001 C CNN "Desc"
	1    5000 2100
	-1   0    0    1   
$EndComp
$Comp
L GND-RESCUE-ruwai_gps_timing_shield #PWR035
U 1 1 53A31E9F
P 4700 2500
F 0 "#PWR035" H 4700 2500 30  0001 C CNN
F 1 "GND" H 4700 2430 30  0001 C CNN
F 2 "" H 4700 2500 60  0000 C CNN
F 3 "" H 4700 2500 60  0000 C CNN
	1    4700 2500
	1    0    0    -1  
$EndComp
$Comp
L GND-RESCUE-ruwai_gps_timing_shield #PWR036
U 1 1 53A31EAA
P 5000 2500
F 0 "#PWR036" H 5000 2500 30  0001 C CNN
F 1 "GND" H 5000 2430 30  0001 C CNN
F 2 "" H 5000 2500 60  0000 C CNN
F 3 "" H 5000 2500 60  0000 C CNN
	1    5000 2500
	1    0    0    -1  
$EndComp
$Comp
L Resistor R28
U 1 1 53A31EC4
P 5400 1550
F 0 "R28" V 5480 1550 40  0000 C CNN
F 1 "2.7k" V 5407 1551 40  0000 C CNN
F 2 "Ruwai:Resistor_SMD0805_HandSoldering" V 5330 1550 30  0001 C CNN
F 3 "" H 5400 1550 30  0000 C CNN
F 4 "Yageo" H 3650 3400 60  0001 C CNN "Manu"
F 5 "RC0805FR-072K7L" H 3650 3500 60  0001 C CNN "Manu#"
F 6 "0805" H 3650 3600 60  0001 C CNN "Package"
F 7 " " H 3650 4500 60  0001 C CNN "Desc"
	1    5400 1550
	0    1    1    0   
$EndComp
$Comp
L LED D5
U 1 1 53A31F41
P 5800 2100
F 0 "D5" H 5800 2200 40  0000 C CNN
F 1 "KP-2012SGC" H 5800 2000 40  0000 C CNN
F 2 "Ruwai:LED-0805" H 5800 2100 60  0001 C CNN
F 3 "" H 5800 2100 60  0000 C CNN
F 4 "Knightbright" H 3650 3400 60  0001 C CNN "Manu"
F 5 "KP-2012SGC" H 3650 3500 60  0001 C CNN "Manu#"
F 6 "0805" H 3650 3600 60  0001 C CNN "Package"
F 7 " " H 3650 4500 60  0001 C CNN "Desc"
	1    5800 2100
	0    1    1    0   
$EndComp
$Comp
L GND-RESCUE-ruwai_gps_timing_shield #PWR037
U 1 1 53A31FFF
P 5800 2500
F 0 "#PWR037" H 5800 2500 30  0001 C CNN
F 1 "GND" H 5800 2430 30  0001 C CNN
F 2 "" H 5800 2500 60  0000 C CNN
F 3 "" H 5800 2500 60  0000 C CNN
	1    5800 2500
	1    0    0    -1  
$EndComp
Text Notes 4150 850  0    60   ~ 12
5V power conditioning
$Comp
L TPS79133 U20
U 1 1 53A33510
P 2850 4700
F 0 "U20" H 2550 4450 60  0000 C CNN
F 1 "TPS79133" H 2700 4950 60  0000 C CNN
F 2 "Ruwai:SOT23-5" H 3200 4450 60  0001 C CNN
F 3 "" H 2900 4650 60  0000 C CNN
F 4 "Texas Instruments" H 3650 3400 60  0001 C CNN "Manu"
F 5 "TPS79133DBVT" H 3650 3500 60  0001 C CNN "Manu#"
F 6 "SOT23 5-pin" H 3650 3600 60  0001 C CNN "Package"
F 7 "Single Output LDO, 100mA, Fixed(3.3V), High PSRR, Low Noise" H 3650 4500 60  0001 C CNN "Desc"
	1    2850 4700
	1    0    0    -1  
$EndComp
$Comp
L Resistor R40
U 1 1 53A337BB
P 1200 4500
F 0 "R40" V 1280 4500 40  0000 C CNN
F 1 "10" V 1207 4501 40  0000 C CNN
F 2 "Ruwai:Resistor_SMD0102_HandSoldering" V 1130 4500 30  0001 C CNN
F 3 "" H 1200 4500 30  0000 C CNN
F 4 "Yageo" H 3650 3400 60  0001 C CNN "Manu"
F 5 "RC0805FR-0710RL" H 3650 3500 60  0001 C CNN "Manu#"
F 6 "0805" H 3650 3600 60  0001 C CNN "Package"
F 7 " " H 3650 4500 60  0001 C CNN "Desc"
	1    1200 4500
	0    1    1    0   
$EndComp
$Comp
L Resistor R39
U 1 1 53A33835
P 1200 4700
F 0 "R39" V 1280 4700 40  0000 C CNN
F 1 "10" V 1207 4701 40  0000 C CNN
F 2 "Ruwai:Resistor_SMD0102_HandSoldering" V 1130 4700 30  0001 C CNN
F 3 "" H 1200 4700 30  0000 C CNN
F 4 "Yageo" H 3650 3400 60  0001 C CNN "Manu"
F 5 "RC0805FR-0710RL" H 3650 3500 60  0001 C CNN "Manu#"
F 6 "0805" H 3650 3600 60  0001 C CNN "Package"
F 7 " " H 3650 4500 60  0001 C CNN "Desc"
	1    1200 4700
	0    1    1    0   
$EndComp
$Comp
L Capacitor C21
U 1 1 53A338C5
P 1800 5100
AR Path="/53A338C5" Ref="C21"  Part="1" 
AR Path="/53A17A2E/53A338C5" Ref="C21"  Part="1" 
F 0 "C21" H 1800 5200 40  0000 L CNN
F 1 "1uF" H 1806 5015 40  0000 L CNN
F 2 "Ruwai:Capacitor_SMD0805_HandSoldering" H 1838 4950 30  0001 C CNN
F 3 "" H 1800 5100 60  0000 C CNN
F 4 "Murata" H 3650 3400 60  0001 C CNN "Manu"
F 5 "GRM21BR71H105KA12L" H 3650 3500 60  0001 C CNN "Manu#"
F 6 "0805" H 3650 3600 60  0001 C CNN "Package"
F 7 " " H 3650 4500 60  0001 C CNN "Desc"
	1    1800 5100
	-1   0    0    1   
$EndComp
$Comp
L GND-RESCUE-ruwai_gps_timing_shield #PWR038
U 1 1 53A33985
P 1800 5400
F 0 "#PWR038" H 1800 5400 30  0001 C CNN
F 1 "GND" H 1800 5330 30  0001 C CNN
F 2 "" H 1800 5400 60  0000 C CNN
F 3 "" H 1800 5400 60  0000 C CNN
	1    1800 5400
	1    0    0    -1  
$EndComp
$Comp
L GND-RESCUE-ruwai_gps_timing_shield #PWR039
U 1 1 53A339A0
P 2050 5400
F 0 "#PWR039" H 2050 5400 30  0001 C CNN
F 1 "GND" H 2050 5330 30  0001 C CNN
F 2 "" H 2050 5400 60  0000 C CNN
F 3 "" H 2050 5400 60  0000 C CNN
	1    2050 5400
	1    0    0    -1  
$EndComp
$Comp
L Capacitor C22
U 1 1 53A351D2
P 3600 5100
AR Path="/53A351D2" Ref="C22"  Part="1" 
AR Path="/53A17A2E/53A351D2" Ref="C22"  Part="1" 
F 0 "C22" H 3600 5200 40  0000 L CNN
F 1 "10nF" H 3606 5015 40  0000 L CNN
F 2 "Ruwai:Capacitor_SMD0805_HandSoldering" H 3638 4950 30  0001 C CNN
F 3 "" H 3600 5100 60  0000 C CNN
F 4 "Kemet" H 3650 3400 60  0001 C CNN "Manu"
F 5 "C0805C103J3GACTU" H 3650 3500 60  0001 C CNN "Manu#"
F 6 "0805" H 3650 3600 60  0001 C CNN "Package"
F 7 " " H 3650 4500 60  0001 C CNN "Desc"
	1    3600 5100
	-1   0    0    1   
$EndComp
$Comp
L Capacitor C23
U 1 1 53A356D1
P 4300 5100
AR Path="/53A356D1" Ref="C23"  Part="1" 
AR Path="/53A17A2E/53A356D1" Ref="C23"  Part="1" 
F 0 "C23" H 4300 5200 40  0000 L CNN
F 1 "1uF" H 4306 5015 40  0000 L CNN
F 2 "Ruwai:Capacitor_SMD0805_HandSoldering" H 4338 4950 30  0001 C CNN
F 3 "" H 4300 5100 60  0000 C CNN
F 4 "Murata" H 3650 3400 60  0001 C CNN "Manu"
F 5 "GRM21BR71H105KA12L" H 3650 3500 60  0001 C CNN "Manu#"
F 6 "0805" H 3650 3600 60  0001 C CNN "Package"
F 7 " " H 3650 4500 60  0001 C CNN "Desc"
	1    4300 5100
	-1   0    0    1   
$EndComp
$Comp
L GND-RESCUE-ruwai_gps_timing_shield #PWR040
U 1 1 53A35727
P 3600 5400
F 0 "#PWR040" H 3600 5400 30  0001 C CNN
F 1 "GND" H 3600 5330 30  0001 C CNN
F 2 "" H 3600 5400 60  0000 C CNN
F 3 "" H 3600 5400 60  0000 C CNN
	1    3600 5400
	1    0    0    -1  
$EndComp
$Comp
L GND-RESCUE-ruwai_gps_timing_shield #PWR041
U 1 1 53A35772
P 4300 5400
F 0 "#PWR041" H 4300 5400 30  0001 C CNN
F 1 "GND" H 4300 5330 30  0001 C CNN
F 2 "" H 4300 5400 60  0000 C CNN
F 3 "" H 4300 5400 60  0000 C CNN
	1    4300 5400
	1    0    0    -1  
$EndComp
$Comp
L Resistor R32
U 1 1 53A35D0D
P 4150 3850
F 0 "R32" V 4230 3850 40  0000 C CNN
F 1 "10" V 4157 3851 40  0000 C CNN
F 2 "Ruwai:Resistor_SMD0102_HandSoldering" V 4080 3850 30  0001 C CNN
F 3 "" H 4150 3850 30  0000 C CNN
F 4 "Yageo" H 3650 3400 60  0001 C CNN "Manu"
F 5 "RC0805FR-0710RL" H 3650 3500 60  0001 C CNN "Manu#"
F 6 "0805" H 3650 3600 60  0001 C CNN "Package"
F 7 " " H 3650 4500 60  0001 C CNN "Desc"
	1    4150 3850
	0    1    1    0   
$EndComp
$Comp
L INDUCTOR_SMALL L21
U 1 1 53A35E95
P 4900 3850
F 0 "L21" H 4900 3950 50  0000 C CNN
F 1 "27nH" H 4900 3800 50  0000 C CNN
F 2 "Ruwai:Inductor_SMD0805_HandSoldering" H 4900 3850 60  0001 C CNN
F 3 "" H 4900 3850 60  0000 C CNN
F 4 "Murata" H 3650 3400 60  0001 C CNN "Manu"
F 5 "LQW2BAS27NJ00L" H 3650 3500 60  0001 C CNN "Manu#"
F 6 "0805" H 3650 3600 60  0001 C CNN "Package"
F 7 " " H 3650 4500 60  0001 C CNN "Desc"
	1    4900 3850
	1    0    0    -1  
$EndComp
$Comp
L Resistor R33
U 1 1 53A35F89
P 4150 4200
F 0 "R33" V 4230 4200 40  0000 C CNN
F 1 "100m" V 4157 4201 40  0000 C CNN
F 2 "Ruwai:Resistor_SMD0805_HandSoldering" V 4080 4200 30  0001 C CNN
F 3 "" H 4150 4200 30  0000 C CNN
F 4 "Bourns" H 3650 3400 60  0001 C CNN "Manu"
F 5 "CRL0805-FW-R100ELF" H 3650 3500 60  0001 C CNN "Manu#"
F 6 "0805" H 3650 3600 60  0001 C CNN "Package"
F 7 " " H 3650 4500 60  0001 C CNN "Desc"
	1    4150 4200
	0    1    1    0   
$EndComp
$Comp
L INDUCTOR_SMALL L20
U 1 1 53A35FC1
P 4900 4200
F 0 "L20" H 4900 4300 50  0000 C CNN
F 1 "27nH" H 4900 4150 50  0000 C CNN
F 2 "Ruwai:Inductor_SMD0805_HandSoldering" H 4900 4200 60  0001 C CNN
F 3 "" H 4900 4200 60  0000 C CNN
F 4 "Murata" H 3650 3400 60  0001 C CNN "Manu"
F 5 "LQW2BAS27NJ00L" H 3650 3500 60  0001 C CNN "Manu#"
F 6 "0805" H 3650 3600 60  0001 C CNN "Package"
F 7 " " H 3650 4500 60  0001 C CNN "Desc"
	1    4900 4200
	1    0    0    -1  
$EndComp
$Comp
L Resistor R31
U 1 1 53A3604D
P 4150 3500
F 0 "R31" V 4230 3500 40  0000 C CNN
F 1 "10" V 4157 3501 40  0000 C CNN
F 2 "Ruwai:Resistor_SMD0102_HandSoldering" V 4080 3500 30  0001 C CNN
F 3 "" H 4150 3500 30  0000 C CNN
F 4 "Yageo" H 3650 3400 60  0001 C CNN "Manu"
F 5 "RC0805FR-0710RL" H 3650 3500 60  0001 C CNN "Manu#"
F 6 "0805" H 3650 3600 60  0001 C CNN "Package"
F 7 " " H 3650 4500 60  0001 C CNN "Desc"
	1    4150 3500
	0    1    1    0   
$EndComp
$Comp
L INDUCTOR_SMALL L22
U 1 1 53A36087
P 4850 3500
F 0 "L22" H 4850 3600 50  0000 C CNN
F 1 "27nH" H 4850 3450 50  0000 C CNN
F 2 "Ruwai:Inductor_SMD0805_HandSoldering" H 4850 3500 60  0001 C CNN
F 3 "" H 4850 3500 60  0000 C CNN
F 4 "Murata" H 3650 3400 60  0001 C CNN "Manu"
F 5 "LQW2BAS27NJ00L" H 3650 3500 60  0001 C CNN "Manu#"
F 6 "0805" H 3650 3600 60  0001 C CNN "Package"
F 7 " " H 3650 4500 60  0001 C CNN "Desc"
	1    4850 3500
	1    0    0    -1  
$EndComp
$Comp
L testpoint TP3
U 1 1 53A360DB
P 3400 3500
F 0 "TP3" H 3300 3350 60  0000 C CNN
F 1 "P3.3V" H 3300 3650 60  0000 C CNN
F 2 "Ruwai:testpoint_1" H 3400 3500 60  0001 C CNN
F 3 "" H 3400 3500 60  0000 C CNN
F 4 "RS" H 3650 3400 60  0001 C CNN "Manu"
F 5 "200-203" H 3650 3500 60  0001 C CNN "Manu#"
F 6 "1mm" H 3650 3600 60  0001 C CNN "Package"
F 7 "Custom Description" H 3650 4500 60  0001 C CNN "Desc"
	1    3400 3500
	1    0    0    -1  
$EndComp
$Comp
L Resistor R30
U 1 1 53A361B0
P 4900 4600
F 0 "R30" V 4980 4600 40  0000 C CNN
F 1 "1.5k" V 4907 4601 40  0000 C CNN
F 2 "Ruwai:Resistor_SMD0102_HandSoldering" V 4830 4600 30  0001 C CNN
F 3 "" H 4900 4600 30  0000 C CNN
F 4 "Yageo" H 3650 3400 60  0001 C CNN "Manu"
F 5 "RC0805FR-071K5L" H 3650 3500 60  0001 C CNN "Manu#"
F 6 "0805" H 3650 3600 60  0001 C CNN "Package"
F 7 " " H 3650 4500 60  0001 C CNN "Desc"
	1    4900 4600
	0    1    1    0   
$EndComp
$Comp
L LED D9
U 1 1 53A3627F
P 5250 5100
F 0 "D9" H 5250 5200 40  0000 C CNN
F 1 "KP-2012SGC" H 5250 5000 40  0000 C CNN
F 2 "Ruwai:LED-0805" H 5250 5100 60  0001 C CNN
F 3 "" H 5250 5100 60  0000 C CNN
F 4 "Knightbright" H 3650 3400 60  0001 C CNN "Manu"
F 5 "KP-2012SGC" H 3650 3500 60  0001 C CNN "Manu#"
F 6 "0805" H 3650 3600 60  0001 C CNN "Package"
F 7 " " H 3650 4500 60  0001 C CNN "Desc"
	1    5250 5100
	0    1    1    0   
$EndComp
$Comp
L GND-RESCUE-ruwai_gps_timing_shield #PWR042
U 1 1 53A36347
P 5250 5400
F 0 "#PWR042" H 5250 5400 30  0001 C CNN
F 1 "GND" H 5250 5330 30  0001 C CNN
F 2 "" H 5250 5400 60  0000 C CNN
F 3 "" H 5250 5400 60  0000 C CNN
	1    5250 5400
	1    0    0    -1  
$EndComp
Text Notes 2600 3200 0    60   ~ 12
3.3V power conditioning
Text HLabel 5550 3500 2    60   Output ~ 12
RTC3.3V
Text HLabel 7400 3850 2    60   Output ~ 12
3.3V
Text HLabel 5550 4200 2    60   Output ~ 12
GPS3.3V
Text HLabel 7400 1200 2    60   Output ~ 12
5V
$Comp
L DiodeSchottky D10
U 1 1 53A3E802
P 8250 5300
F 0 "D10" H 8250 5400 40  0000 C CNN
F 1 "RB751V40T1G" H 8250 5200 40  0000 C CNN
F 2 "Ruwai:diode_sod323" H 8250 5300 60  0001 C CNN
F 3 "" H 8250 5300 60  0000 C CNN
F 4 "ON Semiconductor" H 3650 3400 60  0001 C CNN "Manu"
F 5 "RB751V40T1G" H 3650 3500 60  0001 C CNN "Manu#"
F 6 "SOD-323" H 3650 3600 60  0001 C CNN "Package"
F 7 " " H 3650 4500 60  0001 C CNN "Desc"
	1    8250 5300
	1    0    0    -1  
$EndComp
$Comp
L Resistor R35
U 1 1 53A3E8C9
P 8850 5300
F 0 "R35" V 8930 5300 40  0000 C CNN
F 1 "8.2k" V 8857 5301 40  0000 C CNN
F 2 "Ruwai:Resistor_SMD0805_HandSoldering" V 8780 5300 30  0001 C CNN
F 3 "" H 8850 5300 30  0000 C CNN
F 4 "Yageo" H 3650 3400 60  0001 C CNN "Manu"
F 5 "RC0805FR-078K2L" H 3650 3500 60  0001 C CNN "Manu#"
F 6 "0805" H 3650 3600 60  0001 C CNN "Package"
F 7 " " H 3650 4500 60  0001 C CNN "Desc"
	1    8850 5300
	0    1    1    0   
$EndComp
$Comp
L BATTERY BT1
U 1 1 53A3E929
P 9250 5700
F 0 "BT1" H 9250 5900 50  0000 C CNN
F 1 "BATTERY" H 9250 5510 50  0000 C CNN
F 2 "Ruwai:keystone_500" H 9250 5700 60  0001 C CNN
F 3 "" H 9250 5700 60  0000 C CNN
F 4 "Keystone" H 3650 3400 60  0001 C CNN "Manu"
F 5 "500" H 3650 3500 60  0001 C CNN "Manu#"
F 6 "THM" H 3650 3600 60  0001 C CNN "Package"
F 7 "Custom Description" H 3650 4500 60  0001 C CNN "Desc"
	1    9250 5700
	0    1    1    0   
$EndComp
$Comp
L Resistor R36
U 1 1 53A3EA55
P 10250 5300
F 0 "R36" V 10330 5300 40  0000 C CNN
F 1 "100" V 10257 5301 40  0000 C CNN
F 2 "Ruwai:Resistor_SMD0805_HandSoldering" V 10180 5300 30  0001 C CNN
F 3 "" H 10250 5300 30  0000 C CNN
F 4 "Yageo" H 3650 3400 60  0001 C CNN "Manu"
F 5 "RC0805FR-07100RL" H 3650 3500 60  0001 C CNN "Manu#"
F 6 "0805" H 3650 3600 60  0001 C CNN "Package"
F 7 " " H 3650 4500 60  0001 C CNN "Desc"
	1    10250 5300
	0    1    1    0   
$EndComp
$Comp
L DiodeSchottky D11
U 1 1 53A3EB16
P 9600 5300
F 0 "D11" H 9600 5400 40  0000 C CNN
F 1 "RB751V40T1G" H 9600 5200 40  0000 C CNN
F 2 "Ruwai:diode_sod323" H 9600 5300 60  0001 C CNN
F 3 "" H 9600 5300 60  0000 C CNN
F 4 "ON Semiconductor" H 3650 3400 60  0001 C CNN "Manu"
F 5 "RB751V40T1G" H 3650 3500 60  0001 C CNN "Manu#"
F 6 "SOD-323" H 3650 3600 60  0001 C CNN "Package"
F 7 " " H 3650 4500 60  0001 C CNN "Desc"
	1    9600 5300
	1    0    0    -1  
$EndComp
$Comp
L GND-RESCUE-ruwai_gps_timing_shield #PWR043
U 1 1 53A3EE27
P 9250 6150
F 0 "#PWR043" H 9250 6150 30  0001 C CNN
F 1 "GND" H 9250 6080 30  0001 C CNN
F 2 "" H 9250 6150 60  0000 C CNN
F 3 "" H 9250 6150 60  0000 C CNN
	1    9250 6150
	1    0    0    -1  
$EndComp
Text Label 7850 5300 2    60   ~ 0
3.3V
Text Notes 8750 5050 0    60   ~ 12
Battery power conditioning
$Comp
L Resistor R37
U 1 1 53A40961
P 2250 6450
F 0 "R37" V 2330 6450 40  0000 C CNN
F 1 "10" V 2257 6451 40  0000 C CNN
F 2 "Ruwai:Resistor_SMD0102_HandSoldering" V 2180 6450 30  0001 C CNN
F 3 "" H 2250 6450 30  0000 C CNN
F 4 "Yageo" H 3650 3400 60  0001 C CNN "Manu"
F 5 "RC0805FR-0710RL" H 3650 3500 60  0001 C CNN "Manu#"
F 6 "0805" H 3650 3600 60  0001 C CNN "Package"
F 7 " " H 3650 4500 60  0001 C CNN "Desc"
	1    2250 6450
	0    1    1    0   
$EndComp
$Comp
L Resistor R38
U 1 1 53A40967
P 2250 6650
F 0 "R38" V 2330 6650 40  0000 C CNN
F 1 "10" V 2257 6651 40  0000 C CNN
F 2 "Ruwai:Resistor_SMD0102_HandSoldering" V 2180 6650 30  0001 C CNN
F 3 "" H 2250 6650 30  0000 C CNN
F 4 "Yageo" H 3650 3400 60  0001 C CNN "Manu"
F 5 "RC0805FR-0710RL" H 3650 3500 60  0001 C CNN "Manu#"
F 6 "0805" H 3650 3600 60  0001 C CNN "Package"
F 7 " " H 3650 4500 60  0001 C CNN "Desc"
	1    2250 6650
	0    1    1    0   
$EndComp
Text HLabel 1700 6550 0    60   Input ~ 0
USB_VBUS
$Comp
L TPS79133 U19
U 1 1 53A41290
P 3950 6650
F 0 "U19" H 3650 6400 60  0000 C CNN
F 1 "TPS79133" H 3800 6900 60  0000 C CNN
F 2 "Ruwai:SOT23-5" H 4300 6400 60  0001 C CNN
F 3 "" H 4000 6600 60  0000 C CNN
F 4 "Texas Instruments" H 3650 3400 60  0001 C CNN "Manu"
F 5 "TPS79133DBVT" H 3650 3500 60  0001 C CNN "Manu#"
F 6 "SOT23 5-pin" H 3650 3600 60  0001 C CNN "Package"
F 7 "Single Output LDO, 100mA, Fixed(3.3V), High PSRR, Low Noise" H 3650 4500 60  0001 C CNN "Desc"
	1    3950 6650
	1    0    0    -1  
$EndComp
$Comp
L Capacitor C18
U 1 1 53A41A2C
P 2750 6900
AR Path="/53A41A2C" Ref="C18"  Part="1" 
AR Path="/53A17A2E/53A41A2C" Ref="C18"  Part="1" 
F 0 "C18" H 2750 7000 40  0000 L CNN
F 1 "1uF" H 2756 6815 40  0000 L CNN
F 2 "Ruwai:Capacitor_SMD0805_HandSoldering" H 2788 6750 30  0001 C CNN
F 3 "" H 2750 6900 60  0000 C CNN
F 4 "Murata" H 3650 3400 60  0001 C CNN "Manu"
F 5 "GRM21BR71H105KA12L" H 3650 3500 60  0001 C CNN "Manu#"
F 6 "0805" H 3650 3600 60  0001 C CNN "Package"
F 7 " " H 3650 4500 60  0001 C CNN "Desc"
	1    2750 6900
	-1   0    0    1   
$EndComp
$Comp
L Resistor R41
U 1 1 53A41D88
P 3000 6950
F 0 "R41" V 3080 6950 40  0000 C CNN
F 1 "10k" V 3007 6951 40  0000 C CNN
F 2 "Ruwai:Resistor_SMD0102_HandSoldering" V 2930 6950 30  0001 C CNN
F 3 "" H 3000 6950 30  0000 C CNN
F 4 "Yageo" H 3650 3400 60  0001 C CNN "Manu"
F 5 "RC0805FR-0710KL" H 3650 3500 60  0001 C CNN "Manu#"
F 6 "0805" H 3650 3600 60  0001 C CNN "Package"
F 7 " " H 3650 4500 60  0001 C CNN "Desc"
	1    3000 6950
	-1   0    0    1   
$EndComp
$Comp
L Resistor R34
U 1 1 53A41F84
P 3750 7300
F 0 "R34" V 3830 7300 40  0000 C CNN
F 1 "10k" V 3757 7301 40  0000 C CNN
F 2 "Ruwai:Resistor_SMD0102_HandSoldering" V 3680 7300 30  0001 C CNN
F 3 "" H 3750 7300 30  0000 C CNN
F 4 "Yageo" H 3650 3400 60  0001 C CNN "Manu"
F 5 "RC0805FR-0710KL" H 3650 3500 60  0001 C CNN "Manu#"
F 6 "0805" H 3650 3600 60  0001 C CNN "Package"
F 7 " " H 3650 4500 60  0001 C CNN "Desc"
	1    3750 7300
	0    -1   -1   0   
$EndComp
$Comp
L GND-RESCUE-ruwai_gps_timing_shield #PWR044
U 1 1 53A41FED
P 2750 7600
F 0 "#PWR044" H 2750 7600 30  0001 C CNN
F 1 "GND" H 2750 7530 30  0001 C CNN
F 2 "" H 2750 7600 60  0000 C CNN
F 3 "" H 2750 7600 60  0000 C CNN
	1    2750 7600
	1    0    0    -1  
$EndComp
$Comp
L GND-RESCUE-ruwai_gps_timing_shield #PWR045
U 1 1 53A4201B
P 4100 7600
F 0 "#PWR045" H 4100 7600 30  0001 C CNN
F 1 "GND" H 4100 7530 30  0001 C CNN
F 2 "" H 4100 7600 60  0000 C CNN
F 3 "" H 4100 7600 60  0000 C CNN
	1    4100 7600
	1    0    0    -1  
$EndComp
Text HLabel 2050 7300 0    60   Input ~ 0
~EN_USB_ARD
$Comp
L GND-RESCUE-ruwai_gps_timing_shield #PWR046
U 1 1 53A42BC9
P 3150 7600
F 0 "#PWR046" H 3150 7600 30  0001 C CNN
F 1 "GND" H 3150 7530 30  0001 C CNN
F 2 "" H 3150 7600 60  0000 C CNN
F 3 "" H 3150 7600 60  0000 C CNN
	1    3150 7600
	1    0    0    -1  
$EndComp
$Comp
L GND-RESCUE-ruwai_gps_timing_shield #PWR047
U 1 1 53A42CA6
P 4800 7600
F 0 "#PWR047" H 4800 7600 30  0001 C CNN
F 1 "GND" H 4800 7530 30  0001 C CNN
F 2 "" H 4800 7600 60  0000 C CNN
F 3 "" H 4800 7600 60  0000 C CNN
	1    4800 7600
	1    0    0    -1  
$EndComp
$Comp
L Capacitor C19
U 1 1 53A42CD4
P 4800 7100
AR Path="/53A42CD4" Ref="C19"  Part="1" 
AR Path="/53A17A2E/53A42CD4" Ref="C19"  Part="1" 
F 0 "C19" H 4800 7200 40  0000 L CNN
F 1 "10nF" H 4806 7015 40  0000 L CNN
F 2 "Ruwai:Capacitor_SMD0805_HandSoldering" H 4838 6950 30  0001 C CNN
F 3 "" H 4800 7100 60  0000 C CNN
F 4 "Kemet" H 3650 3400 60  0001 C CNN "Manu"
F 5 "C0805C103J3GACTU" H 3650 3500 60  0001 C CNN "Manu#"
F 6 "0805" H 3650 3600 60  0001 C CNN "Package"
F 7 " " H 3650 4500 60  0001 C CNN "Desc"
	1    4800 7100
	-1   0    0    1   
$EndComp
$Comp
L Capacitor C20
U 1 1 53A42F54
P 5100 7100
AR Path="/53A42F54" Ref="C20"  Part="1" 
AR Path="/53A17A2E/53A42F54" Ref="C20"  Part="1" 
F 0 "C20" H 5100 7200 40  0000 L CNN
F 1 "1uF" H 5106 7015 40  0000 L CNN
F 2 "Ruwai:Capacitor_SMD0805_HandSoldering" H 5138 6950 30  0001 C CNN
F 3 "" H 5100 7100 60  0000 C CNN
F 4 "Murata" H 3650 3400 60  0001 C CNN "Manu"
F 5 "GRM21BR71H105KA12L" H 3650 3500 60  0001 C CNN "Manu#"
F 6 "0805" H 3650 3600 60  0001 C CNN "Package"
F 7 " " H 3650 4500 60  0001 C CNN "Desc"
	1    5100 7100
	-1   0    0    1   
$EndComp
$Comp
L GND-RESCUE-ruwai_gps_timing_shield #PWR048
U 1 1 53A42FBF
P 5100 7600
F 0 "#PWR048" H 5100 7600 30  0001 C CNN
F 1 "GND" H 5100 7530 30  0001 C CNN
F 2 "" H 5100 7600 60  0000 C CNN
F 3 "" H 5100 7600 60  0000 C CNN
F 4 " " H 3650 3400 60  0001 C CNN "Manu"
F 5 " " H 3650 3500 60  0001 C CNN "Manu#"
F 6 " " H 3650 3600 60  0001 C CNN "Package"
F 7 " " H 3650 4500 60  0001 C CNN "Desc"
	1    5100 7600
	1    0    0    -1  
$EndComp
$Comp
L Resistor R29
U 1 1 53A42FEF
P 5500 6550
F 0 "R29" V 5580 6550 40  0000 C CNN
F 1 "1.5k" V 5507 6551 40  0000 C CNN
F 2 "Ruwai:Resistor_SMD0102_HandSoldering" V 5430 6550 30  0001 C CNN
F 3 "" H 5500 6550 30  0000 C CNN
F 4 "Yageo" H 3650 3400 60  0001 C CNN "Manu"
F 5 "RC0805FR-071K5L" H 3650 3500 60  0001 C CNN "Manu#"
F 6 "0805" H 3650 3600 60  0001 C CNN "Package"
F 7 " " H 3650 4500 60  0001 C CNN "Desc"
	1    5500 6550
	0    -1   -1   0   
$EndComp
$Comp
L LED D7
U 1 1 53A43098
P 5950 7100
F 0 "D7" H 5950 7200 40  0000 C CNN
F 1 "KP-2012SGC" H 5950 7000 40  0000 C CNN
F 2 "Ruwai:LED-0805" H 5950 7100 60  0001 C CNN
F 3 "" H 5950 7100 60  0000 C CNN
F 4 "Knightbright" H 3650 3400 60  0001 C CNN "Manu"
F 5 "KP-2012SGC" H 3650 3500 60  0001 C CNN "Manu#"
F 6 "0805" H 3650 3600 60  0001 C CNN "Package"
F 7 " " H 3650 4500 60  0001 C CNN "Desc"
	1    5950 7100
	0    1    1    0   
$EndComp
$Comp
L GND-RESCUE-ruwai_gps_timing_shield #PWR049
U 1 1 53A43157
P 5950 7600
F 0 "#PWR049" H 5950 7600 30  0001 C CNN
F 1 "GND" H 5950 7530 30  0001 C CNN
F 2 "" H 5950 7600 60  0000 C CNN
F 3 "" H 5950 7600 60  0000 C CNN
	1    5950 7600
	1    0    0    -1  
$EndComp
Text HLabel 5750 6200 2    60   Output ~ 0
VUSB
Text Notes 4400 6050 2    60   ~ 12
USB power conditioning
Wire Wire Line
	1550 1550 2700 1550
Wire Wire Line
	2700 1750 2550 1750
Wire Wire Line
	2550 1350 2550 1850
Wire Wire Line
	2550 2350 2550 2500
Wire Wire Line
	2700 1650 2300 1650
Wire Wire Line
	2300 1650 2300 2500
Wire Wire Line
	2550 1350 2450 1350
Connection ~ 2550 1750
Wire Wire Line
	1950 1350 1850 1350
Wire Wire Line
	1850 1350 1850 1900
Wire Wire Line
	1850 2300 1850 2500
Connection ~ 1850 1550
Wire Wire Line
	4000 1550 5150 1550
Wire Wire Line
	5800 1550 5800 1900
Wire Wire Line
	5000 2300 5000 2500
Wire Wire Line
	4700 2300 4700 2500
Wire Wire Line
	4100 2300 4100 2500
Wire Wire Line
	4000 1750 4100 1750
Wire Wire Line
	4100 1750 4100 1900
Wire Wire Line
	4700 1900 4700 1550
Connection ~ 4700 1550
Wire Wire Line
	5000 1900 5000 1550
Connection ~ 5000 1550
Connection ~ 4400 1550
Wire Wire Line
	5800 2300 5800 2500
Wire Wire Line
	5650 1550 5800 1550
Wire Wire Line
	2200 4700 2050 4700
Wire Wire Line
	2050 4700 2050 5400
Wire Wire Line
	2200 4800 2050 4800
Connection ~ 2050 4800
Wire Wire Line
	1550 4600 2200 4600
Wire Wire Line
	1550 4500 1550 4700
Wire Wire Line
	1550 4500 1450 4500
Wire Wire Line
	1550 4700 1450 4700
Connection ~ 1550 4600
Wire Wire Line
	1800 4900 1800 4600
Connection ~ 1800 4600
Wire Wire Line
	1800 5300 1800 5400
Wire Wire Line
	950  4500 850  4500
Wire Wire Line
	850  4500 850  4700
Wire Wire Line
	850  4600 650  4600
Wire Wire Line
	850  4700 950  4700
Connection ~ 850  4600
Wire Wire Line
	3600 4800 3600 4900
Wire Wire Line
	4300 4600 4300 4900
Wire Wire Line
	3600 5300 3600 5400
Wire Wire Line
	4300 5300 4300 5400
Wire Wire Line
	3500 4600 4650 4600
Wire Wire Line
	5150 4600 5250 4600
Wire Wire Line
	5250 4600 5250 4900
Wire Wire Line
	5250 5300 5250 5400
Connection ~ 4300 4600
Wire Wire Line
	3750 3500 3750 4600
Wire Wire Line
	3500 3500 3900 3500
Connection ~ 3750 4600
Wire Wire Line
	3750 3850 3900 3850
Connection ~ 3750 3850
Wire Wire Line
	3750 4200 3900 4200
Connection ~ 3750 4200
Connection ~ 3750 3500
Wire Wire Line
	4400 3500 4600 3500
Wire Wire Line
	4400 3850 4650 3850
Wire Wire Line
	4400 4200 4650 4200
Wire Wire Line
	5100 3500 5550 3500
Wire Wire Line
	5150 3850 7400 3850
Wire Wire Line
	5150 4200 5550 4200
Wire Wire Line
	4400 1550 4400 1200
Wire Wire Line
	4400 1200 7400 1200
Wire Wire Line
	8050 5300 7850 5300
Wire Wire Line
	8450 5300 8600 5300
Wire Wire Line
	9100 5300 9400 5300
Wire Wire Line
	9800 5300 10000 5300
Wire Wire Line
	10500 5300 10700 5300
Wire Wire Line
	9250 5400 9250 5300
Connection ~ 9250 5300
Wire Wire Line
	9250 6000 9250 6150
Wire Wire Line
	2600 6450 2600 6650
Wire Wire Line
	2600 6450 2500 6450
Wire Wire Line
	2600 6650 2500 6650
Connection ~ 2600 6550
Wire Wire Line
	2000 6450 1900 6450
Wire Wire Line
	1900 6450 1900 6650
Wire Wire Line
	1900 6550 1700 6550
Wire Wire Line
	1900 6650 2000 6650
Connection ~ 1900 6550
Wire Wire Line
	2600 6550 3300 6550
Wire Wire Line
	2750 6700 2750 6550
Connection ~ 2750 6550
Wire Wire Line
	3000 6700 3000 6550
Connection ~ 3000 6550
Wire Wire Line
	2750 7100 2750 7600
Wire Wire Line
	2050 7300 3500 7300
Wire Wire Line
	3000 7200 3000 7300
Connection ~ 3000 7300
Wire Wire Line
	4000 7300 4100 7300
Wire Wire Line
	4100 7300 4100 7600
Wire Wire Line
	3300 6750 3250 6750
Wire Wire Line
	3250 6750 3250 7300
Connection ~ 3250 7300
Wire Wire Line
	3300 6650 3150 6650
Wire Wire Line
	3150 6650 3150 7600
Wire Wire Line
	4600 6750 4800 6750
Wire Wire Line
	4800 6750 4800 6900
Wire Wire Line
	4800 7300 4800 7600
Wire Wire Line
	4600 6550 5250 6550
Wire Wire Line
	5750 6550 5950 6550
Wire Wire Line
	5950 6550 5950 6900
Wire Wire Line
	5950 7300 5950 7600
Wire Wire Line
	5100 6200 5100 6900
Connection ~ 5100 6550
Wire Wire Line
	5100 7300 5100 7600
Wire Wire Line
	5100 6200 5750 6200
Wire Wire Line
	6450 950  6450 1200
Connection ~ 6450 1200
Text HLabel 10700 5300 2    60   Output ~ 12
VBAT
Wire Wire Line
	3500 4800 3600 4800
Wire Wire Line
	650  4600 650  950 
Wire Wire Line
	650  950  6450 950 
$Comp
L PWR_FLAG #FLG050
U 1 1 53AB3EC7
P 2050 4500
F 0 "#FLG050" H 2050 4595 30  0001 C CNN
F 1 "PWR_FLAG" H 2050 4680 30  0000 C CNN
F 2 "" H 2050 4500 60  0000 C CNN
F 3 "" H 2050 4500 60  0000 C CNN
	1    2050 4500
	1    0    0    -1  
$EndComp
Wire Wire Line
	2050 4500 2050 4600
Connection ~ 2050 4600
$Comp
L PWR_FLAG #FLG051
U 1 1 53AB4196
P 3200 6450
F 0 "#FLG051" H 3200 6545 30  0001 C CNN
F 1 "PWR_FLAG" H 3200 6630 30  0000 C CNN
F 2 "" H 3200 6450 60  0000 C CNN
F 3 "" H 3200 6450 60  0000 C CNN
	1    3200 6450
	1    0    0    -1  
$EndComp
Wire Wire Line
	3200 6450 3200 6550
Connection ~ 3200 6550
$Comp
L PWR_FLAG #FLG052
U 1 1 53AB54AD
P 7200 3700
F 0 "#FLG052" H 7200 3795 30  0001 C CNN
F 1 "PWR_FLAG" H 7200 3880 30  0000 C CNN
F 2 "" H 7200 3700 60  0000 C CNN
F 3 "" H 7200 3700 60  0000 C CNN
	1    7200 3700
	1    0    0    -1  
$EndComp
Wire Wire Line
	7200 3700 7200 3850
Connection ~ 7200 3850
$Comp
L PWR_FLAG #FLG053
U 1 1 53AB5607
P 5400 3350
F 0 "#FLG053" H 5400 3445 30  0001 C CNN
F 1 "PWR_FLAG" H 5400 3530 30  0000 C CNN
F 2 "" H 5400 3350 60  0000 C CNN
F 3 "" H 5400 3350 60  0000 C CNN
	1    5400 3350
	1    0    0    -1  
$EndComp
Wire Wire Line
	5400 3350 5400 3500
Connection ~ 5400 3500
$Comp
L PWR_FLAG #FLG054
U 1 1 53AB5702
P 5450 4100
F 0 "#FLG054" H 5450 4195 30  0001 C CNN
F 1 "PWR_FLAG" H 5450 4280 30  0000 C CNN
F 2 "" H 5450 4100 60  0000 C CNN
F 3 "" H 5450 4100 60  0000 C CNN
	1    5450 4100
	1    0    0    -1  
$EndComp
Wire Wire Line
	5450 4100 5450 4200
Connection ~ 5450 4200
$Comp
L PWR_FLAG #FLG055
U 1 1 53AB5B4F
P 10600 5200
F 0 "#FLG055" H 10600 5295 30  0001 C CNN
F 1 "PWR_FLAG" H 10600 5380 30  0000 C CNN
F 2 "" H 10600 5200 60  0000 C CNN
F 3 "" H 10600 5200 60  0000 C CNN
	1    10600 5200
	1    0    0    -1  
$EndComp
Wire Wire Line
	10600 5200 10600 5300
Connection ~ 10600 5300
$Comp
L GND-RESCUE-ruwai_gps_timing_shield #PWR056
U 1 1 53AD5355
P 8550 2500
F 0 "#PWR056" H 8550 2500 30  0001 C CNN
F 1 "GND" H 8550 2430 30  0001 C CNN
F 2 "" H 8550 2500 60  0000 C CNN
F 3 "" H 8550 2500 60  0000 C CNN
	1    8550 2500
	1    0    0    -1  
$EndComp
$Comp
L RFGND #PWR057
U 1 1 53AD5390
P 9000 2500
F 0 "#PWR057" H 9000 2500 40  0001 C CNN
F 1 "RFGND" H 9000 2430 40  0000 C CNN
F 2 "" H 9000 2500 60  0000 C CNN
F 3 "" H 9000 2500 60  0000 C CNN
	1    9000 2500
	1    0    0    -1  
$EndComp
Wire Wire Line
	8550 2500 8550 2350
Wire Wire Line
	8550 2350 9000 2350
Wire Wire Line
	9000 2350 9000 2500
Text Notes 3125 6850 3    60   ~ 0
DNP\n
$EndSCHEMATC
