EESchema Schematic File Version 2
LIBS:ruwai
LIBS:power
LIBS:device
LIBS:transistors
LIBS:conn
LIBS:linear
LIBS:regul
LIBS:74xx
LIBS:cmos4000
LIBS:adc-dac
LIBS:memory
LIBS:xilinx
LIBS:microcontrollers
LIBS:dsp
LIBS:microchip
LIBS:analog_switches
LIBS:motorola
LIBS:texas
LIBS:intel
LIBS:audio
LIBS:interface
LIBS:digital-audio
LIBS:philips
LIBS:display
LIBS:cypress
LIBS:siliconi
LIBS:opto
LIBS:atmel
LIBS:contrib
LIBS:valves
LIBS:adc_ai_pga-cache
EELAYER 25 0
EELAYER END
$Descr A4 11693 8268
encoding utf-8
Sheet 3 6
Title "Ruwai ADC analog interface with PGA"
Date "2017-09-15"
Rev "3"
Comp "copyright Mertl Research GmbH 2014"
Comment1 ""
Comment2 ""
Comment3 ""
Comment4 "This documentation describes Open Hardware and is licensed under the CERN OHL v. 1.2."
$EndDescr
$Comp
L PGA281 U7
U 1 1 5471538E
P 3750 5550
F 0 "U7" H 3400 5050 60  0000 C CNN
F 1 "PGA281" H 3500 6050 60  0000 C CNN
F 2 "SSOP_Packages:TSSOP-16_4.4x5mm_Pitch0.65mm" H 4900 5050 60  0001 C CNN
F 3 "" H 3750 5550 60  0000 C CNN
F 4 "Texas Instruments" H 3750 4800 60  0001 L CNN "Manu"
F 5 "PGA281AIPW" H 3750 4700 60  0001 L CNN "Manu#"
F 6 "TSSOP 16-pin" H 3750 4600 60  0001 L CNN "Package"
F 7 "Zero-Drift, High Voltage Programmable Gain Amplifier" H 3750 4500 60  0001 L CNN "Desc"
	1    3750 5550
	1    0    0    -1  
$EndComp
$Comp
L PCF8574_DGV_PW U8
U 1 1 54715399
P 3775 6825
F 0 "U8" H 3425 6225 60  0000 C CNN
F 1 "PCF8574_DGV_PW" H 3775 7425 60  0000 C CNN
F 2 "Ruwai:TSSOP-20_4.4x6.5mm_Pitch0.65mm" H 4975 6225 60  0001 C CNN
F 3 "" H 3775 6825 60  0000 C CNN
F 4 "Texas Instruments" H 3775 6075 60  0001 L CNN "Manu"
F 5 "PCF8574PWR" H 3775 5975 60  0001 L CNN "Manu#"
F 6 "TSSOP 20-pin" H 3775 5875 60  0001 L CNN "Package"
F 7 "Remote 8-Bit I/O Expander for I2C-Bus" H 3775 5775 60  0001 L CNN "Desc"
	1    3775 6825
	1    0    0    -1  
$EndComp
$Comp
L Resistor R23
U 1 1 547153F1
P 8725 1375
F 0 "R23" V 8805 1375 40  0000 C CNN
F 1 "10k" V 8732 1376 40  0000 C CNN
F 2 "Ruwai:Resistor_SMD0102_ReflowWave" V 8655 1375 30  0001 C CNN
F 3 "" V 8805 1375 30  0000 C CNN
F 4 "Yageo" H 8725 875 60  0001 L CNN "Manu"
F 5 "RC0805FR-0710KL" H 8725 775 60  0001 L CNN "Manu#"
F 6 "0805" H 8725 675 60  0001 L CNN "Package"
F 7 " " H 8725 575 60  0001 L CNN "Desc"
	1    8725 1375
	0    1    1    0   
$EndComp
$Comp
L Resistor R24
U 1 1 547153FC
P 8025 1375
F 0 "R24" V 8105 1375 40  0000 C CNN
F 1 "10k" V 8032 1376 40  0000 C CNN
F 2 "Ruwai:Resistor_SMD0102_ReflowWave" V 7955 1375 30  0001 C CNN
F 3 "" V 8105 1375 30  0000 C CNN
F 4 "Yageo" H 8025 875 60  0001 L CNN "Manu"
F 5 "RC0805FR-0710KL" H 8025 775 60  0001 L CNN "Manu#"
F 6 "0805" H 8025 675 60  0001 L CNN "Package"
F 7 " " H 8025 575 60  0001 L CNN "Desc"
	1    8025 1375
	0    1    1    0   
$EndComp
$Comp
L Resistor R20
U 1 1 54715407
P 6075 1525
F 0 "R20" V 6155 1525 40  0000 C CNN
F 1 "10k" V 6082 1526 40  0000 C CNN
F 2 "Ruwai:Resistor_SMD0102_ReflowWave" V 6005 1525 30  0001 C CNN
F 3 "" V 6155 1525 30  0000 C CNN
F 4 "Yageo" H 6075 1025 60  0001 L CNN "Manu"
F 5 "RC0805FR-0710KL" H 6075 925 60  0001 L CNN "Manu#"
F 6 "0805" H 6075 825 60  0001 L CNN "Package"
F 7 " " H 6075 725 60  0001 L CNN "Desc"
	1    6075 1525
	0    1    1    0   
$EndComp
$Comp
L Resistor R21
U 1 1 54715412
P 5025 1525
F 0 "R21" V 5105 1525 40  0000 C CNN
F 1 "10k" V 5032 1526 40  0000 C CNN
F 2 "Ruwai:Resistor_SMD0102_ReflowWave" V 4955 1525 30  0001 C CNN
F 3 "" V 5105 1525 30  0000 C CNN
F 4 "Yageo" H 5025 1025 60  0001 L CNN "Manu"
F 5 "RC0805FR-0710KL" H 5025 925 60  0001 L CNN "Manu#"
F 6 "0805" H 5025 825 60  0001 L CNN "Package"
F 7 " " H 5025 725 60  0001 L CNN "Desc"
	1    5025 1525
	0    1    1    0   
$EndComp
$Comp
L Resistor R22
U 1 1 5471541D
P 4325 1525
F 0 "R22" V 4405 1525 40  0000 C CNN
F 1 "10k" V 4332 1526 40  0000 C CNN
F 2 "Ruwai:Resistor_SMD0102_ReflowWave" V 4255 1525 30  0001 C CNN
F 3 "" V 4405 1525 30  0000 C CNN
F 4 "Yageo" H 4325 1025 60  0001 L CNN "Manu"
F 5 "RC0805FR-0710KL" H 4325 925 60  0001 L CNN "Manu#"
F 6 "0805" H 4325 825 60  0001 L CNN "Package"
F 7 " " H 4325 725 60  0001 L CNN "Desc"
	1    4325 1525
	0    1    1    0   
$EndComp
$Comp
L Capacitor C22
U 1 1 54715428
P 8375 1025
F 0 "C22" H 8375 1125 40  0000 L CNN
F 1 "47nF" H 8381 940 40  0000 L CNN
F 2 "Ruwai:Capacitor_SMD1206_ReflowWave" H 8413 875 30  0001 C CNN
F 3 "" H 8375 1125 60  0000 C CNN
F 4 "Murata" H 8425 625 60  0001 L CNN "Manu"
F 5 "GRM31M5C1H473JA01L" H 8425 525 60  0001 L CNN "Manu#"
F 6 "1206" H 8425 425 60  0001 L CNN "Package"
F 7 "Custom Description" H 8375 675 60  0001 L CNN "Desc"
	1    8375 1025
	1    0    0    -1  
$EndComp
$Comp
L Capacitor C25
U 1 1 54715433
P 5725 1125
F 0 "C25" H 5725 1225 40  0000 L CNN
F 1 "4.7nF" H 5731 1040 40  0000 L CNN
F 2 "Ruwai:Capacitor_SMD0805_ReflowWave" H 5763 975 30  0001 C CNN
F 3 "" H 5725 1225 60  0000 C CNN
F 4 "Murata" H 5775 725 60  0001 L CNN "Manu"
F 5 "GRM2165C1H472JA01D" H 5775 625 60  0001 L CNN "Manu#"
F 6 "0805" H 5775 525 60  0001 L CNN "Package"
F 7 "Custom Description" H 5725 775 60  0001 L CNN "Desc"
	1    5725 1125
	1    0    0    -1  
$EndComp
$Comp
L Capacitor C19
U 1 1 5471543E
P 5425 1125
F 0 "C19" H 5425 1225 40  0000 L CNN
F 1 "22nF" H 5431 1040 40  0000 L CNN
F 2 "Ruwai:Capacitor_SMD0805_ReflowWave" H 5463 975 30  0001 C CNN
F 3 "" H 5425 1225 60  0000 C CNN
F 4 "Kemet" H 5475 725 60  0001 L CNN "Manu"
F 5 "CGA4J2C0G1H223J125AA" H 5475 625 60  0001 L CNN "Manu#"
F 6 "0805" H 5475 525 60  0001 L CNN "Package"
F 7 "Custom Description" H 5425 775 60  0001 L CNN "Desc"
	1    5425 1125
	1    0    0    -1  
$EndComp
$Comp
L Capacitor C21
U 1 1 54715449
P 9075 2025
F 0 "C21" H 9075 2125 40  0000 L CNN
F 1 "2.2nF" H 9081 1940 40  0000 L CNN
F 2 "Ruwai:Capacitor_SMD0805_ReflowWave" H 9113 1875 30  0001 C CNN
F 3 "" H 9075 2125 60  0000 C CNN
F 4 "Multicomp" H 9125 1625 60  0001 L CNN "Manu"
F 5 "MCU0805C222JCT " H 9125 1525 60  0001 L CNN "Manu#"
F 6 "0805" H 9125 1425 60  0001 L CNN "Package"
F 7 "Custom Description" H 9075 1675 60  0001 L CNN "Desc"
	1    9075 2025
	1    0    0    -1  
$EndComp
$Comp
L Capacitor C27
U 1 1 54715454
P 6425 2025
F 0 "C27" H 6425 2125 40  0000 L CNN
F 1 "3.3nF" H 6431 1940 40  0000 L CNN
F 2 "Ruwai:Capacitor_SMD0805_ReflowWave" H 6463 1875 30  0001 C CNN
F 3 "" H 6425 2125 60  0000 C CNN
F 4 "Murata" H 6475 1625 60  0001 L CNN "Manu"
F 5 "GRM2165C1H332JA01D" H 6475 1525 60  0001 L CNN "Manu#"
F 6 "0805" H 6475 1425 60  0001 L CNN "Package"
F 7 "Custom Description" H 6425 1675 60  0001 L CNN "Desc"
	1    6425 2025
	1    0    0    -1  
$EndComp
$Comp
L Capacitor C20
U 1 1 5471545F
P 4675 2025
F 0 "C20" H 4675 2125 40  0000 L CNN
F 1 "10nF" H 4681 1940 40  0000 L CNN
F 2 "Ruwai:Capacitor_SMD0805_ReflowWave" H 4713 1875 30  0001 C CNN
F 3 "" H 4675 2125 60  0000 C CNN
F 4 "Kemet" H 4725 1625 60  0001 L CNN "Manu"
F 5 "C0805C103J3GACTU" H 4725 1525 60  0001 L CNN "Manu#"
F 6 "0805" H 4725 1425 60  0001 L CNN "Package"
F 7 "Custom Description" H 4675 1675 60  0001 L CNN "Desc"
	1    4675 2025
	1    0    0    -1  
$EndComp
$Comp
L Resistor R29
U 1 1 5471546A
P 8025 2675
F 0 "R29" V 8105 2675 40  0000 C CNN
F 1 "10k" V 8032 2676 40  0000 C CNN
F 2 "Ruwai:Resistor_SMD0102_ReflowWave" V 7955 2675 30  0001 C CNN
F 3 "" V 8105 2675 30  0000 C CNN
F 4 "Yageo" H 8025 2175 60  0001 L CNN "Manu"
F 5 "RC0805FR-0710KL" H 8025 2075 60  0001 L CNN "Manu#"
F 6 "0805" H 8025 1975 60  0001 L CNN "Package"
F 7 " " H 8025 1875 60  0001 L CNN "Desc"
	1    8025 2675
	0    1    1    0   
$EndComp
$Comp
L Resistor R28
U 1 1 54715475
P 8725 2675
F 0 "R28" V 8805 2675 40  0000 C CNN
F 1 "10k" V 8732 2676 40  0000 C CNN
F 2 "Ruwai:Resistor_SMD0102_ReflowWave" V 8655 2675 30  0001 C CNN
F 3 "" V 8805 2675 30  0000 C CNN
F 4 "Yageo" H 8725 2175 60  0001 L CNN "Manu"
F 5 "RC0805FR-0710KL" H 8725 2075 60  0001 L CNN "Manu#"
F 6 "0805" H 8725 1975 60  0001 L CNN "Package"
F 7 " " H 8725 1875 60  0001 L CNN "Desc"
	1    8725 2675
	0    1    1    0   
$EndComp
$Comp
L Capacitor C24
U 1 1 54715480
P 8375 3025
F 0 "C24" H 8375 3125 40  0000 L CNN
F 1 "47nF" H 8381 2940 40  0000 L CNN
F 2 "Ruwai:Capacitor_SMD1206_ReflowWave" H 8413 2875 30  0001 C CNN
F 3 "" H 8375 3125 60  0000 C CNN
F 4 "Murata" H 8425 2625 60  0001 L CNN "Manu"
F 5 "GRM31M5C1H473JA01L" H 8425 2525 60  0001 L CNN "Manu#"
F 6 "1206" H 8425 2425 60  0001 L CNN "Package"
F 7 "Custom Description" H 8375 2675 60  0001 L CNN "Desc"
	1    8375 3025
	1    0    0    -1  
$EndComp
$Comp
L Resistor R25
U 1 1 5471548B
P 6075 2525
F 0 "R25" V 6155 2525 40  0000 C CNN
F 1 "10k" V 6082 2526 40  0000 C CNN
F 2 "Ruwai:Resistor_SMD0102_ReflowWave" V 6005 2525 30  0001 C CNN
F 3 "" V 6155 2525 30  0000 C CNN
F 4 "Yageo" H 6075 2025 60  0001 L CNN "Manu"
F 5 "RC0805FR-0710KL" H 6075 1925 60  0001 L CNN "Manu#"
F 6 "0805" H 6075 1825 60  0001 L CNN "Package"
F 7 " " H 6075 1725 60  0001 L CNN "Desc"
	1    6075 2525
	0    1    1    0   
$EndComp
$Comp
L Resistor R26
U 1 1 54715496
P 5025 2525
F 0 "R26" V 5105 2525 40  0000 C CNN
F 1 "10k" V 5032 2526 40  0000 C CNN
F 2 "Ruwai:Resistor_SMD0102_ReflowWave" V 4955 2525 30  0001 C CNN
F 3 "" V 5105 2525 30  0000 C CNN
F 4 "Yageo" H 5025 2025 60  0001 L CNN "Manu"
F 5 "RC0805FR-0710KL" H 5025 1925 60  0001 L CNN "Manu#"
F 6 "0805" H 5025 1825 60  0001 L CNN "Package"
F 7 " " H 5025 1725 60  0001 L CNN "Desc"
	1    5025 2525
	0    1    1    0   
$EndComp
$Comp
L Resistor R27
U 1 1 547154A1
P 4325 2525
F 0 "R27" V 4405 2525 40  0000 C CNN
F 1 "10k" V 4332 2526 40  0000 C CNN
F 2 "Ruwai:Resistor_SMD0102_ReflowWave" V 4255 2525 30  0001 C CNN
F 3 "" V 4405 2525 30  0000 C CNN
F 4 "Yageo" H 4325 2025 60  0001 L CNN "Manu"
F 5 "RC0805FR-0710KL" H 4325 1925 60  0001 L CNN "Manu#"
F 6 "0805" H 4325 1825 60  0001 L CNN "Package"
F 7 " " H 4325 1725 60  0001 L CNN "Desc"
	1    4325 2525
	0    1    1    0   
$EndComp
$Comp
L Capacitor C26
U 1 1 547154AC
P 5725 2925
F 0 "C26" H 5725 3025 40  0000 L CNN
F 1 "4.7nF" H 5731 2840 40  0000 L CNN
F 2 "Ruwai:Capacitor_SMD0805_ReflowWave" H 5763 2775 30  0001 C CNN
F 3 "" H 5725 3025 60  0000 C CNN
F 4 "Murata" H 5775 2525 60  0001 L CNN "Manu"
F 5 "GRM2165C1H472JA01D" H 5775 2425 60  0001 L CNN "Manu#"
F 6 "0805" H 5775 2325 60  0001 L CNN "Package"
F 7 "Custom Description" H 5725 2575 60  0001 L CNN "Desc"
	1    5725 2925
	1    0    0    -1  
$EndComp
$Comp
L Capacitor C23
U 1 1 547154B7
P 5425 2925
F 0 "C23" H 5425 3025 40  0000 L CNN
F 1 "22nF" H 5431 2840 40  0000 L CNN
F 2 "Ruwai:Capacitor_SMD0805_ReflowWave" H 5463 2775 30  0001 C CNN
F 3 "" H 5425 3025 60  0000 C CNN
F 4 "Kemet" H 5475 2525 60  0001 L CNN "Manu"
F 5 "CGA4J2C0G1H223J125AA" H 5475 2425 60  0001 L CNN "Manu#"
F 6 "0805" H 5475 2325 60  0001 L CNN "Package"
F 7 "Custom Description" H 5425 2575 60  0001 L CNN "Desc"
	1    5425 2925
	1    0    0    -1  
$EndComp
$Comp
L GND #PWR021
U 1 1 547154BE
P 10175 5050
F 0 "#PWR021" H 10175 5050 30  0001 C CNN
F 1 "GND" H 10175 4980 30  0001 C CNN
F 2 "" H 10175 5050 60  0000 C CNN
F 3 "" H 10175 5050 60  0000 C CNN
	1    10175 5050
	1    0    0    -1  
$EndComp
$Comp
L GND #PWR022
U 1 1 547154C4
P 10125 6350
F 0 "#PWR022" H 10125 6350 30  0001 C CNN
F 1 "GND" H 10125 6280 30  0001 C CNN
F 2 "" H 10125 6350 60  0000 C CNN
F 3 "" H 10125 6350 60  0000 C CNN
	1    10125 6350
	1    0    0    -1  
$EndComp
$Comp
L inductor L5
U 1 1 547154CE
P 9250 4025
F 0 "L5" H 9250 4075 40  0000 C BNN
F 1 "1uH" H 9250 3975 40  0000 C CNN
F 2 "Ruwai:Inductor_SMD0805_ReflowWave" H 9150 4025 60  0001 C CNN
F 3 "" H 9150 4025 60  0000 C CNN
F 4 "Taiyo Yuden" H 9250 3825 60  0001 L BNN "Manu"
F 5 "BRL2012T1R0M " H 9250 3725 60  0001 L BNN "Manu#"
F 6 "0805" H 9250 3625 60  0001 L BNN "Package"
F 7 "Custom description." H 9250 3525 60  0001 L BNN "Desc"
	1    9250 4025
	1    0    0    -1  
$EndComp
$Comp
L Capacitor C29
U 1 1 547154D9
P 9625 4500
F 0 "C29" H 9625 4600 40  0000 L CNN
F 1 "100nF" H 9631 4415 40  0000 L CNN
F 2 "Ruwai:Capacitor_SMD0805_ReflowWave" H 9663 4350 30  0001 C CNN
F 3 "" H 9625 4600 60  0000 C CNN
F 4 "Murata" H 9675 4100 60  0001 L CNN "Manu"
F 5 "GCM21BR71H104KA37L" H 9675 4000 60  0001 L CNN "Manu#"
F 6 "0805" H 9675 3900 60  0001 L CNN "Package"
F 7 "Custom Description" H 9625 4150 60  0001 L CNN "Desc"
	1    9625 4500
	1    0    0    -1  
$EndComp
$Comp
L GND #PWR023
U 1 1 547154E0
P 9625 5050
F 0 "#PWR023" H 9625 5050 30  0001 C CNN
F 1 "GND" H 9625 4980 30  0001 C CNN
F 2 "" H 9625 5050 60  0000 C CNN
F 3 "" H 9625 5050 60  0000 C CNN
	1    9625 5050
	1    0    0    -1  
$EndComp
$Comp
L GND #PWR024
U 1 1 547154E6
P 9650 6350
F 0 "#PWR024" H 9650 6350 30  0001 C CNN
F 1 "GND" H 9650 6280 30  0001 C CNN
F 2 "" H 9650 6350 60  0000 C CNN
F 3 "" H 9650 6350 60  0000 C CNN
	1    9650 6350
	1    0    0    -1  
$EndComp
Text HLabel 8900 4025 0    60   Input ~ 0
5V_PGA
Text HLabel 8800 5325 0    60   Input ~ 0
5V_PGA
Text Label 2900 7275 2    60   ~ 0
PGA_G0
Text Label 4700 7275 0    60   ~ 0
PGA_G1
Text Label 4700 7175 0    60   ~ 0
PGA_G2
Text Label 4700 6975 0    60   ~ 0
PGA_G3
Text Label 4700 6775 0    60   ~ 0
PGA_G4
Text Label 2925 5800 2    60   ~ 0
PGA_G0
Text Label 2925 5700 2    60   ~ 0
PGA_G1
Text Label 2925 5600 2    60   ~ 0
PGA_G2
Text Label 2925 5500 2    60   ~ 0
PGA_G3
Text Label 2925 5400 2    60   ~ 0
PGA_G4
NoConn ~ 4375 6475
NoConn ~ 4375 6375
NoConn ~ 3175 6375
$Comp
L GND #PWR025
U 1 1 547154FB
P 3025 7650
F 0 "#PWR025" H 3025 7650 30  0001 C CNN
F 1 "GND" H 3025 7580 30  0001 C CNN
F 2 "" H 3025 7650 60  0000 C CNN
F 3 "" H 3025 7650 60  0000 C CNN
	1    3025 7650
	1    0    0    -1  
$EndComp
Text HLabel 2900 6675 0    60   Input ~ 0
SDA_3
Text HLabel 2900 6475 0    60   Input ~ 0
SCL_3
$Comp
L Resistor R33
U 1 1 54715507
P 1775 6775
F 0 "R33" V 1855 6775 40  0000 C CNN
F 1 "10" V 1782 6776 40  0000 C CNN
F 2 "Ruwai:Resistor_SMD0805_ReflowWave" V 1705 6775 30  0001 C CNN
F 3 "" V 1855 6775 30  0000 C CNN
F 4 "Yageo" H 1775 6275 60  0001 L CNN "Manu"
F 5 "RC0805FR-0710RL" H 1775 6175 60  0001 L CNN "Manu#"
F 6 "0805" H 1775 6075 60  0001 L CNN "Package"
F 7 "Custom Description" H 1775 5975 60  0001 L CNN "Desc"
	1    1775 6775
	0    1    1    0   
$EndComp
$Comp
L GND #PWR026
U 1 1 5471550E
P 2300 7650
F 0 "#PWR026" H 2300 7650 30  0001 C CNN
F 1 "GND" H 2300 7580 30  0001 C CNN
F 2 "" H 2300 7650 60  0000 C CNN
F 3 "" H 2300 7650 60  0000 C CNN
	1    2300 7650
	1    0    0    -1  
$EndComp
Text HLabel 1300 6775 0    60   Input ~ 0
3.3V_P
Text Label 2950 5900 2    60   ~ 0
PGA_VON
Text Label 4625 5900 0    60   ~ 0
PGA_VOP
$Comp
L GND #PWR027
U 1 1 54715517
P 5325 6375
F 0 "#PWR027" H 5325 6375 30  0001 C CNN
F 1 "GND" H 5325 6305 30  0001 C CNN
F 2 "" H 5325 6375 60  0000 C CNN
F 3 "" H 5325 6375 60  0000 C CNN
	1    5325 6375
	1    0    0    -1  
$EndComp
Text HLabel 6475 5800 2    60   Input ~ 0
ADC_VCOM
Text HLabel 6475 5700 2    60   Input ~ 0
5V_PGA
$Comp
L GND #PWR028
U 1 1 5471551F
P 5575 6375
F 0 "#PWR028" H 5575 6375 30  0001 C CNN
F 1 "GND" H 5575 6305 30  0001 C CNN
F 2 "" H 5575 6375 60  0000 C CNN
F 3 "" H 5575 6375 60  0000 C CNN
	1    5575 6375
	1    0    0    -1  
$EndComp
$Comp
L GND #PWR029
U 1 1 54715525
P 5075 6375
F 0 "#PWR029" H 5075 6375 30  0001 C CNN
F 1 "GND" H 5075 6305 30  0001 C CNN
F 2 "" H 5075 6375 60  0000 C CNN
F 3 "" H 5075 6375 60  0000 C CNN
	1    5075 6375
	1    0    0    -1  
$EndComp
$Comp
L GND #PWR030
U 1 1 5471552B
P 5275 5575
F 0 "#PWR030" H 5275 5575 30  0001 C CNN
F 1 "GND" H 5275 5505 30  0001 C CNN
F 2 "" H 5275 5575 60  0000 C CNN
F 3 "" H 5275 5575 60  0000 C CNN
	1    5275 5575
	1    0    0    -1  
$EndComp
$Comp
L Resistor R32
U 1 1 54715535
P 5750 5000
F 0 "R32" V 5830 5000 40  0000 C CNN
F 1 "22" V 5757 5001 40  0000 C CNN
F 2 "Ruwai:Resistor_SMD0805_ReflowWave" V 5680 5000 30  0001 C CNN
F 3 "" V 5830 5000 30  0000 C CNN
F 4 "Yageo" H 5750 4500 60  0001 L CNN "Manu"
F 5 "RC0805FR-0722RL" H 5750 4400 60  0001 L CNN "Manu#"
F 6 "0805" H 5750 4300 60  0001 L CNN "Package"
F 7 "Custom Description" H 5750 4200 60  0001 L CNN "Desc"
	1    5750 5000
	0    1    1    0   
$EndComp
Text HLabel 6125 5000 2    60   Input ~ 0
+15V_PGA
$Comp
L GND #PWR031
U 1 1 5471553D
P 5000 4850
F 0 "#PWR031" H 5000 4850 30  0001 C CNN
F 1 "GND" H 5000 4780 30  0001 C CNN
F 2 "" H 5000 4850 60  0000 C CNN
F 3 "" H 5000 4850 60  0000 C CNN
	1    5000 4850
	1    0    0    -1  
$EndComp
Text HLabel 6125 4150 2    60   Input ~ 0
-15V_PGA
Text Label 3925 1525 2    60   ~ 0
PGA_VOP
Text Label 3925 2525 2    60   ~ 0
PGA_VON
$Comp
L inductor L7
U 1 1 5471554B
P 1525 3150
F 0 "L7" H 1525 3200 40  0000 C BNN
F 1 "47uH" H 1525 3100 40  0000 C CNN
F 2 "Ruwai:Inductor_SMD0805_ReflowWave" H 1425 3150 60  0001 C CNN
F 3 "" H 1425 3150 60  0000 C CNN
F 4 "Taiyo Yuden" H 1525 2950 60  0001 L BNN "Manu"
F 5 "BRL2012T470M" H 1525 2850 60  0001 L BNN "Manu#"
F 6 "0805" H 1525 2750 60  0001 L BNN "Package"
F 7 "Custom description." H 1525 2650 60  0001 L BNN "Desc"
	1    1525 3150
	1    0    0    -1  
$EndComp
$Comp
L Resistor R37
U 1 1 54715556
P 2175 3150
F 0 "R37" V 2255 3150 40  0000 C CNN
F 1 "47" V 2182 3151 40  0000 C CNN
F 2 "Ruwai:Resistor_SMD0805_ReflowWave" V 2105 3150 30  0001 C CNN
F 3 "" V 2255 3150 30  0000 C CNN
F 4 "Yageo" H 2175 2650 60  0001 L CNN "Manu"
F 5 "RC0805FR-0747RL" H 2175 2550 60  0001 L CNN "Manu#"
F 6 "0805" H 2175 2450 60  0001 L CNN "Package"
F 7 "Custom Description" H 2175 2350 60  0001 L CNN "Desc"
	1    2175 3150
	0    -1   -1   0   
$EndComp
$Comp
L Capacitor C35
U 1 1 54715561
P 2575 3550
F 0 "C35" H 2575 3650 40  0000 L CNN
F 1 "47nF" H 2581 3465 40  0000 L CNN
F 2 "Ruwai:Capacitor_SMD1206_ReflowWave" H 2613 3400 30  0001 C CNN
F 3 "" H 2575 3650 60  0000 C CNN
F 4 "Murata" H 2625 3150 60  0001 L CNN "Manu"
F 5 "GRM31M5C1H473JA01L" H 2625 3050 60  0001 L CNN "Manu#"
F 6 "1206" H 2625 2950 60  0001 L CNN "Package"
F 7 "Custom Description" H 2575 3200 60  0001 L CNN "Desc"
	1    2575 3550
	1    0    0    -1  
$EndComp
$Comp
L Varistance R36
U 1 1 5471556C
P 2975 3550
F 0 "R36" H 3075 3600 40  0000 R BNN
F 1 "14VRMS" H 2875 3475 40  0000 L TNN
F 2 "Ruwai:Resistor_SMD0805_ReflowWave" H 3025 3500 60  0001 C CNN
F 3 "" V 2975 3550 60  0000 C CNN
F 4 "Epcos" H 2975 3350 60  0001 L BNN "Manu"
F 5 "B72510E0140K062" H 2975 3250 60  0001 L BNN "Manu#"
F 6 "0805" H 2975 3150 60  0001 L BNN "Package"
F 7 "Custom description." H 2975 3050 60  0001 L BNN "Desc"
	1    2975 3550
	0    -1   -1   0   
$EndComp
$Comp
L Resistor R34
U 1 1 54715577
P 3525 3150
F 0 "R34" V 3605 3150 40  0000 C CNN
F 1 "2.2k" V 3532 3151 40  0000 C CNN
F 2 "Ruwai:Resistor_SMD0805_ReflowWave" V 3455 3150 30  0001 C CNN
F 3 "" V 3605 3150 30  0000 C CNN
F 4 "Yageo" H 3525 2650 60  0001 L CNN "Manu"
F 5 "RC0805FR-072K2L" H 3525 2550 60  0001 L CNN "Manu#"
F 6 "0805" H 3525 2450 60  0001 L CNN "Package"
F 7 "Custom Description" H 3525 2350 60  0001 L CNN "Desc"
	1    3525 3150
	0    -1   -1   0   
$EndComp
$Comp
L Capacitor C36
U 1 1 54715582
P 3925 3550
F 0 "C36" H 3925 3650 40  0000 L CNN
F 1 "1nF" H 3931 3465 40  0000 L CNN
F 2 "Ruwai:Capacitor_SMD0805_ReflowWave" H 3963 3400 30  0001 C CNN
F 3 "" H 3925 3650 60  0000 C CNN
F 4 "Kemet" H 3975 3150 60  0001 L CNN "Manu"
F 5 "C0805C102J5GACTU" H 3975 3050 60  0001 L CNN "Manu#"
F 6 "0805" H 3975 2950 60  0001 L CNN "Package"
F 7 "Custom Description" H 3925 3200 60  0001 L CNN "Desc"
	1    3925 3550
	1    0    0    -1  
$EndComp
$Comp
L Resistor R80
U 1 1 5471558D
P 1575 3350
F 0 "R80" V 1655 3350 40  0000 C CNN
F 1 "100k" V 1582 3351 40  0000 C CNN
F 2 "Ruwai:Resistor_SMD0805_ReflowWave" V 1505 3350 30  0001 C CNN
F 3 "" V 1655 3350 30  0000 C CNN
F 4 "Yageo" H 1575 2850 60  0001 L CNN "Manu"
F 5 "RC0805FR-07100KL" H 1575 2750 60  0001 L CNN "Manu#"
F 6 "0805" H 1575 2650 60  0001 L CNN "Package"
F 7 "Custom Description" H 1575 2550 60  0001 L CNN "Desc"
	1    1575 3350
	0    -1   -1   0   
$EndComp
$Comp
L Resistor R38
U 1 1 54715598
P 2175 3950
F 0 "R38" V 2255 3950 40  0000 C CNN
F 1 "47" V 2182 3951 40  0000 C CNN
F 2 "Ruwai:Resistor_SMD0805_ReflowWave" V 2105 3950 30  0001 C CNN
F 3 "" V 2255 3950 30  0000 C CNN
F 4 "Yageo" H 2175 3450 60  0001 L CNN "Manu"
F 5 "RC0805FR-0747RL" H 2175 3350 60  0001 L CNN "Manu#"
F 6 "0805" H 2175 3250 60  0001 L CNN "Package"
F 7 "Custom Description" H 2175 3150 60  0001 L CNN "Desc"
	1    2175 3950
	0    -1   -1   0   
$EndComp
$Comp
L Resistor R35
U 1 1 547155A3
P 3525 3950
F 0 "R35" V 3605 3950 40  0000 C CNN
F 1 "2.2k" V 3532 3951 40  0000 C CNN
F 2 "Ruwai:Resistor_SMD0805_ReflowWave" V 3455 3950 30  0001 C CNN
F 3 "" V 3605 3950 30  0000 C CNN
F 4 "Yageo" H 3525 3450 60  0001 L CNN "Manu"
F 5 "RC0805FR-072K2L" H 3525 3350 60  0001 L CNN "Manu#"
F 6 "0805" H 3525 3250 60  0001 L CNN "Package"
F 7 "Custom Description" H 3525 3150 60  0001 L CNN "Desc"
	1    3525 3950
	0    -1   -1   0   
$EndComp
$Comp
L Resistor R81
U 1 1 547155AE
P 1575 3750
F 0 "R81" V 1655 3750 40  0000 C CNN
F 1 "100k" V 1582 3751 40  0000 C CNN
F 2 "Ruwai:Resistor_SMD0805_ReflowWave" V 1505 3750 30  0001 C CNN
F 3 "" V 1655 3750 30  0000 C CNN
F 4 "Yageo" H 1575 3250 60  0001 L CNN "Manu"
F 5 "RC0805FR-07100KL" H 1575 3150 60  0001 L CNN "Manu#"
F 6 "0805" H 1575 3050 60  0001 L CNN "Package"
F 7 "Custom Description" H 1575 2950 60  0001 L CNN "Desc"
	1    1575 3750
	0    -1   -1   0   
$EndComp
$Comp
L inductor L8
U 1 1 547155B9
P 1525 3950
F 0 "L8" H 1525 4000 40  0000 C BNN
F 1 "47uH" H 1525 3900 40  0000 C CNN
F 2 "Ruwai:Inductor_SMD0805_ReflowWave" H 1425 3950 60  0001 C CNN
F 3 "" H 1425 3950 60  0000 C CNN
F 4 "Taiyo Yuden" H 1525 3750 60  0001 L BNN "Manu"
F 5 "BRL2012T470M" H 1525 3650 60  0001 L BNN "Manu#"
F 6 "0805" H 1525 3550 60  0001 L BNN "Package"
F 7 "Custom description." H 1525 3450 60  0001 L BNN "Desc"
	1    1525 3950
	1    0    0    -1  
$EndComp
$Comp
L GND #PWR032
U 1 1 547155C0
P 2175 3650
F 0 "#PWR032" H 2175 3650 30  0001 C CNN
F 1 "GND" H 2175 3580 30  0001 C CNN
F 2 "" H 2175 3650 60  0000 C CNN
F 3 "" H 2175 3650 60  0000 C CNN
	1    2175 3650
	1    0    0    -1  
$EndComp
Wire Wire Line
	8975 1375 9175 1375
Wire Wire Line
	8275 1375 8475 1375
Wire Wire Line
	10100 1225 10500 1225
Connection ~ 8375 1375
Wire Wire Line
	8375 825  8375 675 
Wire Wire Line
	8375 675  10225 675 
Wire Wire Line
	10225 675  10225 1225
Connection ~ 10225 1225
Wire Wire Line
	7500 1375 7775 1375
Wire Wire Line
	6325 1525 6575 1525
Wire Wire Line
	5275 1525 5825 1525
Wire Wire Line
	5725 1325 5725 1525
Connection ~ 5725 1525
Wire Wire Line
	5425 1325 5425 1525
Connection ~ 5425 1525
Wire Wire Line
	5425 925  5425 675 
Wire Wire Line
	5425 675  7625 675 
Wire Wire Line
	7625 675  7625 1375
Connection ~ 7625 1375
Wire Wire Line
	5725 925  5725 675 
Connection ~ 5725 675 
Wire Wire Line
	4575 1525 4775 1525
Wire Wire Line
	6575 1225 6525 1225
Wire Wire Line
	6525 1225 6525 675 
Connection ~ 6525 675 
Wire Wire Line
	8375 1375 8375 1225
Wire Wire Line
	9175 1075 9075 1075
Wire Wire Line
	9075 1075 9075 675 
Connection ~ 9075 675 
Wire Wire Line
	9075 1375 9075 1825
Connection ~ 9075 1375
Wire Wire Line
	6425 1825 6425 1525
Connection ~ 6425 1525
Wire Wire Line
	4675 1825 4675 1525
Connection ~ 4675 1525
Wire Wire Line
	8975 2675 9175 2675
Wire Wire Line
	8275 2675 8475 2675
Wire Wire Line
	7500 2675 7775 2675
Wire Wire Line
	8375 2825 8375 2675
Connection ~ 8375 2675
Wire Wire Line
	10100 2825 10500 2825
Wire Wire Line
	10225 3375 10225 2825
Wire Wire Line
	8375 3375 10225 3375
Wire Wire Line
	8375 3375 8375 3225
Connection ~ 10225 2825
Wire Wire Line
	9075 2225 9075 2675
Connection ~ 9075 2675
Wire Wire Line
	9175 2975 9075 2975
Wire Wire Line
	9075 2975 9075 3375
Connection ~ 9075 3375
Wire Wire Line
	6325 2525 6575 2525
Wire Wire Line
	5275 2525 5825 2525
Wire Wire Line
	4575 2525 4775 2525
Wire Wire Line
	4675 2225 4675 2525
Connection ~ 4675 2525
Wire Wire Line
	5425 2725 5425 2525
Connection ~ 5425 2525
Wire Wire Line
	5725 2725 5725 2525
Connection ~ 5725 2525
Wire Wire Line
	7625 3375 7625 2675
Wire Wire Line
	5425 3375 7625 3375
Wire Wire Line
	5425 3375 5425 3125
Connection ~ 7625 2675
Wire Wire Line
	5725 3125 5725 3375
Connection ~ 5725 3375
Wire Wire Line
	6425 2225 6425 2525
Connection ~ 6425 2525
Wire Wire Line
	6575 2825 6425 2825
Wire Wire Line
	6425 2825 6425 3375
Connection ~ 6425 3375
Wire Wire Line
	10175 4875 10175 5050
Wire Wire Line
	10125 6175 10125 6350
Wire Wire Line
	10175 4025 10175 4125
Wire Wire Line
	9450 4025 10175 4025
Wire Wire Line
	9650 6000 9650 6350
Wire Wire Line
	10125 5325 10125 5425
Wire Wire Line
	9350 5325 10125 5325
Wire Wire Line
	9650 5600 9650 5325
Connection ~ 9650 5325
Wire Wire Line
	8950 5325 8800 5325
Wire Wire Line
	9625 4300 9625 4025
Connection ~ 9625 4025
Wire Wire Line
	9625 4700 9625 5050
Wire Wire Line
	9050 4025 8900 4025
Wire Wire Line
	4375 7275 4700 7275
Wire Wire Line
	4375 7175 4700 7175
Wire Wire Line
	4375 6975 4700 6975
Wire Wire Line
	4375 6775 4700 6775
Wire Wire Line
	2925 5400 3150 5400
Wire Wire Line
	2925 5500 3150 5500
Wire Wire Line
	2925 5600 3150 5600
Wire Wire Line
	2925 5700 3150 5700
Wire Wire Line
	2925 5800 3150 5800
Wire Wire Line
	3175 6975 3025 6975
Wire Wire Line
	3175 7175 3025 7175
Connection ~ 3025 7175
Wire Wire Line
	2025 6775 3175 6775
Wire Wire Line
	3175 6675 2900 6675
Wire Wire Line
	3175 6475 2900 6475
Wire Wire Line
	2300 7400 2300 7650
Wire Wire Line
	2300 6775 2300 7000
Connection ~ 2300 6775
Connection ~ 2150 6775
Wire Wire Line
	1525 6775 1300 6775
Wire Wire Line
	4350 5300 4625 5300
Wire Wire Line
	4350 5400 4625 5400
Wire Wire Line
	3150 5900 2950 5900
Wire Wire Line
	4350 5900 4625 5900
Wire Wire Line
	5325 6300 5325 6375
Wire Wire Line
	4350 5800 6475 5800
Wire Wire Line
	5325 5800 5325 5900
Connection ~ 5325 5800
Wire Wire Line
	4350 5700 5775 5700
Wire Wire Line
	5575 6375 5575 6300
Wire Wire Line
	5575 5900 5575 5700
Connection ~ 5575 5700
Wire Wire Line
	6275 5700 6475 5700
Wire Wire Line
	4350 5600 5075 5600
Wire Wire Line
	5075 5600 5075 6375
Wire Wire Line
	4350 5500 5100 5500
Wire Wire Line
	5100 5500 5100 5000
Wire Wire Line
	5100 5000 5500 5000
Wire Wire Line
	5275 5475 5275 5575
Wire Wire Line
	5275 5075 5275 5000
Connection ~ 5275 5000
Wire Wire Line
	6000 5000 6125 5000
Wire Wire Line
	4775 4675 4775 4775
Wire Wire Line
	4775 4775 5250 4775
Wire Wire Line
	5250 4775 5250 4675
Wire Wire Line
	5000 4850 5000 4775
Connection ~ 5000 4775
Wire Wire Line
	4350 5200 4550 5200
Wire Wire Line
	4550 4150 5500 4150
Wire Wire Line
	4775 4275 4775 4150
Connection ~ 4775 4150
Wire Wire Line
	5250 4275 5250 4150
Connection ~ 5250 4150
Wire Wire Line
	6000 4150 6125 4150
Wire Wire Line
	4075 1525 3925 1525
Wire Wire Line
	4075 2525 3925 2525
Wire Wire Line
	3175 7275 2900 7275
Wire Wire Line
	2150 5200 3150 5200
Wire Wire Line
	925  3150 1325 3150
Wire Wire Line
	1825 3350 1925 3350
Wire Wire Line
	1925 3350 1925 3750
Wire Wire Line
	1925 3750 1825 3750
Wire Wire Line
	1325 3350 1225 3350
Wire Wire Line
	1225 3350 1225 3150
Connection ~ 1225 3150
Wire Wire Line
	1925 3550 2175 3550
Wire Wire Line
	2175 3550 2175 3650
Connection ~ 1925 3550
Wire Wire Line
	1725 3150 1925 3150
Wire Wire Line
	2425 3150 3275 3150
Wire Wire Line
	2575 3350 2575 3150
Connection ~ 2575 3150
Wire Wire Line
	2975 3350 2975 3150
Connection ~ 2975 3150
Wire Wire Line
	2425 3950 3275 3950
Wire Wire Line
	1725 3950 1925 3950
Wire Wire Line
	925  3950 1325 3950
Wire Wire Line
	1325 3750 1225 3750
Wire Wire Line
	1225 3750 1225 3950
Connection ~ 1225 3950
Wire Wire Line
	2575 3750 2575 3950
Connection ~ 2575 3950
Wire Wire Line
	2975 3750 2975 3950
Connection ~ 2975 3950
Wire Wire Line
	3775 3150 4225 3150
Wire Wire Line
	3775 3950 4225 3950
Wire Wire Line
	3925 3750 3925 3950
Connection ~ 3925 3950
Wire Wire Line
	3925 3350 3925 3150
Connection ~ 3925 3150
Text HLabel 925  3150 0    60   Input ~ 0
AINP2
Text HLabel 925  3950 0    60   Input ~ 0
AINN2
Text Label 4225 3150 0    60   ~ 0
PGA_INP
Text Label 4225 3950 0    60   ~ 0
PGA_INN
$Comp
L inductor L6
U 1 1 54715685
P 9150 5325
F 0 "L6" H 9150 5375 40  0000 C BNN
F 1 "1uH" H 9150 5275 40  0000 C CNN
F 2 "Ruwai:Inductor_SMD0805_ReflowWave" H 9050 5325 60  0001 C CNN
F 3 "" H 9050 5325 60  0000 C CNN
F 4 "Taiyo Yuden" H 9150 5125 60  0001 L BNN "Manu"
F 5 "BRL2012T1R0M " H 9150 5025 60  0001 L BNN "Manu#"
F 6 "0805" H 9150 4925 60  0001 L BNN "Package"
F 7 "Custom description." H 9150 4825 60  0001 L BNN "Desc"
	1    9150 5325
	1    0    0    -1  
$EndComp
$Comp
L Capacitor C28
U 1 1 54715690
P 9650 5800
F 0 "C28" H 9650 5900 40  0000 L CNN
F 1 "100nF" H 9656 5715 40  0000 L CNN
F 2 "Ruwai:Capacitor_SMD0805_ReflowWave" H 9688 5650 30  0001 C CNN
F 3 "" H 9650 5900 60  0000 C CNN
F 4 "Murata" H 9700 5400 60  0001 L CNN "Manu"
F 5 "GCM21BR71H104KA37L" H 9700 5300 60  0001 L CNN "Manu#"
F 6 "0805" H 9700 5200 60  0001 L CNN "Package"
F 7 "Custom Description" H 9650 5450 60  0001 L CNN "Desc"
	1    9650 5800
	1    0    0    -1  
$EndComp
$Comp
L Capacitor C31
U 1 1 5471569B
P 2300 7200
F 0 "C31" H 2300 7300 40  0000 L CNN
F 1 "100nF" H 2306 7115 40  0000 L CNN
F 2 "Ruwai:Capacitor_SMD0805_ReflowWave" H 2338 7050 30  0001 C CNN
F 3 "" H 2300 7300 60  0000 C CNN
F 4 "Murata" H 2350 6800 60  0001 L CNN "Manu"
F 5 "GCM21BR71H104KA37L" H 2350 6700 60  0001 L CNN "Manu#"
F 6 "0805" H 2350 6600 60  0001 L CNN "Package"
F 7 "Custom Description" H 2300 6850 60  0001 L CNN "Desc"
	1    2300 7200
	1    0    0    -1  
$EndComp
$Comp
L Capacitor C30
U 1 1 547156A6
P 5325 6100
F 0 "C30" H 5325 6200 40  0000 L CNN
F 1 "100nF" H 5331 6015 40  0000 L CNN
F 2 "Ruwai:Capacitor_SMD0805_ReflowWave" H 5363 5950 30  0001 C CNN
F 3 "" H 5325 6200 60  0000 C CNN
F 4 "Murata" H 5375 5700 60  0001 L CNN "Manu"
F 5 "GCM21BR71H104KA37L" H 5375 5600 60  0001 L CNN "Manu#"
F 6 "0805" H 5375 5500 60  0001 L CNN "Package"
F 7 "Custom Description" H 5325 5750 60  0001 L CNN "Desc"
	1    5325 6100
	1    0    0    -1  
$EndComp
$Comp
L Capacitor C33
U 1 1 547156B1
P 5575 6100
F 0 "C33" H 5575 6200 40  0000 L CNN
F 1 "470nF" H 5581 6015 40  0000 L CNN
F 2 "Ruwai:Capacitor_SMD0805_ReflowWave" H 5613 5950 30  0001 C CNN
F 3 "" H 5575 6200 60  0000 C CNN
F 4 "Samsung Electro-Mechanics" H 5625 5700 60  0001 L CNN "Manu"
F 5 "CL21B474KBF4PNG" H 5625 5600 60  0001 L CNN "Manu#"
F 6 "0805" H 5625 5500 60  0001 L CNN "Package"
F 7 "Custom Description" H 5575 5750 60  0001 L CNN "Desc"
	1    5575 6100
	1    0    0    -1  
$EndComp
$Comp
L Capacitor C32
U 1 1 547156BC
P 5275 5275
F 0 "C32" H 5275 5375 40  0000 L CNN
F 1 "470nF" H 5281 5190 40  0000 L CNN
F 2 "Ruwai:Capacitor_SMD0805_ReflowWave" H 5313 5125 30  0001 C CNN
F 3 "" H 5275 5375 60  0000 C CNN
F 4 "Samsung Electro-Mechanics" H 5325 4875 60  0001 L CNN "Manu"
F 5 "CL21B474KBF4PNG" H 5325 4775 60  0001 L CNN "Manu#"
F 6 "0805" H 5325 4675 60  0001 L CNN "Package"
F 7 "Custom Description" H 5275 4925 60  0001 L CNN "Desc"
	1    5275 5275
	1    0    0    -1  
$EndComp
$Comp
L Capacitor C34
U 1 1 547156C7
P 4775 4475
F 0 "C34" H 4775 4575 40  0000 L CNN
F 1 "470nF" H 4781 4390 40  0000 L CNN
F 2 "Ruwai:Capacitor_SMD0805_ReflowWave" H 4813 4325 30  0001 C CNN
F 3 "" H 4775 4575 60  0000 C CNN
F 4 "Samsung Electro-Mechanics" H 4825 4075 60  0001 L CNN "Manu"
F 5 "CL21B474KBF4PNG" H 4825 3975 60  0001 L CNN "Manu#"
F 6 "0805" H 4825 3875 60  0001 L CNN "Package"
F 7 "Custom Description" H 4775 4125 60  0001 L CNN "Desc"
	1    4775 4475
	1    0    0    -1  
$EndComp
$Comp
L Resistor R30
U 1 1 547156D2
P 6025 5700
F 0 "R30" V 6105 5700 40  0000 C CNN
F 1 "10" V 6032 5701 40  0000 C CNN
F 2 "Ruwai:Resistor_SMD0805_ReflowWave" V 5955 5700 30  0001 C CNN
F 3 "" V 6105 5700 30  0000 C CNN
F 4 "Yageo" H 6025 5200 60  0001 L CNN "Manu"
F 5 "RC0805FR-0710RL" H 6025 5100 60  0001 L CNN "Manu#"
F 6 "0805" H 6025 5000 60  0001 L CNN "Package"
F 7 "Custom Description" H 6025 4900 60  0001 L CNN "Desc"
	1    6025 5700
	0    1    1    0   
$EndComp
$Comp
L Resistor R31
U 1 1 547156DD
P 5750 4150
F 0 "R31" V 5830 4150 40  0000 C CNN
F 1 "22" V 5757 4151 40  0000 C CNN
F 2 "Ruwai:Resistor_SMD0805_ReflowWave" V 5680 4150 30  0001 C CNN
F 3 "" V 5830 4150 30  0000 C CNN
F 4 "Yageo" H 5750 3650 60  0001 L CNN "Manu"
F 5 "RC0805FR-0722RL" H 5750 3550 60  0001 L CNN "Manu#"
F 6 "0805" H 5750 3450 60  0001 L CNN "Package"
F 7 "Custom Description" H 5750 3350 60  0001 L CNN "Desc"
	1    5750 4150
	0    1    1    0   
$EndComp
$Comp
L DiodeSchottky D2
U 1 1 547156E8
P 5250 4475
F 0 "D2" H 5250 4575 40  0000 C CNN
F 1 "BAS386" H 5250 4375 40  0000 C CNN
F 2 "Ruwai:Diode_SMD0102_ReflowWave" H 5250 4475 60  0001 C CNN
F 3 "" H 5250 4475 60  0000 C CNN
F 4 "Vishay" H 5250 4225 60  0001 L BNN "Manu"
F 5 "BAS386-TR" H 5250 4125 60  0001 L BNN "Manu#"
F 6 "0102" H 5250 4025 60  0001 L BNN "Package"
F 7 "Custom description." H 5250 3925 60  0001 L BNN "Desc"
	1    5250 4475
	0    1    1    0   
$EndComp
Text Notes 3800 7200 1    60   ~ 0
I2C address: 21h
Text Label 4625 5300 0    60   ~ 0
PGA_INN
Text Label 4625 5400 0    60   ~ 0
PGA_INP
Wire Wire Line
	4550 5200 4550 4150
Wire Wire Line
	3025 6975 3025 7650
Wire Wire Line
	3175 6875 3025 6875
Wire Wire Line
	3025 6875 3025 6775
Connection ~ 3025 6775
Text HLabel 10500 1225 2    60   Output ~ 0
PGA2_OUTP
Text HLabel 10500 2825 2    60   Output ~ 0
PGA2_OUTN
$Comp
L GND #PWR033
U 1 1 5475F79E
P 1400 6050
F 0 "#PWR033" H 1400 6050 30  0001 C CNN
F 1 "GND" H 1400 5980 30  0001 C CNN
F 2 "" H 1400 6050 60  0000 C CNN
F 3 "" H 1400 6050 60  0000 C CNN
	1    1400 6050
	1    0    0    -1  
$EndComp
Wire Wire Line
	3150 5300 1975 5300
Wire Wire Line
	1575 5300 1400 5300
Wire Wire Line
	1400 5300 1400 5400
Wire Wire Line
	1400 5900 1400 6050
NoConn ~ 4375 6675
$Comp
L LED D6
U 1 1 547634A1
P 1775 5300
F 0 "D6" H 1750 5385 40  0000 C CNN
F 1 "LED" H 1775 5210 40  0000 C CNN
F 2 "Ruwai:LED-0805" H 1775 5300 60  0001 C CNN
F 3 "" H 1775 5300 60  0001 C CNN
F 4 "Knightbright" H 1775 5300 60  0001 C CNN "Manu"
F 5 "KP-2012SRC-PRV" H 1775 5300 60  0001 C CNN "Manu#"
F 6 "0805" H 1775 5300 60  0001 C CNN "Package"
	1    1775 5300
	-1   0    0    1   
$EndComp
$Comp
L Resistor R86
U 1 1 5476721B
P 1400 5650
F 0 "R86" V 1480 5650 40  0000 C CNN
F 1 "2.2k" V 1407 5651 40  0000 C CNN
F 2 "Ruwai:Resistor_SMD0805_ReflowWave" V 1330 5650 30  0001 C CNN
F 3 "" V 1480 5650 30  0000 C CNN
F 4 "Yageo" H 1400 5150 60  0001 L CNN "Manu"
F 5 "RC0805FR-072K2L" H 1400 5050 60  0001 L CNN "Manu#"
F 6 "0805" H 1400 4950 60  0001 L CNN "Package"
F 7 "Custom Description" H 1400 4850 60  0001 L CNN "Desc"
	1    1400 5650
	-1   0    0    1   
$EndComp
$Comp
L PWR_FLAG #FLG034
U 1 1 54768FAE
P 10175 4025
F 0 "#FLG034" H 10175 4120 30  0001 C CNN
F 1 "PWR_FLAG" H 10175 4205 30  0000 C CNN
F 2 "" H 10175 4025 60  0000 C CNN
F 3 "" H 10175 4025 60  0000 C CNN
	1    10175 4025
	0    1    1    0   
$EndComp
$Comp
L PWR_FLAG #FLG035
U 1 1 5476913A
P 10125 5325
F 0 "#FLG035" H 10125 5420 30  0001 C CNN
F 1 "PWR_FLAG" H 10125 5505 30  0000 C CNN
F 2 "" H 10125 5325 60  0000 C CNN
F 3 "" H 10125 5325 60  0000 C CNN
	1    10125 5325
	0    1    1    0   
$EndComp
Wire Wire Line
	2150 5200 2150 6775
$Comp
L PWR_FLAG #FLG036
U 1 1 5476977A
P 2300 6775
F 0 "#FLG036" H 2300 6870 30  0001 C CNN
F 1 "PWR_FLAG" H 2300 6955 30  0000 C CNN
F 2 "" H 2300 6775 60  0000 C CNN
F 3 "" H 2300 6775 60  0000 C CNN
	1    2300 6775
	1    0    0    -1  
$EndComp
$Comp
L PWR_FLAG #FLG037
U 1 1 54769A0D
P 5250 4150
F 0 "#FLG037" H 5250 4245 30  0001 C CNN
F 1 "PWR_FLAG" H 5250 4330 30  0000 C CNN
F 2 "" H 5250 4150 60  0000 C CNN
F 3 "" H 5250 4150 60  0000 C CNN
	1    5250 4150
	1    0    0    -1  
$EndComp
$Comp
L PWR_FLAG #FLG038
U 1 1 54769A84
P 5275 5000
F 0 "#FLG038" H 5275 5095 30  0001 C CNN
F 1 "PWR_FLAG" H 5275 5180 30  0000 C CNN
F 2 "" H 5275 5000 60  0000 C CNN
F 3 "" H 5275 5000 60  0000 C CNN
	1    5275 5000
	1    0    0    -1  
$EndComp
$Comp
L PWR_FLAG #FLG039
U 1 1 54769B67
P 5575 5700
F 0 "#FLG039" H 5575 5795 30  0001 C CNN
F 1 "PWR_FLAG" H 5575 5880 30  0000 C CNN
F 2 "" H 5575 5700 60  0000 C CNN
F 3 "" H 5575 5700 60  0000 C CNN
	1    5575 5700
	1    0    0    -1  
$EndComp
$Comp
L GND #PWR040
U 1 1 54769CEC
P 4550 7650
F 0 "#PWR040" H 4550 7650 30  0001 C CNN
F 1 "GND" H 4550 7580 30  0001 C CNN
F 2 "" H 4550 7650 60  0000 C CNN
F 3 "" H 4550 7650 60  0000 C CNN
	1    4550 7650
	1    0    0    -1  
$EndComp
Wire Wire Line
	4375 6875 4550 6875
Wire Wire Line
	4550 6875 4550 7650
$Comp
L OPA2209 U5
U 1 1 59BC9F9C
P 6925 2675
F 0 "U5" H 7150 2850 60  0000 C CNN
F 1 "OPA2209" H 7250 2475 60  0000 C CNN
F 2 "SSOP_Packages:MSOP-8_3x3mm_Pitch0.65mm" H 6925 2225 60  0001 L CNN
F 3 "" H 6925 2675 60  0000 C CNN
F 4 "Texas Instruments" H 6925 2125 60  0001 L CNN "Manu"
F 5 "OPA2209AIDGKT" H 6925 2025 60  0001 L CNN "Manu#"
F 6 "VSSOP 8-pin" H 6925 1925 60  0001 L CNN "Package"
F 7 " " H 6925 1825 60  0001 L CNN "Desc"
	1    6925 2675
	1    0    0    -1  
$EndComp
$Comp
L OPA2209 U5
U 2 1 59BCA2AC
P 6925 1375
F 0 "U5" H 7150 1550 60  0000 C CNN
F 1 "OPA2209" H 7250 1175 60  0000 C CNN
F 2 "SSOP_Packages:MSOP-8_3x3mm_Pitch0.65mm" H 6925 925 60  0001 L CNN
F 3 "" H 6925 1375 60  0000 C CNN
F 4 "Texas Instruments" H 6925 825 60  0001 L CNN "Manu"
F 5 "OPA2209AIDGKT" H 6925 725 60  0001 L CNN "Manu#"
F 6 "VSSOP 8-pin" H 6925 625 60  0001 L CNN "Package"
F 7 " " H 6925 525 60  0001 L CNN "Desc"
	2    6925 1375
	1    0    0    1   
$EndComp
$Comp
L OPA2209 U5
U 3 1 59BCA5AB
P 10125 4500
F 0 "U5" H 10350 4675 60  0000 C CNN
F 1 "OPA2209" H 10450 4300 60  0000 C CNN
F 2 "SSOP_Packages:MSOP-8_3x3mm_Pitch0.65mm" H 10125 4050 60  0001 L CNN
F 3 "" H 10125 4500 60  0000 C CNN
F 4 "Texas Instruments" H 10125 3950 60  0001 L CNN "Manu"
F 5 "OPA2209AIDGKT" H 10125 3850 60  0001 L CNN "Manu#"
F 6 "VSSOP 8-pin" H 10125 3750 60  0001 L CNN "Package"
F 7 " " H 10125 3650 60  0001 L CNN "Desc"
	3    10125 4500
	1    0    0    -1  
$EndComp
$Comp
L OPA2209 U6
U 1 1 59BCA7C7
P 9525 2825
F 0 "U6" H 9750 3000 60  0000 C CNN
F 1 "OPA2209" H 9850 2625 60  0000 C CNN
F 2 "SSOP_Packages:MSOP-8_3x3mm_Pitch0.65mm" H 9525 2375 60  0001 L CNN
F 3 "" H 9525 2825 60  0000 C CNN
F 4 "Texas Instruments" H 9525 2275 60  0001 L CNN "Manu"
F 5 "OPA2209AIDGKT" H 9525 2175 60  0001 L CNN "Manu#"
F 6 "VSSOP 8-pin" H 9525 2075 60  0001 L CNN "Package"
F 7 " " H 9525 1975 60  0001 L CNN "Desc"
	1    9525 2825
	1    0    0    -1  
$EndComp
$Comp
L OPA2209 U6
U 2 1 59BCA99B
P 9525 1225
F 0 "U6" H 9750 1400 60  0000 C CNN
F 1 "OPA2209" H 9850 1025 60  0000 C CNN
F 2 "SSOP_Packages:MSOP-8_3x3mm_Pitch0.65mm" H 9525 775 60  0001 L CNN
F 3 "" H 9525 1225 60  0000 C CNN
F 4 "Texas Instruments" H 9525 675 60  0001 L CNN "Manu"
F 5 "OPA2209AIDGKT" H 9525 575 60  0001 L CNN "Manu#"
F 6 "VSSOP 8-pin" H 9525 475 60  0001 L CNN "Package"
F 7 " " H 9525 375 60  0001 L CNN "Desc"
	2    9525 1225
	1    0    0    1   
$EndComp
$Comp
L OPA2209 U6
U 3 1 59BCACDC
P 10075 5800
F 0 "U6" H 10300 5975 60  0000 C CNN
F 1 "OPA2209" H 10400 5600 60  0000 C CNN
F 2 "SSOP_Packages:MSOP-8_3x3mm_Pitch0.65mm" H 10075 5350 60  0001 L CNN
F 3 "" H 10075 5800 60  0000 C CNN
F 4 "Texas Instruments" H 10075 5250 60  0001 L CNN "Manu"
F 5 "OPA2209AIDGKT" H 10075 5150 60  0001 L CNN "Manu#"
F 6 "VSSOP 8-pin" H 10075 5050 60  0001 L CNN "Package"
F 7 " " H 10075 4950 60  0001 L CNN "Desc"
	3    10075 5800
	1    0    0    -1  
$EndComp
$EndSCHEMATC
