(module Molex_SL_70543-0009 (layer F.Cu) (tedit 5E5125BA)
  (fp_text reference "Molex_SL_70543-0009 " (at 0 1.778) (layer F.SilkS)
    (effects (font (size 1 1) (thickness 0.2032)))
  )
  (fp_text value Val** (at 0 0) (layer F.SilkS) hide
    (effects (font (size 1.27 1.27) (thickness 0.2032)))
  )
  (fp_line (start -13.97 -3.81) (end 13.97 -3.81) (layer F.CrtYd) (width 0.12))
  (fp_line (start -13.97 -2.54) (end 13.97 -2.54) (layer F.SilkS) (width 0.15))
  (fp_line (start 13.97 -2.54) (end 13.97 2.54) (layer F.SilkS) (width 0.15))
  (fp_line (start 13.97 2.54) (end -13.97 2.54) (layer F.SilkS) (width 0.15))
  (fp_line (start -13.97 2.54) (end -13.97 -2.54) (layer F.SilkS) (width 0.15))
  (fp_line (start -2.54 -2.54) (end -2.54 -3.81) (layer F.SilkS) (width 0.15))
  (fp_line (start -2.54 -3.81) (end 2.54 -3.81) (layer F.SilkS) (width 0.15))
  (fp_line (start 2.54 -3.81) (end 2.54 -2.54) (layer F.SilkS) (width 0.15))
  (fp_line (start 13.97 -3.81) (end 13.97 2.54) (layer F.CrtYd) (width 0.12))
  (fp_line (start 13.97 2.54) (end -13.97 2.54) (layer F.CrtYd) (width 0.12))
  (fp_line (start -13.97 2.54) (end -13.97 -3.81) (layer F.CrtYd) (width 0.12))
  (pad 1 thru_hole rect (at 11.43 0 180) (size 1.7272 2.032) (drill 1.1) (layers *.Cu *.Mask F.SilkS))
  (pad 2 thru_hole oval (at 8.89 0 180) (size 1.6 2.2) (drill 1.1) (layers *.Cu *.Mask F.SilkS))
  (pad 3 thru_hole oval (at 6.35 0 180) (size 1.6 2.2) (drill 1.1) (layers *.Cu *.Mask F.SilkS))
  (pad 4 thru_hole oval (at 3.81 0 180) (size 1.6 2.2) (drill 1.1) (layers *.Cu *.Mask F.SilkS))
  (pad 5 thru_hole oval (at 1.27 0 180) (size 1.6 2.2) (drill 1.1) (layers *.Cu *.Mask F.SilkS))
  (pad 6 thru_hole oval (at -1.27 0 180) (size 1.6 2.2) (drill 1.1) (layers *.Cu *.Mask F.SilkS))
  (pad 7 thru_hole oval (at -3.81 0 180) (size 1.6 2.2) (drill 1.1) (layers *.Cu *.Mask F.SilkS))
  (pad 8 thru_hole oval (at -6.35 0 180) (size 1.6 2.2) (drill 1.1) (layers *.Cu *.Mask F.SilkS))
  (pad 9 thru_hole oval (at -8.89 0 180) (size 1.6 2.2) (drill 1.1) (layers *.Cu *.Mask F.SilkS))
  (pad 10 thru_hole oval (at -11.43 0 180) (size 1.6 2.2) (drill 1.1) (layers *.Cu *.Mask F.SilkS))
)
