EESchema Schematic File Version 2
LIBS:adc_main_shield-rescue
LIBS:ruwai
LIBS:power
LIBS:device
LIBS:transistors
LIBS:conn
LIBS:linear
LIBS:regul
LIBS:74xx
LIBS:cmos4000
LIBS:adc-dac
LIBS:memory
LIBS:xilinx
LIBS:microcontrollers
LIBS:dsp
LIBS:microchip
LIBS:analog_switches
LIBS:motorola
LIBS:texas
LIBS:intel
LIBS:audio
LIBS:interface
LIBS:digital-audio
LIBS:philips
LIBS:display
LIBS:cypress
LIBS:siliconi
LIBS:opto
LIBS:atmel
LIBS:contrib
LIBS:valves
LIBS:adc_main_shield-cache
EELAYER 25 0
EELAYER END
$Descr A4 11693 8268
encoding utf-8
Sheet 6 6
Title ""
Date "2017-09-12"
Rev "3"
Comp ""
Comment1 ""
Comment2 ""
Comment3 ""
Comment4 ""
$EndDescr
$Comp
L Capacitor C1
U 1 1 546A92A3
P 5900 950
F 0 "C1" H 5900 1050 40  0000 L CNN
F 1 "4.7uF" H 5906 865 40  0000 L CNN
F 2 "Ruwai:Capacitor_SMD1206_ReflowWave" H 5938 800 30  0001 C CNN
F 3 "" H 5900 1050 60  0000 C CNN
F 4 "Murata" H 5950 550 60  0001 L CNN "Manu"
F 5 "GRM31CR71H475KA12L" H 5950 450 60  0001 L CNN "Manu#"
F 6 "1206" H 5950 350 60  0001 L CNN "Package"
F 7 "Custom Description" H 5900 600 60  0001 L CNN "Desc"
	1    5900 950 
	-1   0    0    1   
$EndComp
$Comp
L GND-RESCUE-adc_main_shield #PWR098
U 1 1 546A963C
P 5250 2650
F 0 "#PWR098" H 5250 2650 30  0001 C CNN
F 1 "GND" H 5250 2580 30  0001 C CNN
F 2 "" H 5250 2650 60  0000 C CNN
F 3 "" H 5250 2650 60  0000 C CNN
	1    5250 2650
	1    0    0    -1  
$EndComp
Text HLabel 5400 2050 2    60   Input ~ 0
3.3V_P
Text HLabel 5400 1950 2    60   BiDi ~ 0
SDA_3
Text HLabel 5400 1850 2    60   Input ~ 0
SCL_3
Text Label 6450 1750 0    60   ~ 0
+15V_PGA
Text Label 6450 1650 0    60   ~ 0
-15V_PGA
$Comp
L GND-RESCUE-adc_main_shield #PWR099
U 1 1 546A2B0E
P 5900 2525
F 0 "#PWR099" H 5900 2525 30  0001 C CNN
F 1 "GND" H 5900 2455 30  0001 C CNN
F 2 "" H 5900 2525 60  0000 C CNN
F 3 "" H 5900 2525 60  0000 C CNN
	1    5900 2525
	1    0    0    -1  
$EndComp
$Comp
L GND-RESCUE-adc_main_shield #PWR0100
U 1 1 546A2B21
P 6250 2525
F 0 "#PWR0100" H 6250 2525 30  0001 C CNN
F 1 "GND" H 6250 2455 30  0001 C CNN
F 2 "" H 6250 2525 60  0000 C CNN
F 3 "" H 6250 2525 60  0000 C CNN
	1    6250 2525
	1    0    0    -1  
$EndComp
$Comp
L GND-RESCUE-adc_main_shield #PWR0101
U 1 1 546A2EE0
P 5050 750
F 0 "#PWR0101" H 5050 750 30  0001 C CNN
F 1 "GND" H 5050 680 30  0001 C CNN
F 2 "" H 5050 750 60  0000 C CNN
F 3 "" H 5050 750 60  0000 C CNN
	1    5050 750 
	1    0    0    -1  
$EndComp
Text HLabel 6450 1450 2    60   Input ~ 0
ADC_VCOM
Text HLabel 6450 1250 2    60   Input ~ 0
5V_PGA
$Comp
L Resistor R2
U 1 1 546A347E
P 9850 800
F 0 "R2" V 9930 800 40  0000 C CNN
F 1 "49.9" V 9857 801 40  0000 C CNN
F 2 "Ruwai:Resistor_SMD0102_ReflowWave" V 9780 800 30  0001 C CNN
F 3 "" V 9930 800 30  0000 C CNN
F 4 "Panasonic" H 9850 300 60  0001 L CNN "Manu"
F 5 "ERJ6ENF49R9V" H 9850 200 60  0001 L CNN "Manu#"
F 6 "0805" H 9850 100 60  0001 L CNN "Package"
F 7 "Custom Description" H 9850 0   60  0001 L CNN "Desc"
	1    9850 800 
	0    1    1    0   
$EndComp
$Comp
L Capacitor C6
U 1 1 546A3582
P 10250 1150
F 0 "C6" H 10250 1250 40  0000 L CNN
F 1 "10nF" H 10256 1065 40  0000 L CNN
F 2 "Ruwai:Capacitor_SMD0805_ReflowWave" H 10288 1000 30  0001 C CNN
F 3 "" H 10250 1250 60  0000 C CNN
F 4 "Kemet" H 10300 750 60  0001 L CNN "Manu"
F 5 "C0805C103J3GACTU" H 10300 650 60  0001 L CNN "Manu#"
F 6 "0805" H 10300 550 60  0001 L CNN "Package"
F 7 "Custom Description" H 10250 800 60  0001 L CNN "Desc"
	1    10250 1150
	-1   0    0    1   
$EndComp
Text HLabel 10450 800  2    60   Output ~ 0
AOUT4_P
Text HLabel 10450 1500 2    60   Output ~ 0
AOUT4_N
Text HLabel 10450 2000 2    60   Output ~ 0
AOUT3_P
Text HLabel 10450 2700 2    60   Output ~ 0
AOUT3_N
Text HLabel 10450 3150 2    60   Output ~ 0
AOUT2_P
Text HLabel 10450 3850 2    60   Output ~ 0
AOUT2_N
Text HLabel 10450 4350 2    60   Output ~ 0
AOUT1_P
Text HLabel 10450 5050 2    60   Output ~ 0
AOUT1_N
$Comp
L ferrite_bead L23
U 1 1 546A6715
P 6000 3750
F 0 "L23" H 6010 3820 40  0000 C CNN
F 1 "600" H 6000 3670 40  0000 C CNN
F 2 "Ruwai:Inductor_SMD0805_ReflowWave" H 6000 3680 30  0001 C CNN
F 3 "" H 6000 3830 30  0000 C CNN
F 4 "Murata" H 6000 3500 60  0001 L CNN "Manu"
F 5 "BLM21BD601SN1D" H 6000 3400 60  0001 L CNN "Manu#"
F 6 "0805" H 6000 3300 60  0001 L CNN "Package"
F 7 "Custom Description" H 6000 3200 60  0001 L CNN "Desc"
	1    6000 3750
	1    0    0    1   
$EndComp
Text Label 7150 3750 0    60   ~ 0
+15V_PGA
Text Label 7150 3550 0    60   ~ 0
-15V_PGA
$Comp
L ferrite_bead L22
U 1 1 546A6D2A
P 5550 3350
F 0 "L22" H 5560 3420 40  0000 C CNN
F 1 "220" H 5550 3270 40  0000 C CNN
F 2 "Ruwai:Inductor_SMD0805_ReflowWave" H 5550 3280 30  0001 C CNN
F 3 "" H 5550 3430 30  0000 C CNN
F 4 "Murata" H 5550 3100 60  0001 L CNN "Manu"
F 5 "BLM21PG221SN1D" H 5550 3000 60  0001 L CNN "Manu#"
F 6 "0805" H 5550 2900 60  0001 L CNN "Package"
F 7 "Custom Description" H 5550 2800 60  0001 L CNN "Desc"
	1    5550 3350
	1    0    0    1   
$EndComp
Text HLabel 7150 3350 2    60   Input ~ 0
DOUT_ADC_STACK
Text HLabel 7150 3200 2    60   Output ~ 0
DIN_ADC
Text HLabel 6100 6700 2    60   Output ~ 0
GPS_CLK_3
Text HLabel 7150 2850 2    60   Output ~ 0
5.1V
$Comp
L Capacitor C12
U 1 1 546A7A15
P 6375 4000
F 0 "C12" H 6375 4100 40  0000 L CNN
F 1 "10uF" H 6381 3915 40  0000 L CNN
F 2 "Ruwai:Capacitor_SMD1206_ReflowWave" H 6413 3850 30  0001 C CNN
F 3 "" H 6375 4100 60  0000 C CNN
F 4 "Murata" H 6425 3600 60  0001 L CNN "Manu"
F 5 "GRM31CR71E106KA12L" H 6425 3500 60  0001 L CNN "Manu#"
F 6 "1206" H 6425 3400 60  0001 L CNN "Package"
F 7 "Custom Description" H 6375 3650 60  0001 L CNN "Desc"
	1    6375 4000
	1    0    0    1   
$EndComp
NoConn ~ 1950 2300
NoConn ~ 1950 2400
NoConn ~ 1950 2500
NoConn ~ 1950 2600
NoConn ~ 1950 2700
NoConn ~ 1950 3000
NoConn ~ 1950 3500
NoConn ~ 1950 3600
NoConn ~ 1950 3700
NoConn ~ 1950 3800
NoConn ~ 1950 3900
NoConn ~ 1950 4000
NoConn ~ 1950 4100
NoConn ~ 1950 4300
NoConn ~ 1950 4400
NoConn ~ 1950 4500
NoConn ~ 1950 4600
NoConn ~ 1950 4700
NoConn ~ 1950 4800
NoConn ~ 1950 4900
NoConn ~ 1950 5000
$Comp
L GND-RESCUE-adc_main_shield #PWR0102
U 1 1 546A9B78
P 1750 5600
F 0 "#PWR0102" H 1750 5600 30  0001 C CNN
F 1 "GND" H 1750 5530 30  0001 C CNN
F 2 "" H 1750 5600 60  0000 C CNN
F 3 "" H 1750 5600 60  0000 C CNN
	1    1750 5600
	1    0    0    -1  
$EndComp
Text HLabel 1250 6000 0    60   Output ~ 0
DOUT1_ARD
Text HLabel 1250 5800 0    60   Output ~ 0
SCLK_ARD
Text HLabel 1250 6900 0    60   Output ~ 0
CLKDIV_ARD
NoConn ~ 1950 5700
NoConn ~ 1950 5900
NoConn ~ 1950 6100
NoConn ~ 1950 6200
NoConn ~ 1950 6300
NoConn ~ 1950 6400
NoConn ~ 1950 6500
NoConn ~ 1950 6600
NoConn ~ 1950 6700
NoConn ~ 1950 6800
NoConn ~ 1950 7000
NoConn ~ 1950 7100
NoConn ~ 1950 7200
NoConn ~ 5150 6100
NoConn ~ 5150 6200
NoConn ~ 5150 6300
NoConn ~ 5150 6400
NoConn ~ 5150 6500
NoConn ~ 5150 6600
NoConn ~ 5150 6800
NoConn ~ 5150 6900
NoConn ~ 5150 7000
NoConn ~ 5150 7100
NoConn ~ 5150 7200
Text HLabel 6100 5600 2    60   Output ~ 0
SYNC_ARD
Text HLabel 6100 5800 2    60   Output ~ 0
MODE0_ARD
Text HLabel 6100 6000 2    60   Output ~ 0
MODE1_ARD
Text HLabel 6100 6200 2    60   Output ~ 0
FORMAT0_ARD
NoConn ~ 5150 5500
NoConn ~ 5150 5400
Text HLabel 6100 5000 2    60   Output ~ 0
SCL_ARD
Text HLabel 6100 4800 2    60   BiDi ~ 0
SDA_ARD
Text HLabel 6100 4600 2    60   Input ~ 0
DRDY_ARD
NoConn ~ 5150 4700
NoConn ~ 5150 4600
NoConn ~ 5150 4500
NoConn ~ 5150 4400
NoConn ~ 5150 4300
$Comp
L ferrite_bead L24
U 1 1 546CE806
P 5800 3550
F 0 "L24" H 5810 3620 40  0000 C CNN
F 1 "600" H 5800 3470 40  0000 C CNN
F 2 "Ruwai:Inductor_SMD0805_ReflowWave" H 5800 3480 30  0001 C CNN
F 3 "" H 5800 3630 30  0000 C CNN
F 4 "Murata" H 5800 3300 60  0001 L CNN "Manu"
F 5 "BLM21BD601SN1D" H 5800 3200 60  0001 L CNN "Manu#"
F 6 "0805" H 5800 3100 60  0001 L CNN "Package"
F 7 "Custom Description" H 5800 3000 60  0001 L CNN "Desc"
	1    5800 3550
	1    0    0    1   
$EndComp
$Comp
L ferrite_bead L21
U 1 1 546CE9F6
P 5800 3200
F 0 "L21" H 5810 3270 40  0000 C CNN
F 1 "220" H 5800 3120 40  0000 C CNN
F 2 "Ruwai:Inductor_SMD0805_ReflowWave" H 5800 3130 30  0001 C CNN
F 3 "" H 5800 3280 30  0000 C CNN
F 4 "Murata" H 5800 2950 60  0001 L CNN "Manu"
F 5 "BLM21PG221SN1D" H 5800 2850 60  0001 L CNN "Manu#"
F 6 "0805" H 5800 2750 60  0001 L CNN "Package"
F 7 "Custom Description" H 5800 2650 60  0001 L CNN "Desc"
	1    5800 3200
	1    0    0    1   
$EndComp
$Comp
L ferrite_bead L20
U 1 1 546CEAF8
P 5750 6700
F 0 "L20" H 5760 6770 40  0000 C CNN
F 1 "220" H 5750 6620 40  0000 C CNN
F 2 "Ruwai:Inductor_SMD0805_ReflowWave" H 5750 6630 30  0001 C CNN
F 3 "" H 5750 6780 30  0000 C CNN
F 4 "Murata" H 5750 6450 60  0001 L CNN "Manu"
F 5 "BLM21PG221SN1D" H 5750 6350 60  0001 L CNN "Manu#"
F 6 "0805" H 5750 6250 60  0001 L CNN "Package"
F 7 "Custom Description" H 5750 6150 60  0001 L CNN "Desc"
	1    5750 6700
	1    0    0    1   
$EndComp
$Comp
L ferrite_bead L4
U 1 1 546CEBF8
P 5800 2850
F 0 "L4" H 5810 2920 40  0000 C CNN
F 1 "220" H 5800 2770 40  0000 C CNN
F 2 "Ruwai:Inductor_SMD0805_ReflowWave" H 5800 2780 30  0001 C CNN
F 3 "" H 5800 2930 30  0000 C CNN
F 4 "Murata" H 5800 2600 60  0001 L CNN "Manu"
F 5 "BLM21PG221SN1D" H 5800 2500 60  0001 L CNN "Manu#"
F 6 "0805" H 5800 2400 60  0001 L CNN "Package"
F 7 "Custom Description" H 5800 2300 60  0001 L CNN "Desc"
	1    5800 2850
	1    0    0    1   
$EndComp
$Comp
L ferrite_bead L35
U 1 1 546AE6DD
P 5650 4600
F 0 "L35" H 5520 4650 40  0000 L BNN
F 1 "220" H 5730 4520 40  0000 C CNN
F 2 "Ruwai:Inductor_SMD0805_ReflowWave" H 5650 4530 30  0001 C CNN
F 3 "" H 5650 4680 30  0000 C CNN
F 4 "Murata" H 5650 4350 60  0001 L CNN "Manu"
F 5 "BLM21PG221SN1D" H 5650 4250 60  0001 L CNN "Manu#"
F 6 "0805" H 5650 4150 60  0001 L CNN "Package"
F 7 "Custom Description" H 5650 4050 60  0001 L CNN "Desc"
	1    5650 4600
	1    0    0    -1  
$EndComp
$Comp
L ferrite_bead L34
U 1 1 546CFB71
P 5650 4800
F 0 "L34" H 5520 4850 40  0000 L BNN
F 1 "220" H 5730 4720 40  0000 C CNN
F 2 "Ruwai:Inductor_SMD0805_ReflowWave" H 5650 4730 30  0001 C CNN
F 3 "" H 5650 4880 30  0000 C CNN
F 4 "Murata" H 5650 4550 60  0001 L CNN "Manu"
F 5 "BLM21PG221SN1D" H 5650 4450 60  0001 L CNN "Manu#"
F 6 "0805" H 5650 4350 60  0001 L CNN "Package"
F 7 "Custom Description" H 5650 4250 60  0001 L CNN "Desc"
	1    5650 4800
	1    0    0    -1  
$EndComp
$Comp
L ferrite_bead L33
U 1 1 546CFBCE
P 5650 5000
F 0 "L33" H 5520 5050 40  0000 L BNN
F 1 "220" H 5730 4920 40  0000 C CNN
F 2 "Ruwai:Inductor_SMD0805_ReflowWave" H 5650 4930 30  0001 C CNN
F 3 "" H 5650 5080 30  0000 C CNN
F 4 "Murata" H 5650 4750 60  0001 L CNN "Manu"
F 5 "BLM21PG221SN1D" H 5650 4650 60  0001 L CNN "Manu#"
F 6 "0805" H 5650 4550 60  0001 L CNN "Package"
F 7 "Custom Description" H 5650 4450 60  0001 L CNN "Desc"
	1    5650 5000
	1    0    0    -1  
$EndComp
$Comp
L ferrite_bead L29
U 1 1 546CFEE0
P 5750 5600
F 0 "L29" H 5620 5650 40  0000 L BNN
F 1 "220" H 5830 5520 40  0000 C CNN
F 2 "Ruwai:Inductor_SMD0805_ReflowWave" H 5750 5530 30  0001 C CNN
F 3 "" H 5750 5680 30  0000 C CNN
F 4 "Murata" H 5750 5350 60  0001 L CNN "Manu"
F 5 "BLM21PG221SN1D" H 5750 5250 60  0001 L CNN "Manu#"
F 6 "0805" H 5750 5150 60  0001 L CNN "Package"
F 7 "Custom Description" H 5750 5050 60  0001 L CNN "Desc"
	1    5750 5600
	1    0    0    -1  
$EndComp
$Comp
L ferrite_bead L30
U 1 1 546CFF97
P 5750 5800
F 0 "L30" H 5620 5850 40  0000 L BNN
F 1 "220" H 5830 5720 40  0000 C CNN
F 2 "Ruwai:Inductor_SMD0805_ReflowWave" H 5750 5730 30  0001 C CNN
F 3 "" H 5750 5880 30  0000 C CNN
F 4 "Murata" H 5750 5550 60  0001 L CNN "Manu"
F 5 "BLM21PG221SN1D" H 5750 5450 60  0001 L CNN "Manu#"
F 6 "0805" H 5750 5350 60  0001 L CNN "Package"
F 7 "Custom Description" H 5750 5250 60  0001 L CNN "Desc"
	1    5750 5800
	1    0    0    -1  
$EndComp
$Comp
L ferrite_bead L31
U 1 1 546CFFF5
P 5750 6000
F 0 "L31" H 5620 6050 40  0000 L BNN
F 1 "220" H 5830 5920 40  0000 C CNN
F 2 "Ruwai:Inductor_SMD0805_ReflowWave" H 5750 5930 30  0001 C CNN
F 3 "" H 5750 6080 30  0000 C CNN
F 4 "Murata" H 5750 5750 60  0001 L CNN "Manu"
F 5 "BLM21PG221SN1D" H 5750 5650 60  0001 L CNN "Manu#"
F 6 "0805" H 5750 5550 60  0001 L CNN "Package"
F 7 "Custom Description" H 5750 5450 60  0001 L CNN "Desc"
	1    5750 6000
	1    0    0    -1  
$EndComp
$Comp
L ferrite_bead L32
U 1 1 546D005C
P 5750 6200
F 0 "L32" H 5620 6250 40  0000 L BNN
F 1 "220" H 5830 6120 40  0000 C CNN
F 2 "Ruwai:Inductor_SMD0805_ReflowWave" H 5750 6130 30  0001 C CNN
F 3 "" H 5750 6280 30  0000 C CNN
F 4 "Murata" H 5750 5950 60  0001 L CNN "Manu"
F 5 "BLM21PG221SN1D" H 5750 5850 60  0001 L CNN "Manu#"
F 6 "0805" H 5750 5750 60  0001 L CNN "Package"
F 7 "Custom Description" H 5750 5650 60  0001 L CNN "Desc"
	1    5750 6200
	1    0    0    -1  
$EndComp
$Comp
L ferrite_bead L27
U 1 1 546D0927
P 1600 6000
F 0 "L27" H 1470 6050 40  0000 L BNN
F 1 "220" H 1680 5920 40  0000 C CNN
F 2 "Ruwai:Inductor_SMD0805_ReflowWave" H 1600 5930 30  0001 C CNN
F 3 "" H 1600 6080 30  0000 C CNN
F 4 "Murata" H 1600 5750 60  0001 L CNN "Manu"
F 5 "BLM21PG221SN1D" H 1600 5650 60  0001 L CNN "Manu#"
F 6 "0805" H 1600 5550 60  0001 L CNN "Package"
F 7 "Custom Description" H 1600 5450 60  0001 L CNN "Desc"
	1    1600 6000
	1    0    0    -1  
$EndComp
$Comp
L ferrite_bead L26
U 1 1 546D09C2
P 1600 5800
F 0 "L26" H 1470 5850 40  0000 L BNN
F 1 "220" H 1680 5720 40  0000 C CNN
F 2 "Ruwai:Inductor_SMD0805_ReflowWave" H 1600 5730 30  0001 C CNN
F 3 "" H 1600 5880 30  0000 C CNN
F 4 "Murata" H 1600 5550 60  0001 L CNN "Manu"
F 5 "BLM21PG221SN1D" H 1600 5450 60  0001 L CNN "Manu#"
F 6 "0805" H 1600 5350 60  0001 L CNN "Package"
F 7 "Custom Description" H 1600 5250 60  0001 L CNN "Desc"
	1    1600 5800
	1    0    0    -1  
$EndComp
$Comp
L ferrite_bead L28
U 1 1 546D0A0E
P 1600 6900
F 0 "L28" H 1470 6950 40  0000 L BNN
F 1 "220" H 1680 6820 40  0000 C CNN
F 2 "Ruwai:Inductor_SMD0805_ReflowWave" H 1600 6830 30  0001 C CNN
F 3 "" H 1600 6980 30  0000 C CNN
F 4 "Murata" H 1600 6650 60  0001 L CNN "Manu"
F 5 "BLM21PG221SN1D" H 1600 6550 60  0001 L CNN "Manu#"
F 6 "0805" H 1600 6450 60  0001 L CNN "Package"
F 7 "Custom Description" H 1600 6350 60  0001 L CNN "Desc"
	1    1600 6900
	1    0    0    -1  
$EndComp
$Comp
L Resistor R1
U 1 1 546D4472
P 9850 1500
F 0 "R1" V 9930 1500 40  0000 C CNN
F 1 "49.9" V 9857 1501 40  0000 C CNN
F 2 "Ruwai:Resistor_SMD0102_ReflowWave" V 9780 1500 30  0001 C CNN
F 3 "" V 9930 1500 30  0000 C CNN
F 4 "Panasonic" H 9850 1000 60  0001 L CNN "Manu"
F 5 "ERJ6ENF49R9V" H 9850 900 60  0001 L CNN "Manu#"
F 6 "0805" H 9850 800 60  0001 L CNN "Package"
F 7 "Custom Description" H 9850 700 60  0001 L CNN "Desc"
	1    9850 1500
	0    1    1    0   
$EndComp
$Comp
L Resistor R4
U 1 1 546D4726
P 9850 2000
F 0 "R4" V 9930 2000 40  0000 C CNN
F 1 "49.9" V 9857 2001 40  0000 C CNN
F 2 "Ruwai:Resistor_SMD0102_ReflowWave" V 9780 2000 30  0001 C CNN
F 3 "" V 9930 2000 30  0000 C CNN
F 4 "Panasonic" H 9850 1500 60  0001 L CNN "Manu"
F 5 "ERJ6ENF49R9V" H 9850 1400 60  0001 L CNN "Manu#"
F 6 "0805" H 9850 1300 60  0001 L CNN "Package"
F 7 "Custom Description" H 9850 1200 60  0001 L CNN "Desc"
	1    9850 2000
	0    1    1    0   
$EndComp
$Comp
L Resistor R3
U 1 1 546D48BF
P 9850 2700
F 0 "R3" V 9930 2700 40  0000 C CNN
F 1 "49.9" V 9857 2701 40  0000 C CNN
F 2 "Ruwai:Resistor_SMD0102_ReflowWave" V 9780 2700 30  0001 C CNN
F 3 "" V 9930 2700 30  0000 C CNN
F 4 "Panasonic" H 9850 2200 60  0001 L CNN "Manu"
F 5 "ERJ6ENF49R9V" H 9850 2100 60  0001 L CNN "Manu#"
F 6 "0805" H 9850 2000 60  0001 L CNN "Package"
F 7 "Custom Description" H 9850 1900 60  0001 L CNN "Desc"
	1    9850 2700
	0    1    1    0   
$EndComp
$Comp
L Resistor R45
U 1 1 546D4B3C
P 9850 3150
F 0 "R45" V 9930 3150 40  0000 C CNN
F 1 "49.9" V 9857 3151 40  0000 C CNN
F 2 "Ruwai:Resistor_SMD0102_ReflowWave" V 9780 3150 30  0001 C CNN
F 3 "" V 9930 3150 30  0000 C CNN
F 4 "Panasonic" H 9850 2650 60  0001 L CNN "Manu"
F 5 "ERJ6ENF49R9V" H 9850 2550 60  0001 L CNN "Manu#"
F 6 "0805" H 9850 2450 60  0001 L CNN "Package"
F 7 "Custom Description" H 9850 2350 60  0001 L CNN "Desc"
	1    9850 3150
	0    1    1    0   
$EndComp
$Comp
L Resistor R38
U 1 1 546D4CC3
P 9850 3850
F 0 "R38" V 9930 3850 40  0000 C CNN
F 1 "49.9" V 9857 3851 40  0000 C CNN
F 2 "Ruwai:Resistor_SMD0102_ReflowWave" V 9780 3850 30  0001 C CNN
F 3 "" V 9930 3850 30  0000 C CNN
F 4 "Panasonic" H 9850 3350 60  0001 L CNN "Manu"
F 5 "ERJ6ENF49R9V" H 9850 3250 60  0001 L CNN "Manu#"
F 6 "0805" H 9850 3150 60  0001 L CNN "Package"
F 7 "Custom Description" H 9850 3050 60  0001 L CNN "Desc"
	1    9850 3850
	0    1    1    0   
$EndComp
$Comp
L Resistor R48
U 1 1 546D4E41
P 9850 4350
F 0 "R48" V 9930 4350 40  0000 C CNN
F 1 "49.9" V 9857 4351 40  0000 C CNN
F 2 "Ruwai:Resistor_SMD0102_ReflowWave" V 9780 4350 30  0001 C CNN
F 3 "" V 9930 4350 30  0000 C CNN
F 4 "Panasonic" H 9850 3850 60  0001 L CNN "Manu"
F 5 "ERJ6ENF49R9V" H 9850 3750 60  0001 L CNN "Manu#"
F 6 "0805" H 9850 3650 60  0001 L CNN "Package"
F 7 "Custom Description" H 9850 3550 60  0001 L CNN "Desc"
	1    9850 4350
	0    1    1    0   
$EndComp
$Comp
L Resistor R46
U 1 1 546D51A2
P 9850 5050
F 0 "R46" V 9930 5050 40  0000 C CNN
F 1 "49.9" V 9857 5051 40  0000 C CNN
F 2 "Ruwai:Resistor_SMD0102_ReflowWave" V 9780 5050 30  0001 C CNN
F 3 "" V 9930 5050 30  0000 C CNN
F 4 "Panasonic" H 9850 4550 60  0001 L CNN "Manu"
F 5 "ERJ6ENF49R9V" H 9850 4450 60  0001 L CNN "Manu#"
F 6 "0805" H 9850 4350 60  0001 L CNN "Package"
F 7 "Custom Description" H 9850 4250 60  0001 L CNN "Desc"
	1    9850 5050
	0    1    1    0   
$EndComp
$Comp
L Capacitor C7
U 1 1 546D64E1
P 10250 2350
F 0 "C7" H 10250 2450 40  0000 L CNN
F 1 "10nF" H 10256 2265 40  0000 L CNN
F 2 "Ruwai:Capacitor_SMD0805_ReflowWave" H 10288 2200 30  0001 C CNN
F 3 "" H 10250 2450 60  0000 C CNN
F 4 "Kemet" H 10300 1950 60  0001 L CNN "Manu"
F 5 "C0805C103J3GACTU" H 10300 1850 60  0001 L CNN "Manu#"
F 6 "0805" H 10300 1750 60  0001 L CNN "Package"
F 7 "Custom Description" H 10250 2000 60  0001 L CNN "Desc"
	1    10250 2350
	-1   0    0    1   
$EndComp
$Comp
L Capacitor C8
U 1 1 546D667C
P 10250 3500
F 0 "C8" H 10250 3600 40  0000 L CNN
F 1 "10nF" H 10256 3415 40  0000 L CNN
F 2 "Ruwai:Capacitor_SMD0805_ReflowWave" H 10288 3350 30  0001 C CNN
F 3 "" H 10250 3600 60  0000 C CNN
F 4 "Kemet" H 10300 3100 60  0001 L CNN "Manu"
F 5 "C0805C103J3GACTU" H 10300 3000 60  0001 L CNN "Manu#"
F 6 "0805" H 10300 2900 60  0001 L CNN "Package"
F 7 "Custom Description" H 10250 3150 60  0001 L CNN "Desc"
	1    10250 3500
	-1   0    0    1   
$EndComp
$Comp
L Capacitor C9
U 1 1 546D6819
P 10250 4700
F 0 "C9" H 10250 4800 40  0000 L CNN
F 1 "10nF" H 10256 4615 40  0000 L CNN
F 2 "Ruwai:Capacitor_SMD0805_ReflowWave" H 10288 4550 30  0001 C CNN
F 3 "" H 10250 4800 60  0000 C CNN
F 4 "Kemet" H 10300 4300 60  0001 L CNN "Manu"
F 5 "C0805C103J3GACTU" H 10300 4200 60  0001 L CNN "Manu#"
F 6 "0805" H 10300 4100 60  0001 L CNN "Package"
F 7 "Custom Description" H 10250 4350 60  0001 L CNN "Desc"
	1    10250 4700
	-1   0    0    1   
$EndComp
$Comp
L Capacitor C13
U 1 1 546D73B5
P 6675 4000
F 0 "C13" H 6675 4100 40  0000 L CNN
F 1 "10uF" H 6681 3915 40  0000 L CNN
F 2 "Ruwai:Capacitor_SMD1206_ReflowWave" H 6713 3850 30  0001 C CNN
F 3 "" H 6675 4100 60  0000 C CNN
F 4 "Murata" H 6725 3600 60  0001 L CNN "Manu"
F 5 "GRM31CR71E106KA12L" H 6725 3500 60  0001 L CNN "Manu#"
F 6 "1206" H 6725 3400 60  0001 L CNN "Package"
F 7 "Custom Description" H 6675 3650 60  0001 L CNN "Desc"
	1    6675 4000
	1    0    0    1   
$EndComp
$Comp
L Capacitor C2
U 1 1 546D8D1E
P 6250 950
F 0 "C2" H 6250 1050 40  0000 L CNN
F 1 "4.7uF" H 6256 865 40  0000 L CNN
F 2 "Ruwai:Capacitor_SMD1206_ReflowWave" H 6288 800 30  0001 C CNN
F 3 "" H 6250 1050 60  0000 C CNN
F 4 "Murata" H 6300 550 60  0001 L CNN "Manu"
F 5 "GRM31CR71H475KA12L" H 6300 450 60  0001 L CNN "Manu#"
F 6 "1206" H 6300 350 60  0001 L CNN "Package"
F 7 "Custom Description" H 6250 600 60  0001 L CNN "Desc"
	1    6250 950 
	-1   0    0    1   
$EndComp
$Comp
L Capacitor C4
U 1 1 546D91CF
P 6250 2225
F 0 "C4" H 6250 2325 40  0000 L CNN
F 1 "4.7uF" H 6256 2140 40  0000 L CNN
F 2 "Ruwai:Capacitor_SMD1206_ReflowWave" H 6288 2075 30  0001 C CNN
F 3 "" H 6250 2325 60  0000 C CNN
F 4 "Murata" H 6300 1825 60  0001 L CNN "Manu"
F 5 "GRM31CR71H475KA12L" H 6300 1725 60  0001 L CNN "Manu#"
F 6 "1206" H 6300 1625 60  0001 L CNN "Package"
F 7 "Custom Description" H 6250 1875 60  0001 L CNN "Desc"
	1    6250 2225
	-1   0    0    1   
$EndComp
$Comp
L Capacitor C3
U 1 1 546D934C
P 5900 2225
F 0 "C3" H 5900 2325 40  0000 L CNN
F 1 "4.7uF" H 5906 2140 40  0000 L CNN
F 2 "Ruwai:Capacitor_SMD1206_ReflowWave" H 5938 2075 30  0001 C CNN
F 3 "" H 5900 2325 60  0000 C CNN
F 4 "Murata" H 5950 1825 60  0001 L CNN "Manu"
F 5 "GRM31CR71H475KA12L" H 5950 1725 60  0001 L CNN "Manu#"
F 6 "1206" H 5950 1625 60  0001 L CNN "Package"
F 7 "Custom Description" H 5900 1875 60  0001 L CNN "Desc"
	1    5900 2225
	-1   0    0    1   
$EndComp
$Comp
L Capacitor C5
U 1 1 546D94AD
P 5250 2350
F 0 "C5" H 5250 2450 40  0000 L CNN
F 1 "4.7uF" H 5256 2265 40  0000 L CNN
F 2 "Ruwai:Capacitor_SMD1206_ReflowWave" H 5288 2200 30  0001 C CNN
F 3 "" H 5250 2450 60  0000 C CNN
F 4 "Murata" H 5300 1950 60  0001 L CNN "Manu"
F 5 "GRM31CR71H475KA12L" H 5300 1850 60  0001 L CNN "Manu#"
F 6 "1206" H 5300 1750 60  0001 L CNN "Package"
F 7 "Custom Description" H 5250 2000 60  0001 L CNN "Desc"
	1    5250 2350
	-1   0    0    1   
$EndComp
$Comp
L RUWAI_ADC_SHIELD SHIELD1
U 1 1 5471EA38
P 3550 4700
F 0 "SHIELD1" H 2450 2050 60  0000 C CNN
F 1 "RUWAI_ADC_SHIELD" H 2800 8500 60  0000 C CNN
F 2 "Ruwai:RUWAI_ADC_ARDUINO_SHIELD" H 3550 2050 60  0001 L CNN
F 3 "" H 3550 4700 60  0000 C CNN
F 4 "Manufacturer" H 3550 1900 60  0001 L CNN "Manu"
F 5 "Manufacturer part number" H 3550 1800 60  0001 L CNN "Manu#"
F 6 "The package of the part." H 3550 1700 60  0001 L CNN "Package"
F 7 "Custom Description" H 3550 1600 60  0001 L CNN "Desc"
	1    3550 4700
	1    0    0    -1  
$EndComp
$Comp
L GND-RESCUE-adc_main_shield #PWR0103
U 1 1 5475E61C
P 1250 1325
F 0 "#PWR0103" H 1250 1325 30  0001 C CNN
F 1 "GND" H 1250 1255 30  0001 C CNN
F 2 "" H 1250 1325 60  0000 C CNN
F 3 "" H 1250 1325 60  0000 C CNN
	1    1250 1325
	1    0    0    -1  
$EndComp
$Comp
L GND-RESCUE-adc_main_shield #PWR0104
U 1 1 54772145
P 6525 4325
F 0 "#PWR0104" H 6525 4325 30  0001 C CNN
F 1 "GND" H 6525 4255 30  0001 C CNN
F 2 "" H 6525 4325 60  0000 C CNN
F 3 "" H 6525 4325 60  0000 C CNN
	1    6525 4325
	-1   0    0    -1  
$EndComp
$Comp
L GND-RESCUE-adc_main_shield #PWR0105
U 1 1 54772BE3
P 5300 3975
F 0 "#PWR0105" H 5300 3975 30  0001 C CNN
F 1 "GND" H 5300 3905 30  0001 C CNN
F 2 "" H 5300 3975 60  0000 C CNN
F 3 "" H 5300 3975 60  0000 C CNN
	1    5300 3975
	-1   0    0    -1  
$EndComp
Wire Wire Line
	5050 2050 5400 2050
Wire Wire Line
	5050 1950 5400 1950
Wire Wire Line
	5050 1850 5400 1850
Wire Wire Line
	5250 2550 5250 2650
Wire Wire Line
	5250 2150 5250 2050
Connection ~ 5250 2050
Wire Wire Line
	5050 1750 6450 1750
Wire Wire Line
	5050 1650 6450 1650
Wire Wire Line
	5900 2025 5900 1750
Connection ~ 5900 1750
Wire Wire Line
	6250 2025 6250 1650
Connection ~ 6250 1650
Wire Wire Line
	5900 2425 5900 2525
Wire Wire Line
	6250 2425 6250 2525
Wire Wire Line
	5050 1450 6450 1450
Wire Wire Line
	5050 1250 6450 1250
Wire Wire Line
	5250 1550 5050 1550
Wire Wire Line
	5250 650  5250 1550
Wire Wire Line
	5050 650  6250 650 
Wire Wire Line
	5050 650  5050 750 
Wire Wire Line
	5050 1350 5250 1350
Connection ~ 5250 1350
Wire Wire Line
	5900 1250 5900 1150
Connection ~ 5900 1250
Wire Wire Line
	6250 1450 6250 1150
Connection ~ 6250 1450
Wire Wire Line
	5900 650  5900 750 
Connection ~ 5250 650 
Wire Wire Line
	6250 650  6250 750 
Connection ~ 5900 650 
Wire Wire Line
	9400 800  9600 800 
Wire Wire Line
	9400 1500 9600 1500
Wire Wire Line
	10100 800  10450 800 
Wire Wire Line
	10100 1500 10450 1500
Wire Wire Line
	10250 1350 10250 1500
Connection ~ 10250 1500
Wire Wire Line
	10250 950  10250 800 
Connection ~ 10250 800 
Wire Wire Line
	9400 2000 9600 2000
Wire Wire Line
	9400 2700 9600 2700
Wire Wire Line
	10100 2000 10450 2000
Wire Wire Line
	10100 2700 10450 2700
Wire Wire Line
	10250 2550 10250 2700
Connection ~ 10250 2700
Wire Wire Line
	10250 2150 10250 2000
Connection ~ 10250 2000
Wire Wire Line
	9400 3150 9600 3150
Wire Wire Line
	9400 3850 9600 3850
Wire Wire Line
	10100 3150 10450 3150
Wire Wire Line
	10100 3850 10450 3850
Wire Wire Line
	10250 3700 10250 3850
Connection ~ 10250 3850
Wire Wire Line
	10250 3300 10250 3150
Connection ~ 10250 3150
Wire Wire Line
	9400 4350 9600 4350
Wire Wire Line
	9450 5050 9600 5050
Wire Wire Line
	10100 4350 10450 4350
Wire Wire Line
	10100 5050 10450 5050
Wire Wire Line
	10250 4900 10250 5050
Connection ~ 10250 5050
Wire Wire Line
	10250 4500 10250 4350
Connection ~ 10250 4350
Wire Wire Line
	6200 3750 7150 3750
Wire Wire Line
	5150 3550 5600 3550
Wire Wire Line
	6000 3550 7150 3550
Wire Wire Line
	5300 2950 5300 3975
Wire Wire Line
	5300 3450 5150 3450
Connection ~ 5300 3450
Wire Wire Line
	5150 3150 5300 3150
Connection ~ 5300 3150
Wire Wire Line
	5150 2950 5300 2950
Wire Wire Line
	5150 3350 5350 3350
Wire Wire Line
	5750 3350 7150 3350
Wire Wire Line
	5150 3250 5400 3250
Wire Wire Line
	5400 3250 5400 3200
Wire Wire Line
	5400 3200 5600 3200
Wire Wire Line
	6000 3200 7150 3200
Wire Wire Line
	5150 2850 5600 2850
Wire Wire Line
	6000 2850 7150 2850
Wire Wire Line
	1950 5500 1750 5500
Wire Wire Line
	1750 5400 1750 5600
Wire Wire Line
	1950 5400 1750 5400
Connection ~ 1750 5500
Wire Wire Line
	1950 5800 1800 5800
Wire Wire Line
	1950 6000 1800 6000
Wire Wire Line
	1400 5800 1250 5800
Wire Wire Line
	1400 6000 1250 6000
Wire Wire Line
	1800 6900 1950 6900
Wire Wire Line
	1400 6900 1250 6900
Wire Wire Line
	5150 5700 5300 5700
Wire Wire Line
	5300 5700 5300 5600
Wire Wire Line
	5300 5600 5550 5600
Wire Wire Line
	5150 5800 5550 5800
Wire Wire Line
	5150 5900 5450 5900
Wire Wire Line
	5450 5900 5450 6000
Wire Wire Line
	5450 6000 5550 6000
Wire Wire Line
	5150 6000 5300 6000
Wire Wire Line
	5300 6000 5300 6200
Wire Wire Line
	5300 6200 5550 6200
Wire Wire Line
	5950 5600 6100 5600
Wire Wire Line
	5950 5800 6100 5800
Wire Wire Line
	5950 6000 6100 6000
Wire Wire Line
	5950 6200 6100 6200
Wire Wire Line
	5150 5000 5450 5000
Wire Wire Line
	5150 4900 5350 4900
Wire Wire Line
	5350 4900 5350 4800
Wire Wire Line
	5350 4800 5450 4800
Wire Wire Line
	5150 4800 5250 4800
Wire Wire Line
	5250 4800 5250 4600
Wire Wire Line
	5250 4600 5450 4600
Wire Wire Line
	5850 4600 6100 4600
Wire Wire Line
	5850 4800 6100 4800
Wire Wire Line
	5850 5000 6100 5000
Wire Wire Line
	5150 3750 5800 3750
Wire Wire Line
	2050 1100 1250 1100
Wire Wire Line
	1250 1100 1250 1325
Wire Wire Line
	2050 1200 1250 1200
Connection ~ 1250 1200
Wire Wire Line
	6525 4250 6525 4325
Wire Wire Line
	5450 3750 5450 3750
Wire Wire Line
	6375 3800 6375 2850
Connection ~ 6375 2850
Wire Wire Line
	6675 2850 6675 3800
Connection ~ 6675 2850
Wire Wire Line
	6375 4200 6375 4250
Wire Wire Line
	6375 4250 6675 4250
Wire Wire Line
	6675 4250 6675 4200
Connection ~ 6525 4250
Wire Wire Line
	2050 1400 1800 1400
Wire Wire Line
	2050 1500 1800 1500
Wire Wire Line
	2050 1600 1800 1600
Wire Wire Line
	2050 1700 1800 1700
Wire Wire Line
	2050 1800 1800 1800
Wire Wire Line
	2050 1900 1800 1900
Wire Wire Line
	2050 2000 1800 2000
Wire Wire Line
	2050 2100 1800 2100
Text Label 9400 4350 2    60   ~ 0
CH1+
Text Label 9450 5050 2    60   ~ 0
CH1-
Text Label 1800 1500 2    60   ~ 0
CH1+
Text Label 1800 1400 2    60   ~ 0
CH1-
Text Label 1800 1700 2    60   ~ 0
CH2+
Text Label 1800 1600 2    60   ~ 0
CH2-
Text Label 1800 1900 2    60   ~ 0
CH3+
Text Label 1800 1800 2    60   ~ 0
CH3-
Text Label 1800 2100 2    60   ~ 0
CH4+
Text Label 1800 2000 2    60   ~ 0
CH4-
Text Label 9400 3150 2    60   ~ 0
CH2+
Text Label 9400 3850 2    60   ~ 0
CH2-
Text Label 9400 2700 2    60   ~ 0
CH3-
Text Label 9400 2000 2    60   ~ 0
CH3+
Text Label 9400 800  2    60   ~ 0
CH4+
Text Label 9400 1500 2    60   ~ 0
CH4-
Wire Wire Line
	5150 6700 5550 6700
Wire Wire Line
	5950 6700 6100 6700
NoConn ~ 5150 3050
Wire Wire Line
	5150 3650 5300 3650
Connection ~ 5300 3650
NoConn ~ 1950 3400
NoConn ~ 1950 2800
NoConn ~ 1950 2900
$EndSCHEMATC
