(module Resistor_SMD0805_ReflowWave (layer F.Cu) (tedit 54D71946)
  (descr "Resistor, SMD, 0805, Reflow, Wave,")
  (tags "Resistor, SMD, 0805, Reflow, Wave,")
  (attr smd)
  (fp_text reference R (at 0 -2) (layer F.SilkS)
    (effects (font (size 0.65 0.65) (thickness 0.125)))
  )
  (fp_text value SMD0805_RW (at 0.20066 2.60096) (layer F.SilkS) hide
    (effects (font (thickness 0.3048)))
  )
  (fp_line (start -2.1 1.3) (end -2.1 -1.3) (layer F.CrtYd) (width 0.15))
  (fp_line (start 2.1 1.3) (end -2.1 1.3) (layer F.CrtYd) (width 0.15))
  (fp_line (start 2.1 -1.3) (end 2.1 1.3) (layer F.CrtYd) (width 0.15))
  (fp_line (start -2.1 -1.3) (end 2.1 -1.3) (layer F.CrtYd) (width 0.15))
  (fp_line (start -1.89992 0.50038) (end -1.89992 1.09982) (layer F.SilkS) (width 0.381))
  (fp_line (start -1.89992 1.09982) (end 1.89992 1.09982) (layer F.SilkS) (width 0.381))
  (fp_line (start 1.89992 1.09982) (end 1.89992 0.50038) (layer F.SilkS) (width 0.381))
  (fp_line (start 1.89992 -0.50038) (end 1.89992 -1.09982) (layer F.SilkS) (width 0.381))
  (fp_line (start 1.89992 -1.09982) (end -1.89992 -1.09982) (layer F.SilkS) (width 0.381))
  (fp_line (start -1.89992 -1.09982) (end -1.89992 -0.50038) (layer F.SilkS) (width 0.381))
  (pad 1 smd rect (at -1.00076 0) (size 0.8001 1.25) (layers F.Cu F.Paste F.Mask))
  (pad 2 smd rect (at 1.00076 0) (size 0.8001 1.25) (layers F.Cu F.Paste F.Mask))
  (model ${KIPRJMOD}/../../modules/packages_3d/kicad/R_0805.wrl
    (at (xyz 0 0 0))
    (scale (xyz 1 1 1))
    (rotate (xyz 0 0 0))
  )
)
