(module RUWAI_ARDUINO_SHIELD (layer F.Cu) (tedit 545F8F16)
  (fp_text reference SHIELD** (at 4.826 -54.61) (layer F.SilkS)
    (effects (font (thickness 0.3048)))
  )
  (fp_text value RUWAI_ARDUINO_SHIELD (at 12.446 1.27) (layer F.SilkS)
    (effects (font (thickness 0.3048)))
  )
  (fp_line (start 88.9 0) (end 88.9 -53.34) (layer F.SilkS) (width 0.381))
  (fp_line (start 88.9 0) (end 0 0) (layer F.SilkS) (width 0.381))
  (fp_line (start 88.9 -53.34) (end 0 -53.34) (layer F.SilkS) (width 0.381))
  (fp_line (start 0 0) (end 0 -53.34) (layer F.SilkS) (width 0.381))
  (pad 14 thru_hole oval (at 58.42 -50.8 90) (size 2.54 1.524) (drill 0.8128) (layers *.Cu *.Mask F.SilkS))
  (pad 15 thru_hole oval (at 60.96 -50.8 90) (size 2.54 1.524) (drill 0.8128) (layers *.Cu *.Mask F.SilkS))
  (pad 16 thru_hole oval (at 63.5 -50.8 90) (size 2.54 1.524) (drill 0.8128) (layers *.Cu *.Mask F.SilkS))
  (pad 17 thru_hole oval (at 66.04 -50.8 90) (size 2.54 1.524) (drill 0.8128) (layers *.Cu *.Mask F.SilkS))
  (pad 18 thru_hole oval (at 68.58 -50.8 90) (size 2.54 1.524) (drill 0.8128) (layers *.Cu *.Mask F.SilkS))
  (pad 19 thru_hole oval (at 71.12 -50.8 90) (size 2.54 1.524) (drill 0.8128) (layers *.Cu *.Mask F.SilkS))
  (pad 20 thru_hole oval (at 73.66 -50.8 90) (size 2.54 1.524) (drill 0.8128) (layers *.Cu *.Mask F.SilkS))
  (pad 21 thru_hole oval (at 76.2 -50.8 90) (size 2.54 1.524) (drill 0.8128) (layers *.Cu *.Mask F.SilkS))
  (pad A15 thru_hole oval (at 81.28 -2.54 90) (size 2.54 1.524) (drill 0.8128) (layers *.Cu *.Mask F.SilkS))
  (pad A14 thru_hole oval (at 78.74 -2.54 90) (size 2.54 1.524) (drill 0.8128) (layers *.Cu *.Mask F.SilkS))
  (pad A13 thru_hole oval (at 76.2 -2.54 90) (size 2.54 1.524) (drill 0.8128) (layers *.Cu *.Mask F.SilkS))
  (pad A12 thru_hole oval (at 73.66 -2.54 90) (size 2.54 1.524) (drill 0.8128) (layers *.Cu *.Mask F.SilkS))
  (pad A8 thru_hole oval (at 63.5 -2.54 90) (size 2.54 1.524) (drill 0.8128) (layers *.Cu *.Mask F.SilkS))
  (pad A7 thru_hole oval (at 58.42 -2.54 90) (size 2.54 1.524) (drill 0.8128) (layers *.Cu *.Mask F.SilkS))
  (pad A6 thru_hole oval (at 55.88 -2.54 90) (size 2.54 1.524) (drill 0.8128) (layers *.Cu *.Mask F.SilkS))
  (pad A9 thru_hole oval (at 66.04 -2.54 90) (size 2.54 1.524) (drill 0.8128) (layers *.Cu *.Mask F.SilkS))
  (pad A10 thru_hole oval (at 68.58 -2.54 90) (size 2.54 1.524) (drill 0.8128) (layers *.Cu *.Mask F.SilkS))
  (pad A11 thru_hole oval (at 71.12 -2.54 90) (size 2.54 1.524) (drill 0.8128) (layers *.Cu *.Mask F.SilkS))
  (pad A5 thru_hole oval (at 53.34 -2.54 90) (size 2.54 1.524) (drill 0.8128) (layers *.Cu *.Mask F.SilkS))
  (pad A4 thru_hole oval (at 50.8 -2.54 90) (size 2.54 1.524) (drill 0.8128) (layers *.Cu *.Mask F.SilkS))
  (pad A3 thru_hole oval (at 48.26 -2.54 90) (size 2.54 1.524) (drill 0.8128) (layers *.Cu *.Mask F.SilkS))
  (pad A0 thru_hole oval (at 40.64 -2.54 90) (size 2.54 1.524) (drill 0.8128) (layers *.Cu *.Mask F.SilkS))
  (pad A1 thru_hole oval (at 43.18 -2.54 90) (size 2.54 1.524) (drill 0.8128) (layers *.Cu *.Mask F.SilkS))
  (pad A2 thru_hole oval (at 45.72 -2.54 90) (size 2.54 1.524) (drill 0.8128) (layers *.Cu *.Mask F.SilkS))
  (pad P7 thru_hole oval (at 35.56 -2.54 90) (size 2.54 1.524) (drill 0.8128) (layers *.Cu *.Mask F.SilkS))
  (pad P6 thru_hole oval (at 33.02 -2.54 90) (size 2.54 1.524) (drill 0.8128) (layers *.Cu *.Mask F.SilkS))
  (pad P5 thru_hole oval (at 30.48 -2.54 90) (size 2.54 1.524) (drill 0.8128) (layers *.Cu *.Mask F.SilkS))
  (pad P3 thru_hole oval (at 25.4 -2.54 90) (size 2.54 1.524) (drill 0.8128) (layers *.Cu *.Mask F.SilkS))
  (pad P2 thru_hole oval (at 22.86 -2.54 90) (size 2.54 1.524) (drill 0.8128) (layers *.Cu *.Mask F.SilkS))
  (pad 0 thru_hole oval (at 53.34 -50.8 90) (size 2.54 1.524) (drill 0.8128) (layers *.Cu *.Mask F.SilkS))
  (pad 1 thru_hole oval (at 50.8 -50.8 90) (size 2.54 1.524) (drill 0.8128) (layers *.Cu *.Mask F.SilkS))
  (pad 2 thru_hole oval (at 48.26 -50.8 90) (size 2.54 1.524) (drill 0.8128) (layers *.Cu *.Mask F.SilkS))
  (pad 3 thru_hole oval (at 45.72 -50.8 90) (size 2.54 1.524) (drill 0.8128) (layers *.Cu *.Mask F.SilkS))
  (pad 4 thru_hole oval (at 43.18 -50.8 90) (size 2.54 1.524) (drill 0.8128) (layers *.Cu *.Mask F.SilkS))
  (pad 5 thru_hole oval (at 40.64 -50.8 90) (size 2.54 1.524) (drill 0.8128) (layers *.Cu *.Mask F.SilkS))
  (pad 6 thru_hole oval (at 38.1 -50.8 90) (size 2.54 1.524) (drill 0.8128) (layers *.Cu *.Mask F.SilkS))
  (pad 7 thru_hole oval (at 35.56 -50.8 90) (size 2.54 1.524) (drill 0.8128) (layers *.Cu *.Mask F.SilkS))
  (pad 8 thru_hole oval (at 31.496 -50.8 90) (size 2.54 1.524) (drill 0.8128) (layers *.Cu *.Mask F.SilkS))
  (pad 9 thru_hole oval (at 28.956 -50.8 90) (size 2.54 1.524) (drill 0.8128) (layers *.Cu *.Mask F.SilkS))
  (pad 10 thru_hole oval (at 26.416 -50.8 90) (size 2.54 1.524) (drill 0.8128) (layers *.Cu *.Mask F.SilkS))
  (pad 11 thru_hole oval (at 23.876 -50.8 90) (size 2.54 1.524) (drill 0.8128) (layers *.Cu *.Mask F.SilkS))
  (pad 12 thru_hole oval (at 21.336 -50.8 90) (size 2.54 1.524) (drill 0.8128) (layers *.Cu *.Mask F.SilkS))
  (pad 13 thru_hole oval (at 18.796 -50.8 90) (size 2.54 1.524) (drill 0.8128) (layers *.Cu *.Mask F.SilkS))
  (pad S0 thru_hole oval (at 16.256 -50.8 90) (size 2.54 1.524) (drill 0.8128) (layers *.Cu *.Mask F.SilkS))
  (pad S1 thru_hole oval (at 13.716 -50.8 90) (size 2.54 1.524) (drill 0.8128) (layers *.Cu *.Mask F.SilkS))
  (pad P4 thru_hole oval (at 27.94 -2.54 90) (size 2.54 1.524) (drill 0.8128) (layers *.Cu *.Mask F.SilkS))
  (pad "" thru_hole circle (at 86.36 -2.54 90) (size 3.937 3.937) (drill 3.175) (layers *.Cu *.Mask F.SilkS))
  (pad "" thru_hole circle (at 80.01 -50.8 90) (size 3.937 3.937) (drill 3.175) (layers *.Cu *.Mask F.SilkS))
  (pad "" thru_hole circle (at 5.08 -50.8 90) (size 3.937 3.937) (drill 3.175) (layers *.Cu *.Mask F.SilkS))
  (pad "" thru_hole circle (at 3.81 -2.54 90) (size 3.937 3.937) (drill 3.175) (layers *.Cu *.Mask F.SilkS))
  (pad 22 thru_hole circle (at 83.82 -48.26) (size 1.524 1.524) (drill 0.8128) (layers *.Cu *.Mask F.SilkS))
  (pad 23 thru_hole circle (at 86.36 -48.26) (size 1.524 1.524) (drill 0.8128) (layers *.Cu *.Mask F.SilkS))
  (pad 24 thru_hole circle (at 83.82 -45.72) (size 1.524 1.524) (drill 0.8128) (layers *.Cu *.Mask F.SilkS))
  (pad 25 thru_hole circle (at 86.36 -45.72) (size 1.524 1.524) (drill 0.8128) (layers *.Cu *.Mask F.SilkS))
  (pad 26 thru_hole circle (at 83.82 -43.18) (size 1.524 1.524) (drill 0.8128) (layers *.Cu *.Mask F.SilkS))
  (pad 27 thru_hole circle (at 86.36 -43.18) (size 1.524 1.524) (drill 0.8128) (layers *.Cu *.Mask F.SilkS))
  (pad 28 thru_hole circle (at 83.82 -40.64) (size 1.524 1.524) (drill 0.8128) (layers *.Cu *.Mask F.SilkS))
  (pad 29 thru_hole circle (at 86.36 -40.64) (size 1.524 1.524) (drill 0.8128) (layers *.Cu *.Mask F.SilkS))
  (pad D5V1 thru_hole circle (at 83.82 -50.8) (size 1.524 1.524) (drill 0.8128) (layers *.Cu *.Mask F.SilkS))
  (pad D5V2 thru_hole circle (at 86.36 -50.8) (size 1.524 1.524) (drill 0.8128) (layers *.Cu *.Mask F.SilkS))
  (pad 31 thru_hole circle (at 86.36 -38.1) (size 1.524 1.524) (drill 0.8128) (layers *.Cu *.Mask F.SilkS))
  (pad 30 thru_hole circle (at 83.82 -38.1) (size 1.524 1.524) (drill 0.8128) (layers *.Cu *.Mask F.SilkS))
  (pad 32 thru_hole circle (at 83.82 -35.56) (size 1.524 1.524) (drill 0.8128) (layers *.Cu *.Mask F.SilkS))
  (pad 33 thru_hole circle (at 86.36 -35.56) (size 1.524 1.524) (drill 0.8128) (layers *.Cu *.Mask F.SilkS))
  (pad 34 thru_hole circle (at 83.82 -33.02) (size 1.524 1.524) (drill 0.8128) (layers *.Cu *.Mask F.SilkS))
  (pad 35 thru_hole circle (at 86.36 -33.02) (size 1.524 1.524) (drill 0.8128) (layers *.Cu *.Mask F.SilkS))
  (pad 36 thru_hole circle (at 83.82 -30.48) (size 1.524 1.524) (drill 0.8128) (layers *.Cu *.Mask F.SilkS))
  (pad 37 thru_hole circle (at 86.36 -30.48) (size 1.524 1.524) (drill 0.8128) (layers *.Cu *.Mask F.SilkS))
  (pad 38 thru_hole circle (at 83.82 -27.94) (size 1.524 1.524) (drill 0.8128) (layers *.Cu *.Mask F.SilkS))
  (pad 39 thru_hole circle (at 86.36 -27.94) (size 1.524 1.524) (drill 0.8128) (layers *.Cu *.Mask F.SilkS))
  (pad 40 thru_hole circle (at 83.82 -25.4) (size 1.524 1.524) (drill 0.8128) (layers *.Cu *.Mask F.SilkS))
  (pad 41 thru_hole circle (at 86.36 -25.4) (size 1.524 1.524) (drill 0.8128) (layers *.Cu *.Mask F.SilkS))
  (pad 42 thru_hole circle (at 83.82 -22.86) (size 1.524 1.524) (drill 0.8128) (layers *.Cu *.Mask F.SilkS))
  (pad 43 thru_hole circle (at 86.36 -22.86) (size 1.524 1.524) (drill 0.8128) (layers *.Cu *.Mask F.SilkS))
  (pad 44 thru_hole circle (at 83.82 -20.32) (size 1.524 1.524) (drill 0.8128) (layers *.Cu *.Mask F.SilkS))
  (pad 45 thru_hole circle (at 86.36 -20.32) (size 1.524 1.524) (drill 0.8128) (layers *.Cu *.Mask F.SilkS))
  (pad 46 thru_hole circle (at 83.82 -17.78) (size 1.524 1.524) (drill 0.8128) (layers *.Cu *.Mask F.SilkS))
  (pad 47 thru_hole circle (at 86.36 -17.78) (size 1.524 1.524) (drill 0.8128) (layers *.Cu *.Mask F.SilkS))
  (pad 48 thru_hole circle (at 83.82 -15.24) (size 1.524 1.524) (drill 0.8128) (layers *.Cu *.Mask F.SilkS))
  (pad 49 thru_hole circle (at 86.36 -15.24) (size 1.524 1.524) (drill 0.8128) (layers *.Cu *.Mask F.SilkS))
  (pad 50 thru_hole circle (at 83.82 -12.7) (size 1.524 1.524) (drill 0.8128) (layers *.Cu *.Mask F.SilkS))
  (pad 51 thru_hole circle (at 86.36 -12.7) (size 1.524 1.524) (drill 0.8128) (layers *.Cu *.Mask F.SilkS))
  (pad 52 thru_hole circle (at 83.82 -10.16) (size 1.524 1.524) (drill 0.8128) (layers *.Cu *.Mask F.SilkS))
  (pad 53 thru_hole circle (at 86.36 -10.16) (size 1.524 1.524) (drill 0.8128) (layers *.Cu *.Mask F.SilkS))
  (pad DG1 thru_hole circle (at 83.82 -7.62) (size 1.524 1.524) (drill 0.8128) (layers *.Cu *.Mask F.SilkS))
  (pad DG2 thru_hole circle (at 86.36 -7.62) (size 1.524 1.524) (drill 0.8128) (layers *.Cu *.Mask F.SilkS))
  (pad P1 thru_hole oval (at 20.32 -2.54 90) (size 2.54 1.524) (drill 0.8128) (layers *.Cu *.Mask F.SilkS))
  (pad P0 thru_hole oval (at 17.78 -2.54 90) (size 2.54 1.524) (drill 0.8128) (layers *.Cu *.Mask F.SilkS))
  (pad S2 thru_hole oval (at 11.176 -50.8 90) (size 2.54 1.524) (drill 0.8128) (layers *.Cu *.Mask F.SilkS))
  (pad S3 thru_hole oval (at 8.636 -50.8 90) (size 2.54 1.524) (drill 0.8128) (layers *.Cu *.Mask F.SilkS))
  (pad I1 thru_hole rect (at 2.54 -11.176) (size 1.524 1.524) (drill 0.8128) (layers *.Cu *.Mask F.SilkS))
  (pad I2 thru_hole circle (at 2.54 -13.716) (size 1.524 1.524) (drill 0.8128) (layers *.Cu *.Mask F.SilkS))
  (pad I3 thru_hole circle (at 2.54 -16.256) (size 1.524 1.524) (drill 0.8128) (layers *.Cu *.Mask F.SilkS))
  (pad I4 thru_hole circle (at 2.54 -18.796) (size 1.524 1.524) (drill 0.8128) (layers *.Cu *.Mask F.SilkS))
  (pad I5 thru_hole circle (at 2.54 -21.336) (size 1.524 1.524) (drill 0.8128) (layers *.Cu *.Mask F.SilkS))
  (pad I6 thru_hole circle (at 2.54 -23.876) (size 1.524 1.524) (drill 0.8128) (layers *.Cu *.Mask F.SilkS))
  (pad I7 thru_hole circle (at 2.54 -26.416) (size 1.524 1.524) (drill 0.8128) (layers *.Cu *.Mask F.SilkS))
  (pad I8 thru_hole circle (at 2.54 -28.956) (size 1.524 1.524) (drill 0.8128) (layers *.Cu *.Mask F.SilkS))
  (pad I9 thru_hole circle (at 2.54 -31.496) (size 1.524 1.524) (drill 0.8128) (layers *.Cu *.Mask F.SilkS))
  (pad I10 thru_hole circle (at 2.54 -34.036) (size 1.524 1.524) (drill 0.8128) (layers *.Cu *.Mask F.SilkS))
  (model packages3d\nick\ArduinoMegaShield.wrl
    (at (xyz 0 0 0))
    (scale (xyz 1 1 1))
    (rotate (xyz 0 0 0))
  )
)
