(module conn_usb_B_micro_smd (layer F.Cu) (tedit 54D72B83)
  (descr "USB B micro SMD connector, Molex P/N 47346-0001")
  (fp_text reference conn_usb_B_micro_smd (at 0 2.9) (layer F.SilkS)
    (effects (font (size 0.65 0.65) (thickness 0.125)))
  )
  (fp_text value VAL** (at 0 -4.0005) (layer F.SilkS) hide
    (effects (font (size 0.50038 0.50038) (thickness 0.09906)))
  )
  (fp_line (start -4.4 2.3) (end -4.4 -3.6) (layer F.CrtYd) (width 0.15))
  (fp_line (start 4.5 2.3) (end -4.4 2.3) (layer F.CrtYd) (width 0.15))
  (fp_line (start 4.5 -3.6) (end 4.5 2.3) (layer F.CrtYd) (width 0.15))
  (fp_line (start -4.4 -3.6) (end 4.5 -3.6) (layer F.CrtYd) (width 0.15))
  (fp_line (start -4.20116 1.99898) (end 4.20116 1.99898) (layer F.SilkS) (width 0.20066))
  (fp_line (start -4.20116 2.10058) (end 4.20116 2.10058) (layer F.SilkS) (width 0.20066))
  (fp_line (start 4.20116 2.10058) (end 4.20116 1.89992) (layer F.SilkS) (width 0.20066))
  (fp_line (start 4.20116 1.89992) (end -4.20116 1.89992) (layer F.SilkS) (width 0.20066))
  (fp_line (start -4.20116 1.89992) (end -4.20116 2.10058) (layer F.SilkS) (width 0.20066))
  (fp_line (start -3.9 2) (end -3.8989 -2.90068) (layer F.SilkS) (width 0.3))
  (fp_line (start -3.8989 -2.90068) (end 3.8989 -2.90068) (layer F.SilkS) (width 0.3))
  (fp_line (start 3.8989 -2.90068) (end 3.9 2) (layer F.SilkS) (width 0.3))
  (pad 6 smd rect (at -0.8382 0) (size 1.17348 1.89738) (layers F.Cu F.Paste F.Mask))
  (pad 6 smd rect (at 0.8382 0) (size 1.17348 1.89738) (layers F.Cu F.Paste F.Mask))
  (pad 6 smd rect (at 2.91338 0) (size 2.3749 1.89738) (layers F.Cu F.Paste F.Mask))
  (pad 6 smd rect (at -2.91338 0) (size 2.3749 1.89738) (layers F.Cu F.Paste F.Mask))
  (pad 6 smd rect (at 2.46126 -2.2987) (size 1.4732 2.10058) (layers F.Cu F.Paste F.Mask))
  (pad 6 smd rect (at -2.46126 -2.2987) (size 1.4732 2.10058) (layers F.Cu F.Paste F.Mask))
  (pad 1 smd rect (at -1.30048 -2.65938) (size 0.44958 1.37922) (layers F.Cu F.Paste F.Mask))
  (pad 2 smd rect (at -0.65024 -2.65938) (size 0.44958 1.37922) (layers F.Cu F.Paste F.Mask))
  (pad 3 smd rect (at 0 -2.65938) (size 0.44958 1.37922) (layers F.Cu F.Paste F.Mask))
  (pad 4 smd rect (at 0.65024 -2.65938) (size 0.44958 1.37922) (layers F.Cu F.Paste F.Mask))
  (pad 5 smd rect (at 1.30048 -2.65938) (size 0.44958 1.37922) (layers F.Cu F.Paste F.Mask))
  (model ${KIPRJMOD}/../../modules/packages_3d/walter_lain/usb_B_micro_smd.wrl
    (at (xyz 0 0 0))
    (scale (xyz 1 1 1))
    (rotate (xyz 0 0 0))
  )
)
