ref,value,manufacturer,manufacturer part number,description,quantity
C-SENS1,connector,Bulgin,PXM7010/10S/CR/0911/SN,"Bulgin Buccaneer Series 7000, 10 Pole Free Hanging Connector Plug, Female Contacts, Quick Connect Mating ",1
C-SENS2,connector,Bulgin,PXP7081,"Dust Cap / Cover, Plug, Sealing Cap, Buccaneer 7000 Series PXP7010 Flex Cable Connectors",1
C-SENS3,connector,Bulgin,SA3544/S,"Bulgin 6000 Series, size 8 10A Female Crimp Contact for use with Circular Connector",10
