EESchema Schematic File Version 2
LIBS:power_supply_shield-rescue
LIBS:ruwai
LIBS:power
LIBS:device
LIBS:transistors
LIBS:conn
LIBS:linear
LIBS:regul
LIBS:74xx
LIBS:cmos4000
LIBS:adc-dac
LIBS:memory
LIBS:xilinx
LIBS:microcontrollers
LIBS:dsp
LIBS:microchip
LIBS:analog_switches
LIBS:motorola
LIBS:texas
LIBS:intel
LIBS:audio
LIBS:interface
LIBS:digital-audio
LIBS:philips
LIBS:display
LIBS:cypress
LIBS:siliconi
LIBS:opto
LIBS:atmel
LIBS:contrib
LIBS:valves
LIBS:power_supply_shield-cache
EELAYER 25 0
EELAYER END
$Descr A4 11693 8268
encoding utf-8
Sheet 4 4
Title "Ruwai ADC Main Shield"
Date "2017-09-17"
Rev "3"
Comp "Copyright Mertl Research GmbH 2014 "
Comment1 ""
Comment2 ""
Comment3 ""
Comment4 "This documentation describes Open Hardware and is licensed under the CERN OHL v. 1.2."
$EndDescr
$Comp
L TMR_1 U1
U 1 1 5482E248
P 5100 3750
F 0 "U1" H 4750 3450 60  0000 L CNN
F 1 "TMR 1-0523" H 4750 4100 60  0000 L CNN
F 2 "Ruwai:Traco_TMR_1" H 5110 3050 60  0001 L CNN
F 3 "" H 5150 3850 60  0000 C CNN
F 4 "Traco" H 5100 3450 60  0001 L CNN "Manu"
F 5 "TMR 1-0523" H 5100 3350 60  0001 L CNN "Manu#"
F 6 "TMR_1" H 5100 3250 60  0001 L CNN "Package"
F 7 "Custom Description" H 5100 3150 60  0001 L CNN "Desc"
	1    5100 3750
	1    0    0    -1  
$EndComp
$Comp
L inductor L3
U 1 1 5482DF9E
P 1850 3600
F 0 "L3" H 1850 3650 40  0000 C BNN
F 1 "10uH" H 1850 3550 40  0000 C CNN
F 2 "Ruwai:Inductor_SMD0805_ReflowWave" H 1750 3600 60  0001 C CNN
F 3 "" H 1750 3600 60  0000 C CNN
F 4 "Taiyo Yuden" H 1850 3400 60  0001 L BNN "Manu"
F 5 "BRL2012T100M " H 1850 3300 60  0001 L BNN "Manu#"
F 6 "0805" H 1850 3200 60  0001 L BNN "Package"
F 7 "Custom description." H 1850 3100 60  0001 L BNN "Desc"
	1    1850 3600
	1    0    0    -1  
$EndComp
Text HLabel 1350 3600 0    60   Input ~ 0
5.1V
$Comp
L Capacitor C7
U 1 1 5482E033
P 2200 3950
F 0 "C7" H 2200 4050 40  0000 L CNN
F 1 "100nF" H 2206 3865 40  0000 L CNN
F 2 "Ruwai:Capacitor_SMD1206_ReflowWave" H 2238 3800 30  0001 C CNN
F 3 "" H 2200 4050 60  0000 C CNN
F 4 "AVX" H 2250 3550 60  0001 L CNN "Manu"
F 5 "12065C104JAT1A" H 2250 3450 60  0001 L CNN "Manu#"
F 6 "1206" H 2250 3350 60  0001 L CNN "Package"
F 7 "Custom Description" H 2200 3600 60  0001 L CNN "Desc"
	1    2200 3950
	1    0    0    -1  
$EndComp
$Comp
L Capacitor C4
U 1 1 5482E119
P 2600 3950
F 0 "C4" H 2600 4050 40  0000 L CNN
F 1 "4.7uF" H 2606 3865 40  0000 L CNN
F 2 "Ruwai:Capacitor_SMD1206_ReflowWave" H 2638 3800 30  0001 C CNN
F 3 "" H 2600 4050 60  0000 C CNN
F 4 "Murata" H 2650 3550 60  0001 L CNN "Manu"
F 5 "GRM31CR71E475KA88L" H 2650 3450 60  0001 L CNN "Manu#"
F 6 "1206" H 2650 3350 60  0001 L CNN "Package"
F 7 "Custom Description" H 2600 3600 60  0001 L CNN "Desc"
	1    2600 3950
	1    0    0    -1  
$EndComp
$Comp
L Resistor R1
U 1 1 5482E1EF
P 3400 3600
F 0 "R1" V 3480 3600 40  0000 C CNN
F 1 "100m" V 3407 3601 40  0000 C CNN
F 2 "Ruwai:Resistor_SMD1206_ReflowWave" V 3330 3600 30  0001 C CNN
F 3 "" V 3480 3600 30  0000 C CNN
F 4 "Bourns" H 3400 3100 60  0001 L CNN "Manu"
F 5 "CRL1206-FW-R100ELF" H 3400 3000 60  0001 L CNN "Manu#"
F 6 "1206" H 3400 2900 60  0001 L CNN "Package"
F 7 "Custom Description" H 3400 2800 60  0001 L CNN "Desc"
	1    3400 3600
	0    1    1    0   
$EndComp
$Comp
L Capacitor C1
U 1 1 5482E2AE
P 3850 3950
F 0 "C1" H 3850 4050 40  0000 L CNN
F 1 "100nF" H 3856 3865 40  0000 L CNN
F 2 "Ruwai:Capacitor_SMD0805_ReflowWave" H 3888 3800 30  0001 C CNN
F 3 "" H 3850 4050 60  0000 C CNN
F 4 "Murata" H 3900 3550 60  0001 L CNN "Manu"
F 5 "GCM21BR71H104KA37L" H 3900 3450 60  0001 L CNN "Manu#"
F 6 "0805" H 3900 3350 60  0001 L CNN "Package"
F 7 "Custom Description" H 3850 3600 60  0001 L CNN "Desc"
	1    3850 3950
	1    0    0    -1  
$EndComp
$Comp
L GND-RESCUE-power_supply_shield #PWR018
U 1 1 5482E32A
P 2200 4450
F 0 "#PWR018" H 2200 4450 30  0001 C CNN
F 1 "GND" H 2200 4380 30  0001 C CNN
F 2 "" H 2200 4450 60  0000 C CNN
F 3 "" H 2200 4450 60  0000 C CNN
	1    2200 4450
	1    0    0    -1  
$EndComp
$Comp
L testpoint TP2
U 1 1 5482E795
P 3250 3000
F 0 "TP2" H 3190 2890 60  0000 C CNN
F 1 "15RP" H 3200 3120 60  0000 C CNN
F 2 "Ruwai:testpoint_1" H 3250 3000 60  0001 C CNN
F 3 "" H 3250 3000 60  0000 C CNN
F 4 "RS" H 3250 2700 60  0001 L CNN "Manu"
F 5 "200-101" H 3250 2600 60  0001 L CNN "Manu#"
F 6 "1mm" H 3250 2500 60  0001 L CNN "Package"
F 7 "Custom Description" H 3250 2400 60  0001 L CNN "Desc"
	1    3250 3000
	-1   0    0    1   
$EndComp
$Comp
L Resistor R4
U 1 1 5482ED40
P 7250 2950
F 0 "R4" V 7330 2950 40  0000 C CNN
F 1 "27k" V 7257 2951 40  0000 C CNN
F 2 "Ruwai:Resistor_SMD0805_ReflowWave" V 7180 2950 30  0001 C CNN
F 3 "" V 7330 2950 30  0000 C CNN
F 4 "Yageo" H 7250 2450 60  0001 L CNN "Manu"
F 5 "RC0805FR-0727KL" H 7250 2350 60  0001 L CNN "Manu#"
F 6 "0805" H 7250 2250 60  0001 L CNN "Package"
F 7 "Custom Description" H 7250 2150 60  0001 L CNN "Desc"
	1    7250 2950
	-1   0    0    1   
$EndComp
$Comp
L inductor L1
U 1 1 5482EEB2
P 7700 2550
F 0 "L1" H 7700 2600 40  0000 C BNN
F 1 "22uH" H 7700 2500 40  0000 C CNN
F 2 "Ruwai:Inductor_SMD1210_reflow" H 7600 2550 60  0001 C CNN
F 3 "" H 7600 2550 60  0000 C CNN
F 4 "Bourns" H 7700 2350 60  0001 L BNN "Manu"
F 5 "CM322522-220KL" H 7700 2250 60  0001 L BNN "Manu#"
F 6 "1210" H 7700 2150 60  0001 L BNN "Package"
F 7 "Custom description." H 7700 2050 60  0001 L BNN "Desc"
	1    7700 2550
	1    0    0    -1  
$EndComp
$Comp
L Resistor R2
U 1 1 5482F46F
P 9200 2550
F 0 "R2" V 9280 2550 40  0000 C CNN
F 1 "1" V 9207 2551 40  0000 C CNN
F 2 "Ruwai:Resistor_SMD0102_ReflowWave" V 9130 2550 30  0001 C CNN
F 3 "" V 9280 2550 30  0000 C CNN
F 4 "Yageo" H 9200 2050 60  0001 L CNN "Manu"
F 5 "RC0805FR-071RL" H 9200 1950 60  0001 L CNN "Manu#"
F 6 "0805" H 9200 1850 60  0001 L CNN "Package"
F 7 " " H 9200 1750 60  0001 L CNN "Desc"
	1    9200 2550
	0    -1   -1   0   
$EndComp
Wire Wire Line
	1650 3600 1350 3600
Wire Wire Line
	2050 3600 3150 3600
Wire Wire Line
	3650 3600 4550 3600
Wire Wire Line
	3850 3000 3850 3750
Connection ~ 3850 3600
Wire Wire Line
	3000 3000 3000 3750
Connection ~ 3000 3600
Wire Wire Line
	2600 3750 2600 3600
Connection ~ 2600 3600
Wire Wire Line
	2200 3750 2200 3600
Connection ~ 2200 3600
Wire Wire Line
	2200 4150 2200 4450
Wire Wire Line
	4350 3900 4550 3900
Connection ~ 2200 4300
Wire Wire Line
	3850 4150 3850 4600
Connection ~ 3850 4300
Wire Wire Line
	3000 4300 3000 4150
Connection ~ 3000 4300
Wire Wire Line
	2600 4150 2600 4300
Connection ~ 2600 4300
Wire Wire Line
	3000 3000 3150 3000
Wire Wire Line
	3850 3000 4050 3000
Wire Wire Line
	5650 3600 6050 3600
Wire Wire Line
	6050 3600 6050 2550
Wire Wire Line
	6050 2550 7500 2550
Wire Wire Line
	7900 2550 8950 2550
Wire Wire Line
	9450 2550 10150 2550
Wire Wire Line
	5650 3750 10300 3750
Wire Wire Line
	9650 1850 9650 2700
Connection ~ 9650 2550
Wire Wire Line
	8700 1850 8700 2700
Connection ~ 8700 2550
Wire Wire Line
	8300 2700 8300 2550
Connection ~ 8300 2550
Wire Wire Line
	7250 2700 7250 2550
Connection ~ 7250 2550
Wire Wire Line
	6750 3200 6750 2550
Connection ~ 6750 2550
Wire Wire Line
	8300 3100 8300 4400
Connection ~ 8300 3750
Wire Wire Line
	8700 3100 8700 4400
Connection ~ 8700 3750
Wire Wire Line
	9650 3100 9650 4400
Connection ~ 9650 3750
Wire Wire Line
	7250 3200 7250 3400
Wire Wire Line
	7250 3400 7400 3400
Wire Wire Line
	7800 3400 7950 3400
Wire Wire Line
	7950 3400 7950 4100
Connection ~ 7950 3750
Wire Wire Line
	6100 4950 7500 4950
Wire Wire Line
	7900 4950 8950 4950
Wire Wire Line
	9450 4950 10150 4950
Wire Wire Line
	9650 4800 9650 5650
Connection ~ 9650 4950
Wire Wire Line
	8700 4800 8700 5650
Connection ~ 8700 4950
Wire Wire Line
	8300 4800 8300 4950
Connection ~ 8300 4950
Wire Wire Line
	7250 4800 7250 4950
Connection ~ 7250 4950
Wire Wire Line
	7250 4300 7250 4100
Wire Wire Line
	7250 4100 7400 4100
Wire Wire Line
	7950 4100 7800 4100
Wire Wire Line
	5650 3900 6100 3900
Wire Wire Line
	6100 3900 6100 4950
Wire Wire Line
	6750 3600 6750 4950
Connection ~ 6750 4950
Text HLabel 10150 2550 2    60   Output ~ 0
+15V_PGA
Text HLabel 10150 4950 2    60   Output ~ 0
-15V_PGA
Text Notes 7150 950  2    100  ~ 20
+/- 15V power supply for PGA section
Wire Wire Line
	8700 1850 8950 1850
Wire Wire Line
	9650 1850 9800 1850
Wire Wire Line
	8700 5650 8950 5650
Wire Wire Line
	9650 5650 9800 5650
$Comp
L Capacitor C3
U 1 1 548479C6
P 3000 3950
F 0 "C3" H 3000 4050 40  0000 L CNN
F 1 "4.7uF" H 3006 3865 40  0000 L CNN
F 2 "Ruwai:Capacitor_SMD1206_ReflowWave" H 3038 3800 30  0001 C CNN
F 3 "" H 3000 4050 60  0000 C CNN
F 4 "Murata" H 3050 3550 60  0001 L CNN "Manu"
F 5 "GRM31CR71E475KA88L" H 3050 3450 60  0001 L CNN "Manu#"
F 6 "1206" H 3050 3350 60  0001 L CNN "Package"
F 7 "Custom Description" H 3000 3600 60  0001 L CNN "Desc"
	1    3000 3950
	1    0    0    -1  
$EndComp
$Comp
L testpoint TP3
U 1 1 54848379
P 4150 3000
F 0 "TP3" H 4090 2890 60  0000 C CNN
F 1 "15RM" H 4100 3120 60  0000 C CNN
F 2 "Ruwai:testpoint_1" H 4150 3000 60  0001 C CNN
F 3 "" H 4150 3000 60  0000 C CNN
F 4 "RS" H 4150 2700 60  0001 L CNN "Manu"
F 5 "200-101" H 4150 2600 60  0001 L CNN "Manu#"
F 6 "1mm" H 4150 2500 60  0001 L CNN "Package"
F 7 "Custom Description" H 4150 2400 60  0001 L CNN "Desc"
	1    4150 3000
	-1   0    0    1   
$EndComp
$Comp
L testpoint TP7
U 1 1 54848607
P 9050 1850
F 0 "TP7" H 8990 1740 60  0000 C CNN
F 1 "P15R" H 9000 1970 60  0000 C CNN
F 2 "Ruwai:testpoint_1" H 9050 1850 60  0001 C CNN
F 3 "" H 9050 1850 60  0000 C CNN
F 4 "RS" H 9050 1550 60  0001 L CNN "Manu"
F 5 "200-101" H 9050 1450 60  0001 L CNN "Manu#"
F 6 "1mm" H 9050 1350 60  0001 L CNN "Package"
F 7 "Custom Description" H 9050 1250 60  0001 L CNN "Desc"
	1    9050 1850
	-1   0    0    1   
$EndComp
$Comp
L testpoint TP8
U 1 1 54848C38
P 9900 1850
F 0 "TP8" H 9840 1740 60  0000 C CNN
F 1 "P15PGA" H 9850 1970 60  0000 C CNN
F 2 "Ruwai:testpoint_1" H 9900 1850 60  0001 C CNN
F 3 "" H 9900 1850 60  0000 C CNN
F 4 "RS" H 9900 1550 60  0001 L CNN "Manu"
F 5 "200-101" H 9900 1450 60  0001 L CNN "Manu#"
F 6 "1mm" H 9900 1350 60  0001 L CNN "Package"
F 7 "Custom Description" H 9900 1250 60  0001 L CNN "Desc"
	1    9900 1850
	-1   0    0    1   
$EndComp
$Comp
L testpoint TP9
U 1 1 54848F2D
P 9050 5650
F 0 "TP9" H 8990 5540 60  0000 C CNN
F 1 "M15R" H 9000 5770 60  0000 C CNN
F 2 "Ruwai:testpoint_1" H 9050 5650 60  0001 C CNN
F 3 "" H 9050 5650 60  0000 C CNN
F 4 "RS" H 9050 5350 60  0001 L CNN "Manu"
F 5 "200-101" H 9050 5250 60  0001 L CNN "Manu#"
F 6 "1mm" H 9050 5150 60  0001 L CNN "Package"
F 7 "Custom Description" H 9050 5050 60  0001 L CNN "Desc"
	1    9050 5650
	-1   0    0    1   
$EndComp
$Comp
L testpoint TP10
U 1 1 54849171
P 9900 5650
F 0 "TP10" H 9840 5540 60  0000 C CNN
F 1 "M15PGA" H 9850 5770 60  0000 C CNN
F 2 "Ruwai:testpoint_1" H 9900 5650 60  0001 C CNN
F 3 "" H 9900 5650 60  0000 C CNN
F 4 "RS" H 9900 5350 60  0001 L CNN "Manu"
F 5 "200-101" H 9900 5250 60  0001 L CNN "Manu#"
F 6 "1mm" H 9900 5150 60  0001 L CNN "Package"
F 7 "Custom Description" H 9900 5050 60  0001 L CNN "Desc"
	1    9900 5650
	-1   0    0    1   
$EndComp
$Comp
L Capacitor C2
U 1 1 54849651
P 6750 3400
F 0 "C2" H 6750 3500 40  0000 L CNN
F 1 "100nF" H 6756 3315 40  0000 L CNN
F 2 "Ruwai:Capacitor_SMD1206_ReflowWave" H 6788 3250 30  0001 C CNN
F 3 "" H 6750 3500 60  0000 C CNN
F 4 "AVX" H 6800 3000 60  0001 L CNN "Manu"
F 5 "12065C104JAT1A" H 6800 2900 60  0001 L CNN "Manu#"
F 6 "1206" H 6800 2800 60  0001 L CNN "Package"
F 7 "Custom Description" H 6750 3050 60  0001 L CNN "Desc"
	1    6750 3400
	1    0    0    -1  
$EndComp
$Comp
L Capacitor C8
U 1 1 54849A37
P 8300 2900
F 0 "C8" H 8300 3000 40  0000 L CNN
F 1 "100nF" H 8306 2815 40  0000 L CNN
F 2 "Ruwai:Capacitor_SMD1206_ReflowWave" H 8338 2750 30  0001 C CNN
F 3 "" H 8300 3000 60  0000 C CNN
F 4 "AVX" H 8350 2500 60  0001 L CNN "Manu"
F 5 "12065C104JAT1A" H 8350 2400 60  0001 L CNN "Manu#"
F 6 "1206" H 8350 2300 60  0001 L CNN "Package"
F 7 "Custom Description" H 8300 2550 60  0001 L CNN "Desc"
	1    8300 2900
	1    0    0    -1  
$EndComp
$Comp
L Capacitor C9
U 1 1 54849B9C
P 9650 2900
F 0 "C9" H 9650 3000 40  0000 L CNN
F 1 "100nF" H 9656 2815 40  0000 L CNN
F 2 "Ruwai:Capacitor_SMD1206_ReflowWave" H 9688 2750 30  0001 C CNN
F 3 "" H 9650 3000 60  0000 C CNN
F 4 "AVX" H 9700 2500 60  0001 L CNN "Manu"
F 5 "12065C104JAT1A" H 9700 2400 60  0001 L CNN "Manu#"
F 6 "1206" H 9700 2300 60  0001 L CNN "Package"
F 7 "Custom Description" H 9650 2550 60  0001 L CNN "Desc"
	1    9650 2900
	1    0    0    -1  
$EndComp
$Comp
L Capacitor C10
U 1 1 54849DE5
P 8300 4600
F 0 "C10" H 8300 4700 40  0000 L CNN
F 1 "100nF" H 8306 4515 40  0000 L CNN
F 2 "Ruwai:Capacitor_SMD1206_ReflowWave" H 8338 4450 30  0001 C CNN
F 3 "" H 8300 4700 60  0000 C CNN
F 4 "AVX" H 8350 4200 60  0001 L CNN "Manu"
F 5 "12065C104JAT1A" H 8350 4100 60  0001 L CNN "Manu#"
F 6 "1206" H 8350 4000 60  0001 L CNN "Package"
F 7 "Custom Description" H 8300 4250 60  0001 L CNN "Desc"
	1    8300 4600
	1    0    0    -1  
$EndComp
$Comp
L Capacitor C11
U 1 1 54849F0C
P 9650 4600
F 0 "C11" H 9650 4700 40  0000 L CNN
F 1 "100nF" H 9656 4515 40  0000 L CNN
F 2 "Ruwai:Capacitor_SMD1206_ReflowWave" H 9688 4450 30  0001 C CNN
F 3 "" H 9650 4700 60  0000 C CNN
F 4 "AVX" H 9700 4200 60  0001 L CNN "Manu"
F 5 "12065C104JAT1A" H 9700 4100 60  0001 L CNN "Manu#"
F 6 "1206" H 9700 4000 60  0001 L CNN "Package"
F 7 "Custom Description" H 9650 4250 60  0001 L CNN "Desc"
	1    9650 4600
	1    0    0    -1  
$EndComp
$Comp
L Capacitor C5
U 1 1 5484A403
P 8700 2900
F 0 "C5" H 8700 3000 40  0000 L CNN
F 1 "4.7uF" H 8706 2815 40  0000 L CNN
F 2 "Ruwai:Capacitor_SMD1206_ReflowWave" H 8738 2750 30  0001 C CNN
F 3 "" H 8700 3000 60  0000 C CNN
F 4 "Murata" H 8750 2500 60  0001 L CNN "Manu"
F 5 "GRM31CR71E475KA88L" H 8750 2400 60  0001 L CNN "Manu#"
F 6 "1206" H 8750 2300 60  0001 L CNN "Package"
F 7 "Custom Description" H 8700 2550 60  0001 L CNN "Desc"
	1    8700 2900
	1    0    0    -1  
$EndComp
$Comp
L Capacitor C6
U 1 1 5484A6BC
P 8700 4600
F 0 "C6" H 8700 4700 40  0000 L CNN
F 1 "4.7uF" H 8706 4515 40  0000 L CNN
F 2 "Ruwai:Capacitor_SMD1206_ReflowWave" H 8738 4450 30  0001 C CNN
F 3 "" H 8700 4700 60  0000 C CNN
F 4 "Murata" H 8750 4200 60  0001 L CNN "Manu"
F 5 "GRM31CR71E475KA88L" H 8750 4100 60  0001 L CNN "Manu#"
F 6 "1206" H 8750 4000 60  0001 L CNN "Package"
F 7 "Custom Description" H 8700 4250 60  0001 L CNN "Desc"
	1    8700 4600
	1    0    0    -1  
$EndComp
$Comp
L Resistor R5
U 1 1 5484ABE1
P 7250 4550
F 0 "R5" V 7330 4550 40  0000 C CNN
F 1 "27k" V 7257 4551 40  0000 C CNN
F 2 "Ruwai:Resistor_SMD0805_ReflowWave" V 7180 4550 30  0001 C CNN
F 3 "" V 7330 4550 30  0000 C CNN
F 4 "Yageo" H 7250 4050 60  0001 L CNN "Manu"
F 5 "RC0805FR-0727KL" H 7250 3950 60  0001 L CNN "Manu#"
F 6 "0805" H 7250 3850 60  0001 L CNN "Package"
F 7 "Custom Description" H 7250 3750 60  0001 L CNN "Desc"
	1    7250 4550
	-1   0    0    1   
$EndComp
$Comp
L LED D1
U 1 1 5484B271
P 7600 3400
F 0 "D1" H 7575 3485 40  0000 C CNN
F 1 "green" H 7600 3310 40  0000 C CNN
F 2 "Ruwai:LED-0805" H 7475 3385 60  0001 C CNN
F 3 "" H 7600 3400 60  0000 C CNN
F 4 "Knightbright" H 7600 3200 60  0001 L CNN "Manu"
F 5 "KP-2012SGC" H 7600 3100 60  0001 L CNN "Manu#"
F 6 "0805" H 7600 3000 60  0001 L CNN "Package"
F 7 "LED green." H 7600 2900 60  0001 L CNN "Desc"
	1    7600 3400
	1    0    0    -1  
$EndComp
$Comp
L LED D2
U 1 1 5484B50B
P 7600 4100
F 0 "D2" H 7575 4185 40  0000 C CNN
F 1 "green" H 7600 4010 40  0000 C CNN
F 2 "Ruwai:LED-0805" H 7475 4085 60  0001 C CNN
F 3 "" H 7600 4100 60  0000 C CNN
F 4 "Knightbright" H 7600 3900 60  0001 L CNN "Manu"
F 5 "KP-2012SGC" H 7600 3800 60  0001 L CNN "Manu#"
F 6 "0805" H 7600 3700 60  0001 L CNN "Package"
F 7 "LED green." H 7600 3600 60  0001 L CNN "Desc"
	1    7600 4100
	-1   0    0    -1  
$EndComp
$Comp
L inductor L2
U 1 1 5484B8F2
P 7700 4950
F 0 "L2" H 7700 5000 40  0000 C BNN
F 1 "22uH" H 7700 4900 40  0000 C CNN
F 2 "Ruwai:Inductor_SMD1210_reflow" H 7600 4950 60  0001 C CNN
F 3 "" H 7600 4950 60  0000 C CNN
F 4 "Bourns" H 7700 4750 60  0001 L BNN "Manu"
F 5 "CM322522-220KL" H 7700 4650 60  0001 L BNN "Manu#"
F 6 "1210" H 7700 4550 60  0001 L BNN "Package"
F 7 "Custom description." H 7700 4450 60  0001 L BNN "Desc"
	1    7700 4950
	1    0    0    -1  
$EndComp
$Comp
L Resistor R3
U 1 1 5484BE12
P 9200 4950
F 0 "R3" V 9280 4950 40  0000 C CNN
F 1 "1" V 9207 4951 40  0000 C CNN
F 2 "Ruwai:Resistor_SMD0102_ReflowWave" V 9130 4950 30  0001 C CNN
F 3 "" V 9280 4950 30  0000 C CNN
F 4 "Yageo" H 9200 4450 60  0001 L CNN "Manu"
F 5 "RC0805FR-071RL" H 9200 4350 60  0001 L CNN "Manu#"
F 6 "0805" H 9200 4250 60  0001 L CNN "Package"
F 7 " " H 9200 4150 60  0001 L CNN "Desc"
	1    9200 4950
	0    -1   -1   0   
$EndComp
$Comp
L PWR_FLAG #FLG019
U 1 1 54853409
P 10300 3650
F 0 "#FLG019" H 10300 3745 30  0001 C CNN
F 1 "PWR_FLAG" H 10300 3830 30  0000 C CNN
F 2 "" H 10300 3650 60  0000 C CNN
F 3 "" H 10300 3650 60  0000 C CNN
	1    10300 3650
	1    0    0    -1  
$EndComp
Connection ~ 10300 3750
$Comp
L PWR_FLAG #FLG020
U 1 1 54853526
P 4350 3450
F 0 "#FLG020" H 4350 3545 30  0001 C CNN
F 1 "PWR_FLAG" H 4350 3630 30  0000 C CNN
F 2 "" H 4350 3450 60  0000 C CNN
F 3 "" H 4350 3450 60  0000 C CNN
	1    4350 3450
	1    0    0    -1  
$EndComp
Wire Wire Line
	4350 3450 4350 3600
Connection ~ 4350 3600
Wire Wire Line
	2200 4300 4350 4300
Wire Wire Line
	4350 4300 4350 3900
$Comp
L testpoint TP6
U 1 1 548466E4
P 9250 3500
F 0 "TP6" H 9190 3390 60  0000 C CNN
F 1 "GND_PGA" H 9200 3620 60  0000 C CNN
F 2 "Ruwai:testpoint_1" H 9250 3500 60  0001 C CNN
F 3 "" H 9250 3500 60  0000 C CNN
F 4 "RS" H 9250 3200 60  0001 L CNN "Manu"
F 5 "200-101" H 9250 3100 60  0001 L CNN "Manu#"
F 6 "1mm" H 9250 3000 60  0001 L CNN "Package"
F 7 "Custom Description" H 9250 2900 60  0001 L CNN "Desc"
	1    9250 3500
	-1   0    0    1   
$EndComp
Wire Wire Line
	9150 3500 9050 3500
Wire Wire Line
	9050 3500 9050 3750
Connection ~ 9050 3750
$Comp
L testpoint TP4
U 1 1 54848216
P 4150 4600
F 0 "TP4" H 4080 4470 60  0000 C CNN
F 1 "GND" H 4080 4740 60  0000 C CNN
F 2 "Ruwai:testpoint_1" H 4150 4600 60  0001 C CNN
F 3 "" H 4150 4600 60  0000 C CNN
F 4 "RS" H 4150 4300 60  0001 L CNN "Manu"
F 5 "200-101" H 4150 4200 60  0001 L CNN "Manu#"
F 6 "1mm" H 4150 4100 60  0001 L CNN "Package"
F 7 "Custom Description" H 4150 4000 60  0001 L CNN "Desc"
	1    4150 4600
	-1   0    0    1   
$EndComp
Wire Wire Line
	3850 4600 4050 4600
$Comp
L PGA_GND #PWR021
U 1 1 548306EB
P 10300 3900
F 0 "#PWR021" H 10300 3900 40  0001 C CNN
F 1 "PGA_GND" H 10300 3830 40  0000 C CNN
F 2 "" H 10300 3900 60  0000 C CNN
F 3 "" H 10300 3900 60  0000 C CNN
	1    10300 3900
	1    0    0    -1  
$EndComp
Wire Wire Line
	10300 3900 10300 3650
$EndSCHEMATC
