EESchema Schematic File Version 2
LIBS:ruwai_gps_timing_shield-rescue
LIBS:ruwai
LIBS:74xgxx
LIBS:74xx
LIBS:ac-dc
LIBS:actel
LIBS:adc-dac
LIBS:analog_switches
LIBS:atmel
LIBS:audio
LIBS:brooktre
LIBS:cmos4000
LIBS:cmos_ieee
LIBS:conn
LIBS:contrib
LIBS:cypress
LIBS:dc-dc
LIBS:device
LIBS:digital-audio
LIBS:display
LIBS:dsp
LIBS:elec-unifil
LIBS:ftdi
LIBS:gennum
LIBS:hc11
LIBS:intel
LIBS:interface
LIBS:ir
LIBS:linear
LIBS:memory
LIBS:microchip
LIBS:microchip_pic10mcu
LIBS:microchip_pic12mcu
LIBS:microchip_pic16mcu
LIBS:microchip_pic18mcu
LIBS:microchip_pic32mcu
LIBS:microcontrollers
LIBS:motor_drivers
LIBS:motorola
LIBS:msp430
LIBS:nordicsemi
LIBS:nxp_armmcu
LIBS:onsemi
LIBS:opto
LIBS:philips
LIBS:power
LIBS:powerint
LIBS:pspice
LIBS:references
LIBS:regul
LIBS:relays
LIBS:rfcom
LIBS:sensors
LIBS:silabs
LIBS:siliconi
LIBS:stm8
LIBS:stm32
LIBS:supertex
LIBS:switches
LIBS:texas
LIBS:transf
LIBS:transistors
LIBS:ttl_ieee
LIBS:valves
LIBS:video
LIBS:xilinx
LIBS:ruwai_gps_timing_shield-cache
EELAYER 25 0
EELAYER END
$Descr A4 11693 8268
encoding utf-8
Sheet 6 6
Title "Ruwai GPS Timing Shield"
Date "2017-09-12"
Rev "3"
Comp "Copyright 2014 Mertl Research GmbH"
Comment1 ""
Comment2 ""
Comment3 ""
Comment4 "This documentation describes Open Hardware and is licensed under the CERN OHL v. 1.2."
$EndDescr
$Comp
L DS18B20U_(micro-SOP) U17
U 1 1 53A904D4
P 3350 3600
F 0 "U17" H 3100 3300 60  0000 C CNN
F 1 "DS18B20U_(micro-SOP)" H 3450 3900 60  0000 C CNN
F 2 "Ruwai:MSOP_8" H 3650 3300 60  0001 C CNN
F 3 "" H 3350 3350 60  0000 C CNN
F 4 "Maxim Integrated" H 3650 3400 60  0001 C CNN "Manu"
F 5 "DS18B20U+" H 3650 3500 60  0001 C CNN "Manu#"
F 6 "MSOP 8-pin" H 3650 3600 60  0001 C CNN "Package"
F 7 "Custom Description" H 3650 4500 60  0001 C CNN "Desc"
	1    3350 3600
	1    0    0    -1  
$EndComp
$Comp
L DS1342U U15
U 1 1 53A90542
P 5100 5050
F 0 "U15" H 4650 4650 60  0000 C CNN
F 1 "DS1342U" H 4800 5400 60  0000 C CNN
F 2 "Ruwai:MSOP_8" H 5250 4650 60  0001 C CNN
F 3 "" H 5250 4650 60  0000 C CNN
F 4 "Maxim Integrated" H 3650 3400 60  0001 C CNN "Manu"
F 5 "DS1342U+" H 3650 3500 60  0001 C CNN "Manu#"
F 6 "MSOP 8-pin" H 3650 3600 60  0001 C CNN "Package"
F 7 "Custom Description" H 3650 4500 60  0001 C CNN "Desc"
	1    5100 5050
	1    0    0    -1  
$EndComp
$Comp
L TCA9406 U16
U 1 1 53A905D3
P 8850 5350
F 0 "U16" H 8400 5200 60  0000 C CNN
F 1 "TCA9406" H 8550 5950 60  0000 C CNN
F 2 "Ruwai:SSOP8" H 9200 5200 60  0001 C CNN
F 3 "" H 8400 5200 60  0000 C CNN
F 4 "Texas Instruments" H 3650 3400 60  0001 C CNN "Manu"
F 5 "TCA9406DCTR" H 3650 3500 60  0001 C CNN "Manu#"
F 6 "SSOP 8-pin" H 3650 3600 60  0001 C CNN "Package"
F 7 "Dual Bidirectional 1-MHz I2C-BUS and SMBus Voltage Level-Translator" H 3650 4500 60  0001 C CNN "Desc"
	1    8850 5350
	1    0    0    -1  
$EndComp
$Comp
L Resistor R25
U 1 1 53A90635
P 2250 3450
F 0 "R25" V 2330 3450 40  0000 C CNN
F 1 "47" V 2257 3451 40  0000 C CNN
F 2 "Ruwai:Resistor_SMD0102_HandSoldering" V 2180 3450 30  0001 C CNN
F 3 "" H 2250 3450 30  0000 C CNN
F 4 "Yageo" H 3650 3400 60  0001 C CNN "Manu"
F 5 "RC0805FR-0747RL" H 3650 3500 60  0001 C CNN "Manu#"
F 6 "0805" H 3650 3600 60  0001 C CNN "Package"
F 7 " " H 3650 4500 60  0001 C CNN "Desc"
	1    2250 3450
	0    1    1    0   
$EndComp
$Comp
L Resistor R17
U 1 1 53A906D5
P 2250 3150
F 0 "R17" V 2330 3150 40  0000 C CNN
F 1 "4.7k" V 2257 3151 40  0000 C CNN
F 2 "Ruwai:Resistor_SMD0102_HandSoldering" V 2180 3150 30  0001 C CNN
F 3 "" H 2250 3150 30  0000 C CNN
F 4 "Yageo" H 3650 3400 60  0001 C CNN "Manu"
F 5 "RC0805FR-074K7L" H 3650 3500 60  0001 C CNN "Manu#"
F 6 "0805" H 3650 3600 60  0001 C CNN "Package"
F 7 " " H 3650 4500 60  0001 C CNN "Desc"
	1    2250 3150
	0    1    1    0   
$EndComp
$Comp
L Capacitor C12
U 1 1 53A908FA
P 4300 3750
AR Path="/53A908FA" Ref="C12"  Part="1" 
AR Path="/53A17A3E/53A908FA" Ref="C12"  Part="1" 
F 0 "C12" H 4300 3850 40  0000 L CNN
F 1 "1nF" H 4306 3665 40  0000 L CNN
F 2 "Ruwai:Capacitor_SMD0805_HandSoldering" H 4338 3600 30  0001 C CNN
F 3 "" H 4300 3750 60  0000 C CNN
F 4 "Kemet" H 3650 3400 60  0001 C CNN "Manu"
F 5 "C0805C102J5GACTU" H 3650 3500 60  0001 C CNN "Manu#"
F 6 "0805" H 3650 3600 60  0001 C CNN "Package"
F 7 " " H 3650 4500 60  0001 C CNN "Desc"
	1    4300 3750
	1    0    0    -1  
$EndComp
$Comp
L GND-RESCUE-ruwai_gps_timing_shield #PWR073
U 1 1 53A90967
P 4300 4150
F 0 "#PWR073" H 4300 4150 30  0001 C CNN
F 1 "GND" H 4300 4080 30  0001 C CNN
F 2 "" H 4300 4150 60  0000 C CNN
F 3 "" H 4300 4150 60  0000 C CNN
F 4 " " H 3650 3400 60  0001 C CNN "Manu"
F 5 " " H 3650 3500 60  0001 C CNN "Manu#"
F 6 " " H 3650 3600 60  0001 C CNN "Package"
F 7 " " H 3650 4500 60  0001 C CNN "Desc"
	1    4300 4150
	1    0    0    -1  
$EndComp
$Comp
L GND-RESCUE-ruwai_gps_timing_shield #PWR074
U 1 1 53A90990
P 2600 4150
F 0 "#PWR074" H 2600 4150 30  0001 C CNN
F 1 "GND" H 2600 4080 30  0001 C CNN
F 2 "" H 2600 4150 60  0000 C CNN
F 3 "" H 2600 4150 60  0000 C CNN
F 4 " " H 3650 3400 60  0001 C CNN "Manu"
F 5 " " H 3650 3500 60  0001 C CNN "Manu#"
F 6 " " H 3650 3600 60  0001 C CNN "Package"
F 7 " " H 3650 4500 60  0001 C CNN "Desc"
	1    2600 4150
	1    0    0    -1  
$EndComp
Text HLabel 4600 3150 2    60   Input ~ 0
5V
Text HLabel 1300 3450 0    60   BiDi ~ 0
DQT_ARD
$Comp
L CRYSTAL_SMD X1
U 1 1 53A90F34
P 3650 4850
F 0 "X1" H 3650 4940 30  0000 C CNN
F 1 "32,768KHz" H 3680 4740 30  0000 L CNN
F 2 "Ruwai:crystal_smd" H 3650 4850 60  0001 C CNN
F 3 "" H 3650 4850 60  0000 C CNN
F 4 "Micro Crystal" H 3650 3400 60  0001 C CNN "Manu"
F 5 "MS1V-T1K 32.768kHz 12.5pF +-20ppm" H 3650 3500 60  0001 C CNN "Manu#"
F 6 "SMD" H 3650 3600 60  0001 C CNN "Package"
F 7 " " H 3650 4500 60  0001 C CNN "Desc"
	1    3650 4850
	1    0    0    1   
$EndComp
$Comp
L GND-RESCUE-ruwai_gps_timing_shield #PWR075
U 1 1 53A9126A
P 4150 5500
F 0 "#PWR075" H 4150 5500 30  0001 C CNN
F 1 "GND" H 4150 5430 30  0001 C CNN
F 2 "" H 4150 5500 60  0000 C CNN
F 3 "" H 4150 5500 60  0000 C CNN
F 4 " " H 3650 3400 60  0001 C CNN "Manu"
F 5 " " H 3650 3500 60  0001 C CNN "Manu#"
F 6 " " H 3650 3600 60  0001 C CNN "Package"
F 7 " " H 3650 4500 60  0001 C CNN "Desc"
	1    4150 5500
	1    0    0    -1  
$EndComp
Text HLabel 1300 5150 0    60   Input ~ 0
PPS_GPS
$Comp
L Resistor R26
U 1 1 53A91586
P 2600 4850
F 0 "R26" V 2680 4850 40  0000 C CNN
F 1 "3.3k" V 2607 4851 40  0000 C CNN
F 2 "Ruwai:Resistor_SMD0102_HandSoldering" V 2530 4850 30  0001 C CNN
F 3 "" H 2600 4850 30  0000 C CNN
F 4 "Yageo" H 3650 3400 60  0001 C CNN "Manu"
F 5 "RC0805FR-073K3L" H 3650 3500 60  0001 C CNN "Manu#"
F 6 "0805" H 3650 3600 60  0001 C CNN "Package"
F 7 " " H 3650 4500 60  0001 C CNN "Desc"
	1    2600 4850
	0    1    1    0   
$EndComp
Text Label 1950 4850 2    60   ~ 0
T_3.3V
Text HLabel 6350 5000 2    60   Output ~ 0
SQW_RTC
Text HLabel 10200 5150 2    60   Input ~ 0
SCL_ARD
Text HLabel 10200 5300 2    60   BiDi ~ 0
SDA_ARD
$Comp
L GND-RESCUE-ruwai_gps_timing_shield #PWR076
U 1 1 53A921C8
P 8850 5950
F 0 "#PWR076" H 8850 5950 30  0001 C CNN
F 1 "GND" H 8850 5880 30  0001 C CNN
F 2 "" H 8850 5950 60  0000 C CNN
F 3 "" H 8850 5950 60  0000 C CNN
F 4 " " H 3650 3400 60  0001 C CNN "Manu"
F 5 " " H 3650 3500 60  0001 C CNN "Manu#"
F 6 " " H 3650 3600 60  0001 C CNN "Package"
F 7 " " H 3650 4500 60  0001 C CNN "Desc"
	1    8850 5950
	1    0    0    -1  
$EndComp
Text HLabel 10200 5000 2    60   Input ~ 0
5V
$Comp
L Capacitor C13
U 1 1 53A9258C
P 10200 4650
AR Path="/53A9258C" Ref="C13"  Part="1" 
AR Path="/53A17A3E/53A9258C" Ref="C13"  Part="1" 
F 0 "C13" H 10200 4750 40  0000 L CNN
F 1 "0.1uF" H 10206 4565 40  0000 L CNN
F 2 "Ruwai:Capacitor_SMD0805_HandSoldering" H 10238 4500 30  0001 C CNN
F 3 "" H 10200 4650 60  0000 C CNN
F 4 "Murata" H 3650 3400 60  0001 C CNN "Manu"
F 5 "GCM21BR71H104KA37L" H 3650 3500 60  0001 C CNN "Manu#"
F 6 "0805" H 3650 3600 60  0001 C CNN "Package"
F 7 " " H 3650 4500 60  0001 C CNN "Desc"
	1    10200 4650
	0    1    1    0   
$EndComp
$Comp
L GND-RESCUE-ruwai_gps_timing_shield #PWR077
U 1 1 53A926CB
P 10600 4750
F 0 "#PWR077" H 10600 4750 30  0001 C CNN
F 1 "GND" H 10600 4680 30  0001 C CNN
F 2 "" H 10600 4750 60  0000 C CNN
F 3 "" H 10600 4750 60  0000 C CNN
F 4 " " H 3650 3400 60  0001 C CNN "Manu"
F 5 " " H 3650 3500 60  0001 C CNN "Manu#"
F 6 " " H 3650 3600 60  0001 C CNN "Package"
F 7 " " H 3650 4500 60  0001 C CNN "Desc"
	1    10600 4750
	1    0    0    -1  
$EndComp
Text Label 7650 5000 2    60   ~ 0
T_3.3V
$Comp
L Resistor R27
U 1 1 53A9281A
P 8300 4350
F 0 "R27" V 8380 4350 40  0000 C CNN
F 1 "3.3k" V 8307 4351 40  0000 C CNN
F 2 "Ruwai:Resistor_SMD0102_HandSoldering" V 8230 4350 30  0001 C CNN
F 3 "" H 8300 4350 30  0000 C CNN
F 4 "Yageo" H 3650 3400 60  0001 C CNN "Manu"
F 5 "RC0805FR-073K3L" H 3650 3500 60  0001 C CNN "Manu#"
F 6 "0805" H 3650 3600 60  0001 C CNN "Package"
F 7 " " H 3650 4500 60  0001 C CNN "Desc"
	1    8300 4350
	0    1    1    0   
$EndComp
$Comp
L INDUCTOR_SMALL L14
U 1 1 53A929CB
P 8550 2050
F 0 "L14" H 8550 2150 50  0000 C CNN
F 1 "220" H 8550 2000 50  0000 C CNN
F 2 "Ruwai:Inductor_SMD0805_HandSoldering" H 8550 2050 60  0001 C CNN
F 3 "" H 8550 2050 60  0000 C CNN
F 4 "Murata" H 3650 3400 60  0001 C CNN "Manu"
F 5 "BLM21PG221SN1D" H 3650 3500 60  0001 C CNN "Manu#"
F 6 "0805" H 3650 3600 60  0001 C CNN "Package"
F 7 " " H 3650 4500 60  0001 C CNN "Desc"
	1    8550 2050
	1    0    0    -1  
$EndComp
$Comp
L DiodeSchottky D3
U 1 1 53A92A0F
P 7500 2050
F 0 "D3" H 7500 2150 40  0000 C CNN
F 1 "RB751V40T1G" H 7500 1950 40  0000 C CNN
F 2 "Ruwai:diode_sod323" H 7500 2050 60  0001 C CNN
F 3 "" H 7500 2050 60  0000 C CNN
F 4 "ON Semiconductor" H 3650 3400 60  0001 C CNN "Manu"
F 5 "RB751V40T1G" H 3650 3500 60  0001 C CNN "Manu#"
F 6 "SOD-323" H 3650 3600 60  0001 C CNN "Package"
F 7 " " H 3650 4500 60  0001 C CNN "Desc"
	1    7500 2050
	-1   0    0    1   
$EndComp
$Comp
L Capacitor C14
U 1 1 53A92A8A
P 7950 2450
AR Path="/53A92A8A" Ref="C14"  Part="1" 
AR Path="/53A17A3E/53A92A8A" Ref="C14"  Part="1" 
F 0 "C14" H 7950 2550 40  0000 L CNN
F 1 "1uF" H 7956 2365 40  0000 L CNN
F 2 "Ruwai:Capacitor_SMD0805_HandSoldering" H 7988 2300 30  0001 C CNN
F 3 "" H 7950 2450 60  0000 C CNN
F 4 "Murata" H 3650 3400 60  0001 C CNN "Manu"
F 5 "GRM21BR71H105KA12L" H 3650 3500 60  0001 C CNN "Manu#"
F 6 "0805" H 3650 3600 60  0001 C CNN "Package"
F 7 " " H 3650 4500 60  0001 C CNN "Desc"
	1    7950 2450
	-1   0    0    1   
$EndComp
$Comp
L INDUCTOR_SMALL L13
U 1 1 53A92B07
P 6450 2050
F 0 "L13" H 6450 2150 50  0000 C CNN
F 1 "600" H 6450 2000 50  0000 C CNN
F 2 "Ruwai:Inductor_SMD0805_HandSoldering" H 6450 2050 60  0001 C CNN
F 3 "" H 6450 2050 60  0000 C CNN
F 4 "Murata" H 3650 3400 60  0001 C CNN "Manu"
F 5 "BLM21BD601SN1D" H 3650 3500 60  0001 C CNN "Manu#"
F 6 "0805" H 3650 3600 60  0001 C CNN "Package"
F 7 " " H 3650 4500 60  0001 C CNN "Desc"
	1    6450 2050
	1    0    0    -1  
$EndComp
$Comp
L GND-RESCUE-ruwai_gps_timing_shield #PWR078
U 1 1 53A92BD3
P 7950 2850
F 0 "#PWR078" H 7950 2850 30  0001 C CNN
F 1 "GND" H 7950 2780 30  0001 C CNN
F 2 "" H 7950 2850 60  0000 C CNN
F 3 "" H 7950 2850 60  0000 C CNN
F 4 " " H 3650 3400 60  0001 C CNN "Manu"
F 5 " " H 3650 3500 60  0001 C CNN "Manu#"
F 6 " " H 3650 3600 60  0001 C CNN "Package"
F 7 " " H 3650 4500 60  0001 C CNN "Desc"
	1    7950 2850
	1    0    0    -1  
$EndComp
Wire Wire Line
	2750 3450 2500 3450
Wire Wire Line
	1300 3450 2000 3450
Wire Wire Line
	1700 3450 1700 3150
Wire Wire Line
	1700 3150 2000 3150
Connection ~ 1700 3450
Wire Wire Line
	3950 3450 4300 3450
Wire Wire Line
	4300 3950 4300 4150
Connection ~ 4300 3450
Wire Wire Line
	2500 3150 4600 3150
Connection ~ 4300 3150
Wire Wire Line
	4300 3150 4300 3550
Wire Wire Line
	2750 3750 2600 3750
Wire Wire Line
	2600 3750 2600 4150
Wire Wire Line
	4300 4850 3850 4850
Wire Wire Line
	3450 4850 3400 4850
Wire Wire Line
	3400 4850 3400 5000
Wire Wire Line
	3400 5000 4300 5000
Wire Wire Line
	3650 4750 3650 4000
Wire Wire Line
	3650 4000 2600 4000
Connection ~ 2600 4000
Wire Wire Line
	1300 5150 4300 5150
Wire Wire Line
	4300 5300 4150 5300
Wire Wire Line
	4150 5300 4150 5500
Wire Wire Line
	2850 4850 3000 4850
Wire Wire Line
	3000 4850 3000 5150
Connection ~ 3000 5150
Wire Wire Line
	2350 4850 1950 4850
Wire Wire Line
	5900 5000 6350 5000
Wire Wire Line
	5900 5150 8050 5150
Wire Wire Line
	5900 5300 8050 5300
Wire Wire Line
	9650 5150 10200 5150
Wire Wire Line
	9650 5300 10200 5300
Wire Wire Line
	8850 5750 8850 5950
Wire Wire Line
	9650 5000 10200 5000
Wire Wire Line
	10000 4650 9750 4650
Wire Wire Line
	9750 4650 9750 5000
Connection ~ 9750 5000
Wire Wire Line
	10400 4650 10600 4650
Wire Wire Line
	10600 4650 10600 4750
Wire Wire Line
	7650 5000 8050 5000
Wire Wire Line
	8550 4350 8850 4350
Wire Wire Line
	8850 4350 8850 4500
Wire Wire Line
	8050 4350 7900 4350
Wire Wire Line
	7900 4350 7900 5000
Connection ~ 7900 5000
Wire Wire Line
	7700 2050 8300 2050
Wire Wire Line
	7300 2050 6700 2050
Wire Wire Line
	7950 1550 7950 2250
Connection ~ 7950 2050
Wire Wire Line
	7950 2650 7950 2850
Text Label 7950 1550 1    60   ~ 0
T_3.3V
Wire Wire Line
	8800 2050 9150 2050
Wire Wire Line
	6200 2050 5850 2050
Text HLabel 5850 2050 0    60   Input ~ 0
VBAT
Text HLabel 9150 2050 2    60   Input ~ 0
RTC3.3V
Wire Wire Line
	5900 4850 7000 4850
Wire Wire Line
	7000 4850 7000 2050
Connection ~ 7000 2050
$Comp
L PWR_FLAG #FLG079
U 1 1 53ABC0D4
P 6850 1950
F 0 "#FLG079" H 6850 2045 30  0001 C CNN
F 1 "PWR_FLAG" H 6850 2130 30  0000 C CNN
F 2 "" H 6850 1950 60  0000 C CNN
F 3 "" H 6850 1950 60  0000 C CNN
F 4 " " H 3650 3400 60  0001 C CNN "Manu"
F 5 " " H 3650 3500 60  0001 C CNN "Manu#"
F 6 " " H 3650 3600 60  0001 C CNN "Package"
F 7 " " H 3650 4500 60  0001 C CNN "Desc"
	1    6850 1950
	1    0    0    -1  
$EndComp
Wire Wire Line
	6850 1950 6850 2050
Connection ~ 6850 2050
$Comp
L PWR_FLAG #FLG080
U 1 1 53ABC221
P 2100 4750
F 0 "#FLG080" H 2100 4845 30  0001 C CNN
F 1 "PWR_FLAG" H 2100 4930 30  0000 C CNN
F 2 "" H 2100 4750 60  0000 C CNN
F 3 "" H 2100 4750 60  0000 C CNN
F 4 " " H 3650 3400 60  0001 C CNN "Manu"
F 5 " " H 3650 3500 60  0001 C CNN "Manu#"
F 6 " " H 3650 3600 60  0001 C CNN "Package"
F 7 " " H 3650 4500 60  0001 C CNN "Desc"
	1    2100 4750
	1    0    0    -1  
$EndComp
Wire Wire Line
	2100 4750 2100 4850
Connection ~ 2100 4850
$EndSCHEMATC
