(module Inductor_SMD1210_reflow (layer F.Cu) (tedit 54D715D9)
  (descr "Inductor SMD 1210, reflow soldering")
  (tags "inductor 1210")
  (attr smd)
  (fp_text reference L (at 0 -2.032) (layer F.SilkS)
    (effects (font (size 0.65 0.65) (thickness 0.125)))
  )
  (fp_text value VAL** (at 0 2.7) (layer F.SilkS) hide
    (effects (font (size 1 1) (thickness 0.15)))
  )
  (fp_line (start -2.3 -1.6) (end 2.3 -1.6) (layer F.CrtYd) (width 0.1))
  (fp_line (start -2.3 1.6) (end 2.3 1.6) (layer F.CrtYd) (width 0.1))
  (fp_line (start -2.3 -1.6) (end -2.3 1.6) (layer F.CrtYd) (width 0.1))
  (fp_line (start 2.3 -1.6) (end 2.3 1.6) (layer F.CrtYd) (width 0.1))
  (fp_line (start 1 -1.475) (end -1 -1.475) (layer F.SilkS) (width 0.15))
  (fp_line (start -1 1.475) (end 1 1.475) (layer F.SilkS) (width 0.15))
  (pad 1 smd rect (at -1.5 0) (size 1 2.5) (layers F.Cu F.Paste F.Mask))
  (pad 2 smd rect (at 1.5 0) (size 1 2.5) (layers F.Cu F.Paste F.Mask))
  (model Capacitors_SMD/C_1210P.wrl
    (at (xyz 0 0 0))
    (scale (xyz 1 1 1))
    (rotate (xyz 0 0 0))
  )
)
