EESchema Schematic File Version 2
LIBS:ruwai_gps_timing_shield-rescue
LIBS:ruwai
LIBS:74xgxx
LIBS:74xx
LIBS:ac-dc
LIBS:actel
LIBS:adc-dac
LIBS:analog_switches
LIBS:atmel
LIBS:audio
LIBS:brooktre
LIBS:cmos4000
LIBS:cmos_ieee
LIBS:conn
LIBS:contrib
LIBS:cypress
LIBS:dc-dc
LIBS:device
LIBS:digital-audio
LIBS:display
LIBS:dsp
LIBS:elec-unifil
LIBS:ftdi
LIBS:gennum
LIBS:hc11
LIBS:intel
LIBS:interface
LIBS:ir
LIBS:linear
LIBS:memory
LIBS:microchip
LIBS:microchip_pic10mcu
LIBS:microchip_pic12mcu
LIBS:microchip_pic16mcu
LIBS:microchip_pic18mcu
LIBS:microchip_pic32mcu
LIBS:microcontrollers
LIBS:motor_drivers
LIBS:motorola
LIBS:msp430
LIBS:nordicsemi
LIBS:nxp_armmcu
LIBS:onsemi
LIBS:opto
LIBS:philips
LIBS:power
LIBS:powerint
LIBS:pspice
LIBS:references
LIBS:regul
LIBS:relays
LIBS:rfcom
LIBS:sensors
LIBS:silabs
LIBS:siliconi
LIBS:stm8
LIBS:stm32
LIBS:supertex
LIBS:switches
LIBS:texas
LIBS:transf
LIBS:transistors
LIBS:ttl_ieee
LIBS:valves
LIBS:video
LIBS:xilinx
LIBS:ruwai_gps_timing_shield-cache
EELAYER 25 0
EELAYER END
$Descr A4 11693 8268
encoding utf-8
Sheet 5 6
Title "Ruwai GPS Timing Shield"
Date "2017-09-12"
Rev "3"
Comp "Copyright 2014 Mertl Research GmbH"
Comment1 ""
Comment2 ""
Comment3 ""
Comment4 "This documentation describes Open Hardware and is licensed under the CERN OHL v. 1.2."
$EndDescr
$Comp
L SN74LVC1T45 U5
U 1 1 53A556AC
P 3400 3500
F 0 "U5" H 3100 3200 60  0000 C CNN
F 1 "SN74LVC1T45" H 3350 3850 60  0000 C CNN
F 2 "Ruwai:SOT23-6" H 3800 3200 60  0001 C CNN
F 3 "" H 3400 3250 60  0000 C CNN
F 4 "Texas Instruments" H 3650 3400 60  0001 C CNN "Manu"
F 5 "SN74LVC1T45DBVT" H 3650 3500 60  0001 C CNN "Manu#"
F 6 "SOT23 6-pin" H 3650 3600 60  0001 C CNN "Package"
F 7 "Single-Bit Dual-Supply Bus Transceiver with Configurable Voltage Translation and 3-State Outputs" H 3650 4500 60  0001 C CNN "Desc"
	1    3400 3500
	1    0    0    -1  
$EndComp
Text HLabel 1600 3450 0    60   Output ~ 12
RX_GPS
Text HLabel 1600 3300 0    60   Input ~ 12
3.3V
$Comp
L GND-RESCUE-ruwai_gps_timing_shield #PWR058
U 1 1 53A55892
P 3400 4300
F 0 "#PWR058" H 3400 4300 30  0001 C CNN
F 1 "GND" H 3400 4230 30  0001 C CNN
F 2 "" H 3400 4300 60  0000 C CNN
F 3 "" H 3400 4300 60  0000 C CNN
	1    3400 4300
	1    0    0    -1  
$EndComp
$Comp
L Resistor R10
U 1 1 53A558BE
P 4500 3450
F 0 "R10" V 4580 3450 40  0000 C CNN
F 1 "47" V 4507 3451 40  0000 C CNN
F 2 "Ruwai:Resistor_SMD0102_HandSoldering" V 4430 3450 30  0001 C CNN
F 3 "" H 4500 3450 30  0000 C CNN
F 4 "Yageo" H 3650 3400 60  0001 C CNN "Manu"
F 5 "RC0805FR-0747RL" H 3650 3500 60  0001 C CNN "Manu#"
F 6 "0805" H 3650 3600 60  0001 C CNN "Package"
F 7 " " H 3650 4500 60  0001 C CNN "Desc"
	1    4500 3450
	0    1    1    0   
$EndComp
Text HLabel 4950 3300 2    60   Input ~ 12
5V
Text HLabel 4950 3450 2    60   Input ~ 12
TXD2_ARD
$Comp
L SN74LVC1T45 U1
U 1 1 53A55D7D
P 3400 1800
F 0 "U1" H 3100 1500 60  0000 C CNN
F 1 "SN74LVC1T45" H 3350 2150 60  0000 C CNN
F 2 "Ruwai:SOT23-6" H 3800 1500 60  0001 C CNN
F 3 "" H 3400 1550 60  0000 C CNN
F 4 "Texas Instruments" H 3650 3400 60  0001 C CNN "Manu"
F 5 "SN74LVC1T45DBVT" H 3650 3500 60  0001 C CNN "Manu#"
F 6 "SOT23 6-pin" H 3650 3600 60  0001 C CNN "Package"
F 7 "Single-Bit Dual-Supply Bus Transceiver with Configurable Voltage Translation and 3-State Outputs" H 3650 4500 60  0001 C CNN "Desc"
	1    3400 1800
	1    0    0    -1  
$EndComp
Text HLabel 1600 1750 0    60   Input ~ 12
TX_GPS
Text HLabel 1600 1600 0    60   Input ~ 12
3.3V
$Comp
L Resistor R1
U 1 1 53A55D85
P 2400 1950
F 0 "R1" V 2480 1950 40  0000 C CNN
F 1 "3.9k" V 2407 1951 40  0000 C CNN
F 2 "Ruwai:Resistor_SMD0102_HandSoldering" V 2330 1950 30  0001 C CNN
F 3 "" H 2400 1950 30  0000 C CNN
F 4 "Yageo" H 3650 3400 60  0001 C CNN "Manu"
F 5 "RC0805FR-073K9L" H 3650 3500 60  0001 C CNN "Manu#"
F 6 "0805" H 3650 3600 60  0001 C CNN "Package"
F 7 " " H 3650 4500 60  0001 C CNN "Desc"
	1    2400 1950
	0    1    1    0   
$EndComp
$Comp
L GND-RESCUE-ruwai_gps_timing_shield #PWR059
U 1 1 53A55D8B
P 3400 2600
F 0 "#PWR059" H 3400 2600 30  0001 C CNN
F 1 "GND" H 3400 2530 30  0001 C CNN
F 2 "" H 3400 2600 60  0000 C CNN
F 3 "" H 3400 2600 60  0000 C CNN
	1    3400 2600
	1    0    0    -1  
$EndComp
$Comp
L Resistor R2
U 1 1 53A55D91
P 4500 1750
F 0 "R2" V 4580 1750 40  0000 C CNN
F 1 "47" V 4507 1751 40  0000 C CNN
F 2 "Ruwai:Resistor_SMD0102_HandSoldering" V 4430 1750 30  0001 C CNN
F 3 "" H 4500 1750 30  0000 C CNN
F 4 "Yageo" H 3650 3400 60  0001 C CNN "Manu"
F 5 "RC0805FR-0747RL" H 3650 3500 60  0001 C CNN "Manu#"
F 6 "0805" H 3650 3600 60  0001 C CNN "Package"
F 7 " " H 3650 4500 60  0001 C CNN "Desc"
	1    4500 1750
	0    1    1    0   
$EndComp
Text HLabel 4950 1600 2    60   Input ~ 12
5V
Text HLabel 4950 1750 2    60   Output ~ 12
RXD2_ARD
$Comp
L Resistor R9
U 1 1 53A5580A
P 2350 3650
F 0 "R9" V 2430 3650 40  0000 C CNN
F 1 "3.9k" V 2357 3651 40  0000 C CNN
F 2 "Ruwai:Resistor_SMD0102_HandSoldering" V 2280 3650 30  0001 C CNN
F 3 "" H 2350 3650 30  0000 C CNN
F 4 "Yageo" H 3650 3400 60  0001 C CNN "Manu"
F 5 "RC0805FR-073K9L" H 3650 3500 60  0001 C CNN "Manu#"
F 6 "0805" H 3650 3600 60  0001 C CNN "Package"
F 7 " " H 3650 4500 60  0001 C CNN "Desc"
	1    2350 3650
	0    1    1    0   
$EndComp
Text HLabel 1850 5000 0    60   Input ~ 12
SQW_RTC
Text HLabel 1850 4850 0    60   Input ~ 12
3.3V
$Comp
L Resistor R3
U 1 1 53A56239
P 2350 5200
F 0 "R3" V 2430 5200 40  0000 C CNN
F 1 "3.9k" V 2357 5201 40  0000 C CNN
F 2 "Ruwai:Resistor_SMD0102_HandSoldering" V 2280 5200 30  0001 C CNN
F 3 "" H 2350 5200 30  0000 C CNN
F 4 "Yageo" H 3650 3400 60  0001 C CNN "Manu"
F 5 "RC0805FR-073K9L" H 3650 3500 60  0001 C CNN "Manu#"
F 6 "0805" H 3650 3600 60  0001 C CNN "Package"
F 7 " " H 3650 4500 60  0001 C CNN "Desc"
	1    2350 5200
	0    1    1    0   
$EndComp
$Comp
L GND-RESCUE-ruwai_gps_timing_shield #PWR060
U 1 1 53A5623F
P 3400 5850
F 0 "#PWR060" H 3400 5850 30  0001 C CNN
F 1 "GND" H 3400 5780 30  0001 C CNN
F 2 "" H 3400 5850 60  0000 C CNN
F 3 "" H 3400 5850 60  0000 C CNN
	1    3400 5850
	1    0    0    -1  
$EndComp
$Comp
L Resistor R4
U 1 1 53A56245
P 4500 5000
F 0 "R4" V 4580 5000 40  0000 C CNN
F 1 "47" V 4507 5001 40  0000 C CNN
F 2 "Ruwai:Resistor_SMD0102_HandSoldering" V 4430 5000 30  0001 C CNN
F 3 "" H 4500 5000 30  0000 C CNN
F 4 "Yageo" H 3650 3400 60  0001 C CNN "Manu"
F 5 "RC0805FR-0747RL" H 3650 3500 60  0001 C CNN "Manu#"
F 6 "0805" H 3650 3600 60  0001 C CNN "Package"
F 7 " " H 3650 4500 60  0001 C CNN "Desc"
	1    4500 5000
	0    1    1    0   
$EndComp
Text HLabel 4950 4850 2    60   Input ~ 12
5V
Text HLabel 4950 5000 2    60   Output ~ 12
SQW_ARD
$Comp
L CONN_01X04 CON4
U 1 1 53A56A8F
P 1150 2650
F 0 "CON4" V 1100 2650 50  0000 C CNN
F 1 "CONN_4" V 1200 2650 50  0000 C CNN
F 2 "Connect:SIL-4" H 1150 2650 60  0001 C CNN
F 3 "" H 1150 2650 60  0000 C CNN
F 4 " " H 3650 3400 60  0001 C CNN "Manu"
F 5 " " H 3650 3500 60  0001 C CNN "Manu#"
F 6 " " H 3650 3600 60  0001 C CNN "Package"
F 7 " " H 3650 4500 60  0001 C CNN "Desc"
	1    1150 2650
	-1   0    0    -1  
$EndComp
$Comp
L GND-RESCUE-ruwai_gps_timing_shield #PWR061
U 1 1 53A56C89
P 1600 3000
F 0 "#PWR061" H 1600 3000 30  0001 C CNN
F 1 "GND" H 1600 2930 30  0001 C CNN
F 2 "" H 1600 3000 60  0000 C CNN
F 3 "" H 1600 3000 60  0000 C CNN
	1    1600 3000
	1    0    0    -1  
$EndComp
$Comp
L SN74LVC2T45 U22
U 1 1 53A571D6
P 8600 2300
F 0 "U22" H 8250 2000 60  0000 C CNN
F 1 "SN74LVC2T45" H 8500 2600 60  0000 C CNN
F 2 "Ruwai:SSOP8" H 8900 2000 60  0001 C CNN
F 3 "" H 8650 2100 60  0000 C CNN
F 4 "Texas Instruments" H 3650 3400 60  0001 C CNN "Manu"
F 5 "SN74LVC2T45DCTT" H 3650 3500 60  0001 C CNN "Manu#"
F 6 "SSOP 8-pin" H 3650 3600 60  0001 C CNN "Package"
F 7 "Custom Description" H 3650 4500 60  0001 C CNN "Desc"
	1    8600 2300
	1    0    0    -1  
$EndComp
$Comp
L GND-RESCUE-ruwai_gps_timing_shield #PWR062
U 1 1 53A57355
P 7600 2850
F 0 "#PWR062" H 7600 2850 30  0001 C CNN
F 1 "GND" H 7600 2780 30  0001 C CNN
F 2 "" H 7600 2850 60  0000 C CNN
F 3 "" H 7600 2850 60  0000 C CNN
	1    7600 2850
	1    0    0    -1  
$EndComp
$Comp
L Resistor R6
U 1 1 53A57623
P 9800 2250
F 0 "R6" V 9880 2250 40  0000 C CNN
F 1 "47" V 9807 2251 40  0000 C CNN
F 2 "Ruwai:Resistor_SMD0102_HandSoldering" V 9730 2250 30  0001 C CNN
F 3 "" H 9800 2250 30  0000 C CNN
F 4 "Yageo" H 3650 3400 60  0001 C CNN "Manu"
F 5 "RC0805FR-0747RL" H 3650 3500 60  0001 C CNN "Manu#"
F 6 "0805" H 3650 3600 60  0001 C CNN "Package"
F 7 " " H 3650 4500 60  0001 C CNN "Desc"
	1    9800 2250
	0    1    1    0   
$EndComp
$Comp
L Resistor R8
U 1 1 53A5769F
P 9800 2400
F 0 "R8" V 9880 2400 40  0000 C CNN
F 1 "47" V 9807 2401 40  0000 C CNN
F 2 "Ruwai:Resistor_SMD0805_HandSoldering" V 9730 2400 30  0001 C CNN
F 3 "" H 9800 2400 30  0000 C CNN
F 4 "Yageo" H 3650 3400 60  0001 C CNN "Manu"
F 5 "RC0805FR-0747RL" H 3650 3500 60  0001 C CNN "Manu#"
F 6 "0805" H 3650 3600 60  0001 C CNN "Package"
F 7 " " H 3650 4500 60  0001 C CNN "Desc"
	1    9800 2400
	0    1    1    0   
$EndComp
$Comp
L Resistor R5
U 1 1 53A58141
P 9050 2700
F 0 "R5" V 9130 2700 40  0000 C CNN
F 1 "3.9k" V 9057 2701 40  0000 C CNN
F 2 "Ruwai:Resistor_SMD0102_HandSoldering" V 8980 2700 30  0001 C CNN
F 3 "" H 9050 2700 30  0000 C CNN
F 4 "Yageo" H 3650 3400 60  0001 C CNN "Manu"
F 5 "RC0805FR-073K9L" H 3650 3500 60  0001 C CNN "Manu#"
F 6 "0805" H 3650 3600 60  0001 C CNN "Package"
F 7 " " H 3650 4500 60  0001 C CNN "Desc"
	1    9050 2700
	0    1    1    0   
$EndComp
Text HLabel 7200 2150 0    60   Input ~ 12
3.3V
Text HLabel 7200 2250 0    60   Input ~ 12
PPS_GPS
Text HLabel 7200 2350 0    60   Input ~ 12
FREQ_GPS
Text HLabel 10200 2150 2    60   Input ~ 12
5V
Text HLabel 10200 2250 2    60   Output ~ 12
PPS_ARD
Text HLabel 10200 2400 2    60   Output ~ 12
FREQ_ARD
Text HLabel 1600 6600 0    60   Output ~ 12
RST_GPS
Text HLabel 1600 6450 0    60   Input ~ 12
3.3V
$Comp
L GND-RESCUE-ruwai_gps_timing_shield #PWR063
U 1 1 53A7DF83
P 3400 7450
F 0 "#PWR063" H 3400 7450 30  0001 C CNN
F 1 "GND" H 3400 7380 30  0001 C CNN
F 2 "" H 3400 7450 60  0000 C CNN
F 3 "" H 3400 7450 60  0000 C CNN
	1    3400 7450
	1    0    0    -1  
$EndComp
$Comp
L Resistor R12
U 1 1 53A7DF89
P 4500 6600
F 0 "R12" V 4580 6600 40  0000 C CNN
F 1 "47" V 4507 6601 40  0000 C CNN
F 2 "Ruwai:Resistor_SMD0102_HandSoldering" V 4430 6600 30  0001 C CNN
F 3 "" H 4500 6600 30  0000 C CNN
F 4 "Yageo" H 3650 3400 60  0001 C CNN "Manu"
F 5 "RC0805FR-0747RL" H 3650 3500 60  0001 C CNN "Manu#"
F 6 "0805" H 3650 3600 60  0001 C CNN "Package"
F 7 " " H 3650 4500 60  0001 C CNN "Desc"
	1    4500 6600
	0    1    1    0   
$EndComp
Text HLabel 4950 6450 2    60   Input ~ 12
5V
Text HLabel 4950 6600 2    60   Input ~ 12
RST_GPS_ARD
$Comp
L Resistor R11
U 1 1 53A7DF91
P 2350 6800
F 0 "R11" V 2430 6800 40  0000 C CNN
F 1 "3.9k" V 2357 6801 40  0000 C CNN
F 2 "Ruwai:Resistor_SMD0102_HandSoldering" V 2280 6800 30  0001 C CNN
F 3 "" H 2350 6800 30  0000 C CNN
F 4 "Yageo" H 3650 3400 60  0001 C CNN "Manu"
F 5 "RC0805FR-073K9L" H 3650 3500 60  0001 C CNN "Manu#"
F 6 "0805" H 3650 3600 60  0001 C CNN "Package"
F 7 " " H 3650 4500 60  0001 C CNN "Desc"
	1    2350 6800
	0    1    1    0   
$EndComp
$Comp
L SN74LVC2T45 U3
U 1 1 53A7FB09
P 8600 4000
F 0 "U3" H 8250 3700 60  0000 C CNN
F 1 "SN74LVC2T45" H 8500 4300 60  0000 C CNN
F 2 "Ruwai:SSOP8" H 8900 3700 60  0001 C CNN
F 3 "" H 8650 3800 60  0000 C CNN
F 4 "Texas Instruments" H 3650 3400 60  0001 C CNN "Manu"
F 5 "SN74LVC2T45DCTT" H 3650 3500 60  0001 C CNN "Manu#"
F 6 "SSOP 8-pin" H 3650 3600 60  0001 C CNN "Package"
F 7 "Custom Description" H 3650 4500 60  0001 C CNN "Desc"
	1    8600 4000
	1    0    0    -1  
$EndComp
$Comp
L GND-RESCUE-ruwai_gps_timing_shield #PWR064
U 1 1 53A7FB0F
P 7600 4550
F 0 "#PWR064" H 7600 4550 30  0001 C CNN
F 1 "GND" H 7600 4480 30  0001 C CNN
F 2 "" H 7600 4550 60  0000 C CNN
F 3 "" H 7600 4550 60  0000 C CNN
	1    7600 4550
	1    0    0    -1  
$EndComp
$Comp
L Resistor R18
U 1 1 53A7FB15
P 9800 3950
F 0 "R18" V 9880 3950 40  0000 C CNN
F 1 "1.5k" V 9807 3951 40  0000 C CNN
F 2 "Ruwai:Resistor_SMD0102_HandSoldering" V 9730 3950 30  0001 C CNN
F 3 "" H 9800 3950 30  0000 C CNN
F 4 "Yageo" H 3650 3400 60  0001 C CNN "Manu"
F 5 "RC0805FR-071K5L" H 3650 3500 60  0001 C CNN "Manu#"
F 6 "0805" H 3650 3600 60  0001 C CNN "Package"
F 7 " " H 3650 4500 60  0001 C CNN "Desc"
	1    9800 3950
	0    1    1    0   
$EndComp
$Comp
L Resistor R20
U 1 1 53A7FB1B
P 9800 4300
F 0 "R20" V 9880 4300 40  0000 C CNN
F 1 "1.5k" V 9807 4301 40  0000 C CNN
F 2 "Ruwai:Resistor_SMD0102_HandSoldering" V 9730 4300 30  0001 C CNN
F 3 "" H 9800 4300 30  0000 C CNN
F 4 "Yageo" H 3650 3400 60  0001 C CNN "Manu"
F 5 "RC0805FR-071K5L" H 3650 3500 60  0001 C CNN "Manu#"
F 6 "0805" H 3650 3600 60  0001 C CNN "Package"
F 7 " " H 3650 4500 60  0001 C CNN "Desc"
	1    9800 4300
	0    1    1    0   
$EndComp
$Comp
L Resistor R7
U 1 1 53A7FB21
P 9050 4400
F 0 "R7" V 9130 4400 40  0000 C CNN
F 1 "3.9k" V 9057 4401 40  0000 C CNN
F 2 "Ruwai:Resistor_SMD0102_HandSoldering" V 8980 4400 30  0001 C CNN
F 3 "" H 9050 4400 30  0000 C CNN
F 4 "Yageo" H 3650 3400 60  0001 C CNN "Manu"
F 5 "RC0805FR-073K9L" H 3650 3500 60  0001 C CNN "Manu#"
F 6 "0805" H 3650 3600 60  0001 C CNN "Package"
F 7 " " H 3650 4500 60  0001 C CNN "Desc"
	1    9050 4400
	0    1    1    0   
$EndComp
Text HLabel 7200 3850 0    60   Input ~ 12
3.3V
Text HLabel 7200 3950 0    60   Input ~ 12
PPS_GPS
Text HLabel 7200 4050 0    60   Input ~ 12
FREQ_GPS
$Comp
L LED D1
U 1 1 53A7FCC3
P 10400 3950
F 0 "D1" H 10400 4050 40  0000 C CNN
F 1 "KP-1012SCR-PVR" H 10400 3850 40  0000 C CNN
F 2 "Ruwai:LED-0805" H 10400 3950 60  0001 C CNN
F 3 "" H 10400 3950 60  0000 C CNN
F 4 "Knightbright" H 3650 3400 60  0001 C CNN "Manu"
F 5 "KP-2012SRC-PRV" H 3650 3500 60  0001 C CNN "Manu#"
F 6 "0805" H 3650 3600 60  0001 C CNN "Package"
F 7 " " H 3650 4500 60  0001 C CNN "Desc"
	1    10400 3950
	1    0    0    -1  
$EndComp
$Comp
L LED D2
U 1 1 53A7FE69
P 10400 4300
F 0 "D2" H 10400 4400 40  0000 C CNN
F 1 "KP-1012SCR-PVR" H 10400 4200 40  0000 C CNN
F 2 "Ruwai:LED-0805" H 10400 4300 60  0001 C CNN
F 3 "" H 10400 4300 60  0000 C CNN
F 4 "Knightbright" H 3650 3400 60  0001 C CNN "Manu"
F 5 "KP-2012SRC-PRV" H 3650 3500 60  0001 C CNN "Manu#"
F 6 "0805" H 3650 3600 60  0001 C CNN "Package"
F 7 " " H 3650 4500 60  0001 C CNN "Desc"
	1    10400 4300
	1    0    0    -1  
$EndComp
$Comp
L GND-RESCUE-ruwai_gps_timing_shield #PWR065
U 1 1 53A800C5
P 10950 4450
F 0 "#PWR065" H 10950 4450 30  0001 C CNN
F 1 "GND" H 10950 4380 30  0001 C CNN
F 2 "" H 10950 4450 60  0000 C CNN
F 3 "" H 10950 4450 60  0000 C CNN
	1    10950 4450
	1    0    0    -1  
$EndComp
Text HLabel 10350 4700 2    60   Output ~ 0
FREQ_GPS_3
$Comp
L Capacitor C26
U 1 1 53AB0B7C
P 4500 1150
AR Path="/53AB0B7C" Ref="C26"  Part="1" 
AR Path="/53A18860/53AB0B7C" Ref="C26"  Part="1" 
F 0 "C26" H 4500 1250 40  0000 L CNN
F 1 "0.1uF" H 4506 1065 40  0000 L CNN
F 2 "Ruwai:Capacitor_SMD0805_HandSoldering" H 4538 1000 30  0001 C CNN
F 3 "" H 4500 1150 60  0000 C CNN
F 4 "Murata" H 3650 3400 60  0001 C CNN "Manu"
F 5 "GCM21BR71H104KA37L" H 3650 3500 60  0001 C CNN "Manu#"
F 6 "0805" H 3650 3600 60  0001 C CNN "Package"
F 7 " " H 3650 4500 60  0001 C CNN "Desc"
	1    4500 1150
	0    1    1    0   
$EndComp
$Comp
L GND-RESCUE-ruwai_gps_timing_shield #PWR066
U 1 1 53AB0E6B
P 4800 1300
F 0 "#PWR066" H 4800 1300 30  0001 C CNN
F 1 "GND" H 4800 1230 30  0001 C CNN
F 2 "" H 4800 1300 60  0000 C CNN
F 3 "" H 4800 1300 60  0000 C CNN
	1    4800 1300
	1    0    0    -1  
$EndComp
Wire Wire Line
	1600 3300 2750 3300
Wire Wire Line
	1600 3450 2750 3450
Wire Wire Line
	3400 4050 3400 4300
Wire Wire Line
	4050 3300 4950 3300
Wire Wire Line
	4750 3450 4950 3450
Wire Wire Line
	4250 3450 4050 3450
Wire Wire Line
	1600 1600 2750 1600
Wire Wire Line
	1600 1750 2750 1750
Wire Wire Line
	2650 1950 2750 1950
Wire Wire Line
	2150 1950 2050 1950
Wire Wire Line
	2050 1950 2050 1600
Connection ~ 2050 1600
Wire Wire Line
	3400 2600 3400 2350
Wire Wire Line
	4050 1600 4950 1600
Wire Wire Line
	4750 1750 4950 1750
Wire Wire Line
	4250 1750 4050 1750
Wire Wire Line
	2600 3650 2750 3650
Wire Wire Line
	2100 3650 2000 3650
Wire Wire Line
	2000 3650 2000 4150
Wire Wire Line
	2000 4150 3400 4150
Connection ~ 3400 4150
Wire Wire Line
	1850 4850 2750 4850
Wire Wire Line
	2750 5000 1850 5000
Wire Wire Line
	2600 5200 2750 5200
Wire Wire Line
	2100 5200 2000 5200
Wire Wire Line
	2000 5200 2000 4850
Connection ~ 2000 4850
Wire Wire Line
	3400 5850 3400 5600
Wire Wire Line
	4050 4850 4950 4850
Wire Wire Line
	4750 5000 4950 5000
Wire Wire Line
	4250 5000 4050 5000
Wire Wire Line
	1850 1750 1850 2600
Wire Wire Line
	1850 2600 1350 2600
Connection ~ 1850 1750
Wire Wire Line
	1350 2700 1850 2700
Wire Wire Line
	1850 2700 1850 3450
Connection ~ 1850 3450
Wire Wire Line
	1350 2500 1600 2500
Wire Wire Line
	1600 2500 1600 3000
Wire Wire Line
	1350 2800 1600 2800
Connection ~ 1600 2800
Wire Wire Line
	7200 2150 7900 2150
Wire Wire Line
	7900 2250 7200 2250
Wire Wire Line
	7900 2350 7200 2350
Wire Wire Line
	7900 2450 7600 2450
Wire Wire Line
	7600 2450 7600 2850
Wire Wire Line
	9300 2250 9550 2250
Wire Wire Line
	9300 2350 9500 2350
Wire Wire Line
	10050 2250 10200 2250
Wire Wire Line
	10050 2400 10200 2400
Wire Wire Line
	9300 2150 10200 2150
Wire Wire Line
	7450 2150 7450 2700
Wire Wire Line
	7450 2700 8800 2700
Connection ~ 7450 2150
Wire Wire Line
	9300 2450 9450 2450
Wire Wire Line
	9450 2450 9450 2700
Wire Wire Line
	9450 2700 9300 2700
Wire Wire Line
	9500 2350 9500 2400
Wire Wire Line
	9500 2400 9550 2400
Wire Wire Line
	1600 6450 2750 6450
Wire Wire Line
	1600 6600 2750 6600
Wire Wire Line
	3400 7200 3400 7450
Wire Wire Line
	4050 6450 4950 6450
Wire Wire Line
	4750 6600 4950 6600
Wire Wire Line
	4250 6600 4050 6600
Wire Wire Line
	2600 6800 2750 6800
Wire Wire Line
	2100 6800 2000 6800
Wire Wire Line
	2000 6800 2000 7300
Wire Wire Line
	2000 7300 3400 7300
Connection ~ 3400 7300
Wire Wire Line
	7200 3850 7900 3850
Wire Wire Line
	7900 3950 7200 3950
Wire Wire Line
	7900 4050 7200 4050
Wire Wire Line
	7900 4150 7600 4150
Wire Wire Line
	7600 4150 7600 4550
Wire Wire Line
	9300 3950 9550 3950
Wire Wire Line
	9300 4050 9500 4050
Wire Wire Line
	10050 3950 10200 3950
Wire Wire Line
	7450 3350 7450 4400
Wire Wire Line
	7450 4400 8800 4400
Connection ~ 7450 3850
Wire Wire Line
	9300 4150 9400 4150
Wire Wire Line
	9400 4150 9400 4400
Wire Wire Line
	9400 4400 9300 4400
Wire Wire Line
	9500 4050 9500 4700
Wire Wire Line
	7450 3350 9650 3350
Wire Wire Line
	9500 3350 9500 3850
Wire Wire Line
	9500 3850 9300 3850
Wire Wire Line
	9500 4300 9550 4300
Wire Wire Line
	10050 4300 10200 4300
Wire Wire Line
	9500 4700 10350 4700
Connection ~ 9500 4300
Wire Wire Line
	10600 3950 10950 3950
Wire Wire Line
	10950 3950 10950 4450
Wire Wire Line
	10600 4300 10950 4300
Connection ~ 10950 4300
Wire Wire Line
	4300 1150 4200 1150
Wire Wire Line
	4200 1150 4200 1600
Connection ~ 4200 1600
Wire Wire Line
	4700 1150 4800 1150
Wire Wire Line
	4800 1150 4800 1300
$Comp
L Capacitor C27
U 1 1 53AB1C20
P 2400 3000
AR Path="/53AB1C20" Ref="C27"  Part="1" 
AR Path="/53A18860/53AB1C20" Ref="C27"  Part="1" 
F 0 "C27" H 2400 3100 40  0000 L CNN
F 1 "0.1uF" H 2406 2915 40  0000 L CNN
F 2 "Ruwai:Capacitor_SMD0805_HandSoldering" H 2438 2850 30  0001 C CNN
F 3 "" H 2400 3000 60  0000 C CNN
F 4 "Murata" H 3650 3400 60  0001 C CNN "Manu"
F 5 "GCM21BR71H104KA37L" H 3650 3500 60  0001 C CNN "Manu#"
F 6 "0805" H 3650 3600 60  0001 C CNN "Package"
F 7 " " H 3650 4500 60  0001 C CNN "Desc"
	1    2400 3000
	0    -1   -1   0   
$EndComp
$Comp
L GND-RESCUE-ruwai_gps_timing_shield #PWR067
U 1 1 53AB1CE1
P 2100 3150
F 0 "#PWR067" H 2100 3150 30  0001 C CNN
F 1 "GND" H 2100 3080 30  0001 C CNN
F 2 "" H 2100 3150 60  0000 C CNN
F 3 "" H 2100 3150 60  0000 C CNN
	1    2100 3150
	1    0    0    -1  
$EndComp
Wire Wire Line
	2600 3000 2700 3000
Wire Wire Line
	2700 3000 2700 3300
Connection ~ 2700 3300
Wire Wire Line
	2200 3000 2100 3000
Wire Wire Line
	2100 3000 2100 3150
$Comp
L Capacitor C24
U 1 1 53AB206F
P 4500 4450
AR Path="/53AB206F" Ref="C24"  Part="1" 
AR Path="/53A18860/53AB206F" Ref="C24"  Part="1" 
F 0 "C24" H 4500 4550 40  0000 L CNN
F 1 "0.1uF" H 4506 4365 40  0000 L CNN
F 2 "Ruwai:Capacitor_SMD0805_HandSoldering" H 4538 4300 30  0001 C CNN
F 3 "" H 4500 4450 60  0000 C CNN
F 4 "Murata" H 4500 4450 60  0001 C CNN "Manu"
F 5 "GCM21BR71H104KA37L" H 4500 4450 60  0001 C CNN "Manu#"
F 6 "0805" H 4500 4450 60  0001 C CNN "Package"
	1    4500 4450
	0    1    1    0   
$EndComp
$Comp
L GND-RESCUE-ruwai_gps_timing_shield #PWR068
U 1 1 53AB213F
P 4800 4650
F 0 "#PWR068" H 4800 4650 30  0001 C CNN
F 1 "GND" H 4800 4580 30  0001 C CNN
F 2 "" H 4800 4650 60  0000 C CNN
F 3 "" H 4800 4650 60  0000 C CNN
	1    4800 4650
	1    0    0    -1  
$EndComp
Wire Wire Line
	4700 4450 4800 4450
Wire Wire Line
	4800 4450 4800 4650
Wire Wire Line
	4300 4450 4200 4450
Wire Wire Line
	4200 4450 4200 4850
Connection ~ 4200 4850
$Comp
L Capacitor C28
U 1 1 53AB2348
P 2300 6050
AR Path="/53AB2348" Ref="C28"  Part="1" 
AR Path="/53A18860/53AB2348" Ref="C28"  Part="1" 
F 0 "C28" H 2300 6150 40  0000 L CNN
F 1 "0.1uF" H 2306 5965 40  0000 L CNN
F 2 "Ruwai:Capacitor_SMD0805_HandSoldering" H 2338 5900 30  0001 C CNN
F 3 "" H 2300 6050 60  0000 C CNN
F 4 "Murata" H 2300 6050 60  0001 C CNN "Manu"
F 5 "GCM21BR71H104KA37L" H 2300 6050 60  0001 C CNN "Manu#"
F 6 "0805" H 2300 6050 60  0001 C CNN "Package"
	1    2300 6050
	0    -1   -1   0   
$EndComp
$Comp
L GND-RESCUE-ruwai_gps_timing_shield #PWR069
U 1 1 53AB240B
P 1950 6200
F 0 "#PWR069" H 1950 6200 30  0001 C CNN
F 1 "GND" H 1950 6130 30  0001 C CNN
F 2 "" H 1950 6200 60  0000 C CNN
F 3 "" H 1950 6200 60  0000 C CNN
	1    1950 6200
	1    0    0    -1  
$EndComp
Wire Wire Line
	1950 6200 1950 6050
Wire Wire Line
	1950 6050 2100 6050
Wire Wire Line
	2500 6050 2600 6050
Wire Wire Line
	2600 6050 2600 6450
Connection ~ 2600 6450
$Comp
L Capacitor C29
U 1 1 53AB2C62
P 7500 1700
AR Path="/53AB2C62" Ref="C29"  Part="1" 
AR Path="/53A18860/53AB2C62" Ref="C29"  Part="1" 
F 0 "C29" H 7500 1800 40  0000 L CNN
F 1 "0.1uF" H 7506 1615 40  0000 L CNN
F 2 "Ruwai:Capacitor_SMD0805_HandSoldering" H 7538 1550 30  0001 C CNN
F 3 "" H 7500 1700 60  0000 C CNN
F 4 "Murata" H 7500 1700 60  0001 C CNN "Manu"
F 5 "GCM21BR71H104KA37L" H 7500 1700 60  0001 C CNN "Manu#"
F 6 "0805" H 7500 1700 60  0001 C CNN "Package"
	1    7500 1700
	0    -1   -1   0   
$EndComp
$Comp
L GND-RESCUE-ruwai_gps_timing_shield #PWR070
U 1 1 53AB2D64
P 7150 1850
F 0 "#PWR070" H 7150 1850 30  0001 C CNN
F 1 "GND" H 7150 1780 30  0001 C CNN
F 2 "" H 7150 1850 60  0000 C CNN
F 3 "" H 7150 1850 60  0000 C CNN
	1    7150 1850
	1    0    0    -1  
$EndComp
Wire Wire Line
	7150 1850 7150 1700
Wire Wire Line
	7150 1700 7300 1700
Wire Wire Line
	7700 1700 7800 1700
Wire Wire Line
	7800 1700 7800 2150
Connection ~ 7800 2150
$Comp
L Capacitor C25
U 1 1 53AB3027
P 9800 1700
AR Path="/53AB3027" Ref="C25"  Part="1" 
AR Path="/53A18860/53AB3027" Ref="C25"  Part="1" 
F 0 "C25" H 9800 1800 40  0000 L CNN
F 1 "0.1uF" H 9806 1615 40  0000 L CNN
F 2 "Ruwai:Capacitor_SMD0805_HandSoldering" H 9838 1550 30  0001 C CNN
F 3 "" H 9800 1700 60  0000 C CNN
F 4 "Murata" H 9800 1700 60  0001 C CNN "Manu"
F 5 "GCM21BR71H104KA37L" H 9800 1700 60  0001 C CNN "Manu#"
F 6 "0805" H 9800 1700 60  0001 C CNN "Package"
	1    9800 1700
	0    -1   -1   0   
$EndComp
$Comp
L GND-RESCUE-ruwai_gps_timing_shield #PWR071
U 1 1 53AB30B4
P 10100 1850
F 0 "#PWR071" H 10100 1850 30  0001 C CNN
F 1 "GND" H 10100 1780 30  0001 C CNN
F 2 "" H 10100 1850 60  0000 C CNN
F 3 "" H 10100 1850 60  0000 C CNN
	1    10100 1850
	1    0    0    -1  
$EndComp
Wire Wire Line
	10100 1850 10100 1700
Wire Wire Line
	10100 1700 10000 1700
Wire Wire Line
	9600 1700 9500 1700
Wire Wire Line
	9500 1700 9500 2150
Connection ~ 9500 2150
$Comp
L SN74LVC1T45 U6
U 1 1 53A7DF7B
P 3400 6650
F 0 "U6" H 3100 6350 60  0000 C CNN
F 1 "SN74LVC1T45" H 3350 7000 60  0000 C CNN
F 2 "Ruwai:SOT23-6" H 3800 6350 60  0001 C CNN
F 3 "" H 3400 6400 60  0000 C CNN
F 4 "Texas Instruments" H 3650 3400 60  0001 C CNN "Manu"
F 5 "SN74LVC1T45DBVT" H 3650 3500 60  0001 C CNN "Manu#"
F 6 "SOT23 6-pin" H 3650 3600 60  0001 C CNN "Package"
F 7 "Single-Bit Dual-Supply Bus Transceiver with Configurable Voltage Translation and 3-State Outputs" H 3650 4500 60  0001 C CNN "Desc"
	1    3400 6650
	1    0    0    -1  
$EndComp
$Comp
L TXB0101 U2
U 1 1 5465DBF8
P 3400 5050
F 0 "U2" H 3100 4750 60  0000 C CNN
F 1 "TXB0101" H 3250 5400 60  0000 C CNN
F 2 "Ruwai:SOT23-6" H 3800 4750 60  0001 C CNN
F 3 "" H 3400 4800 60  0000 C CNN
F 4 "Texas Instruments" H 3400 4350 60  0001 L CNN "Manu"
F 5 "TXB0101DBVT" H 3400 4250 60  0001 L CNN "Manu#"
F 6 "SOT23 6-pin" H 3400 4150 60  0001 L CNN "Package"
F 7 "1-Bit Bidirectional Voltage-Level Translator With Auto Direction Sensing and +/-15-kV ESD Protect " H 3400 4050 60  0001 L CNN "Desc"
	1    3400 5050
	1    0    0    -1  
$EndComp
$Comp
L Capacitor C31
U 1 1 547CFF26
P 9850 3350
AR Path="/547CFF26" Ref="C31"  Part="1" 
AR Path="/53A18860/547CFF26" Ref="C31"  Part="1" 
F 0 "C31" H 9850 3450 40  0000 L CNN
F 1 "0.1uF" H 9856 3265 40  0000 L CNN
F 2 "Ruwai:Capacitor_SMD0805_HandSoldering" H 9888 3200 30  0001 C CNN
F 3 "" H 9850 3350 60  0000 C CNN
F 4 "Murata" H 9850 3350 60  0001 C CNN "Manu"
F 5 "GCM21BR71H104KA37L" H 9850 3350 60  0001 C CNN "Manu#"
F 6 "0805" H 9850 3350 60  0001 C CNN "Package"
	1    9850 3350
	0    -1   -1   0   
$EndComp
Connection ~ 9500 3350
Wire Wire Line
	10050 3350 10150 3350
Wire Wire Line
	10150 3350 10150 3600
$Comp
L GND-RESCUE-ruwai_gps_timing_shield #PWR072
U 1 1 547D01EA
P 10150 3600
F 0 "#PWR072" H 10150 3600 30  0001 C CNN
F 1 "GND" H 10150 3530 30  0001 C CNN
F 2 "" H 10150 3600 60  0000 C CNN
F 3 "" H 10150 3600 60  0000 C CNN
	1    10150 3600
	1    0    0    -1  
$EndComp
$EndSCHEMATC
