EESchema Schematic File Version 2
LIBS:ruwai
LIBS:power
LIBS:device
LIBS:transistors
LIBS:conn
LIBS:linear
LIBS:regul
LIBS:74xx
LIBS:cmos4000
LIBS:adc-dac
LIBS:memory
LIBS:xilinx
LIBS:microcontrollers
LIBS:dsp
LIBS:microchip
LIBS:analog_switches
LIBS:motorola
LIBS:texas
LIBS:intel
LIBS:audio
LIBS:interface
LIBS:digital-audio
LIBS:philips
LIBS:display
LIBS:cypress
LIBS:siliconi
LIBS:opto
LIBS:atmel
LIBS:contrib
LIBS:valves
LIBS:adc_ai_pga-cache
EELAYER 25 0
EELAYER END
$Descr A4 11693 8268
encoding utf-8
Sheet 6 6
Title "Ruwai ADC analog interface with PGA"
Date "2017-09-15"
Rev "3"
Comp "copyright Mertl Research GmbH 2014"
Comment1 ""
Comment2 ""
Comment3 ""
Comment4 "This documentation describes Open Hardware and is licensed under the CERN OHL v. 1.2."
$EndDescr
$Comp
L PGA281 U15
U 1 1 5472865C
P 3725 5500
F 0 "U15" H 3375 5000 60  0000 C CNN
F 1 "PGA281" H 3475 6000 60  0000 C CNN
F 2 "SSOP_Packages:TSSOP-16_4.4x5mm_Pitch0.65mm" H 4875 5000 60  0001 C CNN
F 3 "" H 3725 5500 60  0000 C CNN
F 4 "Texas Instruments" H 3725 4750 60  0001 L CNN "Manu"
F 5 "PGA281AIPW" H 3725 4650 60  0001 L CNN "Manu#"
F 6 "TSSOP 16-pin" H 3725 4550 60  0001 L CNN "Package"
F 7 "Zero-Drift, High Voltage Programmable Gain Amplifier" H 3725 4450 60  0001 L CNN "Desc"
	1    3725 5500
	1    0    0    -1  
$EndComp
$Comp
L PCF8574_DGV_PW U16
U 1 1 54728667
P 3750 6775
F 0 "U16" H 3400 6175 60  0000 C CNN
F 1 "PCF8574_DGV_PW" H 3750 7375 60  0000 C CNN
F 2 "Ruwai:TSSOP-20_4.4x6.5mm_Pitch0.65mm" H 4950 6175 60  0001 C CNN
F 3 "" H 3750 6775 60  0000 C CNN
F 4 "Texas Instruments" H 3750 6025 60  0001 L CNN "Manu"
F 5 "PCF8574PWR" H 3750 5925 60  0001 L CNN "Manu#"
F 6 "TSSOP 20-pin" H 3750 5825 60  0001 L CNN "Package"
F 7 "Remote 8-Bit I/O Expander for I2C-Bus" H 3750 5725 60  0001 L CNN "Desc"
	1    3750 6775
	1    0    0    -1  
$EndComp
$Comp
L Resistor R61
U 1 1 547286BF
P 8700 1325
F 0 "R61" V 8780 1325 40  0000 C CNN
F 1 "10k" V 8707 1326 40  0000 C CNN
F 2 "Ruwai:Resistor_SMD0102_ReflowWave" V 8630 1325 30  0001 C CNN
F 3 "" V 8780 1325 30  0000 C CNN
F 4 "Yageo" H 8700 825 60  0001 L CNN "Manu"
F 5 "RC0805FR-0710KL" H 8700 725 60  0001 L CNN "Manu#"
F 6 "0805" H 8700 625 60  0001 L CNN "Package"
F 7 " " H 8700 525 60  0001 L CNN "Desc"
	1    8700 1325
	0    1    1    0   
$EndComp
$Comp
L Resistor R62
U 1 1 547286CA
P 8000 1325
F 0 "R62" V 8080 1325 40  0000 C CNN
F 1 "10k" V 8007 1326 40  0000 C CNN
F 2 "Ruwai:Resistor_SMD0102_ReflowWave" V 7930 1325 30  0001 C CNN
F 3 "" V 8080 1325 30  0000 C CNN
F 4 "Yageo" H 8000 825 60  0001 L CNN "Manu"
F 5 "RC0805FR-0710KL" H 8000 725 60  0001 L CNN "Manu#"
F 6 "0805" H 8000 625 60  0001 L CNN "Package"
F 7 " " H 8000 525 60  0001 L CNN "Desc"
	1    8000 1325
	0    1    1    0   
$EndComp
$Comp
L Resistor R58
U 1 1 547286D5
P 6050 1475
F 0 "R58" V 6130 1475 40  0000 C CNN
F 1 "10k" V 6057 1476 40  0000 C CNN
F 2 "Ruwai:Resistor_SMD0102_ReflowWave" V 5980 1475 30  0001 C CNN
F 3 "" V 6130 1475 30  0000 C CNN
F 4 "Yageo" H 6050 975 60  0001 L CNN "Manu"
F 5 "RC0805FR-0710KL" H 6050 875 60  0001 L CNN "Manu#"
F 6 "0805" H 6050 775 60  0001 L CNN "Package"
F 7 " " H 6050 675 60  0001 L CNN "Desc"
	1    6050 1475
	0    1    1    0   
$EndComp
$Comp
L Resistor R59
U 1 1 547286E0
P 5000 1475
F 0 "R59" V 5080 1475 40  0000 C CNN
F 1 "10k" V 5007 1476 40  0000 C CNN
F 2 "Ruwai:Resistor_SMD0102_ReflowWave" V 4930 1475 30  0001 C CNN
F 3 "" V 5080 1475 30  0000 C CNN
F 4 "Yageo" H 5000 975 60  0001 L CNN "Manu"
F 5 "RC0805FR-0710KL" H 5000 875 60  0001 L CNN "Manu#"
F 6 "0805" H 5000 775 60  0001 L CNN "Package"
F 7 " " H 5000 675 60  0001 L CNN "Desc"
	1    5000 1475
	0    1    1    0   
$EndComp
$Comp
L Resistor R60
U 1 1 547286EB
P 4300 1475
F 0 "R60" V 4380 1475 40  0000 C CNN
F 1 "10k" V 4307 1476 40  0000 C CNN
F 2 "Ruwai:Resistor_SMD0102_ReflowWave" V 4230 1475 30  0001 C CNN
F 3 "" V 4380 1475 30  0000 C CNN
F 4 "Yageo" H 4300 975 60  0001 L CNN "Manu"
F 5 "RC0805FR-0710KL" H 4300 875 60  0001 L CNN "Manu#"
F 6 "0805" H 4300 775 60  0001 L CNN "Package"
F 7 " " H 4300 675 60  0001 L CNN "Desc"
	1    4300 1475
	0    1    1    0   
$EndComp
$Comp
L Capacitor C58
U 1 1 547286F6
P 8350 975
F 0 "C58" H 8350 1075 40  0000 L CNN
F 1 "47nF" H 8356 890 40  0000 L CNN
F 2 "Ruwai:Capacitor_SMD1206_ReflowWave" H 8388 825 30  0001 C CNN
F 3 "" H 8350 1075 60  0000 C CNN
F 4 "Murata" H 8400 575 60  0001 L CNN "Manu"
F 5 "GRM31M5C1H473JA01L" H 8400 475 60  0001 L CNN "Manu#"
F 6 "1206" H 8400 375 60  0001 L CNN "Package"
F 7 "Custom Description" H 8350 625 60  0001 L CNN "Desc"
	1    8350 975 
	1    0    0    -1  
$EndComp
$Comp
L Capacitor C61
U 1 1 54728701
P 5700 1075
F 0 "C61" H 5700 1175 40  0000 L CNN
F 1 "4.7nF" H 5706 990 40  0000 L CNN
F 2 "Ruwai:Capacitor_SMD0805_ReflowWave" H 5738 925 30  0001 C CNN
F 3 "" H 5700 1175 60  0000 C CNN
F 4 "Murata" H 5750 675 60  0001 L CNN "Manu"
F 5 "GRM2165C1H472JA01D" H 5750 575 60  0001 L CNN "Manu#"
F 6 "0805" H 5750 475 60  0001 L CNN "Package"
F 7 "Custom Description" H 5700 725 60  0001 L CNN "Desc"
	1    5700 1075
	1    0    0    -1  
$EndComp
$Comp
L Capacitor C55
U 1 1 5472870C
P 5400 1075
F 0 "C55" H 5400 1175 40  0000 L CNN
F 1 "22nF" H 5406 990 40  0000 L CNN
F 2 "Ruwai:Capacitor_SMD0805_ReflowWave" H 5438 925 30  0001 C CNN
F 3 "" H 5400 1175 60  0000 C CNN
F 4 "Kemet" H 5450 675 60  0001 L CNN "Manu"
F 5 "CGA4J2C0G1H223J125AA" H 5450 575 60  0001 L CNN "Manu#"
F 6 "0805" H 5450 475 60  0001 L CNN "Package"
F 7 "Custom Description" H 5400 725 60  0001 L CNN "Desc"
	1    5400 1075
	1    0    0    -1  
$EndComp
$Comp
L Capacitor C57
U 1 1 54728717
P 9050 1975
F 0 "C57" H 9050 2075 40  0000 L CNN
F 1 "2.2nF" H 9056 1890 40  0000 L CNN
F 2 "Ruwai:Capacitor_SMD0805_ReflowWave" H 9088 1825 30  0001 C CNN
F 3 "" H 9050 2075 60  0000 C CNN
F 4 "Multicomp" H 9100 1575 60  0001 L CNN "Manu"
F 5 "MCU0805C222JCT " H 9100 1475 60  0001 L CNN "Manu#"
F 6 "0805" H 9100 1375 60  0001 L CNN "Package"
F 7 "Custom Description" H 9050 1625 60  0001 L CNN "Desc"
	1    9050 1975
	1    0    0    -1  
$EndComp
$Comp
L Capacitor C63
U 1 1 54728722
P 6400 1975
F 0 "C63" H 6400 2075 40  0000 L CNN
F 1 "3.3nF" H 6406 1890 40  0000 L CNN
F 2 "Ruwai:Capacitor_SMD0805_ReflowWave" H 6438 1825 30  0001 C CNN
F 3 "" H 6400 2075 60  0000 C CNN
F 4 "Murata" H 6450 1575 60  0001 L CNN "Manu"
F 5 "GRM2165C1H332JA01D" H 6450 1475 60  0001 L CNN "Manu#"
F 6 "0805" H 6450 1375 60  0001 L CNN "Package"
F 7 "Custom Description" H 6400 1625 60  0001 L CNN "Desc"
	1    6400 1975
	1    0    0    -1  
$EndComp
$Comp
L Capacitor C56
U 1 1 5472872D
P 4650 1975
F 0 "C56" H 4650 2075 40  0000 L CNN
F 1 "10nF" H 4656 1890 40  0000 L CNN
F 2 "Ruwai:Capacitor_SMD0805_ReflowWave" H 4688 1825 30  0001 C CNN
F 3 "" H 4650 2075 60  0000 C CNN
F 4 "Kemet" H 4700 1575 60  0001 L CNN "Manu"
F 5 "C0805C103J3GACTU" H 4700 1475 60  0001 L CNN "Manu#"
F 6 "0805" H 4700 1375 60  0001 L CNN "Package"
F 7 "Custom Description" H 4650 1625 60  0001 L CNN "Desc"
	1    4650 1975
	1    0    0    -1  
$EndComp
$Comp
L Resistor R67
U 1 1 54728738
P 8000 2625
F 0 "R67" V 8080 2625 40  0000 C CNN
F 1 "10k" V 8007 2626 40  0000 C CNN
F 2 "Ruwai:Resistor_SMD0102_ReflowWave" V 7930 2625 30  0001 C CNN
F 3 "" V 8080 2625 30  0000 C CNN
F 4 "Yageo" H 8000 2125 60  0001 L CNN "Manu"
F 5 "RC0805FR-0710KL" H 8000 2025 60  0001 L CNN "Manu#"
F 6 "0805" H 8000 1925 60  0001 L CNN "Package"
F 7 " " H 8000 1825 60  0001 L CNN "Desc"
	1    8000 2625
	0    1    1    0   
$EndComp
$Comp
L Resistor R66
U 1 1 54728743
P 8700 2625
F 0 "R66" V 8780 2625 40  0000 C CNN
F 1 "10k" V 8707 2626 40  0000 C CNN
F 2 "Ruwai:Resistor_SMD0102_ReflowWave" V 8630 2625 30  0001 C CNN
F 3 "" V 8780 2625 30  0000 C CNN
F 4 "Yageo" H 8700 2125 60  0001 L CNN "Manu"
F 5 "RC0805FR-0710KL" H 8700 2025 60  0001 L CNN "Manu#"
F 6 "0805" H 8700 1925 60  0001 L CNN "Package"
F 7 " " H 8700 1825 60  0001 L CNN "Desc"
	1    8700 2625
	0    1    1    0   
$EndComp
$Comp
L Capacitor C60
U 1 1 5472874E
P 8350 2975
F 0 "C60" H 8350 3075 40  0000 L CNN
F 1 "47nF" H 8356 2890 40  0000 L CNN
F 2 "Ruwai:Capacitor_SMD1206_ReflowWave" H 8388 2825 30  0001 C CNN
F 3 "" H 8350 3075 60  0000 C CNN
F 4 "Murata" H 8400 2575 60  0001 L CNN "Manu"
F 5 "GRM31M5C1H473JA01L" H 8400 2475 60  0001 L CNN "Manu#"
F 6 "1206" H 8400 2375 60  0001 L CNN "Package"
F 7 "Custom Description" H 8350 2625 60  0001 L CNN "Desc"
	1    8350 2975
	1    0    0    -1  
$EndComp
$Comp
L Resistor R63
U 1 1 54728759
P 6050 2475
F 0 "R63" V 6130 2475 40  0000 C CNN
F 1 "10k" V 6057 2476 40  0000 C CNN
F 2 "Ruwai:Resistor_SMD0102_ReflowWave" V 5980 2475 30  0001 C CNN
F 3 "" V 6130 2475 30  0000 C CNN
F 4 "Yageo" H 6050 1975 60  0001 L CNN "Manu"
F 5 "RC0805FR-0710KL" H 6050 1875 60  0001 L CNN "Manu#"
F 6 "0805" H 6050 1775 60  0001 L CNN "Package"
F 7 " " H 6050 1675 60  0001 L CNN "Desc"
	1    6050 2475
	0    1    1    0   
$EndComp
$Comp
L Resistor R64
U 1 1 54728764
P 5000 2475
F 0 "R64" V 5080 2475 40  0000 C CNN
F 1 "10k" V 5007 2476 40  0000 C CNN
F 2 "Ruwai:Resistor_SMD0102_ReflowWave" V 4930 2475 30  0001 C CNN
F 3 "" V 5080 2475 30  0000 C CNN
F 4 "Yageo" H 5000 1975 60  0001 L CNN "Manu"
F 5 "RC0805FR-0710KL" H 5000 1875 60  0001 L CNN "Manu#"
F 6 "0805" H 5000 1775 60  0001 L CNN "Package"
F 7 " " H 5000 1675 60  0001 L CNN "Desc"
	1    5000 2475
	0    1    1    0   
$EndComp
$Comp
L Resistor R65
U 1 1 5472876F
P 4300 2475
F 0 "R65" V 4380 2475 40  0000 C CNN
F 1 "10k" V 4307 2476 40  0000 C CNN
F 2 "Ruwai:Resistor_SMD0102_ReflowWave" V 4230 2475 30  0001 C CNN
F 3 "" V 4380 2475 30  0000 C CNN
F 4 "Yageo" H 4300 1975 60  0001 L CNN "Manu"
F 5 "RC0805FR-0710KL" H 4300 1875 60  0001 L CNN "Manu#"
F 6 "0805" H 4300 1775 60  0001 L CNN "Package"
F 7 " " H 4300 1675 60  0001 L CNN "Desc"
	1    4300 2475
	0    1    1    0   
$EndComp
$Comp
L Capacitor C62
U 1 1 5472877A
P 5700 2875
F 0 "C62" H 5700 2975 40  0000 L CNN
F 1 "4.7nF" H 5706 2790 40  0000 L CNN
F 2 "Ruwai:Capacitor_SMD0805_ReflowWave" H 5738 2725 30  0001 C CNN
F 3 "" H 5700 2975 60  0000 C CNN
F 4 "Murata" H 5750 2475 60  0001 L CNN "Manu"
F 5 "GRM2165C1H472JA01D" H 5750 2375 60  0001 L CNN "Manu#"
F 6 "0805" H 5750 2275 60  0001 L CNN "Package"
F 7 "Custom Description" H 5700 2525 60  0001 L CNN "Desc"
	1    5700 2875
	1    0    0    -1  
$EndComp
$Comp
L Capacitor C59
U 1 1 54728785
P 5400 2875
F 0 "C59" H 5400 2975 40  0000 L CNN
F 1 "22nF" H 5406 2790 40  0000 L CNN
F 2 "Ruwai:Capacitor_SMD0805_ReflowWave" H 5438 2725 30  0001 C CNN
F 3 "" H 5400 2975 60  0000 C CNN
F 4 "Kemet" H 5450 2475 60  0001 L CNN "Manu"
F 5 "CGA4J2C0G1H223J125AA" H 5450 2375 60  0001 L CNN "Manu#"
F 6 "0805" H 5450 2275 60  0001 L CNN "Package"
F 7 "Custom Description" H 5400 2525 60  0001 L CNN "Desc"
	1    5400 2875
	1    0    0    -1  
$EndComp
$Comp
L GND #PWR070
U 1 1 5472878C
P 10150 5000
F 0 "#PWR070" H 10150 5000 30  0001 C CNN
F 1 "GND" H 10150 4930 30  0001 C CNN
F 2 "" H 10150 5000 60  0000 C CNN
F 3 "" H 10150 5000 60  0000 C CNN
	1    10150 5000
	1    0    0    -1  
$EndComp
$Comp
L GND #PWR071
U 1 1 54728792
P 10100 6300
F 0 "#PWR071" H 10100 6300 30  0001 C CNN
F 1 "GND" H 10100 6230 30  0001 C CNN
F 2 "" H 10100 6300 60  0000 C CNN
F 3 "" H 10100 6300 60  0000 C CNN
	1    10100 6300
	1    0    0    -1  
$EndComp
$Comp
L inductor L13
U 1 1 5472879C
P 9225 3975
F 0 "L13" H 9225 4025 40  0000 C BNN
F 1 "1uH" H 9225 3925 40  0000 C CNN
F 2 "Ruwai:Inductor_SMD0805_ReflowWave" H 9125 3975 60  0001 C CNN
F 3 "" H 9125 3975 60  0000 C CNN
F 4 "Taiyo Yuden" H 9225 3775 60  0001 L BNN "Manu"
F 5 "BRL2012T1R0M " H 9225 3675 60  0001 L BNN "Manu#"
F 6 "0805" H 9225 3575 60  0001 L BNN "Package"
F 7 "Custom description." H 9225 3475 60  0001 L BNN "Desc"
	1    9225 3975
	1    0    0    -1  
$EndComp
$Comp
L Capacitor C65
U 1 1 547287A7
P 9600 4450
F 0 "C65" H 9600 4550 40  0000 L CNN
F 1 "100nF" H 9606 4365 40  0000 L CNN
F 2 "Ruwai:Capacitor_SMD0805_ReflowWave" H 9638 4300 30  0001 C CNN
F 3 "" H 9600 4550 60  0000 C CNN
F 4 "Murata" H 9650 4050 60  0001 L CNN "Manu"
F 5 "GCM21BR71H104KA37L" H 9650 3950 60  0001 L CNN "Manu#"
F 6 "0805" H 9650 3850 60  0001 L CNN "Package"
F 7 "Custom Description" H 9600 4100 60  0001 L CNN "Desc"
	1    9600 4450
	1    0    0    -1  
$EndComp
$Comp
L GND #PWR072
U 1 1 547287AE
P 9600 5000
F 0 "#PWR072" H 9600 5000 30  0001 C CNN
F 1 "GND" H 9600 4930 30  0001 C CNN
F 2 "" H 9600 5000 60  0000 C CNN
F 3 "" H 9600 5000 60  0000 C CNN
	1    9600 5000
	1    0    0    -1  
$EndComp
$Comp
L GND #PWR073
U 1 1 547287B4
P 9625 6300
F 0 "#PWR073" H 9625 6300 30  0001 C CNN
F 1 "GND" H 9625 6230 30  0001 C CNN
F 2 "" H 9625 6300 60  0000 C CNN
F 3 "" H 9625 6300 60  0000 C CNN
	1    9625 6300
	1    0    0    -1  
$EndComp
Text HLabel 8875 3975 0    60   Input ~ 0
5V_PGA
Text HLabel 8775 5275 0    60   Input ~ 0
5V_PGA
Text Label 2875 7225 2    60   ~ 0
PGA_G0
Text Label 4800 7225 0    60   ~ 0
PGA_G1
Text Label 4800 7125 0    60   ~ 0
PGA_G2
Text Label 4800 6925 0    60   ~ 0
PGA_G3
Text Label 4800 6725 0    60   ~ 0
PGA_G4
Text Label 2900 5750 2    60   ~ 0
PGA_G0
Text Label 2900 5650 2    60   ~ 0
PGA_G1
Text Label 2900 5550 2    60   ~ 0
PGA_G2
Text Label 2900 5450 2    60   ~ 0
PGA_G3
Text Label 2900 5350 2    60   ~ 0
PGA_G4
NoConn ~ 4350 6425
NoConn ~ 4350 6325
NoConn ~ 3150 6325
$Comp
L GND #PWR074
U 1 1 547287C9
P 3000 7600
F 0 "#PWR074" H 3000 7600 30  0001 C CNN
F 1 "GND" H 3000 7530 30  0001 C CNN
F 2 "" H 3000 7600 60  0000 C CNN
F 3 "" H 3000 7600 60  0000 C CNN
	1    3000 7600
	1    0    0    -1  
$EndComp
Text HLabel 2875 6625 0    60   Input ~ 0
SDA_3
Text HLabel 2875 6425 0    60   Input ~ 0
SCL_3
$Comp
L Resistor R71
U 1 1 547287D5
P 1750 6725
F 0 "R71" V 1830 6725 40  0000 C CNN
F 1 "10" V 1757 6726 40  0000 C CNN
F 2 "Ruwai:Resistor_SMD0805_ReflowWave" V 1680 6725 30  0001 C CNN
F 3 "" V 1830 6725 30  0000 C CNN
F 4 "Yageo" H 1750 6225 60  0001 L CNN "Manu"
F 5 "RC0805FR-0710RL" H 1750 6125 60  0001 L CNN "Manu#"
F 6 "0805" H 1750 6025 60  0001 L CNN "Package"
F 7 "Custom Description" H 1750 5925 60  0001 L CNN "Desc"
	1    1750 6725
	0    1    1    0   
$EndComp
$Comp
L GND #PWR075
U 1 1 547287DC
P 2275 7600
F 0 "#PWR075" H 2275 7600 30  0001 C CNN
F 1 "GND" H 2275 7530 30  0001 C CNN
F 2 "" H 2275 7600 60  0000 C CNN
F 3 "" H 2275 7600 60  0000 C CNN
	1    2275 7600
	1    0    0    -1  
$EndComp
Text HLabel 1275 6725 0    60   Input ~ 0
3.3V_P
Text Label 2925 5850 2    60   ~ 0
PGA_VON
Text Label 4600 5850 0    60   ~ 0
PGA_VOP
$Comp
L GND #PWR076
U 1 1 547287E5
P 5300 6325
F 0 "#PWR076" H 5300 6325 30  0001 C CNN
F 1 "GND" H 5300 6255 30  0001 C CNN
F 2 "" H 5300 6325 60  0000 C CNN
F 3 "" H 5300 6325 60  0000 C CNN
	1    5300 6325
	1    0    0    -1  
$EndComp
Text HLabel 6450 5750 2    60   Input ~ 0
ADC_VCOM
Text HLabel 6450 5650 2    60   Input ~ 0
5V_PGA
$Comp
L GND #PWR077
U 1 1 547287ED
P 5550 6325
F 0 "#PWR077" H 5550 6325 30  0001 C CNN
F 1 "GND" H 5550 6255 30  0001 C CNN
F 2 "" H 5550 6325 60  0000 C CNN
F 3 "" H 5550 6325 60  0000 C CNN
	1    5550 6325
	1    0    0    -1  
$EndComp
$Comp
L GND #PWR078
U 1 1 547287F3
P 5050 6325
F 0 "#PWR078" H 5050 6325 30  0001 C CNN
F 1 "GND" H 5050 6255 30  0001 C CNN
F 2 "" H 5050 6325 60  0000 C CNN
F 3 "" H 5050 6325 60  0000 C CNN
	1    5050 6325
	1    0    0    -1  
$EndComp
$Comp
L GND #PWR079
U 1 1 547287F9
P 5250 5525
F 0 "#PWR079" H 5250 5525 30  0001 C CNN
F 1 "GND" H 5250 5455 30  0001 C CNN
F 2 "" H 5250 5525 60  0000 C CNN
F 3 "" H 5250 5525 60  0000 C CNN
	1    5250 5525
	1    0    0    -1  
$EndComp
$Comp
L Resistor R70
U 1 1 54728803
P 5725 4950
F 0 "R70" V 5805 4950 40  0000 C CNN
F 1 "22" V 5732 4951 40  0000 C CNN
F 2 "Ruwai:Resistor_SMD0805_ReflowWave" V 5655 4950 30  0001 C CNN
F 3 "" V 5805 4950 30  0000 C CNN
F 4 "Yageo" H 5725 4450 60  0001 L CNN "Manu"
F 5 "RC0805FR-0722RL" H 5725 4350 60  0001 L CNN "Manu#"
F 6 "0805" H 5725 4250 60  0001 L CNN "Package"
F 7 "Custom Description" H 5725 4150 60  0001 L CNN "Desc"
	1    5725 4950
	0    1    1    0   
$EndComp
Text HLabel 6100 4950 2    60   Input ~ 0
+15V_PGA
$Comp
L GND #PWR080
U 1 1 5472880B
P 4975 4800
F 0 "#PWR080" H 4975 4800 30  0001 C CNN
F 1 "GND" H 4975 4730 30  0001 C CNN
F 2 "" H 4975 4800 60  0000 C CNN
F 3 "" H 4975 4800 60  0000 C CNN
	1    4975 4800
	1    0    0    -1  
$EndComp
Text HLabel 6100 4100 2    60   Input ~ 0
-15V_PGA
Text Label 3900 1475 2    60   ~ 0
PGA_VOP
Text Label 3900 2475 2    60   ~ 0
PGA_VON
$Comp
L inductor L15
U 1 1 54728819
P 1500 3100
F 0 "L15" H 1500 3150 40  0000 C BNN
F 1 "47uH" H 1500 3050 40  0000 C CNN
F 2 "Ruwai:Inductor_SMD0805_ReflowWave" H 1400 3100 60  0001 C CNN
F 3 "" H 1400 3100 60  0000 C CNN
F 4 "Taiyo Yuden" H 1500 2900 60  0001 L BNN "Manu"
F 5 "BRL2012T470M" H 1500 2800 60  0001 L BNN "Manu#"
F 6 "0805" H 1500 2700 60  0001 L BNN "Package"
F 7 "Custom description." H 1500 2600 60  0001 L BNN "Desc"
	1    1500 3100
	1    0    0    -1  
$EndComp
$Comp
L Resistor R75
U 1 1 54728824
P 2150 3100
F 0 "R75" V 2230 3100 40  0000 C CNN
F 1 "47" V 2157 3101 40  0000 C CNN
F 2 "Ruwai:Resistor_SMD0805_ReflowWave" V 2080 3100 30  0001 C CNN
F 3 "" V 2230 3100 30  0000 C CNN
F 4 "Yageo" H 2150 2600 60  0001 L CNN "Manu"
F 5 "RC0805FR-0747RL" H 2150 2500 60  0001 L CNN "Manu#"
F 6 "0805" H 2150 2400 60  0001 L CNN "Package"
F 7 "Custom Description" H 2150 2300 60  0001 L CNN "Desc"
	1    2150 3100
	0    -1   -1   0   
$EndComp
$Comp
L Capacitor C71
U 1 1 5472882F
P 2550 3500
F 0 "C71" H 2550 3600 40  0000 L CNN
F 1 "47nF" H 2556 3415 40  0000 L CNN
F 2 "Ruwai:Capacitor_SMD1206_ReflowWave" H 2588 3350 30  0001 C CNN
F 3 "" H 2550 3600 60  0000 C CNN
F 4 "Murata" H 2600 3100 60  0001 L CNN "Manu"
F 5 "GRM31M5C1H473JA01L" H 2600 3000 60  0001 L CNN "Manu#"
F 6 "1206" H 2600 2900 60  0001 L CNN "Package"
F 7 "Custom Description" H 2550 3150 60  0001 L CNN "Desc"
	1    2550 3500
	1    0    0    -1  
$EndComp
$Comp
L Varistance R74
U 1 1 5472883A
P 2950 3500
F 0 "R74" H 3050 3550 40  0000 R BNN
F 1 "14VRMS" H 2850 3425 40  0000 L TNN
F 2 "Ruwai:Resistor_SMD0805_ReflowWave" H 3000 3450 60  0001 C CNN
F 3 "" V 2950 3500 60  0000 C CNN
F 4 "Epcos" H 2950 3300 60  0001 L BNN "Manu"
F 5 "B72510E0140K062" H 2950 3200 60  0001 L BNN "Manu#"
F 6 "0805" H 2950 3100 60  0001 L BNN "Package"
F 7 "Custom description." H 2950 3000 60  0001 L BNN "Desc"
	1    2950 3500
	0    -1   -1   0   
$EndComp
$Comp
L Resistor R72
U 1 1 54728845
P 3500 3100
F 0 "R72" V 3580 3100 40  0000 C CNN
F 1 "2.2k" V 3507 3101 40  0000 C CNN
F 2 "Ruwai:Resistor_SMD0805_ReflowWave" V 3430 3100 30  0001 C CNN
F 3 "" V 3580 3100 30  0000 C CNN
F 4 "Yageo" H 3500 2600 60  0001 L CNN "Manu"
F 5 "RC0805FR-072K2L" H 3500 2500 60  0001 L CNN "Manu#"
F 6 "0805" H 3500 2400 60  0001 L CNN "Package"
F 7 "Custom Description" H 3500 2300 60  0001 L CNN "Desc"
	1    3500 3100
	0    -1   -1   0   
$EndComp
$Comp
L Capacitor C72
U 1 1 54728850
P 3900 3500
F 0 "C72" H 3900 3600 40  0000 L CNN
F 1 "1nF" H 3906 3415 40  0000 L CNN
F 2 "Ruwai:Capacitor_SMD0805_ReflowWave" H 3938 3350 30  0001 C CNN
F 3 "" H 3900 3600 60  0000 C CNN
F 4 "Kemet" H 3950 3100 60  0001 L CNN "Manu"
F 5 "C0805C102J5GACTU" H 3950 3000 60  0001 L CNN "Manu#"
F 6 "0805" H 3950 2900 60  0001 L CNN "Package"
F 7 "Custom Description" H 3900 3150 60  0001 L CNN "Desc"
	1    3900 3500
	1    0    0    -1  
$EndComp
$Comp
L Resistor R84
U 1 1 5472885B
P 1550 3300
F 0 "R84" V 1630 3300 40  0000 C CNN
F 1 "100k" V 1557 3301 40  0000 C CNN
F 2 "Ruwai:Resistor_SMD0805_ReflowWave" V 1480 3300 30  0001 C CNN
F 3 "" V 1630 3300 30  0000 C CNN
F 4 "Yageo" H 1550 2800 60  0001 L CNN "Manu"
F 5 "RC0805FR-07100KL" H 1550 2700 60  0001 L CNN "Manu#"
F 6 "0805" H 1550 2600 60  0001 L CNN "Package"
F 7 "Custom Description" H 1550 2500 60  0001 L CNN "Desc"
	1    1550 3300
	0    -1   -1   0   
$EndComp
$Comp
L Resistor R76
U 1 1 54728866
P 2150 3900
F 0 "R76" V 2230 3900 40  0000 C CNN
F 1 "47" V 2157 3901 40  0000 C CNN
F 2 "Ruwai:Resistor_SMD0805_ReflowWave" V 2080 3900 30  0001 C CNN
F 3 "" V 2230 3900 30  0000 C CNN
F 4 "Yageo" H 2150 3400 60  0001 L CNN "Manu"
F 5 "RC0805FR-0747RL" H 2150 3300 60  0001 L CNN "Manu#"
F 6 "0805" H 2150 3200 60  0001 L CNN "Package"
F 7 "Custom Description" H 2150 3100 60  0001 L CNN "Desc"
	1    2150 3900
	0    -1   -1   0   
$EndComp
$Comp
L Resistor R73
U 1 1 54728871
P 3500 3900
F 0 "R73" V 3580 3900 40  0000 C CNN
F 1 "2.2k" V 3507 3901 40  0000 C CNN
F 2 "Ruwai:Resistor_SMD0805_ReflowWave" V 3430 3900 30  0001 C CNN
F 3 "" V 3580 3900 30  0000 C CNN
F 4 "Yageo" H 3500 3400 60  0001 L CNN "Manu"
F 5 "RC0805FR-072K2L" H 3500 3300 60  0001 L CNN "Manu#"
F 6 "0805" H 3500 3200 60  0001 L CNN "Package"
F 7 "Custom Description" H 3500 3100 60  0001 L CNN "Desc"
	1    3500 3900
	0    -1   -1   0   
$EndComp
$Comp
L Resistor R85
U 1 1 5472887C
P 1550 3700
F 0 "R85" V 1630 3700 40  0000 C CNN
F 1 "100k" V 1557 3701 40  0000 C CNN
F 2 "Ruwai:Resistor_SMD0805_ReflowWave" V 1480 3700 30  0001 C CNN
F 3 "" V 1630 3700 30  0000 C CNN
F 4 "Yageo" H 1550 3200 60  0001 L CNN "Manu"
F 5 "RC0805FR-07100KL" H 1550 3100 60  0001 L CNN "Manu#"
F 6 "0805" H 1550 3000 60  0001 L CNN "Package"
F 7 "Custom Description" H 1550 2900 60  0001 L CNN "Desc"
	1    1550 3700
	0    -1   -1   0   
$EndComp
$Comp
L inductor L16
U 1 1 54728887
P 1500 3900
F 0 "L16" H 1500 3950 40  0000 C BNN
F 1 "47uH" H 1500 3850 40  0000 C CNN
F 2 "Ruwai:Inductor_SMD0805_ReflowWave" H 1400 3900 60  0001 C CNN
F 3 "" H 1400 3900 60  0000 C CNN
F 4 "Taiyo Yuden" H 1500 3700 60  0001 L BNN "Manu"
F 5 "BRL2012T470M" H 1500 3600 60  0001 L BNN "Manu#"
F 6 "0805" H 1500 3500 60  0001 L BNN "Package"
F 7 "Custom description." H 1500 3400 60  0001 L BNN "Desc"
	1    1500 3900
	1    0    0    -1  
$EndComp
$Comp
L GND #PWR081
U 1 1 5472888E
P 2150 3600
F 0 "#PWR081" H 2150 3600 30  0001 C CNN
F 1 "GND" H 2150 3530 30  0001 C CNN
F 2 "" H 2150 3600 60  0000 C CNN
F 3 "" H 2150 3600 60  0000 C CNN
	1    2150 3600
	1    0    0    -1  
$EndComp
Text HLabel 900  3100 0    60   Input ~ 0
AINP4
Text HLabel 900  3900 0    60   Input ~ 0
AINN4
Text Label 4200 3100 0    60   ~ 0
PGA_INP
Text Label 4200 3900 0    60   ~ 0
PGA_INN
$Comp
L inductor L14
U 1 1 54728953
P 9125 5275
F 0 "L14" H 9125 5325 40  0000 C BNN
F 1 "1uH" H 9125 5225 40  0000 C CNN
F 2 "Ruwai:Inductor_SMD0805_ReflowWave" H 9025 5275 60  0001 C CNN
F 3 "" H 9025 5275 60  0000 C CNN
F 4 "Taiyo Yuden" H 9125 5075 60  0001 L BNN "Manu"
F 5 "BRL2012T1R0M " H 9125 4975 60  0001 L BNN "Manu#"
F 6 "0805" H 9125 4875 60  0001 L BNN "Package"
F 7 "Custom description." H 9125 4775 60  0001 L BNN "Desc"
	1    9125 5275
	1    0    0    -1  
$EndComp
$Comp
L Capacitor C64
U 1 1 5472895E
P 9625 5750
F 0 "C64" H 9625 5850 40  0000 L CNN
F 1 "100nF" H 9631 5665 40  0000 L CNN
F 2 "Ruwai:Capacitor_SMD0805_ReflowWave" H 9663 5600 30  0001 C CNN
F 3 "" H 9625 5850 60  0000 C CNN
F 4 "Murata" H 9675 5350 60  0001 L CNN "Manu"
F 5 "GCM21BR71H104KA37L" H 9675 5250 60  0001 L CNN "Manu#"
F 6 "0805" H 9675 5150 60  0001 L CNN "Package"
F 7 "Custom Description" H 9625 5400 60  0001 L CNN "Desc"
	1    9625 5750
	1    0    0    -1  
$EndComp
$Comp
L Capacitor C67
U 1 1 54728969
P 2275 7150
F 0 "C67" H 2275 7250 40  0000 L CNN
F 1 "100nF" H 2281 7065 40  0000 L CNN
F 2 "Ruwai:Capacitor_SMD0805_ReflowWave" H 2313 7000 30  0001 C CNN
F 3 "" H 2275 7250 60  0000 C CNN
F 4 "Murata" H 2325 6750 60  0001 L CNN "Manu"
F 5 "GCM21BR71H104KA37L" H 2325 6650 60  0001 L CNN "Manu#"
F 6 "0805" H 2325 6550 60  0001 L CNN "Package"
F 7 "Custom Description" H 2275 6800 60  0001 L CNN "Desc"
	1    2275 7150
	1    0    0    -1  
$EndComp
$Comp
L Capacitor C66
U 1 1 54728974
P 5300 6050
F 0 "C66" H 5300 6150 40  0000 L CNN
F 1 "100nF" H 5306 5965 40  0000 L CNN
F 2 "Ruwai:Capacitor_SMD0805_ReflowWave" H 5338 5900 30  0001 C CNN
F 3 "" H 5300 6150 60  0000 C CNN
F 4 "Murata" H 5350 5650 60  0001 L CNN "Manu"
F 5 "GCM21BR71H104KA37L" H 5350 5550 60  0001 L CNN "Manu#"
F 6 "0805" H 5350 5450 60  0001 L CNN "Package"
F 7 "Custom Description" H 5300 5700 60  0001 L CNN "Desc"
	1    5300 6050
	1    0    0    -1  
$EndComp
$Comp
L Capacitor C69
U 1 1 5472897F
P 5550 6050
F 0 "C69" H 5550 6150 40  0000 L CNN
F 1 "470nF" H 5556 5965 40  0000 L CNN
F 2 "Ruwai:Capacitor_SMD0805_ReflowWave" H 5588 5900 30  0001 C CNN
F 3 "" H 5550 6150 60  0000 C CNN
F 4 "Samsung Electro-Mechanics" H 5600 5650 60  0001 L CNN "Manu"
F 5 "CL21B474KBF4PNG" H 5600 5550 60  0001 L CNN "Manu#"
F 6 "0805" H 5600 5450 60  0001 L CNN "Package"
F 7 "Custom Description" H 5550 5700 60  0001 L CNN "Desc"
	1    5550 6050
	1    0    0    -1  
$EndComp
$Comp
L Capacitor C68
U 1 1 5472898A
P 5250 5225
F 0 "C68" H 5250 5325 40  0000 L CNN
F 1 "470nF" H 5256 5140 40  0000 L CNN
F 2 "Ruwai:Capacitor_SMD0805_ReflowWave" H 5288 5075 30  0001 C CNN
F 3 "" H 5250 5325 60  0000 C CNN
F 4 "Samsung Electro-Mechanics" H 5300 4825 60  0001 L CNN "Manu"
F 5 "CL21B474KBF4PNG" H 5300 4725 60  0001 L CNN "Manu#"
F 6 "0805" H 5300 4625 60  0001 L CNN "Package"
F 7 "Custom Description" H 5250 4875 60  0001 L CNN "Desc"
	1    5250 5225
	1    0    0    -1  
$EndComp
$Comp
L Capacitor C70
U 1 1 54728995
P 4750 4425
F 0 "C70" H 4750 4525 40  0000 L CNN
F 1 "470nF" H 4756 4340 40  0000 L CNN
F 2 "Ruwai:Capacitor_SMD0805_ReflowWave" H 4788 4275 30  0001 C CNN
F 3 "" H 4750 4525 60  0000 C CNN
F 4 "Samsung Electro-Mechanics" H 4800 4025 60  0001 L CNN "Manu"
F 5 "CL21B474KBF4PNG" H 4800 3925 60  0001 L CNN "Manu#"
F 6 "0805" H 4800 3825 60  0001 L CNN "Package"
F 7 "Custom Description" H 4750 4075 60  0001 L CNN "Desc"
	1    4750 4425
	1    0    0    -1  
$EndComp
$Comp
L Resistor R68
U 1 1 547289A0
P 6000 5650
F 0 "R68" V 6080 5650 40  0000 C CNN
F 1 "10" V 6007 5651 40  0000 C CNN
F 2 "Ruwai:Resistor_SMD0805_ReflowWave" V 5930 5650 30  0001 C CNN
F 3 "" V 6080 5650 30  0000 C CNN
F 4 "Yageo" H 6000 5150 60  0001 L CNN "Manu"
F 5 "RC0805FR-0710RL" H 6000 5050 60  0001 L CNN "Manu#"
F 6 "0805" H 6000 4950 60  0001 L CNN "Package"
F 7 "Custom Description" H 6000 4850 60  0001 L CNN "Desc"
	1    6000 5650
	0    1    1    0   
$EndComp
$Comp
L Resistor R69
U 1 1 547289AB
P 5725 4100
F 0 "R69" V 5805 4100 40  0000 C CNN
F 1 "22" V 5732 4101 40  0000 C CNN
F 2 "Ruwai:Resistor_SMD0805_ReflowWave" V 5655 4100 30  0001 C CNN
F 3 "" V 5805 4100 30  0000 C CNN
F 4 "Yageo" H 5725 3600 60  0001 L CNN "Manu"
F 5 "RC0805FR-0722RL" H 5725 3500 60  0001 L CNN "Manu#"
F 6 "0805" H 5725 3400 60  0001 L CNN "Package"
F 7 "Custom Description" H 5725 3300 60  0001 L CNN "Desc"
	1    5725 4100
	0    1    1    0   
$EndComp
$Comp
L DiodeSchottky D4
U 1 1 547289B6
P 5225 4425
F 0 "D4" H 5225 4525 40  0000 C CNN
F 1 "BAS386" H 5225 4325 40  0000 C CNN
F 2 "Ruwai:Diode_SMD0102_ReflowWave" H 5225 4425 60  0001 C CNN
F 3 "" H 5225 4425 60  0000 C CNN
F 4 "Vishay" H 5225 4175 60  0001 L BNN "Manu"
F 5 "BAS386-TR" H 5225 4075 60  0001 L BNN "Manu#"
F 6 "0102" H 5225 3975 60  0001 L BNN "Package"
F 7 "Custom description." H 5225 3875 60  0001 L BNN "Desc"
	1    5225 4425
	0    1    1    0   
$EndComp
Text Notes 3775 7150 1    60   ~ 0
I2C address: 23h
Text Label 4600 5250 0    60   ~ 0
PGA_INN
Text Label 4600 5350 0    60   ~ 0
PGA_INP
Wire Wire Line
	8950 1325 9150 1325
Wire Wire Line
	8250 1325 8450 1325
Wire Wire Line
	10075 1175 10475 1175
Connection ~ 8350 1325
Wire Wire Line
	8350 775  8350 625 
Wire Wire Line
	8350 625  10200 625 
Wire Wire Line
	10200 625  10200 1175
Connection ~ 10200 1175
Wire Wire Line
	7475 1325 7750 1325
Wire Wire Line
	6300 1475 6550 1475
Wire Wire Line
	5250 1475 5800 1475
Wire Wire Line
	5700 1275 5700 1475
Connection ~ 5700 1475
Wire Wire Line
	5400 1275 5400 1475
Connection ~ 5400 1475
Wire Wire Line
	5400 875  5400 625 
Wire Wire Line
	5400 625  7600 625 
Wire Wire Line
	7600 625  7600 1325
Connection ~ 7600 1325
Wire Wire Line
	5700 875  5700 625 
Connection ~ 5700 625 
Wire Wire Line
	4550 1475 4750 1475
Wire Wire Line
	6550 1175 6500 1175
Wire Wire Line
	6500 1175 6500 625 
Connection ~ 6500 625 
Wire Wire Line
	8350 1325 8350 1175
Wire Wire Line
	9150 1025 9050 1025
Wire Wire Line
	9050 1025 9050 625 
Connection ~ 9050 625 
Wire Wire Line
	9050 1325 9050 1775
Connection ~ 9050 1325
Wire Wire Line
	6400 1775 6400 1475
Connection ~ 6400 1475
Wire Wire Line
	4650 1775 4650 1475
Connection ~ 4650 1475
Wire Wire Line
	8950 2625 9150 2625
Wire Wire Line
	8250 2625 8450 2625
Wire Wire Line
	7475 2625 7750 2625
Wire Wire Line
	8350 2775 8350 2625
Connection ~ 8350 2625
Wire Wire Line
	10075 2775 10475 2775
Wire Wire Line
	10200 3325 10200 2775
Wire Wire Line
	8350 3325 10200 3325
Wire Wire Line
	8350 3325 8350 3175
Connection ~ 10200 2775
Wire Wire Line
	9050 2175 9050 2625
Connection ~ 9050 2625
Wire Wire Line
	9150 2925 9050 2925
Wire Wire Line
	9050 2925 9050 3325
Connection ~ 9050 3325
Wire Wire Line
	6300 2475 6550 2475
Wire Wire Line
	5250 2475 5800 2475
Wire Wire Line
	4550 2475 4750 2475
Wire Wire Line
	4650 2175 4650 2475
Connection ~ 4650 2475
Wire Wire Line
	5400 2675 5400 2475
Connection ~ 5400 2475
Wire Wire Line
	5700 2675 5700 2475
Connection ~ 5700 2475
Wire Wire Line
	7600 3325 7600 2625
Wire Wire Line
	5400 3325 7600 3325
Wire Wire Line
	5400 3325 5400 3075
Connection ~ 7600 2625
Wire Wire Line
	5700 3075 5700 3325
Connection ~ 5700 3325
Wire Wire Line
	6400 2175 6400 2475
Connection ~ 6400 2475
Wire Wire Line
	6550 2775 6400 2775
Wire Wire Line
	6400 2775 6400 3325
Connection ~ 6400 3325
Wire Wire Line
	10150 4825 10150 5000
Wire Wire Line
	10100 6125 10100 6300
Wire Wire Line
	10150 3975 10150 4075
Wire Wire Line
	9425 3975 10150 3975
Wire Wire Line
	9625 5950 9625 6300
Wire Wire Line
	10100 5275 10100 5375
Wire Wire Line
	9325 5275 10100 5275
Wire Wire Line
	9625 5550 9625 5275
Connection ~ 9625 5275
Wire Wire Line
	8925 5275 8775 5275
Wire Wire Line
	9600 4250 9600 3975
Connection ~ 9600 3975
Wire Wire Line
	9600 4650 9600 5000
Wire Wire Line
	9025 3975 8875 3975
Wire Wire Line
	4350 7225 4800 7225
Wire Wire Line
	4350 7125 4800 7125
Wire Wire Line
	4350 6925 4800 6925
Wire Wire Line
	4350 6725 4800 6725
Wire Wire Line
	2900 5350 3125 5350
Wire Wire Line
	2900 5450 3125 5450
Wire Wire Line
	2900 5550 3125 5550
Wire Wire Line
	2900 5650 3125 5650
Wire Wire Line
	2900 5750 3125 5750
Wire Wire Line
	3000 6925 3150 6925
Wire Wire Line
	3150 7125 3000 7125
Wire Wire Line
	2000 6725 3150 6725
Wire Wire Line
	3150 6625 2875 6625
Wire Wire Line
	3150 6425 2875 6425
Wire Wire Line
	2275 7350 2275 7600
Wire Wire Line
	2275 6725 2275 6950
Connection ~ 2275 6725
Connection ~ 2125 6725
Wire Wire Line
	1500 6725 1275 6725
Wire Wire Line
	4325 5250 4600 5250
Wire Wire Line
	4325 5350 4600 5350
Wire Wire Line
	3125 5850 2925 5850
Wire Wire Line
	4325 5850 4600 5850
Wire Wire Line
	5300 6250 5300 6325
Wire Wire Line
	4325 5750 6450 5750
Wire Wire Line
	5300 5750 5300 5850
Connection ~ 5300 5750
Wire Wire Line
	4325 5650 5750 5650
Wire Wire Line
	5550 6325 5550 6250
Wire Wire Line
	5550 5850 5550 5650
Connection ~ 5550 5650
Wire Wire Line
	6250 5650 6450 5650
Wire Wire Line
	4325 5550 5050 5550
Wire Wire Line
	5050 5550 5050 6325
Wire Wire Line
	4325 5450 5075 5450
Wire Wire Line
	5075 5450 5075 4950
Wire Wire Line
	5075 4950 5475 4950
Wire Wire Line
	5250 5425 5250 5525
Wire Wire Line
	5250 5025 5250 4950
Connection ~ 5250 4950
Wire Wire Line
	5975 4950 6100 4950
Wire Wire Line
	4750 4625 4750 4725
Wire Wire Line
	4750 4725 5225 4725
Wire Wire Line
	5225 4725 5225 4625
Wire Wire Line
	4975 4800 4975 4725
Connection ~ 4975 4725
Wire Wire Line
	4325 5150 4525 5150
Wire Wire Line
	4525 4100 5475 4100
Wire Wire Line
	4750 4225 4750 4100
Connection ~ 4750 4100
Wire Wire Line
	5225 4225 5225 4100
Connection ~ 5225 4100
Wire Wire Line
	5975 4100 6100 4100
Wire Wire Line
	4050 1475 3900 1475
Wire Wire Line
	4050 2475 3900 2475
Wire Wire Line
	3150 7225 2875 7225
Wire Wire Line
	2125 5150 3125 5150
Wire Wire Line
	900  3100 1300 3100
Wire Wire Line
	1800 3300 1900 3300
Wire Wire Line
	1900 3300 1900 3700
Wire Wire Line
	1900 3700 1800 3700
Wire Wire Line
	1300 3300 1200 3300
Wire Wire Line
	1200 3300 1200 3100
Connection ~ 1200 3100
Wire Wire Line
	1900 3500 2150 3500
Wire Wire Line
	2150 3500 2150 3600
Connection ~ 1900 3500
Wire Wire Line
	1700 3100 1900 3100
Wire Wire Line
	2400 3100 3250 3100
Wire Wire Line
	2550 3300 2550 3100
Connection ~ 2550 3100
Wire Wire Line
	2950 3300 2950 3100
Connection ~ 2950 3100
Wire Wire Line
	2400 3900 3250 3900
Wire Wire Line
	1700 3900 1900 3900
Wire Wire Line
	900  3900 1300 3900
Wire Wire Line
	1300 3700 1200 3700
Wire Wire Line
	1200 3700 1200 3900
Connection ~ 1200 3900
Wire Wire Line
	2550 3700 2550 3900
Connection ~ 2550 3900
Wire Wire Line
	2950 3700 2950 3900
Connection ~ 2950 3900
Wire Wire Line
	3750 3100 4200 3100
Wire Wire Line
	3750 3900 4200 3900
Wire Wire Line
	3900 3700 3900 3900
Connection ~ 3900 3900
Wire Wire Line
	3900 3300 3900 3100
Connection ~ 3900 3100
Wire Wire Line
	4525 5150 4525 4100
Wire Wire Line
	3000 6725 3000 6925
Connection ~ 3000 6725
Wire Wire Line
	3150 6825 3000 6825
Connection ~ 3000 6825
Wire Wire Line
	3000 7125 3000 7600
Text HLabel 10475 1175 2    60   Output ~ 0
PGA4_OUTP
Text HLabel 10475 2775 2    60   Output ~ 0
PGA4_OUTN
NoConn ~ 4350 6625
$Comp
L GND #PWR082
U 1 1 54760C92
P 1375 6000
F 0 "#PWR082" H 1375 6000 30  0001 C CNN
F 1 "GND" H 1375 5930 30  0001 C CNN
F 2 "" H 1375 6000 60  0000 C CNN
F 3 "" H 1375 6000 60  0000 C CNN
	1    1375 6000
	1    0    0    -1  
$EndComp
Wire Wire Line
	3125 5250 1950 5250
Wire Wire Line
	1550 5250 1375 5250
Wire Wire Line
	1375 5250 1375 5350
Wire Wire Line
	1375 5850 1375 6000
$Comp
L LED D8
U 1 1 54763C15
P 1750 5250
F 0 "D8" H 1725 5335 40  0000 C CNN
F 1 "LED" H 1750 5160 40  0000 C CNN
F 2 "Ruwai:LED-0805" H 1750 5250 60  0001 C CNN
F 3 "" H 1750 5250 60  0001 C CNN
F 4 "Knightbright" H 1750 5250 60  0001 C CNN "Manu"
F 5 "KP-2012SRC-PRV" H 1750 5250 60  0001 C CNN "Manu#"
F 6 "0805" H 1750 5250 60  0001 C CNN "Package"
	1    1750 5250
	-1   0    0    1   
$EndComp
$Comp
L Resistor R88
U 1 1 54767AA1
P 1375 5600
F 0 "R88" V 1455 5600 40  0000 C CNN
F 1 "2.2k" V 1382 5601 40  0000 C CNN
F 2 "Ruwai:Resistor_SMD0805_ReflowWave" V 1305 5600 30  0001 C CNN
F 3 "" V 1455 5600 30  0000 C CNN
F 4 "Yageo" H 1375 5100 60  0001 L CNN "Manu"
F 5 "RC0805FR-072K2L" H 1375 5000 60  0001 L CNN "Manu#"
F 6 "0805" H 1375 4900 60  0001 L CNN "Package"
F 7 "Custom Description" H 1375 4800 60  0001 L CNN "Desc"
	1    1375 5600
	-1   0    0    1   
$EndComp
Wire Wire Line
	2125 5150 2125 6725
$Comp
L PWR_FLAG #FLG083
U 1 1 5476BF3A
P 10150 3975
F 0 "#FLG083" H 10150 4070 30  0001 C CNN
F 1 "PWR_FLAG" H 10150 4155 30  0000 C CNN
F 2 "" H 10150 3975 60  0000 C CNN
F 3 "" H 10150 3975 60  0000 C CNN
	1    10150 3975
	0    1    1    0   
$EndComp
$Comp
L PWR_FLAG #FLG084
U 1 1 5476C451
P 10100 5275
F 0 "#FLG084" H 10100 5370 30  0001 C CNN
F 1 "PWR_FLAG" H 10100 5455 30  0000 C CNN
F 2 "" H 10100 5275 60  0000 C CNN
F 3 "" H 10100 5275 60  0000 C CNN
	1    10100 5275
	0    1    1    0   
$EndComp
$Comp
L PWR_FLAG #FLG085
U 1 1 5476C678
P 2275 6725
F 0 "#FLG085" H 2275 6820 30  0001 C CNN
F 1 "PWR_FLAG" H 2275 6905 30  0000 C CNN
F 2 "" H 2275 6725 60  0000 C CNN
F 3 "" H 2275 6725 60  0000 C CNN
	1    2275 6725
	1    0    0    -1  
$EndComp
$Comp
L PWR_FLAG #FLG086
U 1 1 5476C833
P 5550 5650
F 0 "#FLG086" H 5550 5745 30  0001 C CNN
F 1 "PWR_FLAG" H 5550 5830 30  0000 C CNN
F 2 "" H 5550 5650 60  0000 C CNN
F 3 "" H 5550 5650 60  0000 C CNN
	1    5550 5650
	1    0    0    -1  
$EndComp
$Comp
L PWR_FLAG #FLG087
U 1 1 5476C8E0
P 5250 4950
F 0 "#FLG087" H 5250 5045 30  0001 C CNN
F 1 "PWR_FLAG" H 5250 5130 30  0000 C CNN
F 2 "" H 5250 4950 60  0000 C CNN
F 3 "" H 5250 4950 60  0000 C CNN
	1    5250 4950
	1    0    0    -1  
$EndComp
$Comp
L PWR_FLAG #FLG088
U 1 1 5476C9F9
P 5225 4100
F 0 "#FLG088" H 5225 4195 30  0001 C CNN
F 1 "PWR_FLAG" H 5225 4280 30  0000 C CNN
F 2 "" H 5225 4100 60  0000 C CNN
F 3 "" H 5225 4100 60  0000 C CNN
	1    5225 4100
	1    0    0    -1  
$EndComp
$Comp
L GND #PWR089
U 1 1 5476CB7E
P 4550 7600
F 0 "#PWR089" H 4550 7600 30  0001 C CNN
F 1 "GND" H 4550 7530 30  0001 C CNN
F 2 "" H 4550 7600 60  0000 C CNN
F 3 "" H 4550 7600 60  0000 C CNN
	1    4550 7600
	1    0    0    -1  
$EndComp
Wire Wire Line
	4350 6825 4550 6825
Wire Wire Line
	4550 6825 4550 7600
$Comp
L OPA2209 U13
U 1 1 59BD32A3
P 6900 2625
F 0 "U13" H 7125 2800 60  0000 C CNN
F 1 "OPA2209" H 7225 2425 60  0000 C CNN
F 2 "SSOP_Packages:MSOP-8_3x3mm_Pitch0.65mm" H 6900 2175 60  0001 L CNN
F 3 "" H 6900 2625 60  0000 C CNN
F 4 "Texas Instruments" H 6900 2075 60  0001 L CNN "Manu"
F 5 "OPA2209AIDGKT" H 6900 1975 60  0001 L CNN "Manu#"
F 6 "VSSOP 8-pin" H 6900 1875 60  0001 L CNN "Package"
F 7 " " H 6900 1775 60  0001 L CNN "Desc"
	1    6900 2625
	1    0    0    -1  
$EndComp
$Comp
L OPA2209 U13
U 2 1 59BD3431
P 6900 1325
F 0 "U13" H 7125 1500 60  0000 C CNN
F 1 "OPA2209" H 7225 1125 60  0000 C CNN
F 2 "SSOP_Packages:MSOP-8_3x3mm_Pitch0.65mm" H 6900 875 60  0001 L CNN
F 3 "" H 6900 1325 60  0000 C CNN
F 4 "Texas Instruments" H 6900 775 60  0001 L CNN "Manu"
F 5 "OPA2209AIDGKT" H 6900 675 60  0001 L CNN "Manu#"
F 6 "VSSOP 8-pin" H 6900 575 60  0001 L CNN "Package"
F 7 " " H 6900 475 60  0001 L CNN "Desc"
	2    6900 1325
	1    0    0    1   
$EndComp
$Comp
L OPA2209 U13
U 3 1 59BD377D
P 10100 4450
F 0 "U13" H 10325 4625 60  0000 C CNN
F 1 "OPA2209" H 10425 4250 60  0000 C CNN
F 2 "SSOP_Packages:MSOP-8_3x3mm_Pitch0.65mm" H 10100 4000 60  0001 L CNN
F 3 "" H 10100 4450 60  0000 C CNN
F 4 "Texas Instruments" H 10100 3900 60  0001 L CNN "Manu"
F 5 "OPA2209AIDGKT" H 10100 3800 60  0001 L CNN "Manu#"
F 6 "VSSOP 8-pin" H 10100 3700 60  0001 L CNN "Package"
F 7 " " H 10100 3600 60  0001 L CNN "Desc"
	3    10100 4450
	1    0    0    -1  
$EndComp
$Comp
L OPA2209 U14
U 1 1 59BD398B
P 9500 2775
F 0 "U14" H 9725 2950 60  0000 C CNN
F 1 "OPA2209" H 9825 2575 60  0000 C CNN
F 2 "SSOP_Packages:MSOP-8_3x3mm_Pitch0.65mm" H 9500 2325 60  0001 L CNN
F 3 "" H 9500 2775 60  0000 C CNN
F 4 "Texas Instruments" H 9500 2225 60  0001 L CNN "Manu"
F 5 "OPA2209AIDGKT" H 9500 2125 60  0001 L CNN "Manu#"
F 6 "VSSOP 8-pin" H 9500 2025 60  0001 L CNN "Package"
F 7 " " H 9500 1925 60  0001 L CNN "Desc"
	1    9500 2775
	1    0    0    -1  
$EndComp
$Comp
L OPA2209 U14
U 2 1 59BD3BE0
P 9500 1175
F 0 "U14" H 9725 1350 60  0000 C CNN
F 1 "OPA2209" H 9825 975 60  0000 C CNN
F 2 "SSOP_Packages:MSOP-8_3x3mm_Pitch0.65mm" H 9500 725 60  0001 L CNN
F 3 "" H 9500 1175 60  0000 C CNN
F 4 "Texas Instruments" H 9500 625 60  0001 L CNN "Manu"
F 5 "OPA2209AIDGKT" H 9500 525 60  0001 L CNN "Manu#"
F 6 "VSSOP 8-pin" H 9500 425 60  0001 L CNN "Package"
F 7 " " H 9500 325 60  0001 L CNN "Desc"
	2    9500 1175
	1    0    0    1   
$EndComp
$Comp
L OPA2209 U14
U 3 1 59BD3E3A
P 10050 5750
F 0 "U14" H 10275 5925 60  0000 C CNN
F 1 "OPA2209" H 10375 5550 60  0000 C CNN
F 2 "SSOP_Packages:MSOP-8_3x3mm_Pitch0.65mm" H 10050 5300 60  0001 L CNN
F 3 "" H 10050 5750 60  0000 C CNN
F 4 "Texas Instruments" H 10050 5200 60  0001 L CNN "Manu"
F 5 "OPA2209AIDGKT" H 10050 5100 60  0001 L CNN "Manu#"
F 6 "VSSOP 8-pin" H 10050 5000 60  0001 L CNN "Package"
F 7 " " H 10050 4900 60  0001 L CNN "Desc"
	3    10050 5750
	1    0    0    -1  
$EndComp
$EndSCHEMATC
