EESchema Schematic File Version 2
LIBS:adc_main_shield-rescue
LIBS:ruwai
LIBS:power
LIBS:device
LIBS:transistors
LIBS:conn
LIBS:linear
LIBS:regul
LIBS:74xx
LIBS:cmos4000
LIBS:adc-dac
LIBS:memory
LIBS:xilinx
LIBS:microcontrollers
LIBS:dsp
LIBS:microchip
LIBS:analog_switches
LIBS:motorola
LIBS:texas
LIBS:intel
LIBS:audio
LIBS:interface
LIBS:digital-audio
LIBS:philips
LIBS:display
LIBS:cypress
LIBS:siliconi
LIBS:opto
LIBS:atmel
LIBS:contrib
LIBS:valves
LIBS:adc_main_shield-cache
EELAYER 25 0
EELAYER END
$Descr A4 11693 8268
encoding utf-8
Sheet 2 6
Title "Ruwai ADC Main Shield"
Date "2017-09-12"
Rev "3"
Comp "Copyright Mertl Research GmbH 2014 "
Comment1 ""
Comment2 ""
Comment3 ""
Comment4 "This documentation describes Open Hardware and is licensed under the CERN OHL v. 1.2."
$EndDescr
$Comp
L inductor L36
U 1 1 546B587B
P 6150 6100
F 0 "L36" H 6150 6150 40  0000 C BNN
F 1 "22uH" H 6150 6050 40  0000 C CNN
F 2 "Ruwai:Inductor_SMD1210_reflow" H 6050 6100 60  0001 C CNN
F 3 "" H 6050 6100 60  0000 C CNN
F 4 "Bourns" H 6150 6100 60  0001 C CNN "Manu"
F 5 "CM322522-220KL" H 6150 6100 60  0001 C CNN "Manu#"
F 6 "1210" H 6150 6100 60  0001 C CNN "Package"
	1    6150 6100
	1    0    0    -1  
$EndComp
$Comp
L Capacitor C37
U 1 1 546B58F5
P 5800 6400
F 0 "C37" H 5800 6500 40  0000 L CNN
F 1 "0.1uF" H 5806 6315 40  0000 L CNN
F 2 "Ruwai:Capacitor_SMD0805_ReflowWave" H 5838 6250 30  0001 C CNN
F 3 "" H 5800 6500 60  0000 C CNN
F 4 "Murata" H 5850 6000 60  0001 L CNN "Manu"
F 5 "GCM21BR71H104KA37L" H 5850 5900 60  0001 L CNN "Manu#"
F 6 "0805" H 5850 5800 60  0001 L CNN "Package"
F 7 "Custom Description" H 5800 6050 60  0001 L CNN "Desc"
	1    5800 6400
	1    0    0    -1  
$EndComp
$Comp
L Capacitor C34
U 1 1 546B59AE
P 6500 6400
F 0 "C34" H 6500 6500 40  0000 L CNN
F 1 "1uF" H 6506 6315 40  0000 L CNN
F 2 "Ruwai:Capacitor_SMD0805_ReflowWave" H 6538 6250 30  0001 C CNN
F 3 "" H 6500 6500 60  0000 C CNN
F 4 "Murata" H 6550 6000 60  0001 L CNN "Manu"
F 5 "GRM21BR71H105KA12L" H 6550 5900 60  0001 L CNN "Manu#"
F 6 "0805" H 6550 5800 60  0001 L CNN "Package"
F 7 "Custom Description" H 6500 6050 60  0001 L CNN "Desc"
	1    6500 6400
	1    0    0    -1  
$EndComp
$Comp
L SN74LVC1T45 U7
U 1 1 546B59E4
P 2950 1050
F 0 "U7" H 2650 750 60  0000 C CNN
F 1 "SN74LVC1T45" H 2900 1400 60  0000 C CNN
F 2 "Ruwai:SOT23-6" H 3350 750 60  0001 C CNN
F 3 "" H 2950 800 60  0000 C CNN
F 4 "Texas Instruments" H 2950 350 60  0001 L CNN "Manu"
F 5 "SN74LVC1T45DBVT" H 2950 250 60  0001 L CNN "Manu#"
F 6 "SOT23 6-pin" H 2950 150 60  0001 L CNN "Package"
F 7 "Single-Bit Dual-Supply Bus Transceiver with Configurable Voltage Translation and 3-State Outputs" H 2950 50  60  0001 L CNN "Desc"
	1    2950 1050
	1    0    0    -1  
$EndComp
Wire Wire Line
	5450 6100 5950 6100
Wire Wire Line
	5800 6100 5800 6200
Wire Wire Line
	6350 6100 6850 6100
Wire Wire Line
	6500 6100 6500 6200
Connection ~ 6500 6100
Connection ~ 5800 6100
$Comp
L GND-RESCUE-adc_main_shield #PWR01
U 1 1 546A0858
P 5800 6700
F 0 "#PWR01" H 5800 6700 30  0001 C CNN
F 1 "GND" H 5800 6630 30  0001 C CNN
F 2 "" H 5800 6700 60  0000 C CNN
F 3 "" H 5800 6700 60  0000 C CNN
	1    5800 6700
	1    0    0    -1  
$EndComp
$Comp
L GND-RESCUE-adc_main_shield #PWR02
U 1 1 546A0872
P 6500 6700
F 0 "#PWR02" H 6500 6700 30  0001 C CNN
F 1 "GND" H 6500 6630 30  0001 C CNN
F 2 "" H 6500 6700 60  0000 C CNN
F 3 "" H 6500 6700 60  0000 C CNN
	1    6500 6700
	1    0    0    -1  
$EndComp
Wire Wire Line
	5800 6700 5800 6600
Wire Wire Line
	6500 6600 6500 6700
Text HLabel 5450 6100 0    60   Input ~ 0
3.3V_P
Text Label 6850 6100 0    60   ~ 0
3.3V_IO
Wire Wire Line
	2300 850  1350 850 
Wire Wire Line
	2300 1000 1350 1000
$Comp
L GND-RESCUE-adc_main_shield #PWR03
U 1 1 546A0C50
P 2950 1800
F 0 "#PWR03" H 2950 1800 30  0001 C CNN
F 1 "GND" H 2950 1730 30  0001 C CNN
F 2 "" H 2950 1800 60  0000 C CNN
F 3 "" H 2950 1800 60  0000 C CNN
	1    2950 1800
	1    0    0    -1  
$EndComp
Wire Wire Line
	2950 1600 2950 1800
Wire Wire Line
	2300 1200 2150 1200
Wire Wire Line
	2150 1200 2150 1700
Wire Wire Line
	2150 1700 2950 1700
Connection ~ 2950 1700
Wire Wire Line
	3600 850  4450 850 
$Comp
L Resistor R29
U 1 1 546A0CA5
P 4000 1000
F 0 "R29" V 4080 1000 40  0000 C CNN
F 1 "47" V 4007 1001 40  0000 C CNN
F 2 "Ruwai:Resistor_SMD0805_ReflowWave" V 3930 1000 30  0001 C CNN
F 3 "" V 4080 1000 30  0000 C CNN
F 4 "Yageo" H 4000 500 60  0001 L CNN "Manu"
F 5 "RC0805FR-0747RL" H 4000 400 60  0001 L CNN "Manu#"
F 6 "0805" H 4000 300 60  0001 L CNN "Package"
F 7 "Custom Description" H 4000 200 60  0001 L CNN "Desc"
	1    4000 1000
	0    1    1    0   
$EndComp
Wire Wire Line
	3600 1000 3750 1000
Wire Wire Line
	4250 1000 4450 1000
Text Label 1350 850  2    60   ~ 0
3.3V_IO
$Comp
L SN74LVC1T45 U6
U 1 1 546A0EB8
P 2950 2450
F 0 "U6" H 2650 2150 60  0000 C CNN
F 1 "SN74LVC1T45" H 2900 2800 60  0000 C CNN
F 2 "Ruwai:SOT23-6" H 3350 2150 60  0001 C CNN
F 3 "" H 2950 2200 60  0000 C CNN
F 4 "Texas Instruments" H 2950 1750 60  0001 L CNN "Manu"
F 5 "SN74LVC1T45DBVT" H 2950 1650 60  0001 L CNN "Manu#"
F 6 "SOT23 6-pin" H 2950 1550 60  0001 L CNN "Package"
F 7 "Single-Bit Dual-Supply Bus Transceiver with Configurable Voltage Translation and 3-State Outputs" H 2950 1450 60  0001 L CNN "Desc"
	1    2950 2450
	1    0    0    -1  
$EndComp
Wire Wire Line
	1350 2250 2300 2250
Wire Wire Line
	2300 2400 1350 2400
$Comp
L GND-RESCUE-adc_main_shield #PWR04
U 1 1 546A0EC0
P 2950 3250
F 0 "#PWR04" H 2950 3250 30  0001 C CNN
F 1 "GND" H 2950 3180 30  0001 C CNN
F 2 "" H 2950 3250 60  0000 C CNN
F 3 "" H 2950 3250 60  0000 C CNN
	1    2950 3250
	1    0    0    -1  
$EndComp
Wire Wire Line
	2950 3000 2950 3250
Wire Wire Line
	3600 2250 4450 2250
$Comp
L Resistor R26
U 1 1 546A0ED0
P 4000 2400
F 0 "R26" V 4080 2400 40  0000 C CNN
F 1 "47" V 4007 2401 40  0000 C CNN
F 2 "Ruwai:Resistor_SMD0805_ReflowWave" V 3930 2400 30  0001 C CNN
F 3 "" V 4080 2400 30  0000 C CNN
F 4 "Yageo" H 4000 1900 60  0001 L CNN "Manu"
F 5 "RC0805FR-0747RL" H 4000 1800 60  0001 L CNN "Manu#"
F 6 "0805" H 4000 1700 60  0001 L CNN "Package"
F 7 "Custom Description" H 4000 1600 60  0001 L CNN "Desc"
	1    4000 2400
	0    1    1    0   
$EndComp
Wire Wire Line
	3600 2400 3750 2400
Wire Wire Line
	4250 2400 4450 2400
Text Label 1350 2250 2    60   ~ 0
3.3V_IO
$Comp
L Capacitor C39
U 1 1 546A0F40
P 1550 2950
F 0 "C39" H 1550 3050 40  0000 L CNN
F 1 "0.1uF" H 1556 2865 40  0000 L CNN
F 2 "Ruwai:Capacitor_SMD0805_ReflowWave" H 1588 2800 30  0001 C CNN
F 3 "" H 1550 3050 60  0000 C CNN
F 4 "Murata" H 1600 2550 60  0001 L CNN "Manu"
F 5 "GCM21BR71H104KA37L" H 1600 2450 60  0001 L CNN "Manu#"
F 6 "0805" H 1600 2350 60  0001 L CNN "Package"
F 7 "Custom Description" H 1550 2600 60  0001 L CNN "Desc"
	1    1550 2950
	1    0    0    -1  
$EndComp
$Comp
L Capacitor C45
U 1 1 546A0FC3
P 4350 2950
F 0 "C45" H 4350 3050 40  0000 L CNN
F 1 "0.1uF" H 4356 2865 40  0000 L CNN
F 2 "Ruwai:Capacitor_SMD0805_ReflowWave" H 4388 2800 30  0001 C CNN
F 3 "" H 4350 3050 60  0000 C CNN
F 4 "Murata" H 4400 2550 60  0001 L CNN "Manu"
F 5 "GCM21BR71H104KA37L" H 4400 2450 60  0001 L CNN "Manu#"
F 6 "0805" H 4400 2350 60  0001 L CNN "Package"
F 7 "Custom Description" H 4350 2600 60  0001 L CNN "Desc"
	1    4350 2950
	1    0    0    -1  
$EndComp
$Comp
L Resistor R24
U 1 1 546A1033
P 1900 2600
F 0 "R24" V 1980 2600 40  0000 C CNN
F 1 "3.9k" V 1907 2601 40  0000 C CNN
F 2 "Ruwai:Resistor_SMD0805_ReflowWave" V 1830 2600 30  0001 C CNN
F 3 "" V 1980 2600 30  0000 C CNN
F 4 "Yageo" H 1900 2100 60  0001 L CNN "Manu"
F 5 "RC0805FR-073K9L" H 1900 2000 60  0001 L CNN "Manu#"
F 6 "0805" H 1900 1900 60  0001 L CNN "Package"
F 7 "Custom Description" H 1900 1800 60  0001 L CNN "Desc"
	1    1900 2600
	0    1    1    0   
$EndComp
Wire Wire Line
	1650 2600 1550 2600
Wire Wire Line
	1550 2250 1550 2750
Connection ~ 1550 2250
Wire Wire Line
	2150 2600 2300 2600
Connection ~ 1550 2600
$Comp
L GND-RESCUE-adc_main_shield #PWR05
U 1 1 546A1217
P 1550 3250
F 0 "#PWR05" H 1550 3250 30  0001 C CNN
F 1 "GND" H 1550 3180 30  0001 C CNN
F 2 "" H 1550 3250 60  0000 C CNN
F 3 "" H 1550 3250 60  0000 C CNN
	1    1550 3250
	1    0    0    -1  
$EndComp
Wire Wire Line
	1550 3150 1550 3250
$Comp
L GND-RESCUE-adc_main_shield #PWR06
U 1 1 546A128E
P 4350 3250
F 0 "#PWR06" H 4350 3250 30  0001 C CNN
F 1 "GND" H 4350 3180 30  0001 C CNN
F 2 "" H 4350 3250 60  0000 C CNN
F 3 "" H 4350 3250 60  0000 C CNN
	1    4350 3250
	1    0    0    -1  
$EndComp
Wire Wire Line
	4350 2750 4350 2250
Connection ~ 4350 2250
Wire Wire Line
	4350 3150 4350 3250
$Comp
L SN74LVC1T45 U11
U 1 1 546A171E
P 2950 3850
F 0 "U11" H 2650 3550 60  0000 C CNN
F 1 "SN74LVC1T45" H 2900 4200 60  0000 C CNN
F 2 "Ruwai:SOT23-6" H 3350 3550 60  0001 C CNN
F 3 "" H 2950 3600 60  0000 C CNN
F 4 "Texas Instruments" H 2950 3150 60  0001 L CNN "Manu"
F 5 "SN74LVC1T45DBVT" H 2950 3050 60  0001 L CNN "Manu#"
F 6 "SOT23 6-pin" H 2950 2950 60  0001 L CNN "Package"
F 7 "Single-Bit Dual-Supply Bus Transceiver with Configurable Voltage Translation and 3-State Outputs" H 2950 2850 60  0001 L CNN "Desc"
	1    2950 3850
	1    0    0    -1  
$EndComp
Wire Wire Line
	1350 3650 2300 3650
Wire Wire Line
	2300 3800 1350 3800
$Comp
L GND-RESCUE-adc_main_shield #PWR07
U 1 1 546A1726
P 2950 4600
F 0 "#PWR07" H 2950 4600 30  0001 C CNN
F 1 "GND" H 2950 4530 30  0001 C CNN
F 2 "" H 2950 4600 60  0000 C CNN
F 3 "" H 2950 4600 60  0000 C CNN
	1    2950 4600
	1    0    0    -1  
$EndComp
Wire Wire Line
	2950 4400 2950 4600
Wire Wire Line
	2300 4000 2150 4000
Wire Wire Line
	2150 4000 2150 4500
Wire Wire Line
	2150 4500 2950 4500
Connection ~ 2950 4500
Wire Wire Line
	3600 3650 4450 3650
$Comp
L Resistor R30
U 1 1 546A1737
P 4000 3800
F 0 "R30" V 4080 3800 40  0000 C CNN
F 1 "47" V 4007 3801 40  0000 C CNN
F 2 "Ruwai:Resistor_SMD0805_ReflowWave" V 3930 3800 30  0001 C CNN
F 3 "" V 4080 3800 30  0000 C CNN
F 4 "Yageo" H 4000 3300 60  0001 L CNN "Manu"
F 5 "RC0805FR-0747RL" H 4000 3200 60  0001 L CNN "Manu#"
F 6 "0805" H 4000 3100 60  0001 L CNN "Package"
F 7 "Custom Description" H 4000 3000 60  0001 L CNN "Desc"
	1    4000 3800
	0    1    1    0   
$EndComp
Wire Wire Line
	3600 3800 3750 3800
Wire Wire Line
	4250 3800 4450 3800
Text Label 1350 3650 2    60   ~ 0
3.3V_IO
$Comp
L Capacitor C40
U 1 1 546A17C5
P 1550 4250
F 0 "C40" H 1550 4350 40  0000 L CNN
F 1 "0.1uF" H 1556 4165 40  0000 L CNN
F 2 "Ruwai:Capacitor_SMD0805_ReflowWave" H 1588 4100 30  0001 C CNN
F 3 "" H 1550 4350 60  0000 C CNN
F 4 "Murata" H 1600 3850 60  0001 L CNN "Manu"
F 5 "GCM21BR71H104KA37L" H 1600 3750 60  0001 L CNN "Manu#"
F 6 "0805" H 1600 3650 60  0001 L CNN "Package"
F 7 "Custom Description" H 1550 3900 60  0001 L CNN "Desc"
	1    1550 4250
	1    0    0    -1  
$EndComp
$Comp
L GND-RESCUE-adc_main_shield #PWR08
U 1 1 546A1840
P 1550 4600
F 0 "#PWR08" H 1550 4600 30  0001 C CNN
F 1 "GND" H 1550 4530 30  0001 C CNN
F 2 "" H 1550 4600 60  0000 C CNN
F 3 "" H 1550 4600 60  0000 C CNN
	1    1550 4600
	1    0    0    -1  
$EndComp
Wire Wire Line
	1550 4050 1550 3650
Connection ~ 1550 3650
Wire Wire Line
	1550 4450 1550 4600
$Comp
L SN74LVC1T45 U12
U 1 1 546A1B89
P 2950 5300
F 0 "U12" H 2650 5000 60  0000 C CNN
F 1 "SN74LVC1T45" H 2900 5650 60  0000 C CNN
F 2 "Ruwai:SOT23-6" H 3350 5000 60  0001 C CNN
F 3 "" H 2950 5050 60  0000 C CNN
F 4 "Texas Instruments" H 2950 4600 60  0001 L CNN "Manu"
F 5 "SN74LVC1T45DBVT" H 2950 4500 60  0001 L CNN "Manu#"
F 6 "SOT23 6-pin" H 2950 4400 60  0001 L CNN "Package"
F 7 "Single-Bit Dual-Supply Bus Transceiver with Configurable Voltage Translation and 3-State Outputs" H 2950 4300 60  0001 L CNN "Desc"
	1    2950 5300
	1    0    0    -1  
$EndComp
Wire Wire Line
	2300 5100 1350 5100
Wire Wire Line
	2300 5250 1350 5250
$Comp
L GND-RESCUE-adc_main_shield #PWR09
U 1 1 546A1B91
P 2950 6050
F 0 "#PWR09" H 2950 6050 30  0001 C CNN
F 1 "GND" H 2950 5980 30  0001 C CNN
F 2 "" H 2950 6050 60  0000 C CNN
F 3 "" H 2950 6050 60  0000 C CNN
	1    2950 6050
	1    0    0    -1  
$EndComp
Wire Wire Line
	2950 5850 2950 6050
Wire Wire Line
	2300 5450 2150 5450
Wire Wire Line
	2150 5450 2150 5950
Wire Wire Line
	2150 5950 2950 5950
Connection ~ 2950 5950
Wire Wire Line
	3600 5100 4450 5100
$Comp
L Resistor R28
U 1 1 546A1BA1
P 4000 5250
F 0 "R28" V 4080 5250 40  0000 C CNN
F 1 "47" V 4007 5251 40  0000 C CNN
F 2 "Ruwai:Resistor_SMD0805_ReflowWave" V 3930 5250 30  0001 C CNN
F 3 "" V 4080 5250 30  0000 C CNN
F 4 "Yageo" H 4000 4750 60  0001 L CNN "Manu"
F 5 "RC0805FR-0747RL" H 4000 4650 60  0001 L CNN "Manu#"
F 6 "0805" H 4000 4550 60  0001 L CNN "Package"
F 7 "Custom Description" H 4000 4450 60  0001 L CNN "Desc"
	1    4000 5250
	0    1    1    0   
$EndComp
Wire Wire Line
	3600 5250 3750 5250
Wire Wire Line
	4250 5250 4450 5250
Text Label 1350 5100 2    60   ~ 0
3.3V_IO
$Comp
L SN74LVC1T45 U13
U 1 1 546A261F
P 2950 6800
F 0 "U13" H 2650 6500 60  0000 C CNN
F 1 "SN74LVC1T45" H 2900 7150 60  0000 C CNN
F 2 "Ruwai:SOT23-6" H 3350 6500 60  0001 C CNN
F 3 "" H 2950 6550 60  0000 C CNN
F 4 "Texas Instruments" H 2950 6100 60  0001 L CNN "Manu"
F 5 "SN74LVC1T45DBVT" H 2950 6000 60  0001 L CNN "Manu#"
F 6 "SOT23 6-pin" H 2950 5900 60  0001 L CNN "Package"
F 7 "Single-Bit Dual-Supply Bus Transceiver with Configurable Voltage Translation and 3-State Outputs" H 2950 5800 60  0001 L CNN "Desc"
	1    2950 6800
	1    0    0    -1  
$EndComp
Wire Wire Line
	1350 6600 2300 6600
Wire Wire Line
	2300 6750 1350 6750
$Comp
L GND-RESCUE-adc_main_shield #PWR010
U 1 1 546A2627
P 2950 7600
F 0 "#PWR010" H 2950 7600 30  0001 C CNN
F 1 "GND" H 2950 7530 30  0001 C CNN
F 2 "" H 2950 7600 60  0000 C CNN
F 3 "" H 2950 7600 60  0000 C CNN
	1    2950 7600
	1    0    0    -1  
$EndComp
Wire Wire Line
	2950 7350 2950 7600
Wire Wire Line
	3600 6600 4450 6600
$Comp
L Resistor R27
U 1 1 546A2633
P 4000 6750
F 0 "R27" V 4080 6750 40  0000 C CNN
F 1 "47" V 4007 6751 40  0000 C CNN
F 2 "Ruwai:Resistor_SMD0805_ReflowWave" V 3930 6750 30  0001 C CNN
F 3 "" V 4080 6750 30  0000 C CNN
F 4 "Yageo" H 4000 6250 60  0001 L CNN "Manu"
F 5 "RC0805FR-0747RL" H 4000 6150 60  0001 L CNN "Manu#"
F 6 "0805" H 4000 6050 60  0001 L CNN "Package"
F 7 "Custom Description" H 4000 5950 60  0001 L CNN "Desc"
	1    4000 6750
	0    1    1    0   
$EndComp
Wire Wire Line
	3600 6750 3750 6750
Wire Wire Line
	4250 6750 4450 6750
Text Label 1350 6600 2    60   ~ 0
3.3V_IO
$Comp
L Capacitor C38
U 1 1 546A2643
P 1550 7300
F 0 "C38" H 1550 7400 40  0000 L CNN
F 1 "0.1uF" H 1556 7215 40  0000 L CNN
F 2 "Ruwai:Capacitor_SMD0805_ReflowWave" H 1588 7150 30  0001 C CNN
F 3 "" H 1550 7400 60  0000 C CNN
F 4 "Murata" H 1600 6900 60  0001 L CNN "Manu"
F 5 "GCM21BR71H104KA37L" H 1600 6800 60  0001 L CNN "Manu#"
F 6 "0805" H 1600 6700 60  0001 L CNN "Package"
F 7 "Custom Description" H 1550 6950 60  0001 L CNN "Desc"
	1    1550 7300
	1    0    0    -1  
$EndComp
$Comp
L Capacitor C43
U 1 1 546A264D
P 4350 7300
F 0 "C43" H 4350 7400 40  0000 L CNN
F 1 "0.1uF" H 4356 7215 40  0000 L CNN
F 2 "Ruwai:Capacitor_SMD0805_ReflowWave" H 4388 7150 30  0001 C CNN
F 3 "" H 4350 7400 60  0000 C CNN
F 4 "Murata" H 4400 6900 60  0001 L CNN "Manu"
F 5 "GCM21BR71H104KA37L" H 4400 6800 60  0001 L CNN "Manu#"
F 6 "0805" H 4400 6700 60  0001 L CNN "Package"
F 7 "Custom Description" H 4350 6950 60  0001 L CNN "Desc"
	1    4350 7300
	1    0    0    -1  
$EndComp
Wire Wire Line
	1550 6600 1550 7100
Connection ~ 1550 6600
Wire Wire Line
	2150 6950 2300 6950
$Comp
L GND-RESCUE-adc_main_shield #PWR011
U 1 1 546A2662
P 1550 7600
F 0 "#PWR011" H 1550 7600 30  0001 C CNN
F 1 "GND" H 1550 7530 30  0001 C CNN
F 2 "" H 1550 7600 60  0000 C CNN
F 3 "" H 1550 7600 60  0000 C CNN
	1    1550 7600
	1    0    0    -1  
$EndComp
Wire Wire Line
	1550 7500 1550 7600
$Comp
L GND-RESCUE-adc_main_shield #PWR012
U 1 1 546A2669
P 4350 7600
F 0 "#PWR012" H 4350 7600 30  0001 C CNN
F 1 "GND" H 4350 7530 30  0001 C CNN
F 2 "" H 4350 7600 60  0000 C CNN
F 3 "" H 4350 7600 60  0000 C CNN
	1    4350 7600
	1    0    0    -1  
$EndComp
Wire Wire Line
	4350 7100 4350 6600
Connection ~ 4350 6600
Wire Wire Line
	4350 7500 4350 7600
Wire Wire Line
	2150 6950 2150 7450
Wire Wire Line
	2150 7450 2950 7450
Connection ~ 2950 7450
$Comp
L SN74LVC1T45 U14
U 1 1 546A32E7
P 8700 1050
F 0 "U14" H 8400 750 60  0000 C CNN
F 1 "SN74LVC1T45" H 8650 1400 60  0000 C CNN
F 2 "Ruwai:SOT23-6" H 9100 750 60  0001 C CNN
F 3 "" H 8700 800 60  0000 C CNN
F 4 "Texas Instruments" H 8700 350 60  0001 L CNN "Manu"
F 5 "SN74LVC1T45DBVT" H 8700 250 60  0001 L CNN "Manu#"
F 6 "SOT23 6-pin" H 8700 150 60  0001 L CNN "Package"
F 7 "Single-Bit Dual-Supply Bus Transceiver with Configurable Voltage Translation and 3-State Outputs" H 8700 50  60  0001 L CNN "Desc"
	1    8700 1050
	1    0    0    -1  
$EndComp
Wire Wire Line
	7100 850  8050 850 
Wire Wire Line
	8050 1000 7100 1000
$Comp
L GND-RESCUE-adc_main_shield #PWR013
U 1 1 546A32EF
P 8700 1850
F 0 "#PWR013" H 8700 1850 30  0001 C CNN
F 1 "GND" H 8700 1780 30  0001 C CNN
F 2 "" H 8700 1850 60  0000 C CNN
F 3 "" H 8700 1850 60  0000 C CNN
	1    8700 1850
	1    0    0    -1  
$EndComp
Wire Wire Line
	8700 1600 8700 1850
Wire Wire Line
	9350 850  10200 850 
$Comp
L Resistor R32
U 1 1 546A32FB
P 9750 1000
F 0 "R32" V 9830 1000 40  0000 C CNN
F 1 "47" V 9757 1001 40  0000 C CNN
F 2 "Ruwai:Resistor_SMD0805_ReflowWave" V 9680 1000 30  0001 C CNN
F 3 "" V 9830 1000 30  0000 C CNN
F 4 "Yageo" H 9750 500 60  0001 L CNN "Manu"
F 5 "RC0805FR-0747RL" H 9750 400 60  0001 L CNN "Manu#"
F 6 "0805" H 9750 300 60  0001 L CNN "Package"
F 7 "Custom Description" H 9750 200 60  0001 L CNN "Desc"
	1    9750 1000
	0    1    1    0   
$EndComp
Wire Wire Line
	9350 1000 9500 1000
Wire Wire Line
	10000 1000 10200 1000
Text Label 7100 850  2    60   ~ 0
3.3V_IO
$Comp
L Capacitor C41
U 1 1 546A330B
P 7300 1550
F 0 "C41" H 7300 1650 40  0000 L CNN
F 1 "0.1uF" H 7306 1465 40  0000 L CNN
F 2 "Ruwai:Capacitor_SMD0805_ReflowWave" H 7338 1400 30  0001 C CNN
F 3 "" H 7300 1650 60  0000 C CNN
F 4 "Murata" H 7350 1150 60  0001 L CNN "Manu"
F 5 "GCM21BR71H104KA37L" H 7350 1050 60  0001 L CNN "Manu#"
F 6 "0805" H 7350 950 60  0001 L CNN "Package"
F 7 "Custom Description" H 7300 1200 60  0001 L CNN "Desc"
	1    7300 1550
	1    0    0    -1  
$EndComp
$Comp
L Resistor R25
U 1 1 546A331F
P 7650 1200
F 0 "R25" V 7730 1200 40  0000 C CNN
F 1 "3.9k" V 7657 1201 40  0000 C CNN
F 2 "Ruwai:Resistor_SMD0805_ReflowWave" V 7647 1200 10  0001 C CNN
F 3 "" V 7730 1200 30  0000 C CNN
F 4 "Yageo" H 7650 700 60  0001 L CNN "Manu"
F 5 "RC0805FR-073K9L" H 7650 600 60  0001 L CNN "Manu#"
F 6 "0805" H 7650 500 60  0001 L CNN "Package"
F 7 "Custom Description" H 7650 400 60  0001 L CNN "Desc"
	1    7650 1200
	0    1    1    0   
$EndComp
Wire Wire Line
	7400 1200 7300 1200
Wire Wire Line
	7300 850  7300 1350
Connection ~ 7300 850 
Wire Wire Line
	7900 1200 8050 1200
Connection ~ 7300 1200
$Comp
L GND-RESCUE-adc_main_shield #PWR014
U 1 1 546A332A
P 7300 1850
F 0 "#PWR014" H 7300 1850 30  0001 C CNN
F 1 "GND" H 7300 1780 30  0001 C CNN
F 2 "" H 7300 1850 60  0000 C CNN
F 3 "" H 7300 1850 60  0000 C CNN
	1    7300 1850
	1    0    0    -1  
$EndComp
Wire Wire Line
	7300 1750 7300 1850
$Comp
L SN74LVC1T45 U16
U 1 1 546A3FA2
P 8700 3850
F 0 "U16" H 8400 3550 60  0000 C CNN
F 1 "SN74LVC1T45" H 8650 4200 60  0000 C CNN
F 2 "Ruwai:SOT23-6" H 9100 3550 60  0001 C CNN
F 3 "" H 8700 3600 60  0000 C CNN
F 4 "Texas Instruments" H 8700 3150 60  0001 L CNN "Manu"
F 5 "SN74LVC1T45DBVT" H 8700 3050 60  0001 L CNN "Manu#"
F 6 "SOT23 6-pin" H 8700 2950 60  0001 L CNN "Package"
F 7 "Single-Bit Dual-Supply Bus Transceiver with Configurable Voltage Translation and 3-State Outputs" H 8700 2850 60  0001 L CNN "Desc"
	1    8700 3850
	1    0    0    -1  
$EndComp
Wire Wire Line
	8050 3650 7100 3650
Wire Wire Line
	8050 3800 7100 3800
$Comp
L GND-RESCUE-adc_main_shield #PWR015
U 1 1 546A3FAA
P 8700 4600
F 0 "#PWR015" H 8700 4600 30  0001 C CNN
F 1 "GND" H 8700 4530 30  0001 C CNN
F 2 "" H 8700 4600 60  0000 C CNN
F 3 "" H 8700 4600 60  0000 C CNN
	1    8700 4600
	1    0    0    -1  
$EndComp
Wire Wire Line
	8700 4400 8700 4600
Wire Wire Line
	8050 4000 7900 4000
Wire Wire Line
	7900 4000 7900 4500
Wire Wire Line
	7900 4500 8700 4500
Connection ~ 8700 4500
Wire Wire Line
	9350 3650 10200 3650
$Comp
L Resistor R31
U 1 1 546A3FBA
P 9750 3800
F 0 "R31" V 9830 3800 40  0000 C CNN
F 1 "47" V 9757 3801 40  0000 C CNN
F 2 "Ruwai:Resistor_SMD0805_ReflowWave" V 9680 3800 30  0001 C CNN
F 3 "" V 9830 3800 30  0000 C CNN
F 4 "Yageo" H 9750 3300 60  0001 L CNN "Manu"
F 5 "RC0805FR-0747RL" H 9750 3200 60  0001 L CNN "Manu#"
F 6 "0805" H 9750 3100 60  0001 L CNN "Package"
F 7 "Custom Description" H 9750 3000 60  0001 L CNN "Desc"
	1    9750 3800
	0    1    1    0   
$EndComp
Wire Wire Line
	9350 3800 9500 3800
Wire Wire Line
	10000 3800 10200 3800
Text Label 7100 3650 2    60   ~ 0
3.3V_IO
$Comp
L Capacitor C42
U 1 1 546A3FCA
P 10100 4250
F 0 "C42" H 10100 4350 40  0000 L CNN
F 1 "0.1uF" H 10106 4165 40  0000 L CNN
F 2 "Ruwai:Capacitor_SMD0805_ReflowWave" H 10138 4100 30  0001 C CNN
F 3 "" H 10100 4350 60  0000 C CNN
F 4 "Murata" H 10150 3850 60  0001 L CNN "Manu"
F 5 "GCM21BR71H104KA37L" H 10150 3750 60  0001 L CNN "Manu#"
F 6 "0805" H 10150 3650 60  0001 L CNN "Package"
F 7 "Custom Description" H 10100 3900 60  0001 L CNN "Desc"
	1    10100 4250
	1    0    0    -1  
$EndComp
$Comp
L GND-RESCUE-adc_main_shield #PWR016
U 1 1 546A3FD0
P 10100 4600
F 0 "#PWR016" H 10100 4600 30  0001 C CNN
F 1 "GND" H 10100 4530 30  0001 C CNN
F 2 "" H 10100 4600 60  0000 C CNN
F 3 "" H 10100 4600 60  0000 C CNN
	1    10100 4600
	1    0    0    -1  
$EndComp
Wire Wire Line
	10100 4450 10100 4600
Wire Wire Line
	10100 4050 10100 3650
Connection ~ 10100 3650
$Comp
L SN74LVC1T45 U15
U 1 1 546A464B
P 8700 2400
F 0 "U15" H 8400 2100 60  0000 C CNN
F 1 "SN74LVC1T45" H 8650 2750 60  0000 C CNN
F 2 "Ruwai:SOT23-6" H 9100 2100 60  0001 C CNN
F 3 "" H 8700 2150 60  0000 C CNN
F 4 "Texas Instruments" H 8700 1700 60  0001 L CNN "Manu"
F 5 "SN74LVC1T45DBVT" H 8700 1600 60  0001 L CNN "Manu#"
F 6 "SOT23 6-pin" H 8700 1500 60  0001 L CNN "Package"
F 7 "Single-Bit Dual-Supply Bus Transceiver with Configurable Voltage Translation and 3-State Outputs" H 8700 1400 60  0001 L CNN "Desc"
	1    8700 2400
	1    0    0    -1  
$EndComp
Wire Wire Line
	8050 2200 7100 2200
Wire Wire Line
	8050 2350 7100 2350
$Comp
L GND-RESCUE-adc_main_shield #PWR017
U 1 1 546A4653
P 8700 3150
F 0 "#PWR017" H 8700 3150 30  0001 C CNN
F 1 "GND" H 8700 3080 30  0001 C CNN
F 2 "" H 8700 3150 60  0000 C CNN
F 3 "" H 8700 3150 60  0000 C CNN
	1    8700 3150
	1    0    0    -1  
$EndComp
Wire Wire Line
	8700 2950 8700 3150
Wire Wire Line
	8050 2550 7900 2550
Wire Wire Line
	7900 2550 7900 3050
Wire Wire Line
	7900 3050 8700 3050
Connection ~ 8700 3050
Wire Wire Line
	9350 2200 10200 2200
$Comp
L Resistor R33
U 1 1 546A4663
P 9750 2350
F 0 "R33" V 9830 2350 40  0000 C CNN
F 1 "47" V 9757 2351 40  0000 C CNN
F 2 "Ruwai:Resistor_SMD0805_ReflowWave" V 9680 2350 30  0001 C CNN
F 3 "" V 9830 2350 30  0000 C CNN
F 4 "Yageo" H 9750 1850 60  0001 L CNN "Manu"
F 5 "RC0805FR-0747RL" H 9750 1750 60  0001 L CNN "Manu#"
F 6 "0805" H 9750 1650 60  0001 L CNN "Package"
F 7 "Custom Description" H 9750 1550 60  0001 L CNN "Desc"
	1    9750 2350
	0    1    1    0   
$EndComp
Wire Wire Line
	9350 2350 9500 2350
Wire Wire Line
	10000 2350 10200 2350
Text Label 7100 2200 2    60   ~ 0
3.3V_IO
$Comp
L Capacitor C44
U 1 1 546A4673
P 10100 2800
F 0 "C44" H 10100 2900 40  0000 L CNN
F 1 "0.1uF" H 10106 2715 40  0000 L CNN
F 2 "Ruwai:Capacitor_SMD0805_ReflowWave" H 10138 2650 30  0001 C CNN
F 3 "" H 10100 2900 60  0000 C CNN
F 4 "Murata" H 10150 2400 60  0001 L CNN "Manu"
F 5 "GCM21BR71H104KA37L" H 10150 2300 60  0001 L CNN "Manu#"
F 6 "0805" H 10150 2200 60  0001 L CNN "Package"
F 7 "Custom Description" H 10100 2450 60  0001 L CNN "Desc"
	1    10100 2800
	1    0    0    -1  
$EndComp
$Comp
L GND-RESCUE-adc_main_shield #PWR018
U 1 1 546A4679
P 10100 3150
F 0 "#PWR018" H 10100 3150 30  0001 C CNN
F 1 "GND" H 10100 3080 30  0001 C CNN
F 2 "" H 10100 3150 60  0000 C CNN
F 3 "" H 10100 3150 60  0000 C CNN
	1    10100 3150
	1    0    0    -1  
$EndComp
Wire Wire Line
	10100 3000 10100 3150
Wire Wire Line
	10100 2600 10100 2200
Connection ~ 10100 2200
$Comp
L TCA9406 U10
U 1 1 546A5101
P 9000 5800
F 0 "U10" H 8550 5650 60  0000 C CNN
F 1 "TCA9406" H 8700 6400 60  0000 C CNN
F 2 "Ruwai:SSOP8" H 9350 5650 60  0001 C CNN
F 3 "" H 8550 5650 60  0000 C CNN
F 4 "Texas Instruments" H 9000 5300 60  0001 L CNN "Manu"
F 5 "TCA9406DCTR" H 9000 5200 60  0001 L CNN "Manu#"
F 6 "SSOP 8-pin" H 9000 5100 60  0001 L CNN "Package"
F 7 "Dual Bidirectional 1-MHz I2C-BUS and SMBus Voltage Level-Translator" H 9000 5000 60  0001 L CNN "Desc"
	1    9000 5800
	1    0    0    -1  
$EndComp
$Comp
L GND-RESCUE-adc_main_shield #PWR019
U 1 1 546A5240
P 9000 6400
F 0 "#PWR019" H 9000 6400 30  0001 C CNN
F 1 "GND" H 9000 6330 30  0001 C CNN
F 2 "" H 9000 6400 60  0000 C CNN
F 3 "" H 9000 6400 60  0000 C CNN
	1    9000 6400
	1    0    0    -1  
$EndComp
Wire Wire Line
	9000 6400 9000 6200
Wire Wire Line
	8200 5600 7700 5600
Wire Wire Line
	8200 5750 7700 5750
Wire Wire Line
	9800 5600 10250 5600
Wire Wire Line
	9800 5750 10250 5750
$Comp
L Capacitor C35
U 1 1 546A57D6
P 10000 6100
F 0 "C35" H 10000 6200 40  0000 L CNN
F 1 "0.1uF" H 10006 6015 40  0000 L CNN
F 2 "Ruwai:Capacitor_SMD0805_ReflowWave" H 10038 5950 30  0001 C CNN
F 3 "" H 10000 6200 60  0000 C CNN
F 4 "Murata" H 10050 5700 60  0001 L CNN "Manu"
F 5 "GCM21BR71H104KA37L" H 10050 5600 60  0001 L CNN "Manu#"
F 6 "0805" H 10050 5500 60  0001 L CNN "Package"
F 7 "Custom Description" H 10000 5750 60  0001 L CNN "Desc"
	1    10000 6100
	1    0    0    -1  
$EndComp
$Comp
L Capacitor C36
U 1 1 546A585D
P 7950 6100
F 0 "C36" H 7950 6200 40  0000 L CNN
F 1 "0.1uF" H 7956 6015 40  0000 L CNN
F 2 "Ruwai:Capacitor_SMD0805_ReflowWave" H 7988 5950 30  0001 C CNN
F 3 "" H 7950 6200 60  0000 C CNN
F 4 "Murata" H 8000 5700 60  0001 L CNN "Manu"
F 5 "GCM21BR71H104KA37L" H 8000 5600 60  0001 L CNN "Manu#"
F 6 "0805" H 8000 5500 60  0001 L CNN "Package"
F 7 "Custom Description" H 7950 5750 60  0001 L CNN "Desc"
	1    7950 6100
	1    0    0    -1  
$EndComp
Wire Wire Line
	7700 5450 8200 5450
Wire Wire Line
	7950 4850 7950 5900
Connection ~ 7950 5450
Wire Wire Line
	9800 5450 10250 5450
Wire Wire Line
	10000 5900 10000 5450
Connection ~ 10000 5450
$Comp
L Resistor R23
U 1 1 546A5C9F
P 8400 4850
F 0 "R23" V 8480 4850 40  0000 C CNN
F 1 "3.3k" V 8407 4851 40  0000 C CNN
F 2 "Ruwai:Resistor_SMD0805_ReflowWave" V 8330 4850 30  0001 C CNN
F 3 "" V 8480 4850 30  0000 C CNN
F 4 "Yageo" H 8400 4350 60  0001 L CNN "Manu"
F 5 "RC0805FR-073K3L" H 8400 4250 60  0001 L CNN "Manu#"
F 6 "0805" H 8400 4150 60  0001 L CNN "Package"
F 7 "Custom Description" H 8400 4050 60  0001 L CNN "Desc"
	1    8400 4850
	0    1    1    0   
$EndComp
Wire Wire Line
	9000 4950 9000 4850
Wire Wire Line
	9000 4850 8650 4850
Wire Wire Line
	7950 4850 8150 4850
$Comp
L GND-RESCUE-adc_main_shield #PWR020
U 1 1 546A603E
P 7950 6400
F 0 "#PWR020" H 7950 6400 30  0001 C CNN
F 1 "GND" H 7950 6330 30  0001 C CNN
F 2 "" H 7950 6400 60  0000 C CNN
F 3 "" H 7950 6400 60  0000 C CNN
	1    7950 6400
	1    0    0    -1  
$EndComp
$Comp
L GND-RESCUE-adc_main_shield #PWR021
U 1 1 546A606A
P 10000 6400
F 0 "#PWR021" H 10000 6400 30  0001 C CNN
F 1 "GND" H 10000 6330 30  0001 C CNN
F 2 "" H 10000 6400 60  0000 C CNN
F 3 "" H 10000 6400 60  0000 C CNN
	1    10000 6400
	1    0    0    -1  
$EndComp
Wire Wire Line
	7950 6300 7950 6400
Wire Wire Line
	10000 6300 10000 6400
Text Label 7700 5450 2    60   ~ 0
3.3V_IO
Text HLabel 7700 5600 0    60   Output ~ 0
SCL_3
Text HLabel 7700 5750 0    60   BiDi ~ 0
SDA_3
Text HLabel 10250 5450 2    60   Input ~ 0
5V
Text HLabel 10250 5600 2    60   Input ~ 0
SCL_ARD
Text HLabel 10250 5750 2    60   BiDi ~ 0
SDA_ARD
Text HLabel 4450 850  2    60   Input ~ 0
5V
Text HLabel 4450 1000 2    60   Input ~ 0
SYNC_ARD
Text HLabel 1350 1000 0    60   Output ~ 0
SYNC_3
Text HLabel 1350 2400 0    60   Input ~ 0
DRDY_3
Text HLabel 4450 2250 2    60   Input ~ 0
5V
Text HLabel 4450 2400 2    60   Output ~ 0
DRDY_ARD
Text HLabel 4450 3650 2    60   Input ~ 0
5V
Text HLabel 4450 3800 2    60   Input ~ 0
MODE0_ARD
Text HLabel 1350 3800 0    60   Output ~ 0
MODE0_3
Text HLabel 1350 5250 0    60   Output ~ 0
MODE1_3
Text HLabel 4450 5100 2    60   Input ~ 0
5V
Text HLabel 4450 5250 2    60   Input ~ 0
MODE1_ARD
Text HLabel 1350 6750 0    60   Output ~ 0
FORMAT0_3
Text HLabel 4450 6600 2    60   Input ~ 0
5V
Text HLabel 4450 6750 2    60   Input ~ 0
FORMAT0_ARD
Text HLabel 7100 1000 0    60   Input ~ 0
DOUT1_3
Text HLabel 10200 850  2    60   Input ~ 0
5V
Text HLabel 10200 1000 2    60   Output ~ 0
DOUT1_ARD
Text HLabel 7100 2350 0    60   Output ~ 0
SCLK_3
Text HLabel 10200 2200 2    60   Input ~ 0
5V
Text HLabel 10200 2350 2    60   Input ~ 0
SCLK_ARD
Text HLabel 7100 3800 0    60   Output ~ 0
CLKDIV_3
Text HLabel 10200 3650 2    60   Input ~ 0
5V
Text HLabel 10200 3800 2    60   Input ~ 0
CLKDIV_ARD
$Comp
L PWR_FLAG #FLG022
U 1 1 546E5851
P 6700 6050
F 0 "#FLG022" H 6700 6145 30  0001 C CNN
F 1 "PWR_FLAG" H 6700 6230 30  0000 C CNN
F 2 "" H 6700 6050 60  0000 C CNN
F 3 "" H 6700 6050 60  0000 C CNN
	1    6700 6050
	1    0    0    -1  
$EndComp
Wire Wire Line
	6700 6050 6700 6100
Connection ~ 6700 6100
$Comp
L Capacitor C11
U 1 1 547DCB11
P 10075 1550
F 0 "C11" H 10075 1650 40  0000 L CNN
F 1 "0.1uF" H 10081 1465 40  0000 L CNN
F 2 "Ruwai:Capacitor_SMD0805_ReflowWave" H 10113 1400 30  0001 C CNN
F 3 "" H 10075 1650 60  0000 C CNN
F 4 "Murata" H 10125 1150 60  0001 L CNN "Manu"
F 5 "GCM21BR71H104KA37L" H 10125 1050 60  0001 L CNN "Manu#"
F 6 "0805" H 10125 950 60  0001 L CNN "Package"
F 7 "Custom Description" H 10075 1200 60  0001 L CNN "Desc"
	1    10075 1550
	1    0    0    -1  
$EndComp
$Comp
L GND-RESCUE-adc_main_shield #PWR023
U 1 1 547DCBFD
P 10075 1850
F 0 "#PWR023" H 10075 1850 30  0001 C CNN
F 1 "GND" H 10075 1780 30  0001 C CNN
F 2 "" H 10075 1850 60  0000 C CNN
F 3 "" H 10075 1850 60  0000 C CNN
	1    10075 1850
	1    0    0    -1  
$EndComp
Wire Wire Line
	10075 1350 10075 850 
Connection ~ 10075 850 
Wire Wire Line
	10075 1750 10075 1850
$Comp
L Capacitor C10
U 1 1 547DD250
P 7400 2800
F 0 "C10" H 7400 2900 40  0000 L CNN
F 1 "0.1uF" H 7406 2715 40  0000 L CNN
F 2 "Ruwai:Capacitor_SMD0805_ReflowWave" H 7438 2650 30  0001 C CNN
F 3 "" H 7400 2900 60  0000 C CNN
F 4 "Murata" H 7450 2400 60  0001 L CNN "Manu"
F 5 "GCM21BR71H104KA37L" H 7450 2300 60  0001 L CNN "Manu#"
F 6 "0805" H 7450 2200 60  0001 L CNN "Package"
F 7 "Custom Description" H 7400 2450 60  0001 L CNN "Desc"
	1    7400 2800
	1    0    0    -1  
$EndComp
$Comp
L GND-RESCUE-adc_main_shield #PWR024
U 1 1 547DD303
P 7400 3150
F 0 "#PWR024" H 7400 3150 30  0001 C CNN
F 1 "GND" H 7400 3080 30  0001 C CNN
F 2 "" H 7400 3150 60  0000 C CNN
F 3 "" H 7400 3150 60  0000 C CNN
	1    7400 3150
	1    0    0    -1  
$EndComp
Wire Wire Line
	7400 3150 7400 3000
Wire Wire Line
	7400 2600 7400 2200
Connection ~ 7400 2200
$EndSCHEMATC
