EESchema Schematic File Version 2
LIBS:power_supply_shield-rescue
LIBS:ruwai
LIBS:power
LIBS:device
LIBS:transistors
LIBS:conn
LIBS:linear
LIBS:regul
LIBS:74xx
LIBS:cmos4000
LIBS:adc-dac
LIBS:memory
LIBS:xilinx
LIBS:microcontrollers
LIBS:dsp
LIBS:microchip
LIBS:analog_switches
LIBS:motorola
LIBS:texas
LIBS:intel
LIBS:audio
LIBS:interface
LIBS:digital-audio
LIBS:philips
LIBS:display
LIBS:cypress
LIBS:siliconi
LIBS:opto
LIBS:atmel
LIBS:contrib
LIBS:valves
LIBS:power_supply_shield-cache
EELAYER 25 0
EELAYER END
$Descr A4 11693 8268
encoding utf-8
Sheet 3 4
Title "Ruwai ADC Main Shield"
Date "2017-09-17"
Rev "3"
Comp "Copyright Mertl Research GmbH 2014 "
Comment1 ""
Comment2 ""
Comment3 ""
Comment4 "This documentation describes Open Hardware and is licensed under the CERN OHL v. 1.2."
$EndDescr
$Comp
L THL_10WI U3
U 1 1 5480FAEB
P 5200 3550
F 0 "U3" H 4850 3250 60  0000 L CNN
F 1 "THL_10-2411WI" H 4850 3900 60  0000 L CNN
F 2 "Ruwai:Traco_THL_10WI" H 5200 3300 60  0001 C CNN
F 3 "" H 5250 3650 60  0000 C CNN
F 4 "Traco" H 5200 3250 60  0001 L CNN "Manu"
F 5 "THL 10-2411WI" H 5200 3150 60  0001 L CNN "Manu#"
F 6 "THL 10WI" H 5200 3050 60  0001 L CNN "Package"
F 7 "Custom Description" H 5200 2950 60  0001 L CNN "Desc"
	1    5200 3550
	1    0    0    -1  
$EndComp
$Comp
L 70543-0001 P1
U 1 1 54810225
P 900 3550
F 0 "P1" H 900 3400 60  0000 C CNN
F 1 "70543-0001" H 950 3700 60  0000 C CNN
F 2 "Ruwai:Molex_SL_70543-0001" H 900 2850 60  0001 L CNN
F 3 "" H 900 3550 60  0000 C CNN
F 4 "Molex" H 900 3250 60  0001 L CNN "Manu"
F 5 "70543-0001" H 900 3150 60  0001 L CNN "Manu#"
F 6 "1x2 pins; 2.54mm pitch; straight" H 900 3050 60  0001 L CNN "Package"
F 7 "Custom Description" H 900 2950 60  0001 L CNN "Desc"
	1    900  3550
	1    0    0    -1  
$EndComp
$Comp
L Varistance F1
U 1 1 5481032E
P 1600 4250
F 0 "F1" H 1700 4300 40  0000 R BNN
F 1 "1.1A" H 1500 4180 40  0000 L TNN
F 2 "Ruwai:PF1812L" H 1650 4200 60  0001 C CNN
F 3 "" V 1600 4250 60  0000 C CNN
F 4 "Littlefuse" H 1600 4050 60  0001 L BNN "Manu"
F 5 "1812L110/33MR" H 1600 3950 60  0001 L BNN "Manu#"
F 6 "PF1812L" H 1600 3850 60  0001 L BNN "Package"
F 7 "Custom description." H 1600 3750 60  0001 L BNN "Desc"
	1    1600 4250
	1    0    0    -1  
$EndComp
$Comp
L DiodeSchottky D3
U 1 1 548103B5
P 1600 2850
F 0 "D3" H 1600 2950 40  0000 C CNN
F 1 "MBR360" H 1600 2750 40  0000 C CNN
F 2 "Diodes_ThroughHole:Diode_DO-201AD_Horizontal_RM15" H 1500 2850 60  0001 C CNN
F 3 "" H 1600 2850 60  0000 C CNN
F 4 "Vishay" H 1600 2600 60  0001 L BNN "Manu"
F 5 "SB360-E3/54" H 1600 2500 60  0001 L BNN "Manu#"
F 6 "DO-201AD" H 1600 2400 60  0001 L BNN "Package"
F 7 "Custom description." H 1600 2300 60  0001 L BNN "Desc"
	1    1600 2850
	1    0    0    -1  
$EndComp
$Comp
L Capacitor C16
U 1 1 548106D8
P 1950 3550
F 0 "C16" H 1950 3650 40  0000 L CNN
F 1 "220nF" H 1956 3465 40  0000 L CNN
F 2 "Ruwai:wima_pcm7.5" H 1988 3400 30  0001 C CNN
F 3 "" H 1950 3650 60  0000 C CNN
F 4 "Wima" H 2000 3150 60  0001 L CNN "Manu"
F 5 "MKS4C032202B00" H 2000 3050 60  0001 L CNN "Manu#"
F 6 "pcm 7.5mm" H 2000 2950 60  0001 L CNN "Package"
F 7 "Custom Description" H 1950 3200 60  0001 L CNN "Desc"
	1    1950 3550
	1    0    0    -1  
$EndComp
$Comp
L inductor L5
U 1 1 5481075B
P 2300 2850
F 0 "L5" H 2300 2900 40  0000 C BNN
F 1 "68uH" H 2300 2800 40  0000 C CNN
F 2 "Ruwai:inductor_d9.5mm_g5mm" H 2200 2850 60  0001 C CNN
F 3 "" H 2200 2850 60  0000 C CNN
F 4 "Panasonic" H 2300 2650 60  0001 L BNN "Manu"
F 5 "ELC09D680F" H 2300 2550 60  0001 L BNN "Manu#"
F 6 "D9.5R5" H 2300 2450 60  0001 L BNN "Package"
F 7 "Custom description." H 2300 2350 60  0001 L BNN "Desc"
	1    2300 2850
	1    0    0    -1  
$EndComp
$Comp
L Resistor R7
U 1 1 5481091A
P 3000 2850
F 0 "R7" V 3080 2850 40  0000 C CNN
F 1 "100m" V 3007 2851 40  0000 C CNN
F 2 "Resistors_ThroughHole:Resistor_Horizontal_RM10mm" V 2930 2850 30  0001 C CNN
F 3 "" V 3080 2850 30  0000 C CNN
F 4 "TE Connectivity" H 3000 2350 60  0001 L CNN "Manu"
F 5 "LR1LJR10" H 3000 2250 60  0001 L CNN "Manu#"
F 6 "2.3D6.2mm" H 3000 2150 60  0001 L CNN "Package"
F 7 "Custom Description" H 3000 2050 60  0001 L CNN "Desc"
	1    3000 2850
	0    1    1    0   
$EndComp
$Comp
L Capacitor C17
U 1 1 54811038
P 3900 3550
F 0 "C17" H 3900 3650 40  0000 L CNN
F 1 "100nF" H 3906 3465 40  0000 L CNN
F 2 "Ruwai:Capacitor_SMD1206_ReflowWave" H 3938 3400 30  0001 C CNN
F 3 "" H 3900 3650 60  0000 C CNN
F 4 "AVX" H 3950 3150 60  0001 L CNN "Manu"
F 5 "12065C104JAT1A" H 3950 3050 60  0001 L CNN "Manu#"
F 6 "1206" H 3950 2950 60  0001 L CNN "Package"
F 7 "Custom Description" H 3900 3200 60  0001 L CNN "Desc"
	1    3900 3550
	1    0    0    -1  
$EndComp
$Comp
L Capacitor_pol. C14
U 1 1 5481148A
P 3400 3550
F 0 "C14" H 3400 3650 40  0000 L CNN
F 1 "100uF" H 3410 3440 40  0000 L CNN
F 2 "Ruwai:Capacitor_THM_D8R3.5" H 3438 3400 30  0001 C CNN
F 3 "" H 3400 3650 60  0000 C CNN
F 4 "Panasonic" H 3410 3260 60  0001 L CNN "Manu"
F 5 "ECA1HHG101" H 3410 3190 60  0001 L CNN "Manu#"
F 6 "D8R3.5" H 3410 3110 60  0001 L CNN "Package"
F 7 "Custom Description" H 3410 3020 60  0001 L CNN "Desc"
	1    3400 3550
	1    0    0    -1  
$EndComp
$Comp
L ferrite_bead L7
U 1 1 54811E6D
P 6750 2850
F 0 "L7" H 6620 2900 40  0000 L BNN
F 1 "220" H 6880 2750 40  0000 R BNN
F 2 "Ruwai:Inductor_SMD0805_ReflowWave" H 6750 2780 30  0001 C CNN
F 3 "" H 6750 2930 30  0000 C CNN
F 4 "Murata" H 6750 2600 60  0001 L CNN "Manu"
F 5 "BLM21PG221SN1D" H 6750 2500 60  0001 L CNN "Manu#"
F 6 "0805" H 6750 2400 60  0001 L CNN "Package"
F 7 "Custom Description" H 6750 2300 60  0001 L CNN "Desc"
	1    6750 2850
	1    0    0    -1  
$EndComp
$Comp
L Resistor R8
U 1 1 54812207
P 7350 3850
F 0 "R8" V 7430 3850 40  0000 C CNN
F 1 "4.7k" V 7357 3851 40  0000 C CNN
F 2 "Ruwai:Resistor_SMD0805_ReflowWave" V 7280 3850 30  0001 C CNN
F 3 "" V 7430 3850 30  0000 C CNN
F 4 "Yageo" H 7350 3350 60  0001 L CNN "Manu"
F 5 "RC0805FR-074K7L" H 7350 3250 60  0001 L CNN "Manu#"
F 6 "0805" H 7350 3150 60  0001 L CNN "Package"
F 7 "Custom Description" H 7350 3050 60  0001 L CNN "Desc"
	1    7350 3850
	-1   0    0    1   
$EndComp
$Comp
L GND-RESCUE-power_supply_shield #PWR013
U 1 1 548126FB
P 6250 4600
F 0 "#PWR013" H 6250 4600 30  0001 C CNN
F 1 "GND" H 6250 4530 30  0001 C CNN
F 2 "" H 6250 4600 60  0000 C CNN
F 3 "" H 6250 4600 60  0000 C CNN
	1    6250 4600
	1    0    0    -1  
$EndComp
$Comp
L Resistor R11
U 1 1 54812F2A
P 8750 2850
F 0 "R11" V 8830 2850 40  0000 C CNN
F 1 "10m" V 8757 2851 40  0000 C CNN
F 2 "Ruwai:Resistor_SMD1206_ReflowWave" V 8680 2850 30  0001 C CNN
F 3 "" V 8830 2850 30  0000 C CNN
F 4 "Panasonic" H 8750 2350 60  0001 L CNN "Manu"
F 5 "ERJMP2MF10MU" H 8750 2250 60  0001 L CNN "Manu#"
F 6 "1206" H 8750 2150 60  0001 L CNN "Package"
F 7 "Custom Description" H 8750 2050 60  0001 L CNN "Desc"
	1    8750 2850
	0    -1   -1   0   
$EndComp
Text HLabel 9000 1800 2    60   Output ~ 0
5.1V
$Comp
L 70543-0003 P2
U 1 1 54813C46
P 10550 3500
F 0 "P2" H 10550 3250 60  0000 C CNN
F 1 "70543-0003" H 10550 3750 60  0000 C CNN
F 2 "Ruwai:Molex_SL_70543-0038" H 10550 2700 60  0001 L CNN
F 3 "" H 10550 3500 60  0000 C CNN
F 4 "Molex" H 10550 3100 60  0001 L CNN "Manu"
F 5 "70543-0003" H 10550 3000 60  0001 L CNN "Manu#"
F 6 "1x4 pins; 2.54mm pitch; straight" H 10550 2900 60  0001 L CNN "Package"
F 7 "Custom Description" H 10550 2800 60  0001 L CNN "Desc"
	1    10550 3500
	-1   0    0    -1  
$EndComp
$Comp
L testpoint TP13
U 1 1 54814D0A
P 2200 4750
F 0 "TP13" H 2130 4620 60  0000 C CNN
F 1 "-VIN_R" H 2130 4890 60  0000 C CNN
F 2 "Ruwai:testpoint_1" H 2200 4750 60  0001 C CNN
F 3 "" H 2200 4750 60  0000 C CNN
F 4 "RS" H 2200 4450 60  0001 L CNN "Manu"
F 5 "200-101" H 2200 4350 60  0001 L CNN "Manu#"
F 6 "1mm" H 2200 4250 60  0001 L CNN "Package"
F 7 "Custom Description" H 2200 4150 60  0001 L CNN "Desc"
	1    2200 4750
	-1   0    0    1   
$EndComp
$Comp
L testpoint TP15
U 1 1 54814FC5
P 4650 4750
F 0 "TP15" H 4580 4620 60  0000 C CNN
F 1 "-VIN" H 4580 4890 60  0000 C CNN
F 2 "Ruwai:testpoint_1" H 4650 4750 60  0001 C CNN
F 3 "" H 4650 4750 60  0000 C CNN
F 4 "RS" H 4650 4450 60  0001 L CNN "Manu"
F 5 "200-101" H 4650 4350 60  0001 L CNN "Manu#"
F 6 "1mm" H 4650 4250 60  0001 L CNN "Package"
F 7 "Custom Description" H 4650 4150 60  0001 L CNN "Desc"
	1    4650 4750
	-1   0    0    1   
$EndComp
$Comp
L testpoint TP12
U 1 1 5481563C
P 8600 2450
F 0 "TP12" H 8530 2320 60  0000 C CNN
F 1 "5.1V" H 8530 2590 60  0000 C CNN
F 2 "Ruwai:testpoint_1" H 8600 2450 60  0001 C CNN
F 3 "" H 8600 2450 60  0000 C CNN
F 4 "RS" H 8600 2150 60  0001 L CNN "Manu"
F 5 "200-101" H 8600 2050 60  0001 L CNN "Manu#"
F 6 "1mm" H 8600 1950 60  0001 L CNN "Package"
F 7 "Custom Description" H 8600 1850 60  0001 L CNN "Desc"
	1    8600 2450
	-1   0    0    1   
$EndComp
$Comp
L testpoint TP19
U 1 1 5481597B
P 9800 2600
F 0 "TP19" H 9730 2470 60  0000 C CNN
F 1 "5.1V_BB" H 9730 2740 60  0000 C CNN
F 2 "Ruwai:testpoint_1" H 9800 2600 60  0001 C CNN
F 3 "" H 9800 2600 60  0000 C CNN
F 4 "RS" H 9800 2300 60  0001 L CNN "Manu"
F 5 "200-101" H 9800 2200 60  0001 L CNN "Manu#"
F 6 "1mm" H 9800 2100 60  0001 L CNN "Package"
F 7 "Custom Description" H 9800 2000 60  0001 L CNN "Desc"
	1    9800 2600
	-1   0    0    1   
$EndComp
Text Notes 11150 4000 2    60   ~ 0
BeagleBone Power
Text Notes 650  4850 0    60   ~ 0
INPUT:\n9 - 36V \n(nominal: 12V / 1A)
$Comp
L inductor L6
U 1 1 54841CB4
P 2300 4250
F 0 "L6" H 2300 4300 40  0000 C BNN
F 1 "68uH" H 2300 4200 40  0000 C CNN
F 2 "Ruwai:inductor_d9.5mm_g5mm" H 2200 4250 60  0001 C CNN
F 3 "" H 2200 4250 60  0000 C CNN
F 4 "Panasonic" H 2300 4050 60  0001 L BNN "Manu"
F 5 "ELC09D680F" H 2300 3950 60  0001 L BNN "Manu#"
F 6 "D9.5R5" H 2300 3850 60  0001 L BNN "Package"
F 7 "Custom description." H 2300 3750 60  0001 L BNN "Desc"
	1    2300 4250
	1    0    0    -1  
$EndComp
Text Notes 2100 2650 0    60   ~ 0
Der Bauteil für R7 ist noch unbekannt.
$Comp
L Capacitor_pol. C15
U 1 1 548423E9
P 8300 3550
F 0 "C15" H 8300 3650 40  0000 L CNN
F 1 "100uF" H 8310 3440 40  0000 L CNN
F 2 "Ruwai:Capacitor_THM_D8R3.5" H 8338 3400 30  0001 C CNN
F 3 "" H 8300 3650 60  0000 C CNN
F 4 "Panasonic" H 8310 3260 60  0001 L CNN "Manu"
F 5 "ECA1HHG101" H 8310 3190 60  0001 L CNN "Manu#"
F 6 "D8R3.5" H 8310 3110 60  0001 L CNN "Package"
F 7 "Custom Description" H 8310 3020 60  0001 L CNN "Desc"
	1    8300 3550
	1    0    0    -1  
$EndComp
$Comp
L Capacitor C18
U 1 1 54842F6E
P 6250 3550
F 0 "C18" H 6250 3650 40  0000 L CNN
F 1 "100nF" H 6256 3465 40  0000 L CNN
F 2 "Ruwai:Capacitor_SMD1206_ReflowWave" H 6288 3400 30  0001 C CNN
F 3 "" H 6250 3650 60  0000 C CNN
F 4 "AVX" H 6300 3150 60  0001 L CNN "Manu"
F 5 "12065C104JAT1A" H 6300 3050 60  0001 L CNN "Manu#"
F 6 "1206" H 6300 2950 60  0001 L CNN "Package"
F 7 "Custom Description" H 6250 3200 60  0001 L CNN "Desc"
	1    6250 3550
	1    0    0    -1  
$EndComp
$Comp
L LED D4
U 1 1 54845546
P 7350 3200
F 0 "D4" H 7325 3285 40  0000 C CNN
F 1 "green" H 7350 3110 40  0000 C CNN
F 2 "Ruwai:LED-0805" H 7225 3185 60  0001 C CNN
F 3 "" H 7350 3200 60  0000 C CNN
F 4 "Knightbright" H 7350 3000 60  0001 L CNN "Manu"
F 5 "KP-2012SGC" H 7350 2900 60  0001 L CNN "Manu#"
F 6 "0805" H 7350 2800 60  0001 L CNN "Package"
F 7 "LED green." H 7350 2700 60  0001 L CNN "Desc"
	1    7350 3200
	0    1    1    0   
$EndComp
$Comp
L Capacitor C19
U 1 1 54845C50
P 7850 3550
F 0 "C19" H 7850 3650 40  0000 L CNN
F 1 "100nF" H 7856 3465 40  0000 L CNN
F 2 "Ruwai:Capacitor_SMD1206_ReflowWave" H 7888 3400 30  0001 C CNN
F 3 "" H 7850 3650 60  0000 C CNN
F 4 "AVX" H 7900 3150 60  0001 L CNN "Manu"
F 5 "12065C104JAT1A" H 7900 3050 60  0001 L CNN "Manu#"
F 6 "1206" H 7900 2950 60  0001 L CNN "Package"
F 7 "Custom Description" H 7850 3200 60  0001 L CNN "Desc"
	1    7850 3550
	1    0    0    -1  
$EndComp
$Comp
L ferrite_bead L10
U 1 1 54846A1B
P 9900 3200
F 0 "L10" H 9770 3250 40  0000 L BNN
F 1 "220" H 10030 3100 40  0000 R BNN
F 2 "Ruwai:Inductor_SMD0805_ReflowWave" H 9900 3130 30  0001 C CNN
F 3 "" H 9900 3280 30  0000 C CNN
F 4 "Murata" H 9900 2950 60  0001 L CNN "Manu"
F 5 "BLM21PG221SN1D" H 9900 2850 60  0001 L CNN "Manu#"
F 6 "0805" H 9900 2750 60  0001 L CNN "Package"
F 7 "Custom Description" H 9900 2650 60  0001 L CNN "Desc"
	1    9900 3200
	1    0    0    -1  
$EndComp
$Comp
L ferrite_bead L11
U 1 1 54846BFF
P 9900 3400
F 0 "L11" H 9770 3450 40  0000 L BNN
F 1 "220" H 10030 3300 40  0000 R BNN
F 2 "Ruwai:Inductor_SMD0805_ReflowWave" H 9900 3330 30  0001 C CNN
F 3 "" H 9900 3480 30  0000 C CNN
F 4 "Murata" H 9900 3150 60  0001 L CNN "Manu"
F 5 "BLM21PG221SN1D" H 9900 3050 60  0001 L CNN "Manu#"
F 6 "0805" H 9900 2950 60  0001 L CNN "Package"
F 7 "Custom Description" H 9900 2850 60  0001 L CNN "Desc"
	1    9900 3400
	1    0    0    -1  
$EndComp
$Comp
L ferrite_bead L12
U 1 1 54846D2C
P 9900 3600
F 0 "L12" H 9770 3650 40  0000 L BNN
F 1 "220" H 10030 3500 40  0000 R BNN
F 2 "Ruwai:Inductor_SMD0805_ReflowWave" H 9900 3530 30  0001 C CNN
F 3 "" H 9900 3680 30  0000 C CNN
F 4 "Murata" H 9900 3350 60  0001 L CNN "Manu"
F 5 "BLM21PG221SN1D" H 9900 3250 60  0001 L CNN "Manu#"
F 6 "0805" H 9900 3150 60  0001 L CNN "Package"
F 7 "Custom Description" H 9900 3050 60  0001 L CNN "Desc"
	1    9900 3600
	1    0    0    -1  
$EndComp
$Comp
L ferrite_bead L13
U 1 1 54846E49
P 9900 3800
F 0 "L13" H 9770 3850 40  0000 L BNN
F 1 "220" H 10030 3700 40  0000 R BNN
F 2 "Ruwai:Inductor_SMD0805_ReflowWave" H 9900 3730 30  0001 C CNN
F 3 "" H 9900 3880 30  0000 C CNN
F 4 "Murata" H 9900 3550 60  0001 L CNN "Manu"
F 5 "BLM21PG221SN1D" H 9900 3450 60  0001 L CNN "Manu#"
F 6 "0805" H 9900 3350 60  0001 L CNN "Package"
F 7 "Custom Description" H 9900 3250 60  0001 L CNN "Desc"
	1    9900 3800
	1    0    0    -1  
$EndComp
$Comp
L DS1820_(TO-92) U4
U 1 1 5484E4B9
P 5550 5300
F 0 "U4" H 5250 5050 60  0000 L CNN
F 1 "DS1820_(TO-92)" H 5250 5550 60  0000 L CNN
F 2 "Housings_TO-92:TO-92-Free-inline-wide" H 5550 4500 60  0001 L CNN
F 3 "" H 5650 5050 60  0000 C CNN
F 4 "Maxim Integrated" H 5550 4900 60  0001 L CNN "Manu"
F 5 "DS18S20+" H 5550 4800 60  0001 L CNN "Manu#"
F 6 "TO-92" H 5550 4700 60  0001 L CNN "Package"
F 7 "Custom Description" H 5550 4600 60  0001 L CNN "Desc"
	1    5550 5300
	1    0    0    1   
$EndComp
$Comp
L Resistor R12
U 1 1 5484E69A
P 6750 5200
F 0 "R12" V 6830 5200 40  0000 C CNN
F 1 "4.7k" V 6757 5201 40  0000 C CNN
F 2 "Ruwai:Resistor_SMD0805_ReflowWave" V 6680 5200 30  0001 C CNN
F 3 "" V 6830 5200 30  0000 C CNN
F 4 "Yageo" H 6750 4700 60  0001 L CNN "Manu"
F 5 "RC0805FR-074K7L" H 6750 4600 60  0001 L CNN "Manu#"
F 6 "0805" H 6750 4500 60  0001 L CNN "Package"
F 7 "Custom Description" H 6750 4400 60  0001 L CNN "Desc"
	1    6750 5200
	0    -1   -1   0   
$EndComp
$Comp
L GND-RESCUE-power_supply_shield #PWR014
U 1 1 5484E9D0
P 6250 5700
F 0 "#PWR014" H 6250 5700 30  0001 C CNN
F 1 "GND" H 6250 5630 30  0001 C CNN
F 2 "" H 6250 5700 60  0000 C CNN
F 3 "" H 6250 5700 60  0000 C CNN
	1    6250 5700
	1    0    0    -1  
$EndComp
Text Notes 5250 5900 0    60   ~ 0
Place temperature sensor near THL_10
Text HLabel 7700 5300 2    60   Output ~ 0
temp
$Comp
L PWR_FLAG #FLG015
U 1 1 5484FFB7
P 8800 1700
F 0 "#FLG015" H 8800 1795 30  0001 C CNN
F 1 "PWR_FLAG" H 8800 1880 30  0000 C CNN
F 2 "" H 8800 1700 60  0000 C CNN
F 3 "" H 8800 1700 60  0000 C CNN
	1    8800 1700
	1    0    0    -1  
$EndComp
$Comp
L PWR_FLAG #FLG016
U 1 1 548501DD
P 4450 2700
F 0 "#FLG016" H 4450 2795 30  0001 C CNN
F 1 "PWR_FLAG" H 4450 2880 30  0000 C CNN
F 2 "" H 4450 2700 60  0000 C CNN
F 3 "" H 4450 2700 60  0000 C CNN
	1    4450 2700
	1    0    0    -1  
$EndComp
$Comp
L PWR_FLAG #FLG017
U 1 1 5485020E
P 4600 4250
F 0 "#FLG017" H 4600 4345 30  0001 C CNN
F 1 "PWR_FLAG" H 4600 4430 30  0000 C CNN
F 2 "" H 4600 4250 60  0000 C CNN
F 3 "" H 4600 4250 60  0000 C CNN
	1    4600 4250
	0    1    1    0   
$EndComp
Wire Wire Line
	1200 3500 1300 3500
Wire Wire Line
	1300 3500 1300 2850
Wire Wire Line
	1300 2850 1400 2850
Wire Wire Line
	1200 3600 1300 3600
Wire Wire Line
	1300 3600 1300 4250
Wire Wire Line
	1300 4250 1400 4250
Wire Wire Line
	1800 4250 2100 4250
Wire Wire Line
	1800 2850 2100 2850
Wire Wire Line
	1950 3350 1950 2850
Connection ~ 1950 2850
Wire Wire Line
	1950 3750 1950 4750
Connection ~ 1950 4250
Wire Wire Line
	2500 2850 2750 2850
Wire Wire Line
	3250 2850 4450 2850
Wire Wire Line
	4450 2700 4450 3400
Wire Wire Line
	4450 3400 4650 3400
Wire Wire Line
	2500 4250 4600 4250
Wire Wire Line
	4450 3700 4450 4750
Wire Wire Line
	4450 3700 4650 3700
Wire Wire Line
	3400 3350 3400 2850
Connection ~ 3400 2850
Wire Wire Line
	3400 3750 3400 4250
Connection ~ 3400 4250
Wire Wire Line
	3900 3750 3900 4250
Connection ~ 3900 4250
Wire Wire Line
	3900 3350 3900 2850
Connection ~ 3900 2850
Wire Wire Line
	5750 3400 5900 3400
Wire Wire Line
	5900 3400 5900 2850
Wire Wire Line
	5900 2850 6550 2850
Wire Wire Line
	5750 3700 5900 3700
Wire Wire Line
	5900 3700 5900 4250
Wire Wire Line
	5900 4250 9500 4250
Wire Wire Line
	6250 3750 6250 4600
Connection ~ 6250 4250
Wire Wire Line
	6250 3350 6250 2850
Connection ~ 6250 2850
Wire Wire Line
	6950 2850 8500 2850
Wire Wire Line
	7350 2850 7350 3000
Wire Wire Line
	7350 3400 7350 3600
Wire Wire Line
	7350 4100 7350 4250
Connection ~ 7350 4250
Wire Wire Line
	7850 2850 7850 3350
Connection ~ 7350 2850
Connection ~ 7850 2850
Wire Wire Line
	8300 4250 8300 3750
Connection ~ 8300 2850
Wire Wire Line
	9000 2850 9500 2850
Wire Wire Line
	9500 2600 9500 3400
Wire Wire Line
	9500 3200 9700 3200
Wire Wire Line
	9500 3400 9700 3400
Connection ~ 9500 3200
Wire Wire Line
	9500 4250 9500 3600
Wire Wire Line
	9500 3600 9700 3600
Connection ~ 8300 4250
Wire Wire Line
	9700 3800 9500 3800
Connection ~ 9500 3800
Wire Wire Line
	10100 3600 10150 3600
Wire Wire Line
	10150 3600 10150 3550
Wire Wire Line
	10150 3550 10250 3550
Wire Wire Line
	10100 3800 10200 3800
Wire Wire Line
	10200 3800 10200 3650
Wire Wire Line
	10200 3650 10250 3650
Wire Wire Line
	10100 3400 10150 3400
Wire Wire Line
	10150 3400 10150 3450
Wire Wire Line
	10150 3450 10250 3450
Wire Wire Line
	10100 3200 10200 3200
Wire Wire Line
	10200 3200 10200 3350
Wire Wire Line
	10200 3350 10250 3350
Wire Wire Line
	1950 4750 2100 4750
Wire Wire Line
	4450 4750 4550 4750
Connection ~ 4450 4250
Wire Wire Line
	9500 2600 9700 2600
Connection ~ 9500 2850
Wire Wire Line
	8300 1800 8300 3350
Wire Wire Line
	8300 1800 9000 1800
Wire Wire Line
	8500 2450 8300 2450
Connection ~ 8300 2450
Wire Wire Line
	5750 5200 6500 5200
Wire Wire Line
	5750 5400 6250 5400
Wire Wire Line
	6250 5400 6250 5700
Wire Wire Line
	5750 5300 7700 5300
Wire Wire Line
	7000 5200 7200 5200
Wire Wire Line
	7200 5200 7200 5300
Connection ~ 7200 5300
Wire Wire Line
	8800 1700 8800 1800
Connection ~ 8800 1800
Connection ~ 4450 2850
NoConn ~ 5750 3550
NoConn ~ 4650 3550
Wire Wire Line
	6000 5200 6000 4900
Wire Wire Line
	6000 4900 6350 4900
Connection ~ 6000 5200
Text Label 6350 4900 0    60   ~ 0
5.1V
Wire Wire Line
	7850 3750 7850 4250
Connection ~ 7850 4250
$EndSCHEMATC
