(module Resistor_SMD0102_ReflowWave (layer F.Cu) (tedit 54D71921)
  (descr "Resistor, SMD, 0805, Reflow, Wave,")
  (tags "Resistor, SMD, 0805, Reflow, Wave,")
  (attr smd)
  (fp_text reference R (at 0 -2) (layer F.SilkS)
    (effects (font (size 0.65 0.65) (thickness 0.125)))
  )
  (fp_text value 0102_RW (at 0.20066 2.60096) (layer F.SilkS) hide
    (effects (font (thickness 0.3048)))
  )
  (fp_line (start -2.1 1.3) (end -2.1 -1.3) (layer F.CrtYd) (width 0.15))
  (fp_line (start 2.1 1.3) (end -2.1 1.3) (layer F.CrtYd) (width 0.15))
  (fp_line (start 2.1 -1.3) (end 2.1 1.3) (layer F.CrtYd) (width 0.15))
  (fp_line (start -2.1 -1.3) (end 2.1 -1.3) (layer F.CrtYd) (width 0.15))
  (fp_line (start -1.89992 0.50038) (end -1.89992 1.09982) (layer F.SilkS) (width 0.381))
  (fp_line (start -1.89992 1.09982) (end 1.89992 1.09982) (layer F.SilkS) (width 0.381))
  (fp_line (start 1.89992 1.09982) (end 1.89992 0.50038) (layer F.SilkS) (width 0.381))
  (fp_line (start 1.89992 -0.50038) (end 1.89992 -1.09982) (layer F.SilkS) (width 0.381))
  (fp_line (start 1.89992 -1.09982) (end -1.89992 -1.09982) (layer F.SilkS) (width 0.381))
  (fp_line (start -1.89992 -1.09982) (end -1.89992 -0.50038) (layer F.SilkS) (width 0.381))
  (pad 1 smd rect (at -1.00076 0) (size 0.8001 1.19888) (layers F.Cu F.Paste F.Mask))
  (pad 2 smd rect (at 1.00076 0) (size 0.8001 1.19888) (layers F.Cu F.Paste F.Mask))
  (model ${KIPRJMOD}/../../modules/packages_3d/mertl-research/res_mmu_0102/resistor_smd0102.wrl
    (at (xyz 0 0 0))
    (scale (xyz 0.3937 0.3937 0.3937))
    (rotate (xyz 0 0 0))
  )
)
