EESchema Schematic File Version 2
LIBS:ruwai
LIBS:power
LIBS:device
LIBS:transistors
LIBS:conn
LIBS:linear
LIBS:regul
LIBS:74xx
LIBS:cmos4000
LIBS:adc-dac
LIBS:memory
LIBS:xilinx
LIBS:microcontrollers
LIBS:dsp
LIBS:microchip
LIBS:analog_switches
LIBS:motorola
LIBS:texas
LIBS:intel
LIBS:audio
LIBS:interface
LIBS:digital-audio
LIBS:philips
LIBS:display
LIBS:cypress
LIBS:siliconi
LIBS:opto
LIBS:atmel
LIBS:contrib
LIBS:valves
LIBS:adc_ai_pga-cache
EELAYER 25 0
EELAYER END
$Descr A4 11693 8268
encoding utf-8
Sheet 4 6
Title "Ruwai ADC analog interface with PGA"
Date "2017-09-15"
Rev "3"
Comp "copyright Mertl Research GmbH 2014"
Comment1 ""
Comment2 ""
Comment3 ""
Comment4 "This documentation describes Open Hardware and is licensed under the CERN OHL v. 1.2."
$EndDescr
$Comp
L PGA281 U11
U 1 1 5471FFC1
P 3775 5525
F 0 "U11" H 3425 5025 60  0000 C CNN
F 1 "PGA281" H 3525 6025 60  0000 C CNN
F 2 "SSOP_Packages:TSSOP-16_4.4x5mm_Pitch0.65mm" H 4925 5025 60  0001 C CNN
F 3 "" H 3775 5525 60  0000 C CNN
F 4 "Texas Instruments" H 3775 4775 60  0001 L CNN "Manu"
F 5 "PGA281AIPW" H 3775 4675 60  0001 L CNN "Manu#"
F 6 "TSSOP 16-pin" H 3775 4575 60  0001 L CNN "Package"
F 7 "Zero-Drift, High Voltage Programmable Gain Amplifier" H 3775 4475 60  0001 L CNN "Desc"
	1    3775 5525
	1    0    0    -1  
$EndComp
$Comp
L PCF8574_DGV_PW U12
U 1 1 5471FFCC
P 3800 6800
F 0 "U12" H 3450 6200 60  0000 C CNN
F 1 "PCF8574_DGV_PW" H 3800 7400 60  0000 C CNN
F 2 "Ruwai:TSSOP-20_4.4x6.5mm_Pitch0.65mm" H 5000 6200 60  0001 C CNN
F 3 "" H 3800 6800 60  0000 C CNN
F 4 "Texas Instruments" H 3800 6050 60  0001 L CNN "Manu"
F 5 "PCF8574PWR" H 3800 5950 60  0001 L CNN "Manu#"
F 6 "TSSOP 20-pin" H 3800 5850 60  0001 L CNN "Package"
F 7 "Remote 8-Bit I/O Expander for I2C-Bus" H 3800 5750 60  0001 L CNN "Desc"
	1    3800 6800
	1    0    0    -1  
$EndComp
$Comp
L Resistor R42
U 1 1 54720024
P 8750 1350
F 0 "R42" V 8830 1350 40  0000 C CNN
F 1 "10k" V 8757 1351 40  0000 C CNN
F 2 "Ruwai:Resistor_SMD0102_ReflowWave" V 8680 1350 30  0001 C CNN
F 3 "" V 8830 1350 30  0000 C CNN
F 4 "Yageo" H 8750 850 60  0001 L CNN "Manu"
F 5 "RC0805FR-0710KL" H 8750 750 60  0001 L CNN "Manu#"
F 6 "0805" H 8750 650 60  0001 L CNN "Package"
F 7 " " H 8750 550 60  0001 L CNN "Desc"
	1    8750 1350
	0    1    1    0   
$EndComp
$Comp
L Resistor R43
U 1 1 5472002F
P 8050 1350
F 0 "R43" V 8130 1350 40  0000 C CNN
F 1 "10k" V 8057 1351 40  0000 C CNN
F 2 "Ruwai:Resistor_SMD0102_ReflowWave" V 7980 1350 30  0001 C CNN
F 3 "" V 8130 1350 30  0000 C CNN
F 4 "Yageo" H 8050 850 60  0001 L CNN "Manu"
F 5 "RC0805FR-0710KL" H 8050 750 60  0001 L CNN "Manu#"
F 6 "0805" H 8050 650 60  0001 L CNN "Package"
F 7 " " H 8050 550 60  0001 L CNN "Desc"
	1    8050 1350
	0    1    1    0   
$EndComp
$Comp
L Resistor R39
U 1 1 5472003A
P 6100 1500
F 0 "R39" V 6180 1500 40  0000 C CNN
F 1 "10k" V 6107 1501 40  0000 C CNN
F 2 "Ruwai:Resistor_SMD0102_ReflowWave" V 6030 1500 30  0001 C CNN
F 3 "" V 6180 1500 30  0000 C CNN
F 4 "Yageo" H 6100 1000 60  0001 L CNN "Manu"
F 5 "RC0805FR-0710KL" H 6100 900 60  0001 L CNN "Manu#"
F 6 "0805" H 6100 800 60  0001 L CNN "Package"
F 7 " " H 6100 700 60  0001 L CNN "Desc"
	1    6100 1500
	0    1    1    0   
$EndComp
$Comp
L Resistor R40
U 1 1 54720045
P 5050 1500
F 0 "R40" V 5130 1500 40  0000 C CNN
F 1 "10k" V 5057 1501 40  0000 C CNN
F 2 "Ruwai:Resistor_SMD0102_ReflowWave" V 4980 1500 30  0001 C CNN
F 3 "" V 5130 1500 30  0000 C CNN
F 4 "Yageo" H 5050 1000 60  0001 L CNN "Manu"
F 5 "RC0805FR-0710KL" H 5050 900 60  0001 L CNN "Manu#"
F 6 "0805" H 5050 800 60  0001 L CNN "Package"
F 7 " " H 5050 700 60  0001 L CNN "Desc"
	1    5050 1500
	0    1    1    0   
$EndComp
$Comp
L Resistor R41
U 1 1 54720050
P 4350 1500
F 0 "R41" V 4430 1500 40  0000 C CNN
F 1 "10k" V 4357 1501 40  0000 C CNN
F 2 "Ruwai:Resistor_SMD0102_ReflowWave" V 4280 1500 30  0001 C CNN
F 3 "" V 4430 1500 30  0000 C CNN
F 4 "Yageo" H 4350 1000 60  0001 L CNN "Manu"
F 5 "RC0805FR-0710KL" H 4350 900 60  0001 L CNN "Manu#"
F 6 "0805" H 4350 800 60  0001 L CNN "Package"
F 7 " " H 4350 700 60  0001 L CNN "Desc"
	1    4350 1500
	0    1    1    0   
$EndComp
$Comp
L Capacitor C40
U 1 1 5472005B
P 8400 1000
F 0 "C40" H 8400 1100 40  0000 L CNN
F 1 "47nF" H 8406 915 40  0000 L CNN
F 2 "Ruwai:Capacitor_SMD1206_ReflowWave" H 8438 850 30  0001 C CNN
F 3 "" H 8400 1100 60  0000 C CNN
F 4 "Murata" H 8450 600 60  0001 L CNN "Manu"
F 5 "GRM31M5C1H473JA01L" H 8450 500 60  0001 L CNN "Manu#"
F 6 "1206" H 8450 400 60  0001 L CNN "Package"
F 7 "Custom Description" H 8400 650 60  0001 L CNN "Desc"
	1    8400 1000
	1    0    0    -1  
$EndComp
$Comp
L Capacitor C43
U 1 1 54720066
P 5750 1100
F 0 "C43" H 5750 1200 40  0000 L CNN
F 1 "4.7nF" H 5756 1015 40  0000 L CNN
F 2 "Ruwai:Capacitor_SMD0805_ReflowWave" H 5788 950 30  0001 C CNN
F 3 "" H 5750 1200 60  0000 C CNN
F 4 "Murata" H 5800 700 60  0001 L CNN "Manu"
F 5 "GRM2165C1H472JA01D" H 5800 600 60  0001 L CNN "Manu#"
F 6 "0805" H 5800 500 60  0001 L CNN "Package"
F 7 "Custom Description" H 5750 750 60  0001 L CNN "Desc"
	1    5750 1100
	1    0    0    -1  
$EndComp
$Comp
L Capacitor C37
U 1 1 54720071
P 5450 1100
F 0 "C37" H 5450 1200 40  0000 L CNN
F 1 "22nF" H 5456 1015 40  0000 L CNN
F 2 "Ruwai:Capacitor_SMD0805_ReflowWave" H 5488 950 30  0001 C CNN
F 3 "" H 5450 1200 60  0000 C CNN
F 4 "Kemet" H 5500 700 60  0001 L CNN "Manu"
F 5 "CGA4J2C0G1H223J125AA" H 5500 600 60  0001 L CNN "Manu#"
F 6 "0805" H 5500 500 60  0001 L CNN "Package"
F 7 "Custom Description" H 5450 750 60  0001 L CNN "Desc"
	1    5450 1100
	1    0    0    -1  
$EndComp
$Comp
L Capacitor C39
U 1 1 5472007C
P 9100 2000
F 0 "C39" H 9100 2100 40  0000 L CNN
F 1 "2.2nF" H 9106 1915 40  0000 L CNN
F 2 "Ruwai:Capacitor_SMD0805_ReflowWave" H 9138 1850 30  0001 C CNN
F 3 "" H 9100 2100 60  0000 C CNN
F 4 "Multicomp" H 9150 1600 60  0001 L CNN "Manu"
F 5 "MCU0805C222JCT " H 9150 1500 60  0001 L CNN "Manu#"
F 6 "0805" H 9150 1400 60  0001 L CNN "Package"
F 7 "Custom Description" H 9100 1650 60  0001 L CNN "Desc"
	1    9100 2000
	1    0    0    -1  
$EndComp
$Comp
L Capacitor C45
U 1 1 54720087
P 6450 2000
F 0 "C45" H 6450 2100 40  0000 L CNN
F 1 "3.3nF" H 6456 1915 40  0000 L CNN
F 2 "Ruwai:Capacitor_SMD0805_ReflowWave" H 6488 1850 30  0001 C CNN
F 3 "" H 6450 2100 60  0000 C CNN
F 4 "Murata" H 6500 1600 60  0001 L CNN "Manu"
F 5 "GRM2165C1H332JA01D" H 6500 1500 60  0001 L CNN "Manu#"
F 6 "0805" H 6500 1400 60  0001 L CNN "Package"
F 7 "Custom Description" H 6450 1650 60  0001 L CNN "Desc"
	1    6450 2000
	1    0    0    -1  
$EndComp
$Comp
L Capacitor C38
U 1 1 54720092
P 4700 2000
F 0 "C38" H 4700 2100 40  0000 L CNN
F 1 "10nF" H 4706 1915 40  0000 L CNN
F 2 "Ruwai:Capacitor_SMD0805_ReflowWave" H 4738 1850 30  0001 C CNN
F 3 "" H 4700 2100 60  0000 C CNN
F 4 "Kemet" H 4750 1600 60  0001 L CNN "Manu"
F 5 "C0805C103J3GACTU" H 4750 1500 60  0001 L CNN "Manu#"
F 6 "0805" H 4750 1400 60  0001 L CNN "Package"
F 7 "Custom Description" H 4700 1650 60  0001 L CNN "Desc"
	1    4700 2000
	1    0    0    -1  
$EndComp
$Comp
L Resistor R48
U 1 1 5472009D
P 8050 2650
F 0 "R48" V 8130 2650 40  0000 C CNN
F 1 "10k" V 8057 2651 40  0000 C CNN
F 2 "Ruwai:Resistor_SMD0102_ReflowWave" V 7980 2650 30  0001 C CNN
F 3 "" V 8130 2650 30  0000 C CNN
F 4 "Yageo" H 8050 2150 60  0001 L CNN "Manu"
F 5 "RC0805FR-0710KL" H 8050 2050 60  0001 L CNN "Manu#"
F 6 "0805" H 8050 1950 60  0001 L CNN "Package"
F 7 " " H 8050 1850 60  0001 L CNN "Desc"
	1    8050 2650
	0    1    1    0   
$EndComp
$Comp
L Resistor R47
U 1 1 547200A8
P 8750 2650
F 0 "R47" V 8830 2650 40  0000 C CNN
F 1 "10k" V 8757 2651 40  0000 C CNN
F 2 "Ruwai:Resistor_SMD0102_ReflowWave" V 8680 2650 30  0001 C CNN
F 3 "" V 8830 2650 30  0000 C CNN
F 4 "Yageo" H 8750 2150 60  0001 L CNN "Manu"
F 5 "RC0805FR-0710KL" H 8750 2050 60  0001 L CNN "Manu#"
F 6 "0805" H 8750 1950 60  0001 L CNN "Package"
F 7 " " H 8750 1850 60  0001 L CNN "Desc"
	1    8750 2650
	0    1    1    0   
$EndComp
$Comp
L Capacitor C42
U 1 1 547200B3
P 8400 3000
F 0 "C42" H 8400 3100 40  0000 L CNN
F 1 "47nF" H 8406 2915 40  0000 L CNN
F 2 "Ruwai:Capacitor_SMD1206_ReflowWave" H 8438 2850 30  0001 C CNN
F 3 "" H 8400 3100 60  0000 C CNN
F 4 "Murata" H 8450 2600 60  0001 L CNN "Manu"
F 5 "GRM31M5C1H473JA01L" H 8450 2500 60  0001 L CNN "Manu#"
F 6 "1206" H 8450 2400 60  0001 L CNN "Package"
F 7 "Custom Description" H 8400 2650 60  0001 L CNN "Desc"
	1    8400 3000
	1    0    0    -1  
$EndComp
$Comp
L Resistor R44
U 1 1 547200BE
P 6100 2500
F 0 "R44" V 6180 2500 40  0000 C CNN
F 1 "10k" V 6107 2501 40  0000 C CNN
F 2 "Ruwai:Resistor_SMD0102_ReflowWave" V 6030 2500 30  0001 C CNN
F 3 "" V 6180 2500 30  0000 C CNN
F 4 "Yageo" H 6100 2000 60  0001 L CNN "Manu"
F 5 "RC0805FR-0710KL" H 6100 1900 60  0001 L CNN "Manu#"
F 6 "0805" H 6100 1800 60  0001 L CNN "Package"
F 7 " " H 6100 1700 60  0001 L CNN "Desc"
	1    6100 2500
	0    1    1    0   
$EndComp
$Comp
L Resistor R45
U 1 1 547200C9
P 5050 2500
F 0 "R45" V 5130 2500 40  0000 C CNN
F 1 "10k" V 5057 2501 40  0000 C CNN
F 2 "Ruwai:Resistor_SMD0102_ReflowWave" V 4980 2500 30  0001 C CNN
F 3 "" V 5130 2500 30  0000 C CNN
F 4 "Yageo" H 5050 2000 60  0001 L CNN "Manu"
F 5 "RC0805FR-0710KL" H 5050 1900 60  0001 L CNN "Manu#"
F 6 "0805" H 5050 1800 60  0001 L CNN "Package"
F 7 " " H 5050 1700 60  0001 L CNN "Desc"
	1    5050 2500
	0    1    1    0   
$EndComp
$Comp
L Resistor R46
U 1 1 547200D4
P 4350 2500
F 0 "R46" V 4430 2500 40  0000 C CNN
F 1 "10k" V 4357 2501 40  0000 C CNN
F 2 "Ruwai:Resistor_SMD0102_ReflowWave" V 4280 2500 30  0001 C CNN
F 3 "" V 4430 2500 30  0000 C CNN
F 4 "Yageo" H 4350 2000 60  0001 L CNN "Manu"
F 5 "RC0805FR-0710KL" H 4350 1900 60  0001 L CNN "Manu#"
F 6 "0805" H 4350 1800 60  0001 L CNN "Package"
F 7 " " H 4350 1700 60  0001 L CNN "Desc"
	1    4350 2500
	0    1    1    0   
$EndComp
$Comp
L Capacitor C44
U 1 1 547200DF
P 5750 2900
F 0 "C44" H 5750 3000 40  0000 L CNN
F 1 "4.7nF" H 5756 2815 40  0000 L CNN
F 2 "Ruwai:Capacitor_SMD0805_ReflowWave" H 5788 2750 30  0001 C CNN
F 3 "" H 5750 3000 60  0000 C CNN
F 4 "Murata" H 5800 2500 60  0001 L CNN "Manu"
F 5 "GRM2165C1H472JA01D" H 5800 2400 60  0001 L CNN "Manu#"
F 6 "0805" H 5800 2300 60  0001 L CNN "Package"
F 7 "Custom Description" H 5750 2550 60  0001 L CNN "Desc"
	1    5750 2900
	1    0    0    -1  
$EndComp
$Comp
L Capacitor C41
U 1 1 547200EA
P 5450 2900
F 0 "C41" H 5450 3000 40  0000 L CNN
F 1 "22nF" H 5456 2815 40  0000 L CNN
F 2 "Ruwai:Capacitor_SMD0805_ReflowWave" H 5488 2750 30  0001 C CNN
F 3 "" H 5450 3000 60  0000 C CNN
F 4 "Kemet" H 5500 2500 60  0001 L CNN "Manu"
F 5 "CGA4J2C0G1H223J125AA" H 5500 2400 60  0001 L CNN "Manu#"
F 6 "0805" H 5500 2300 60  0001 L CNN "Package"
F 7 "Custom Description" H 5450 2550 60  0001 L CNN "Desc"
	1    5450 2900
	1    0    0    -1  
$EndComp
$Comp
L GND #PWR041
U 1 1 547200F1
P 10200 5025
F 0 "#PWR041" H 10200 5025 30  0001 C CNN
F 1 "GND" H 10200 4955 30  0001 C CNN
F 2 "" H 10200 5025 60  0000 C CNN
F 3 "" H 10200 5025 60  0000 C CNN
	1    10200 5025
	1    0    0    -1  
$EndComp
$Comp
L GND #PWR042
U 1 1 547200F7
P 10150 6325
F 0 "#PWR042" H 10150 6325 30  0001 C CNN
F 1 "GND" H 10150 6255 30  0001 C CNN
F 2 "" H 10150 6325 60  0000 C CNN
F 3 "" H 10150 6325 60  0000 C CNN
	1    10150 6325
	1    0    0    -1  
$EndComp
$Comp
L inductor L9
U 1 1 54720101
P 9275 4000
F 0 "L9" H 9275 4050 40  0000 C BNN
F 1 "1uH" H 9275 3950 40  0000 C CNN
F 2 "Ruwai:Inductor_SMD0805_ReflowWave" H 9175 4000 60  0001 C CNN
F 3 "" H 9175 4000 60  0000 C CNN
F 4 "Taiyo Yuden" H 9275 3800 60  0001 L BNN "Manu"
F 5 "BRL2012T1R0M " H 9275 3700 60  0001 L BNN "Manu#"
F 6 "0805" H 9275 3600 60  0001 L BNN "Package"
F 7 "Custom description." H 9275 3500 60  0001 L BNN "Desc"
	1    9275 4000
	1    0    0    -1  
$EndComp
$Comp
L Capacitor C47
U 1 1 5472010C
P 9650 4475
F 0 "C47" H 9650 4575 40  0000 L CNN
F 1 "100nF" H 9656 4390 40  0000 L CNN
F 2 "Ruwai:Capacitor_SMD0805_ReflowWave" H 9688 4325 30  0001 C CNN
F 3 "" H 9650 4575 60  0000 C CNN
F 4 "Murata" H 9700 4075 60  0001 L CNN "Manu"
F 5 "GCM21BR71H104KA37L" H 9700 3975 60  0001 L CNN "Manu#"
F 6 "0805" H 9700 3875 60  0001 L CNN "Package"
F 7 "Custom Description" H 9650 4125 60  0001 L CNN "Desc"
	1    9650 4475
	1    0    0    -1  
$EndComp
$Comp
L GND #PWR043
U 1 1 54720113
P 9650 5025
F 0 "#PWR043" H 9650 5025 30  0001 C CNN
F 1 "GND" H 9650 4955 30  0001 C CNN
F 2 "" H 9650 5025 60  0000 C CNN
F 3 "" H 9650 5025 60  0000 C CNN
	1    9650 5025
	1    0    0    -1  
$EndComp
$Comp
L GND #PWR044
U 1 1 54720119
P 9675 6325
F 0 "#PWR044" H 9675 6325 30  0001 C CNN
F 1 "GND" H 9675 6255 30  0001 C CNN
F 2 "" H 9675 6325 60  0000 C CNN
F 3 "" H 9675 6325 60  0000 C CNN
	1    9675 6325
	1    0    0    -1  
$EndComp
Text HLabel 8925 4000 0    60   Input ~ 0
5V_PGA
Text HLabel 8825 5300 0    60   Input ~ 0
5V_PGA
Text Label 2925 7250 2    60   ~ 0
PGA_G0
Text Label 4850 7250 0    60   ~ 0
PGA_G1
Text Label 4850 7150 0    60   ~ 0
PGA_G2
Text Label 4850 6950 0    60   ~ 0
PGA_G3
Text Label 4850 6750 0    60   ~ 0
PGA_G4
Text Label 2950 5775 2    60   ~ 0
PGA_G0
Text Label 2950 5675 2    60   ~ 0
PGA_G1
Text Label 2950 5575 2    60   ~ 0
PGA_G2
Text Label 2950 5475 2    60   ~ 0
PGA_G3
Text Label 2950 5375 2    60   ~ 0
PGA_G4
NoConn ~ 4400 6450
NoConn ~ 4400 6350
NoConn ~ 3200 6350
$Comp
L GND #PWR045
U 1 1 5472012E
P 3050 7625
F 0 "#PWR045" H 3050 7625 30  0001 C CNN
F 1 "GND" H 3050 7555 30  0001 C CNN
F 2 "" H 3050 7625 60  0000 C CNN
F 3 "" H 3050 7625 60  0000 C CNN
	1    3050 7625
	1    0    0    -1  
$EndComp
Text HLabel 2925 6650 0    60   Input ~ 0
SDA_3
Text HLabel 2925 6450 0    60   Input ~ 0
SCL_3
$Comp
L Resistor R52
U 1 1 5472013A
P 1800 6750
F 0 "R52" V 1880 6750 40  0000 C CNN
F 1 "10" V 1807 6751 40  0000 C CNN
F 2 "Ruwai:Resistor_SMD0805_ReflowWave" V 1730 6750 30  0001 C CNN
F 3 "" V 1880 6750 30  0000 C CNN
F 4 "Yageo" H 1800 6250 60  0001 L CNN "Manu"
F 5 "RC0805FR-0710RL" H 1800 6150 60  0001 L CNN "Manu#"
F 6 "0805" H 1800 6050 60  0001 L CNN "Package"
F 7 "Custom Description" H 1800 5950 60  0001 L CNN "Desc"
	1    1800 6750
	0    1    1    0   
$EndComp
$Comp
L GND #PWR046
U 1 1 54720141
P 2325 7625
F 0 "#PWR046" H 2325 7625 30  0001 C CNN
F 1 "GND" H 2325 7555 30  0001 C CNN
F 2 "" H 2325 7625 60  0000 C CNN
F 3 "" H 2325 7625 60  0000 C CNN
	1    2325 7625
	1    0    0    -1  
$EndComp
Text HLabel 1325 6750 0    60   Input ~ 0
3.3V_P
Text Label 2975 5875 2    60   ~ 0
PGA_VON
Text Label 4650 5875 0    60   ~ 0
PGA_VOP
$Comp
L GND #PWR047
U 1 1 5472014A
P 5350 6350
F 0 "#PWR047" H 5350 6350 30  0001 C CNN
F 1 "GND" H 5350 6280 30  0001 C CNN
F 2 "" H 5350 6350 60  0000 C CNN
F 3 "" H 5350 6350 60  0000 C CNN
	1    5350 6350
	1    0    0    -1  
$EndComp
Text HLabel 6500 5775 2    60   Input ~ 0
ADC_VCOM
Text HLabel 6500 5675 2    60   Input ~ 0
5V_PGA
$Comp
L GND #PWR048
U 1 1 54720152
P 5600 6350
F 0 "#PWR048" H 5600 6350 30  0001 C CNN
F 1 "GND" H 5600 6280 30  0001 C CNN
F 2 "" H 5600 6350 60  0000 C CNN
F 3 "" H 5600 6350 60  0000 C CNN
	1    5600 6350
	1    0    0    -1  
$EndComp
$Comp
L GND #PWR049
U 1 1 54720158
P 5100 6350
F 0 "#PWR049" H 5100 6350 30  0001 C CNN
F 1 "GND" H 5100 6280 30  0001 C CNN
F 2 "" H 5100 6350 60  0000 C CNN
F 3 "" H 5100 6350 60  0000 C CNN
	1    5100 6350
	1    0    0    -1  
$EndComp
$Comp
L GND #PWR050
U 1 1 5472015E
P 5300 5550
F 0 "#PWR050" H 5300 5550 30  0001 C CNN
F 1 "GND" H 5300 5480 30  0001 C CNN
F 2 "" H 5300 5550 60  0000 C CNN
F 3 "" H 5300 5550 60  0000 C CNN
	1    5300 5550
	1    0    0    -1  
$EndComp
$Comp
L Resistor R51
U 1 1 54720168
P 5775 4975
F 0 "R51" V 5855 4975 40  0000 C CNN
F 1 "22" V 5782 4976 40  0000 C CNN
F 2 "Ruwai:Resistor_SMD0805_ReflowWave" V 5705 4975 30  0001 C CNN
F 3 "" V 5855 4975 30  0000 C CNN
F 4 "Yageo" H 5775 4475 60  0001 L CNN "Manu"
F 5 "RC0805FR-0722RL" H 5775 4375 60  0001 L CNN "Manu#"
F 6 "0805" H 5775 4275 60  0001 L CNN "Package"
F 7 "Custom Description" H 5775 4175 60  0001 L CNN "Desc"
	1    5775 4975
	0    1    1    0   
$EndComp
Text HLabel 6150 4975 2    60   Input ~ 0
+15V_PGA
$Comp
L GND #PWR051
U 1 1 54720170
P 5025 4825
F 0 "#PWR051" H 5025 4825 30  0001 C CNN
F 1 "GND" H 5025 4755 30  0001 C CNN
F 2 "" H 5025 4825 60  0000 C CNN
F 3 "" H 5025 4825 60  0000 C CNN
	1    5025 4825
	1    0    0    -1  
$EndComp
Text HLabel 6150 4125 2    60   Input ~ 0
-15V_PGA
Text Label 3950 1500 2    60   ~ 0
PGA_VOP
Text Label 3950 2500 2    60   ~ 0
PGA_VON
$Comp
L inductor L11
U 1 1 5472017E
P 1550 3125
F 0 "L11" H 1550 3175 40  0000 C BNN
F 1 "47uH" H 1550 3075 40  0000 C CNN
F 2 "Ruwai:Inductor_SMD0805_ReflowWave" H 1450 3125 60  0001 C CNN
F 3 "" H 1450 3125 60  0000 C CNN
F 4 "Taiyo Yuden" H 1550 2925 60  0001 L BNN "Manu"
F 5 "BRL2012T470M" H 1550 2825 60  0001 L BNN "Manu#"
F 6 "0805" H 1550 2725 60  0001 L BNN "Package"
F 7 "Custom description." H 1550 2625 60  0001 L BNN "Desc"
	1    1550 3125
	1    0    0    -1  
$EndComp
$Comp
L Resistor R56
U 1 1 54720189
P 2200 3125
F 0 "R56" V 2280 3125 40  0000 C CNN
F 1 "47" V 2207 3126 40  0000 C CNN
F 2 "Ruwai:Resistor_SMD0805_ReflowWave" V 2130 3125 30  0001 C CNN
F 3 "" V 2280 3125 30  0000 C CNN
F 4 "Yageo" H 2200 2625 60  0001 L CNN "Manu"
F 5 "RC0805FR-0747RL" H 2200 2525 60  0001 L CNN "Manu#"
F 6 "0805" H 2200 2425 60  0001 L CNN "Package"
F 7 "Custom Description" H 2200 2325 60  0001 L CNN "Desc"
	1    2200 3125
	0    -1   -1   0   
$EndComp
$Comp
L Capacitor C53
U 1 1 54720194
P 2600 3525
F 0 "C53" H 2600 3625 40  0000 L CNN
F 1 "47nF" H 2606 3440 40  0000 L CNN
F 2 "Ruwai:Capacitor_SMD1206_ReflowWave" H 2638 3375 30  0001 C CNN
F 3 "" H 2600 3625 60  0000 C CNN
F 4 "Murata" H 2650 3125 60  0001 L CNN "Manu"
F 5 "GRM31M5C1H473JA01L" H 2650 3025 60  0001 L CNN "Manu#"
F 6 "1206" H 2650 2925 60  0001 L CNN "Package"
F 7 "Custom Description" H 2600 3175 60  0001 L CNN "Desc"
	1    2600 3525
	1    0    0    -1  
$EndComp
$Comp
L Varistance R55
U 1 1 5472019F
P 3000 3525
F 0 "R55" H 3100 3575 40  0000 R BNN
F 1 "14VRMS" H 2900 3450 40  0000 L TNN
F 2 "Ruwai:Resistor_SMD0805_ReflowWave" H 3050 3475 60  0001 C CNN
F 3 "" V 3000 3525 60  0000 C CNN
F 4 "Epcos" H 3000 3325 60  0001 L BNN "Manu"
F 5 "B72510E0140K062" H 3000 3225 60  0001 L BNN "Manu#"
F 6 "0805" H 3000 3125 60  0001 L BNN "Package"
F 7 "Custom description." H 3000 3025 60  0001 L BNN "Desc"
	1    3000 3525
	0    -1   -1   0   
$EndComp
$Comp
L Resistor R53
U 1 1 547201AA
P 3550 3125
F 0 "R53" V 3630 3125 40  0000 C CNN
F 1 "2.2k" V 3557 3126 40  0000 C CNN
F 2 "Ruwai:Resistor_SMD0805_ReflowWave" V 3480 3125 30  0001 C CNN
F 3 "" V 3630 3125 30  0000 C CNN
F 4 "Yageo" H 3550 2625 60  0001 L CNN "Manu"
F 5 "RC0805FR-072K2L" H 3550 2525 60  0001 L CNN "Manu#"
F 6 "0805" H 3550 2425 60  0001 L CNN "Package"
F 7 "Custom Description" H 3550 2325 60  0001 L CNN "Desc"
	1    3550 3125
	0    -1   -1   0   
$EndComp
$Comp
L Capacitor C54
U 1 1 547201B5
P 3950 3525
F 0 "C54" H 3950 3625 40  0000 L CNN
F 1 "1nF" H 3956 3440 40  0000 L CNN
F 2 "Ruwai:Capacitor_SMD0805_ReflowWave" H 3988 3375 30  0001 C CNN
F 3 "" H 3950 3625 60  0000 C CNN
F 4 "Kemet" H 4000 3125 60  0001 L CNN "Manu"
F 5 "C0805C102J5GACTU" H 4000 3025 60  0001 L CNN "Manu#"
F 6 "0805" H 4000 2925 60  0001 L CNN "Package"
F 7 "Custom Description" H 3950 3175 60  0001 L CNN "Desc"
	1    3950 3525
	1    0    0    -1  
$EndComp
$Comp
L Resistor R82
U 1 1 547201C0
P 1600 3325
F 0 "R82" V 1680 3325 40  0000 C CNN
F 1 "100k" V 1607 3326 40  0000 C CNN
F 2 "Ruwai:Resistor_SMD0805_ReflowWave" V 1530 3325 30  0001 C CNN
F 3 "" V 1680 3325 30  0000 C CNN
F 4 "Yageo" H 1600 2825 60  0001 L CNN "Manu"
F 5 "RC0805FR-07100KL" H 1600 2725 60  0001 L CNN "Manu#"
F 6 "0805" H 1600 2625 60  0001 L CNN "Package"
F 7 "Custom Description" H 1600 2525 60  0001 L CNN "Desc"
	1    1600 3325
	0    -1   -1   0   
$EndComp
$Comp
L Resistor R57
U 1 1 547201CB
P 2200 3925
F 0 "R57" V 2280 3925 40  0000 C CNN
F 1 "47" V 2207 3926 40  0000 C CNN
F 2 "Ruwai:Resistor_SMD0805_ReflowWave" V 2130 3925 30  0001 C CNN
F 3 "" V 2280 3925 30  0000 C CNN
F 4 "Yageo" H 2200 3425 60  0001 L CNN "Manu"
F 5 "RC0805FR-0747RL" H 2200 3325 60  0001 L CNN "Manu#"
F 6 "0805" H 2200 3225 60  0001 L CNN "Package"
F 7 "Custom Description" H 2200 3125 60  0001 L CNN "Desc"
	1    2200 3925
	0    -1   -1   0   
$EndComp
$Comp
L Resistor R54
U 1 1 547201D6
P 3550 3925
F 0 "R54" V 3630 3925 40  0000 C CNN
F 1 "2.2k" V 3557 3926 40  0000 C CNN
F 2 "Ruwai:Resistor_SMD0805_ReflowWave" V 3480 3925 30  0001 C CNN
F 3 "" V 3630 3925 30  0000 C CNN
F 4 "Yageo" H 3550 3425 60  0001 L CNN "Manu"
F 5 "RC0805FR-072K2L" H 3550 3325 60  0001 L CNN "Manu#"
F 6 "0805" H 3550 3225 60  0001 L CNN "Package"
F 7 "Custom Description" H 3550 3125 60  0001 L CNN "Desc"
	1    3550 3925
	0    -1   -1   0   
$EndComp
$Comp
L Resistor R83
U 1 1 547201E1
P 1600 3725
F 0 "R83" V 1680 3725 40  0000 C CNN
F 1 "100k" V 1607 3726 40  0000 C CNN
F 2 "Ruwai:Resistor_SMD0805_ReflowWave" V 1530 3725 30  0001 C CNN
F 3 "" V 1680 3725 30  0000 C CNN
F 4 "Yageo" H 1600 3225 60  0001 L CNN "Manu"
F 5 "RC0805FR-07100KL" H 1600 3125 60  0001 L CNN "Manu#"
F 6 "0805" H 1600 3025 60  0001 L CNN "Package"
F 7 "Custom Description" H 1600 2925 60  0001 L CNN "Desc"
	1    1600 3725
	0    -1   -1   0   
$EndComp
$Comp
L inductor L12
U 1 1 547201EC
P 1550 3925
F 0 "L12" H 1550 3975 40  0000 C BNN
F 1 "47uH" H 1550 3875 40  0000 C CNN
F 2 "Ruwai:Inductor_SMD0805_ReflowWave" H 1450 3925 60  0001 C CNN
F 3 "" H 1450 3925 60  0000 C CNN
F 4 "Taiyo Yuden" H 1550 3725 60  0001 L BNN "Manu"
F 5 "BRL2012T470M" H 1550 3625 60  0001 L BNN "Manu#"
F 6 "0805" H 1550 3525 60  0001 L BNN "Package"
F 7 "Custom description." H 1550 3425 60  0001 L BNN "Desc"
	1    1550 3925
	1    0    0    -1  
$EndComp
$Comp
L GND #PWR052
U 1 1 547201F3
P 2200 3625
F 0 "#PWR052" H 2200 3625 30  0001 C CNN
F 1 "GND" H 2200 3555 30  0001 C CNN
F 2 "" H 2200 3625 60  0000 C CNN
F 3 "" H 2200 3625 60  0000 C CNN
	1    2200 3625
	1    0    0    -1  
$EndComp
Text HLabel 950  3125 0    60   Input ~ 0
AINP3
Text HLabel 950  3925 0    60   Input ~ 0
AINN3
Text Label 4250 3125 0    60   ~ 0
PGA_INP
Text Label 4250 3925 0    60   ~ 0
PGA_INN
$Comp
L inductor L10
U 1 1 547202B8
P 9175 5300
F 0 "L10" H 9175 5350 40  0000 C BNN
F 1 "1uH" H 9175 5250 40  0000 C CNN
F 2 "Ruwai:Inductor_SMD0805_ReflowWave" H 9075 5300 60  0001 C CNN
F 3 "" H 9075 5300 60  0000 C CNN
F 4 "Taiyo Yuden" H 9175 5100 60  0001 L BNN "Manu"
F 5 "BRL2012T1R0M " H 9175 5000 60  0001 L BNN "Manu#"
F 6 "0805" H 9175 4900 60  0001 L BNN "Package"
F 7 "Custom description." H 9175 4800 60  0001 L BNN "Desc"
	1    9175 5300
	1    0    0    -1  
$EndComp
$Comp
L Capacitor C46
U 1 1 547202C3
P 9675 5775
F 0 "C46" H 9675 5875 40  0000 L CNN
F 1 "100nF" H 9681 5690 40  0000 L CNN
F 2 "Ruwai:Capacitor_SMD0805_ReflowWave" H 9713 5625 30  0001 C CNN
F 3 "" H 9675 5875 60  0000 C CNN
F 4 "Murata" H 9725 5375 60  0001 L CNN "Manu"
F 5 "GCM21BR71H104KA37L" H 9725 5275 60  0001 L CNN "Manu#"
F 6 "0805" H 9725 5175 60  0001 L CNN "Package"
F 7 "Custom Description" H 9675 5425 60  0001 L CNN "Desc"
	1    9675 5775
	1    0    0    -1  
$EndComp
$Comp
L Capacitor C49
U 1 1 547202CE
P 2325 7175
F 0 "C49" H 2325 7275 40  0000 L CNN
F 1 "100nF" H 2331 7090 40  0000 L CNN
F 2 "Ruwai:Capacitor_SMD0805_ReflowWave" H 2363 7025 30  0001 C CNN
F 3 "" H 2325 7275 60  0000 C CNN
F 4 "Murata" H 2375 6775 60  0001 L CNN "Manu"
F 5 "GCM21BR71H104KA37L" H 2375 6675 60  0001 L CNN "Manu#"
F 6 "0805" H 2375 6575 60  0001 L CNN "Package"
F 7 "Custom Description" H 2325 6825 60  0001 L CNN "Desc"
	1    2325 7175
	1    0    0    -1  
$EndComp
$Comp
L Capacitor C48
U 1 1 547202D9
P 5350 6075
F 0 "C48" H 5350 6175 40  0000 L CNN
F 1 "100nF" H 5356 5990 40  0000 L CNN
F 2 "Ruwai:Capacitor_SMD0805_ReflowWave" H 5388 5925 30  0001 C CNN
F 3 "" H 5350 6175 60  0000 C CNN
F 4 "Murata" H 5400 5675 60  0001 L CNN "Manu"
F 5 "GCM21BR71H104KA37L" H 5400 5575 60  0001 L CNN "Manu#"
F 6 "0805" H 5400 5475 60  0001 L CNN "Package"
F 7 "Custom Description" H 5350 5725 60  0001 L CNN "Desc"
	1    5350 6075
	1    0    0    -1  
$EndComp
$Comp
L Capacitor C51
U 1 1 547202E4
P 5600 6075
F 0 "C51" H 5600 6175 40  0000 L CNN
F 1 "470nF" H 5606 5990 40  0000 L CNN
F 2 "Ruwai:Capacitor_SMD0805_ReflowWave" H 5638 5925 30  0001 C CNN
F 3 "" H 5600 6175 60  0000 C CNN
F 4 "Samsung Electro-Mechanics" H 5650 5675 60  0001 L CNN "Manu"
F 5 "CL21B474KBF4PNG" H 5650 5575 60  0001 L CNN "Manu#"
F 6 "0805" H 5650 5475 60  0001 L CNN "Package"
F 7 "Custom Description" H 5600 5725 60  0001 L CNN "Desc"
	1    5600 6075
	1    0    0    -1  
$EndComp
$Comp
L Capacitor C50
U 1 1 547202EF
P 5300 5250
F 0 "C50" H 5300 5350 40  0000 L CNN
F 1 "470nF" H 5306 5165 40  0000 L CNN
F 2 "Ruwai:Capacitor_SMD0805_ReflowWave" H 5338 5100 30  0001 C CNN
F 3 "" H 5300 5350 60  0000 C CNN
F 4 "Samsung Electro-Mechanics" H 5350 4850 60  0001 L CNN "Manu"
F 5 "CL21B474KBF4PNG" H 5350 4750 60  0001 L CNN "Manu#"
F 6 "0805" H 5350 4650 60  0001 L CNN "Package"
F 7 "Custom Description" H 5300 4900 60  0001 L CNN "Desc"
	1    5300 5250
	1    0    0    -1  
$EndComp
$Comp
L Capacitor C52
U 1 1 547202FA
P 4800 4450
F 0 "C52" H 4800 4550 40  0000 L CNN
F 1 "470nF" H 4806 4365 40  0000 L CNN
F 2 "Ruwai:Capacitor_SMD0805_ReflowWave" H 4838 4300 30  0001 C CNN
F 3 "" H 4800 4550 60  0000 C CNN
F 4 "Samsung Electro-Mechanics" H 4850 4050 60  0001 L CNN "Manu"
F 5 "CL21B474KBF4PNG" H 4850 3950 60  0001 L CNN "Manu#"
F 6 "0805" H 4850 3850 60  0001 L CNN "Package"
F 7 "Custom Description" H 4800 4100 60  0001 L CNN "Desc"
	1    4800 4450
	1    0    0    -1  
$EndComp
$Comp
L Resistor R49
U 1 1 54720305
P 6050 5675
F 0 "R49" V 6130 5675 40  0000 C CNN
F 1 "10" V 6057 5676 40  0000 C CNN
F 2 "Ruwai:Resistor_SMD0805_ReflowWave" V 5980 5675 30  0001 C CNN
F 3 "" V 6130 5675 30  0000 C CNN
F 4 "Yageo" H 6050 5175 60  0001 L CNN "Manu"
F 5 "RC0805FR-0710RL" H 6050 5075 60  0001 L CNN "Manu#"
F 6 "0805" H 6050 4975 60  0001 L CNN "Package"
F 7 "Custom Description" H 6050 4875 60  0001 L CNN "Desc"
	1    6050 5675
	0    1    1    0   
$EndComp
$Comp
L Resistor R50
U 1 1 54720310
P 5775 4125
F 0 "R50" V 5855 4125 40  0000 C CNN
F 1 "22" V 5782 4126 40  0000 C CNN
F 2 "Ruwai:Resistor_SMD0805_ReflowWave" V 5705 4125 30  0001 C CNN
F 3 "" V 5855 4125 30  0000 C CNN
F 4 "Yageo" H 5775 3625 60  0001 L CNN "Manu"
F 5 "RC0805FR-0722RL" H 5775 3525 60  0001 L CNN "Manu#"
F 6 "0805" H 5775 3425 60  0001 L CNN "Package"
F 7 "Custom Description" H 5775 3325 60  0001 L CNN "Desc"
	1    5775 4125
	0    1    1    0   
$EndComp
$Comp
L DiodeSchottky D3
U 1 1 5472031B
P 5275 4450
F 0 "D3" H 5275 4550 40  0000 C CNN
F 1 "BAS386" H 5275 4350 40  0000 C CNN
F 2 "Ruwai:Diode_SMD0102_ReflowWave" H 5275 4450 60  0001 C CNN
F 3 "" H 5275 4450 60  0000 C CNN
F 4 "Vishay" H 5275 4200 60  0001 L BNN "Manu"
F 5 "BAS386-TR" H 5275 4100 60  0001 L BNN "Manu#"
F 6 "0102" H 5275 4000 60  0001 L BNN "Package"
F 7 "Custom description." H 5275 3900 60  0001 L BNN "Desc"
	1    5275 4450
	0    1    1    0   
$EndComp
Text Notes 3825 7175 1    60   ~ 0
I2C address: 22h
Text Label 4650 5275 0    60   ~ 0
PGA_INN
Text Label 4650 5375 0    60   ~ 0
PGA_INP
Wire Wire Line
	9000 1350 9200 1350
Wire Wire Line
	8300 1350 8500 1350
Wire Wire Line
	10125 1200 10575 1200
Connection ~ 8400 1350
Wire Wire Line
	8400 800  8400 650 
Wire Wire Line
	8400 650  10250 650 
Wire Wire Line
	10250 650  10250 1200
Connection ~ 10250 1200
Wire Wire Line
	7525 1350 7800 1350
Wire Wire Line
	6350 1500 6600 1500
Wire Wire Line
	5300 1500 5850 1500
Wire Wire Line
	5750 1300 5750 1500
Connection ~ 5750 1500
Wire Wire Line
	5450 1300 5450 1500
Connection ~ 5450 1500
Wire Wire Line
	5450 900  5450 650 
Wire Wire Line
	5450 650  7650 650 
Wire Wire Line
	7650 650  7650 1350
Connection ~ 7650 1350
Wire Wire Line
	5750 900  5750 650 
Connection ~ 5750 650 
Wire Wire Line
	4600 1500 4800 1500
Wire Wire Line
	6600 1200 6550 1200
Wire Wire Line
	6550 1200 6550 650 
Connection ~ 6550 650 
Wire Wire Line
	8400 1350 8400 1200
Wire Wire Line
	9200 1050 9100 1050
Wire Wire Line
	9100 1050 9100 650 
Connection ~ 9100 650 
Wire Wire Line
	9100 1350 9100 1800
Connection ~ 9100 1350
Wire Wire Line
	6450 1800 6450 1500
Connection ~ 6450 1500
Wire Wire Line
	4700 1800 4700 1500
Connection ~ 4700 1500
Wire Wire Line
	9000 2650 9200 2650
Wire Wire Line
	8300 2650 8500 2650
Wire Wire Line
	7525 2650 7800 2650
Wire Wire Line
	8400 2800 8400 2650
Connection ~ 8400 2650
Wire Wire Line
	10125 2800 10575 2800
Wire Wire Line
	10250 3350 10250 2800
Wire Wire Line
	8400 3350 10250 3350
Wire Wire Line
	8400 3350 8400 3200
Connection ~ 10250 2800
Wire Wire Line
	9100 2200 9100 2650
Connection ~ 9100 2650
Wire Wire Line
	9200 2950 9100 2950
Wire Wire Line
	9100 2950 9100 3350
Connection ~ 9100 3350
Wire Wire Line
	6350 2500 6600 2500
Wire Wire Line
	5300 2500 5850 2500
Wire Wire Line
	4600 2500 4800 2500
Wire Wire Line
	4700 2200 4700 2500
Connection ~ 4700 2500
Wire Wire Line
	5450 2700 5450 2500
Connection ~ 5450 2500
Wire Wire Line
	5750 2700 5750 2500
Connection ~ 5750 2500
Wire Wire Line
	7650 3350 7650 2650
Wire Wire Line
	5450 3350 7650 3350
Wire Wire Line
	5450 3350 5450 3100
Connection ~ 7650 2650
Wire Wire Line
	5750 3100 5750 3350
Connection ~ 5750 3350
Wire Wire Line
	6450 2200 6450 2500
Connection ~ 6450 2500
Wire Wire Line
	6600 2800 6450 2800
Wire Wire Line
	6450 2800 6450 3350
Connection ~ 6450 3350
Wire Wire Line
	10200 4850 10200 5025
Wire Wire Line
	10150 6150 10150 6325
Wire Wire Line
	10200 4000 10200 4100
Wire Wire Line
	9475 4000 10200 4000
Wire Wire Line
	9675 5975 9675 6325
Wire Wire Line
	10150 5300 10150 5400
Wire Wire Line
	9375 5300 10150 5300
Wire Wire Line
	9675 5575 9675 5300
Connection ~ 9675 5300
Wire Wire Line
	8975 5300 8825 5300
Wire Wire Line
	9650 4275 9650 4000
Connection ~ 9650 4000
Wire Wire Line
	9650 4675 9650 5025
Wire Wire Line
	9075 4000 8925 4000
Wire Wire Line
	4400 7250 4850 7250
Wire Wire Line
	4400 7150 4850 7150
Wire Wire Line
	4400 6950 4850 6950
Wire Wire Line
	4400 6750 4850 6750
Wire Wire Line
	2950 5375 3175 5375
Wire Wire Line
	2950 5475 3175 5475
Wire Wire Line
	2950 5575 3175 5575
Wire Wire Line
	2950 5675 3175 5675
Wire Wire Line
	2950 5775 3175 5775
Wire Wire Line
	3200 6850 3050 6850
Wire Wire Line
	3200 7150 3050 7150
Connection ~ 3050 7150
Wire Wire Line
	2050 6750 3200 6750
Wire Wire Line
	3200 6650 2925 6650
Wire Wire Line
	3200 6450 2925 6450
Wire Wire Line
	2325 7375 2325 7625
Wire Wire Line
	2325 6750 2325 6975
Connection ~ 2325 6750
Connection ~ 2175 6750
Wire Wire Line
	1550 6750 1325 6750
Wire Wire Line
	4375 5275 4650 5275
Wire Wire Line
	4375 5375 4650 5375
Wire Wire Line
	3175 5875 2975 5875
Wire Wire Line
	4375 5875 4650 5875
Wire Wire Line
	5350 6275 5350 6350
Wire Wire Line
	4375 5775 6500 5775
Wire Wire Line
	5350 5775 5350 5875
Connection ~ 5350 5775
Wire Wire Line
	4375 5675 5800 5675
Wire Wire Line
	5600 6350 5600 6275
Wire Wire Line
	5600 5875 5600 5675
Connection ~ 5600 5675
Wire Wire Line
	6300 5675 6500 5675
Wire Wire Line
	4375 5575 5100 5575
Wire Wire Line
	5100 5575 5100 6350
Wire Wire Line
	4375 5475 5125 5475
Wire Wire Line
	5125 5475 5125 4975
Wire Wire Line
	5125 4975 5525 4975
Wire Wire Line
	5300 5450 5300 5550
Wire Wire Line
	5300 5050 5300 4975
Connection ~ 5300 4975
Wire Wire Line
	6025 4975 6150 4975
Wire Wire Line
	4800 4650 4800 4750
Wire Wire Line
	4800 4750 5275 4750
Wire Wire Line
	5275 4750 5275 4650
Wire Wire Line
	5025 4825 5025 4750
Connection ~ 5025 4750
Wire Wire Line
	4375 5175 4575 5175
Wire Wire Line
	4575 4125 5525 4125
Wire Wire Line
	4800 4250 4800 4125
Connection ~ 4800 4125
Wire Wire Line
	5275 4250 5275 4125
Connection ~ 5275 4125
Wire Wire Line
	6025 4125 6150 4125
Wire Wire Line
	4100 1500 3950 1500
Wire Wire Line
	4100 2500 3950 2500
Wire Wire Line
	3200 7250 2925 7250
Wire Wire Line
	2175 5175 3175 5175
Wire Wire Line
	950  3125 1350 3125
Wire Wire Line
	1850 3325 1950 3325
Wire Wire Line
	1950 3325 1950 3725
Wire Wire Line
	1950 3725 1850 3725
Wire Wire Line
	1350 3325 1250 3325
Wire Wire Line
	1250 3325 1250 3125
Connection ~ 1250 3125
Wire Wire Line
	1950 3525 2200 3525
Wire Wire Line
	2200 3525 2200 3625
Connection ~ 1950 3525
Wire Wire Line
	1750 3125 1950 3125
Wire Wire Line
	2450 3125 3300 3125
Wire Wire Line
	2600 3325 2600 3125
Connection ~ 2600 3125
Wire Wire Line
	3000 3325 3000 3125
Connection ~ 3000 3125
Wire Wire Line
	2450 3925 3300 3925
Wire Wire Line
	1750 3925 1950 3925
Wire Wire Line
	950  3925 1350 3925
Wire Wire Line
	1350 3725 1250 3725
Wire Wire Line
	1250 3725 1250 3925
Connection ~ 1250 3925
Wire Wire Line
	2600 3725 2600 3925
Connection ~ 2600 3925
Wire Wire Line
	3000 3725 3000 3925
Connection ~ 3000 3925
Wire Wire Line
	3800 3125 4250 3125
Wire Wire Line
	3800 3925 4250 3925
Wire Wire Line
	3950 3725 3950 3925
Connection ~ 3950 3925
Wire Wire Line
	3950 3325 3950 3125
Connection ~ 3950 3125
Wire Wire Line
	4575 5175 4575 4125
Wire Wire Line
	3050 6850 3050 7625
Wire Wire Line
	3200 6950 2900 6950
Wire Wire Line
	2900 6950 2900 6750
Connection ~ 2900 6750
Text HLabel 10575 1200 2    60   Output ~ 0
PGA3_OUTP
Text HLabel 10575 2800 2    60   Output ~ 0
PGA3_OUTN
$Comp
L GND #PWR053
U 1 1 54760474
P 1425 6025
F 0 "#PWR053" H 1425 6025 30  0001 C CNN
F 1 "GND" H 1425 5955 30  0001 C CNN
F 2 "" H 1425 6025 60  0000 C CNN
F 3 "" H 1425 6025 60  0000 C CNN
	1    1425 6025
	1    0    0    -1  
$EndComp
Wire Wire Line
	3175 5275 2000 5275
Wire Wire Line
	1600 5275 1425 5275
Wire Wire Line
	1425 5275 1425 5375
Wire Wire Line
	1425 5875 1425 6025
$Comp
L LED D7
U 1 1 547638CE
P 1800 5275
F 0 "D7" H 1775 5360 40  0000 C CNN
F 1 "LED" H 1800 5185 40  0000 C CNN
F 2 "Ruwai:LED-0805" H 1800 5275 60  0001 C CNN
F 3 "" H 1800 5275 60  0001 C CNN
F 4 "Knightbright" H 1800 5275 60  0001 C CNN "Manu"
F 5 "KP-2012SRC-PRV" H 1800 5275 60  0001 C CNN "Manu#"
F 6 "0805" H 1800 5275 60  0001 C CNN "Package"
	1    1800 5275
	-1   0    0    1   
$EndComp
$Comp
L Resistor R87
U 1 1 54767685
P 1425 5625
F 0 "R87" V 1505 5625 40  0000 C CNN
F 1 "2.2k" V 1432 5626 40  0000 C CNN
F 2 "Ruwai:Resistor_SMD0805_ReflowWave" V 1355 5625 30  0001 C CNN
F 3 "" V 1505 5625 30  0000 C CNN
F 4 "Yageo" H 1425 5125 60  0001 L CNN "Manu"
F 5 "RC0805FR-072K2L" H 1425 5025 60  0001 L CNN "Manu#"
F 6 "0805" H 1425 4925 60  0001 L CNN "Package"
F 7 "Custom Description" H 1425 4825 60  0001 L CNN "Desc"
	1    1425 5625
	-1   0    0    1   
$EndComp
$Comp
L PWR_FLAG #FLG054
U 1 1 5476A157
P 10200 4000
F 0 "#FLG054" H 10200 4095 30  0001 C CNN
F 1 "PWR_FLAG" H 10200 4180 30  0000 C CNN
F 2 "" H 10200 4000 60  0000 C CNN
F 3 "" H 10200 4000 60  0000 C CNN
	1    10200 4000
	0    1    1    0   
$EndComp
$Comp
L PWR_FLAG #FLG055
U 1 1 5476A19F
P 10150 5300
F 0 "#FLG055" H 10150 5395 30  0001 C CNN
F 1 "PWR_FLAG" H 10150 5480 30  0000 C CNN
F 2 "" H 10150 5300 60  0000 C CNN
F 3 "" H 10150 5300 60  0000 C CNN
	1    10150 5300
	0    1    1    0   
$EndComp
$Comp
L PWR_FLAG #FLG056
U 1 1 5476A1E0
P 2325 6750
F 0 "#FLG056" H 2325 6845 30  0001 C CNN
F 1 "PWR_FLAG" H 2325 6930 30  0000 C CNN
F 2 "" H 2325 6750 60  0000 C CNN
F 3 "" H 2325 6750 60  0000 C CNN
	1    2325 6750
	1    0    0    -1  
$EndComp
$Comp
L PWR_FLAG #FLG057
U 1 1 5476A4DF
P 5275 4125
F 0 "#FLG057" H 5275 4220 30  0001 C CNN
F 1 "PWR_FLAG" H 5275 4305 30  0000 C CNN
F 2 "" H 5275 4125 60  0000 C CNN
F 3 "" H 5275 4125 60  0000 C CNN
	1    5275 4125
	1    0    0    -1  
$EndComp
$Comp
L PWR_FLAG #FLG058
U 1 1 5476A58C
P 5300 4975
F 0 "#FLG058" H 5300 5070 30  0001 C CNN
F 1 "PWR_FLAG" H 5300 5155 30  0000 C CNN
F 2 "" H 5300 4975 60  0000 C CNN
F 3 "" H 5300 4975 60  0000 C CNN
	1    5300 4975
	1    0    0    -1  
$EndComp
$Comp
L PWR_FLAG #FLG059
U 1 1 5476A6A5
P 5600 5675
F 0 "#FLG059" H 5600 5770 30  0001 C CNN
F 1 "PWR_FLAG" H 5600 5855 30  0000 C CNN
F 2 "" H 5600 5675 60  0000 C CNN
F 3 "" H 5600 5675 60  0000 C CNN
	1    5600 5675
	1    0    0    -1  
$EndComp
Wire Wire Line
	2175 5175 2175 6750
$Comp
L GND #PWR060
U 1 1 5476B14D
P 4600 7625
F 0 "#PWR060" H 4600 7625 30  0001 C CNN
F 1 "GND" H 4600 7555 30  0001 C CNN
F 2 "" H 4600 7625 60  0000 C CNN
F 3 "" H 4600 7625 60  0000 C CNN
	1    4600 7625
	1    0    0    -1  
$EndComp
Wire Wire Line
	4400 6850 4600 6850
Wire Wire Line
	4600 6850 4600 7625
NoConn ~ 4400 6650
$Comp
L OPA2209 U9
U 1 1 59BCCEF9
P 6950 2650
F 0 "U9" H 7175 2825 60  0000 C CNN
F 1 "OPA2209" H 7275 2450 60  0000 C CNN
F 2 "SSOP_Packages:MSOP-8_3x3mm_Pitch0.65mm" H 6950 2200 60  0001 L CNN
F 3 "" H 6950 2650 60  0000 C CNN
F 4 "Texas Instruments" H 6950 2100 60  0001 L CNN "Manu"
F 5 "OPA2209AIDGKT" H 6950 2000 60  0001 L CNN "Manu#"
F 6 "VSSOP 8-pin" H 6950 1900 60  0001 L CNN "Package"
F 7 " " H 6950 1800 60  0001 L CNN "Desc"
	1    6950 2650
	1    0    0    -1  
$EndComp
$Comp
L OPA2209 U9
U 2 1 59BCD0E5
P 6950 1350
F 0 "U9" H 7175 1525 60  0000 C CNN
F 1 "OPA2209" H 7275 1150 60  0000 C CNN
F 2 "SSOP_Packages:MSOP-8_3x3mm_Pitch0.65mm" H 6950 900 60  0001 L CNN
F 3 "" H 6950 1350 60  0000 C CNN
F 4 "Texas Instruments" H 6950 800 60  0001 L CNN "Manu"
F 5 "OPA2209AIDGKT" H 6950 700 60  0001 L CNN "Manu#"
F 6 "VSSOP 8-pin" H 6950 600 60  0001 L CNN "Package"
F 7 " " H 6950 500 60  0001 L CNN "Desc"
	2    6950 1350
	1    0    0    1   
$EndComp
$Comp
L OPA2209 U10
U 1 1 59BCD2A2
P 9550 2800
F 0 "U10" H 9775 2975 60  0000 C CNN
F 1 "OPA2209" H 9875 2600 60  0000 C CNN
F 2 "SSOP_Packages:MSOP-8_3x3mm_Pitch0.65mm" H 9550 2350 60  0001 L CNN
F 3 "" H 9550 2800 60  0000 C CNN
F 4 "Texas Instruments" H 9550 2250 60  0001 L CNN "Manu"
F 5 "OPA2209AIDGKT" H 9550 2150 60  0001 L CNN "Manu#"
F 6 "VSSOP 8-pin" H 9550 2050 60  0001 L CNN "Package"
F 7 " " H 9550 1950 60  0001 L CNN "Desc"
	1    9550 2800
	1    0    0    -1  
$EndComp
$Comp
L OPA2209 U10
U 2 1 59BCD41C
P 9550 1200
F 0 "U10" H 9775 1375 60  0000 C CNN
F 1 "OPA2209" H 9875 1000 60  0000 C CNN
F 2 "SSOP_Packages:MSOP-8_3x3mm_Pitch0.65mm" H 9550 750 60  0001 L CNN
F 3 "" H 9550 1200 60  0000 C CNN
F 4 "Texas Instruments" H 9550 650 60  0001 L CNN "Manu"
F 5 "OPA2209AIDGKT" H 9550 550 60  0001 L CNN "Manu#"
F 6 "VSSOP 8-pin" H 9550 450 60  0001 L CNN "Package"
F 7 " " H 9550 350 60  0001 L CNN "Desc"
	2    9550 1200
	1    0    0    1   
$EndComp
$Comp
L OPA2209 U9
U 3 1 59BCF540
P 10150 4475
F 0 "U9" H 10375 4650 60  0000 C CNN
F 1 "OPA2209" H 10475 4275 60  0000 C CNN
F 2 "SSOP_Packages:MSOP-8_3x3mm_Pitch0.65mm" H 10150 4025 60  0001 L CNN
F 3 "" H 10150 4475 60  0000 C CNN
F 4 "Texas Instruments" H 10150 3925 60  0001 L CNN "Manu"
F 5 "OPA2209AIDGKT" H 10150 3825 60  0001 L CNN "Manu#"
F 6 "VSSOP 8-pin" H 10150 3725 60  0001 L CNN "Package"
F 7 " " H 10150 3625 60  0001 L CNN "Desc"
	3    10150 4475
	1    0    0    -1  
$EndComp
$Comp
L OPA2209 U10
U 3 1 59BCF6BC
P 10100 5775
F 0 "U10" H 10325 5950 60  0000 C CNN
F 1 "OPA2209" H 10425 5575 60  0000 C CNN
F 2 "SSOP_Packages:MSOP-8_3x3mm_Pitch0.65mm" H 10100 5325 60  0001 L CNN
F 3 "" H 10100 5775 60  0000 C CNN
F 4 "Texas Instruments" H 10100 5225 60  0001 L CNN "Manu"
F 5 "OPA2209AIDGKT" H 10100 5125 60  0001 L CNN "Manu#"
F 6 "VSSOP 8-pin" H 10100 5025 60  0001 L CNN "Package"
F 7 " " H 10100 4925 60  0001 L CNN "Desc"
	3    10100 5775
	1    0    0    -1  
$EndComp
$EndSCHEMATC
