EESchema Schematic File Version 2
LIBS:adc_main_shield-rescue
LIBS:ruwai
LIBS:power
LIBS:device
LIBS:transistors
LIBS:conn
LIBS:linear
LIBS:regul
LIBS:74xx
LIBS:cmos4000
LIBS:adc-dac
LIBS:memory
LIBS:xilinx
LIBS:microcontrollers
LIBS:dsp
LIBS:microchip
LIBS:analog_switches
LIBS:motorola
LIBS:texas
LIBS:intel
LIBS:audio
LIBS:interface
LIBS:digital-audio
LIBS:philips
LIBS:display
LIBS:cypress
LIBS:siliconi
LIBS:opto
LIBS:atmel
LIBS:contrib
LIBS:valves
LIBS:adc_main_shield-cache
EELAYER 25 0
EELAYER END
$Descr A4 11693 8268
encoding utf-8
Sheet 5 6
Title "Ruwai ADC Main Shield"
Date "2017-09-12"
Rev "3"
Comp "Copyright Mertl Research GmbH 2014 "
Comment1 ""
Comment2 ""
Comment3 ""
Comment4 "This documentation describes Open Hardware and is licensed under the CERN OHL v. 1.2."
$EndDescr
$Comp
L TPS73250 U9
U 1 1 5468E25D
P 3700 1650
F 0 "U9" H 3400 1400 60  0000 C CNN
F 1 "TPS73250" H 3550 1900 60  0000 C CNN
F 2 "Ruwai:SOT23-5" H 4050 1400 60  0001 C CNN
F 3 "" H 3750 1600 60  0000 C CNN
F 4 "Texas Instruments" H 3700 1250 60  0001 L CNN "Manu"
F 5 "TPS73250DBVR" H 3700 1150 60  0001 L CNN "Manu#"
F 6 "SOT23 5-pin" H 3700 1050 60  0001 L CNN "Package"
F 7 "Single Output LDO, 250mA, Fixed(5.0V), Fast Transient Response, Reverse Current Protection" H 3700 950 60  0001 L CNN "Desc"
	1    3700 1650
	1    0    0    -1  
$EndComp
$Comp
L Resistor R19
U 1 1 5468E327
P 2550 1250
F 0 "R19" V 2630 1250 40  0000 C CNN
F 1 "2.7k" V 2557 1251 40  0000 C CNN
F 2 "Ruwai:Resistor_SMD0805_ReflowWave" V 2480 1250 30  0001 C CNN
F 3 "" V 2630 1250 30  0000 C CNN
F 4 "Yageo" H 2550 750 60  0001 L CNN "Manu"
F 5 "RC0805FR-072K7L" H 2550 650 60  0001 L CNN "Manu#"
F 6 "0805" H 2550 550 60  0001 L CNN "Package"
F 7 "Custom Description" H 2550 450 60  0001 L CNN "Desc"
	1    2550 1250
	0    1    1    0   
$EndComp
$Comp
L Resistor R20
U 1 1 5468E3A8
P 2900 2250
F 0 "R20" V 2980 2250 40  0000 C CNN
F 1 "2.2k" V 2907 2251 40  0000 C CNN
F 2 "Ruwai:Resistor_SMD0805_ReflowWave" V 2830 2250 30  0001 C CNN
F 3 "" V 2980 2250 30  0000 C CNN
F 4 "Yageo" H 2900 1750 60  0001 L CNN "Manu"
F 5 "RC0805FR-072K2L" H 2900 1650 60  0001 L CNN "Manu#"
F 6 "0805" H 2900 1550 60  0001 L CNN "Package"
F 7 "Custom Description" H 2900 1450 60  0001 L CNN "Desc"
	1    2900 2250
	1    0    0    -1  
$EndComp
$Comp
L Resistor R17
U 1 1 5468E436
P 5700 2250
F 0 "R17" V 5780 2250 40  0000 C CNN
F 1 "6.8k" V 5707 2251 40  0000 C CNN
F 2 "Ruwai:Resistor_SMD0805_ReflowWave" V 5630 2250 30  0001 C CNN
F 3 "" V 5780 2250 30  0000 C CNN
F 4 "Yageo" H 5700 1750 60  0001 L CNN "Manu"
F 5 "RC0805FR-076K8L" H 5700 1650 60  0001 L CNN "Manu#"
F 6 "0805" H 5700 1550 60  0001 L CNN "Package"
F 7 "Custom Description" H 5700 1450 60  0001 L CNN "Desc"
	1    5700 2250
	1    0    0    -1  
$EndComp
$Comp
L Resistor R18
U 1 1 5468E4AD
P 4950 1150
F 0 "R18" V 5030 1150 40  0000 C CNN
F 1 "1" V 4957 1151 40  0000 C CNN
F 2 "Ruwai:Resistor_SMD0102_ReflowWave" V 4880 1150 30  0001 C CNN
F 3 "" V 5030 1150 30  0000 C CNN
F 4 "Yageo" H 4950 650 60  0001 L CNN "Manu"
F 5 "RC0805FR-071RL" H 4950 550 60  0001 L CNN "Manu#"
F 6 "0805" H 4950 450 60  0001 L CNN "Package"
F 7 "Custom Description" H 4950 350 60  0001 L CNN "Desc"
	1    4950 1150
	1    0    0    -1  
$EndComp
$Comp
L Capacitor C31
U 1 1 5468E5A7
P 2150 2250
F 0 "C31" H 2150 2350 40  0000 L CNN
F 1 "10nF" H 2156 2165 40  0000 L CNN
F 2 "Ruwai:Capacitor_SMD0805_ReflowWave" H 2188 2100 30  0001 C CNN
F 3 "" H 2150 2350 60  0000 C CNN
F 4 "Kemet" H 2200 1850 60  0001 L CNN "Manu"
F 5 "C0805C103J3GACTU" H 2200 1750 60  0001 L CNN "Manu#"
F 6 "0805" H 2200 1650 60  0001 L CNN "Package"
F 7 "Custom Description" H 2150 1900 60  0001 L CNN "Desc"
	1    2150 2250
	1    0    0    -1  
$EndComp
$Comp
L Capacitor C30
U 1 1 5468E68E
P 1800 2250
F 0 "C30" H 1800 2350 40  0000 L CNN
F 1 "2.2uF" H 1806 2165 40  0000 L CNN
F 2 "Ruwai:Capacitor_SMD0805_ReflowWave" H 1838 2100 30  0001 C CNN
F 3 "" H 1800 2350 60  0000 C CNN
F 4 "Murata" H 1850 1850 60  0001 L CNN "Manu"
F 5 "GRM21BR71E225KA73L" H 1850 1750 60  0001 L CNN "Manu#"
F 6 "0805" H 1850 1650 60  0001 L CNN "Package"
F 7 "Custom Description" H 1800 1900 60  0001 L CNN "Desc"
	1    1800 2250
	1    0    0    -1  
$EndComp
$Comp
L Capacitor C32
U 1 1 5468E6D1
P 4550 2250
F 0 "C32" H 4550 2350 40  0000 L CNN
F 1 "10nF" H 4556 2165 40  0000 L CNN
F 2 "Ruwai:Capacitor_SMD0805_ReflowWave" H 4588 2100 30  0001 C CNN
F 3 "" H 4550 2350 60  0000 C CNN
F 4 "Kemet" H 4600 1850 60  0001 L CNN "Manu"
F 5 "C0805C103J3GACTU" H 4600 1750 60  0001 L CNN "Manu#"
F 6 "0805" H 4600 1650 60  0001 L CNN "Package"
F 7 "Custom Description" H 4550 1900 60  0001 L CNN "Desc"
	1    4550 2250
	1    0    0    -1  
$EndComp
$Comp
L Capacitor C33
U 1 1 5468E6F4
P 4950 2250
F 0 "C33" H 4950 2350 40  0000 L CNN
F 1 "2.2uF" H 4956 2165 40  0000 L CNN
F 2 "Ruwai:Capacitor_SMD0805_ReflowWave" H 4988 2100 30  0001 C CNN
F 3 "" H 4950 2350 60  0000 C CNN
F 4 "Murata" H 5000 1850 60  0001 L CNN "Manu"
F 5 "GRM21BR71E225KA73L" H 5000 1750 60  0001 L CNN "Manu#"
F 6 "0805" H 5000 1650 60  0001 L CNN "Package"
F 7 "Custom Description" H 4950 1900 60  0001 L CNN "Desc"
	1    4950 2250
	1    0    0    -1  
$EndComp
$Comp
L GND-RESCUE-adc_main_shield #PWR073
U 1 1 546907ED
P 2900 2650
F 0 "#PWR073" H 2900 2650 30  0001 C CNN
F 1 "GND" H 2900 2580 30  0001 C CNN
F 2 "" H 2900 2650 60  0000 C CNN
F 3 "" H 2900 2650 60  0000 C CNN
	1    2900 2650
	1    0    0    -1  
$EndComp
$Comp
L GND-RESCUE-adc_main_shield #PWR074
U 1 1 54690809
P 2150 2650
F 0 "#PWR074" H 2150 2650 30  0001 C CNN
F 1 "GND" H 2150 2580 30  0001 C CNN
F 2 "" H 2150 2650 60  0000 C CNN
F 3 "" H 2150 2650 60  0000 C CNN
	1    2150 2650
	1    0    0    -1  
$EndComp
$Comp
L GND-RESCUE-adc_main_shield #PWR075
U 1 1 54690819
P 1800 2650
F 0 "#PWR075" H 1800 2650 30  0001 C CNN
F 1 "GND" H 1800 2580 30  0001 C CNN
F 2 "" H 1800 2650 60  0000 C CNN
F 3 "" H 1800 2650 60  0000 C CNN
	1    1800 2650
	1    0    0    -1  
$EndComp
$Comp
L GND-RESCUE-adc_main_shield #PWR076
U 1 1 54690871
P 4550 2650
F 0 "#PWR076" H 4550 2650 30  0001 C CNN
F 1 "GND" H 4550 2580 30  0001 C CNN
F 2 "" H 4550 2650 60  0000 C CNN
F 3 "" H 4550 2650 60  0000 C CNN
	1    4550 2650
	1    0    0    -1  
$EndComp
$Comp
L GND-RESCUE-adc_main_shield #PWR077
U 1 1 54690897
P 4950 2650
F 0 "#PWR077" H 4950 2650 30  0001 C CNN
F 1 "GND" H 4950 2580 30  0001 C CNN
F 2 "" H 4950 2650 60  0000 C CNN
F 3 "" H 4950 2650 60  0000 C CNN
	1    4950 2650
	1    0    0    -1  
$EndComp
$Comp
L GND-RESCUE-adc_main_shield #PWR078
U 1 1 546908A7
P 5700 2650
F 0 "#PWR078" H 5700 2650 30  0001 C CNN
F 1 "GND" H 5700 2580 30  0001 C CNN
F 2 "" H 5700 2650 60  0000 C CNN
F 3 "" H 5700 2650 60  0000 C CNN
	1    5700 2650
	1    0    0    -1  
$EndComp
Wire Wire Line
	1800 2450 1800 2650
Wire Wire Line
	2150 2450 2150 2650
Wire Wire Line
	2900 2500 2900 2650
Wire Wire Line
	4550 2450 4550 2650
Wire Wire Line
	4950 2450 4950 2650
Wire Wire Line
	5700 2500 5700 2650
Wire Wire Line
	3050 1750 2900 1750
Wire Wire Line
	2900 1250 2900 2000
Wire Wire Line
	2900 1250 2800 1250
Connection ~ 2900 1750
Wire Wire Line
	3050 1650 2650 1650
Wire Wire Line
	2650 1650 2650 2650
$Comp
L GND-RESCUE-adc_main_shield #PWR079
U 1 1 546909EA
P 2650 2650
F 0 "#PWR079" H 2650 2650 30  0001 C CNN
F 1 "GND" H 2650 2580 30  0001 C CNN
F 2 "" H 2650 2650 60  0000 C CNN
F 3 "" H 2650 2650 60  0000 C CNN
	1    2650 2650
	1    0    0    -1  
$EndComp
Wire Wire Line
	2150 1250 2150 2050
Wire Wire Line
	2150 1250 2300 1250
Wire Wire Line
	1600 1550 3050 1550
Connection ~ 2150 1550
Wire Wire Line
	1800 2050 1800 1550
Connection ~ 1800 1550
Wire Wire Line
	1000 1550 1200 1550
$Comp
L inductor L9
U 1 1 54690FEE
P 1400 1550
F 0 "L9" H 1400 1600 40  0000 C BNN
F 1 "10uH" H 1400 1500 40  0000 C CNN
F 2 "Ruwai:Inductor_SMD0805_ReflowWave" H 1396 1550 10  0001 C CNN
F 3 "" H 1300 1550 60  0000 C CNN
F 4 "Taiyo Yuden" H 1400 1550 60  0001 L BNN "Manu"
F 5 "BRL2012T100M" H 1400 1550 60  0001 L BNN "Manu#"
F 6 "0805" H 1400 1550 60  0001 L BNN "Package"
F 7 "Custom description." H 1400 1550 60  0001 C CNN "Desc"
	1    1400 1550
	1    0    0    -1  
$EndComp
Wire Wire Line
	4350 1750 4550 1750
Wire Wire Line
	4550 1750 4550 2050
Wire Wire Line
	4350 1550 5150 1550
Wire Wire Line
	5550 1550 5700 1550
Wire Wire Line
	5700 1550 5700 2000
Wire Wire Line
	4950 1400 4950 2050
Connection ~ 4950 1550
Wire Wire Line
	4950 900  4950 750 
$Comp
L LED D6
U 1 1 54691AA1
P 5350 1550
F 0 "D6" H 5325 1635 40  0000 C CNN
F 1 "LED green" H 5350 1460 40  0000 C CNN
F 2 "Ruwai:LED-0805" H 5350 1550 60  0001 C CNN
F 3 "" H 5350 1550 60  0000 C CNN
F 4 "Knightbright" H 5350 1550 60  0001 C CNN "Manu"
F 5 "KP-2012SGC" H 5350 1550 60  0001 C CNN "Manu#"
F 6 "0805" H 5350 1550 60  0001 C CNN "Package"
F 7 "LED green" H 5350 1550 60  0001 C CNN "Desc"
	1    5350 1550
	1    0    0    -1  
$EndComp
Wire Wire Line
	4950 750  5200 750 
$Comp
L TPS73250 U3
U 1 1 546924F9
P 3700 5950
F 0 "U3" H 3400 5700 60  0000 C CNN
F 1 "TPS73250" H 3550 6200 60  0000 C CNN
F 2 "Ruwai:SOT23-5" H 4050 5700 60  0001 C CNN
F 3 "" H 3750 5900 60  0000 C CNN
F 4 "Texas Instruments" H 3700 5550 60  0001 L CNN "Manu"
F 5 "TPS73250DBVR" H 3700 5450 60  0001 L CNN "Manu#"
F 6 "SOT23 5-pin" H 3700 5350 60  0001 L CNN "Package"
F 7 "Single Output LDO, 250mA, Fixed(5.0V), Fast Transient Response, Reverse Current Protection" H 3700 5250 60  0001 L CNN "Desc"
	1    3700 5950
	1    0    0    -1  
$EndComp
$Comp
L Resistor R15
U 1 1 54692503
P 2550 5550
F 0 "R15" V 2630 5550 40  0000 C CNN
F 1 "2.7k" V 2557 5551 40  0000 C CNN
F 2 "Ruwai:Resistor_SMD0805_ReflowWave" V 2480 5550 30  0001 C CNN
F 3 "" V 2630 5550 30  0000 C CNN
F 4 "Yageo" H 2550 5050 60  0001 L CNN "Manu"
F 5 "RC0805FR-072K7L" H 2550 4950 60  0001 L CNN "Manu#"
F 6 "0805" H 2550 4850 60  0001 L CNN "Package"
F 7 "Custom Description" H 2550 4750 60  0001 L CNN "Desc"
	1    2550 5550
	0    1    1    0   
$EndComp
$Comp
L Resistor R16
U 1 1 5469250D
P 2900 6550
F 0 "R16" V 2980 6550 40  0000 C CNN
F 1 "2.2k" V 2907 6551 40  0000 C CNN
F 2 "Ruwai:Resistor_SMD0805_ReflowWave" V 2830 6550 30  0001 C CNN
F 3 "" V 2980 6550 30  0000 C CNN
F 4 "Yageo" H 2900 6050 60  0001 L CNN "Manu"
F 5 "RC0805FR-072K2L" H 2900 5950 60  0001 L CNN "Manu#"
F 6 "0805" H 2900 5850 60  0001 L CNN "Package"
F 7 "Custom Description" H 2900 5750 60  0001 L CNN "Desc"
	1    2900 6550
	1    0    0    -1  
$EndComp
$Comp
L Resistor R13
U 1 1 54692517
P 5700 6550
F 0 "R13" V 5780 6550 40  0000 C CNN
F 1 "6.8k" V 5707 6551 40  0000 C CNN
F 2 "Ruwai:Resistor_SMD0805_ReflowWave" V 5630 6550 30  0001 C CNN
F 3 "" V 5780 6550 30  0000 C CNN
F 4 "Yageo" H 5700 6050 60  0001 L CNN "Manu"
F 5 "RC0805FR-076K8L" H 5700 5950 60  0001 L CNN "Manu#"
F 6 "0805" H 5700 5850 60  0001 L CNN "Package"
F 7 "Custom Description" H 5700 5750 60  0001 L CNN "Desc"
	1    5700 6550
	1    0    0    -1  
$EndComp
$Comp
L Resistor R14
U 1 1 54692521
P 4950 5450
F 0 "R14" V 5030 5450 40  0000 C CNN
F 1 "1" V 4957 5451 40  0000 C CNN
F 2 "Ruwai:Resistor_SMD0102_ReflowWave" V 4880 5450 30  0001 C CNN
F 3 "" V 5030 5450 30  0000 C CNN
F 4 "Yageo" H 4950 4950 60  0001 L CNN "Manu"
F 5 "RC0805FR-071RL" H 4950 4850 60  0001 L CNN "Manu#"
F 6 "0805" H 4950 4750 60  0001 L CNN "Package"
F 7 "Custom Description" H 4950 4650 60  0001 L CNN "Desc"
	1    4950 5450
	1    0    0    -1  
$EndComp
$Comp
L Capacitor C27
U 1 1 5469252B
P 2150 6550
F 0 "C27" H 2150 6650 40  0000 L CNN
F 1 "10nF" H 2156 6465 40  0000 L CNN
F 2 "Ruwai:Capacitor_SMD0805_ReflowWave" H 2188 6400 30  0001 C CNN
F 3 "" H 2150 6650 60  0000 C CNN
F 4 "Kemet" H 2200 6150 60  0001 L CNN "Manu"
F 5 "C0805C103J3GACTU" H 2200 6050 60  0001 L CNN "Manu#"
F 6 "0805" H 2200 5950 60  0001 L CNN "Package"
F 7 "Custom Description" H 2150 6200 60  0001 L CNN "Desc"
	1    2150 6550
	1    0    0    -1  
$EndComp
$Comp
L Capacitor C26
U 1 1 54692535
P 1800 6550
F 0 "C26" H 1800 6650 40  0000 L CNN
F 1 "2.2uF" H 1806 6465 40  0000 L CNN
F 2 "Ruwai:Capacitor_SMD0805_ReflowWave" H 1838 6400 30  0001 C CNN
F 3 "" H 1800 6650 60  0000 C CNN
F 4 "Murata" H 1850 6150 60  0001 L CNN "Manu"
F 5 "GRM21BR71E225KA73L" H 1850 6050 60  0001 L CNN "Manu#"
F 6 "0805" H 1850 5950 60  0001 L CNN "Package"
F 7 "Custom Description" H 1800 6200 60  0001 L CNN "Desc"
	1    1800 6550
	1    0    0    -1  
$EndComp
$Comp
L Capacitor C28
U 1 1 5469253F
P 4550 6550
F 0 "C28" H 4550 6650 40  0000 L CNN
F 1 "10nF" H 4556 6465 40  0000 L CNN
F 2 "Ruwai:Capacitor_SMD0805_ReflowWave" H 4588 6400 30  0001 C CNN
F 3 "" H 4550 6650 60  0000 C CNN
F 4 "Kemet" H 4600 6150 60  0001 L CNN "Manu"
F 5 "C0805C103J3GACTU" H 4600 6050 60  0001 L CNN "Manu#"
F 6 "0805" H 4600 5950 60  0001 L CNN "Package"
F 7 "Custom Description" H 4550 6200 60  0001 L CNN "Desc"
	1    4550 6550
	1    0    0    -1  
$EndComp
$Comp
L Capacitor C29
U 1 1 54692549
P 4950 6550
F 0 "C29" H 4950 6650 40  0000 L CNN
F 1 "2.2uF" H 4956 6465 40  0000 L CNN
F 2 "Ruwai:Capacitor_SMD0805_ReflowWave" H 4988 6400 30  0001 C CNN
F 3 "" H 4950 6650 60  0000 C CNN
F 4 "Murata" H 5000 6150 60  0001 L CNN "Manu"
F 5 "GRM21BR71E225KA73L" H 5000 6050 60  0001 L CNN "Manu#"
F 6 "0805" H 5000 5950 60  0001 L CNN "Package"
F 7 "Custom Description" H 4950 6200 60  0001 L CNN "Desc"
	1    4950 6550
	1    0    0    -1  
$EndComp
$Comp
L GND-RESCUE-adc_main_shield #PWR080
U 1 1 5469254F
P 2900 6950
F 0 "#PWR080" H 2900 6950 30  0001 C CNN
F 1 "GND" H 2900 6880 30  0001 C CNN
F 2 "" H 2900 6950 60  0000 C CNN
F 3 "" H 2900 6950 60  0000 C CNN
	1    2900 6950
	1    0    0    -1  
$EndComp
$Comp
L GND-RESCUE-adc_main_shield #PWR081
U 1 1 54692555
P 2150 6950
F 0 "#PWR081" H 2150 6950 30  0001 C CNN
F 1 "GND" H 2150 6880 30  0001 C CNN
F 2 "" H 2150 6950 60  0000 C CNN
F 3 "" H 2150 6950 60  0000 C CNN
	1    2150 6950
	1    0    0    -1  
$EndComp
$Comp
L GND-RESCUE-adc_main_shield #PWR082
U 1 1 5469255B
P 1800 6950
F 0 "#PWR082" H 1800 6950 30  0001 C CNN
F 1 "GND" H 1800 6880 30  0001 C CNN
F 2 "" H 1800 6950 60  0000 C CNN
F 3 "" H 1800 6950 60  0000 C CNN
	1    1800 6950
	1    0    0    -1  
$EndComp
$Comp
L GND-RESCUE-adc_main_shield #PWR083
U 1 1 54692561
P 4550 6950
F 0 "#PWR083" H 4550 6950 30  0001 C CNN
F 1 "GND" H 4550 6880 30  0001 C CNN
F 2 "" H 4550 6950 60  0000 C CNN
F 3 "" H 4550 6950 60  0000 C CNN
	1    4550 6950
	1    0    0    -1  
$EndComp
$Comp
L GND-RESCUE-adc_main_shield #PWR084
U 1 1 54692567
P 4950 6950
F 0 "#PWR084" H 4950 6950 30  0001 C CNN
F 1 "GND" H 4950 6880 30  0001 C CNN
F 2 "" H 4950 6950 60  0000 C CNN
F 3 "" H 4950 6950 60  0000 C CNN
	1    4950 6950
	1    0    0    -1  
$EndComp
$Comp
L GND-RESCUE-adc_main_shield #PWR085
U 1 1 5469256D
P 5700 6950
F 0 "#PWR085" H 5700 6950 30  0001 C CNN
F 1 "GND" H 5700 6880 30  0001 C CNN
F 2 "" H 5700 6950 60  0000 C CNN
F 3 "" H 5700 6950 60  0000 C CNN
	1    5700 6950
	1    0    0    -1  
$EndComp
Wire Wire Line
	1800 6750 1800 6950
Wire Wire Line
	2150 6750 2150 6950
Wire Wire Line
	2900 6800 2900 6950
Wire Wire Line
	4550 6750 4550 6950
Wire Wire Line
	4950 6750 4950 6950
Wire Wire Line
	5700 6800 5700 6950
Wire Wire Line
	3050 6050 2900 6050
Wire Wire Line
	2900 5550 2900 6300
Wire Wire Line
	2900 5550 2800 5550
Connection ~ 2900 6050
Wire Wire Line
	3050 5950 2650 5950
Wire Wire Line
	2650 5950 2650 6950
$Comp
L GND-RESCUE-adc_main_shield #PWR086
U 1 1 5469257F
P 2650 6950
F 0 "#PWR086" H 2650 6950 30  0001 C CNN
F 1 "GND" H 2650 6880 30  0001 C CNN
F 2 "" H 2650 6950 60  0000 C CNN
F 3 "" H 2650 6950 60  0000 C CNN
	1    2650 6950
	1    0    0    -1  
$EndComp
Wire Wire Line
	2150 5550 2150 6350
Wire Wire Line
	2150 5550 2300 5550
Wire Wire Line
	1600 5850 3050 5850
Connection ~ 2150 5850
Wire Wire Line
	1800 6350 1800 5850
Connection ~ 1800 5850
Wire Wire Line
	1000 5850 1200 5850
Wire Wire Line
	4350 6050 4550 6050
Wire Wire Line
	4550 6050 4550 6350
Wire Wire Line
	4350 5850 5150 5850
Wire Wire Line
	5550 5850 5700 5850
Wire Wire Line
	5700 5850 5700 6300
Wire Wire Line
	4950 5700 4950 6350
Connection ~ 4950 5850
Wire Wire Line
	4950 5200 4950 5050
$Comp
L LED D5
U 1 1 5469259A
P 5350 5850
F 0 "D5" H 5325 5935 40  0000 C CNN
F 1 "LED green" H 5350 5760 40  0000 C CNN
F 2 "Ruwai:LED-0805" H 5350 5850 60  0001 C CNN
F 3 "" H 5350 5850 60  0000 C CNN
F 4 "Knightbright" H 5350 5850 60  0001 C CNN "Manu"
F 5 "KP-2012SGC" H 5350 5850 60  0001 C CNN "Manu#"
F 6 "0805" H 5350 5850 60  0001 C CNN "Package"
F 7 "LED green" H 5350 5850 60  0001 C CNN "Desc"
	1    5350 5850
	1    0    0    -1  
$EndComp
Wire Wire Line
	4950 5050 5200 5050
$Comp
L Resistor R7
U 1 1 54694B47
P 10500 4500
F 0 "R7" V 10580 4500 40  0000 C CNN
F 1 "2.2k" V 10507 4501 40  0000 C CNN
F 2 "Ruwai:Resistor_SMD0805_ReflowWave" V 10430 4500 30  0001 C CNN
F 3 "" V 10580 4500 30  0000 C CNN
F 4 "Yageo" H 10500 4000 60  0001 L CNN "Manu"
F 5 "RC0805FR-072K2L" H 10500 3900 60  0001 L CNN "Manu#"
F 6 "0805" H 10500 3800 60  0001 L CNN "Package"
F 7 "Custom Description" H 10500 3700 60  0001 L CNN "Desc"
	1    10500 4500
	1    0    0    -1  
$EndComp
$Comp
L Resistor R8
U 1 1 54694B51
P 9850 3400
F 0 "R8" V 9930 3400 40  0000 C CNN
F 1 "1" V 9857 3401 40  0000 C CNN
F 2 "Ruwai:Resistor_SMD0102_ReflowWave" V 9780 3400 30  0001 C CNN
F 3 "" V 9930 3400 30  0000 C CNN
F 4 "Yageo" H 9850 2900 60  0001 L CNN "Manu"
F 5 "RC0805FR-071RL" H 9850 2800 60  0001 L CNN "Manu#"
F 6 "0805" H 9850 2700 60  0001 L CNN "Package"
F 7 "Custom Description" H 9850 2600 60  0001 L CNN "Desc"
	1    9850 3400
	1    0    0    -1  
$EndComp
$Comp
L Capacitor C19
U 1 1 54694B5B
P 7700 4500
F 0 "C19" H 7700 4600 40  0000 L CNN
F 1 "10nF" H 7706 4415 40  0000 L CNN
F 2 "Ruwai:Capacitor_SMD0805_ReflowWave" H 7738 4350 30  0001 C CNN
F 3 "" H 7700 4600 60  0000 C CNN
F 4 "Kemet" H 7750 4100 60  0001 L CNN "Manu"
F 5 "C0805C103J3GACTU" H 7750 4000 60  0001 L CNN "Manu#"
F 6 "0805" H 7750 3900 60  0001 L CNN "Package"
F 7 "Custom Description" H 7700 4150 60  0001 L CNN "Desc"
	1    7700 4500
	1    0    0    -1  
$EndComp
$Comp
L Capacitor C18
U 1 1 54694B65
P 7350 4500
F 0 "C18" H 7350 4600 40  0000 L CNN
F 1 "2.2uF" H 7356 4415 40  0000 L CNN
F 2 "Ruwai:Capacitor_SMD0805_ReflowWave" H 7388 4350 30  0001 C CNN
F 3 "" H 7350 4600 60  0000 C CNN
F 4 "Murata" H 7400 4100 60  0001 L CNN "Manu"
F 5 "GRM21BR71E225KA73L" H 7400 4000 60  0001 L CNN "Manu#"
F 6 "0805" H 7400 3900 60  0001 L CNN "Package"
F 7 "Custom Description" H 7350 4150 60  0001 L CNN "Desc"
	1    7350 4500
	1    0    0    -1  
$EndComp
$Comp
L Capacitor C20
U 1 1 54694B6F
P 9550 4500
F 0 "C20" H 9550 4600 40  0000 L CNN
F 1 "10nF" H 9556 4415 40  0000 L CNN
F 2 "Ruwai:Capacitor_SMD0805_ReflowWave" H 9588 4350 30  0001 C CNN
F 3 "" H 9550 4600 60  0000 C CNN
F 4 "Kemet" H 9600 4100 60  0001 L CNN "Manu"
F 5 "C0805C103J3GACTU" H 9600 4000 60  0001 L CNN "Manu#"
F 6 "0805" H 9600 3900 60  0001 L CNN "Package"
F 7 "Custom Description" H 9550 4150 60  0001 L CNN "Desc"
	1    9550 4500
	1    0    0    -1  
$EndComp
$Comp
L Capacitor C21
U 1 1 54694B79
P 9850 4500
F 0 "C21" H 9850 4600 40  0000 L CNN
F 1 "2.2uF" H 9856 4415 40  0000 L CNN
F 2 "Ruwai:Capacitor_SMD0805_ReflowWave" H 9888 4350 30  0001 C CNN
F 3 "" H 9850 4600 60  0000 C CNN
F 4 "Murata" H 9900 4100 60  0001 L CNN "Manu"
F 5 "GRM21BR71E225KA73L" H 9900 4000 60  0001 L CNN "Manu#"
F 6 "0805" H 9900 3900 60  0001 L CNN "Package"
F 7 "Custom Description" H 9850 4150 60  0001 L CNN "Desc"
	1    9850 4500
	1    0    0    -1  
$EndComp
$Comp
L GND-RESCUE-adc_main_shield #PWR087
U 1 1 54694B85
P 7700 4900
F 0 "#PWR087" H 7700 4900 30  0001 C CNN
F 1 "GND" H 7700 4830 30  0001 C CNN
F 2 "" H 7700 4900 60  0000 C CNN
F 3 "" H 7700 4900 60  0000 C CNN
	1    7700 4900
	1    0    0    -1  
$EndComp
$Comp
L GND-RESCUE-adc_main_shield #PWR088
U 1 1 54694B8B
P 7350 4900
F 0 "#PWR088" H 7350 4900 30  0001 C CNN
F 1 "GND" H 7350 4830 30  0001 C CNN
F 2 "" H 7350 4900 60  0000 C CNN
F 3 "" H 7350 4900 60  0000 C CNN
	1    7350 4900
	1    0    0    -1  
$EndComp
$Comp
L GND-RESCUE-adc_main_shield #PWR089
U 1 1 54694B91
P 9550 4900
F 0 "#PWR089" H 9550 4900 30  0001 C CNN
F 1 "GND" H 9550 4830 30  0001 C CNN
F 2 "" H 9550 4900 60  0000 C CNN
F 3 "" H 9550 4900 60  0000 C CNN
	1    9550 4900
	1    0    0    -1  
$EndComp
$Comp
L GND-RESCUE-adc_main_shield #PWR090
U 1 1 54694B97
P 9850 4900
F 0 "#PWR090" H 9850 4900 30  0001 C CNN
F 1 "GND" H 9850 4830 30  0001 C CNN
F 2 "" H 9850 4900 60  0000 C CNN
F 3 "" H 9850 4900 60  0000 C CNN
	1    9850 4900
	1    0    0    -1  
$EndComp
$Comp
L GND-RESCUE-adc_main_shield #PWR091
U 1 1 54694B9D
P 10500 4900
F 0 "#PWR091" H 10500 4900 30  0001 C CNN
F 1 "GND" H 10500 4830 30  0001 C CNN
F 2 "" H 10500 4900 60  0000 C CNN
F 3 "" H 10500 4900 60  0000 C CNN
	1    10500 4900
	1    0    0    -1  
$EndComp
Wire Wire Line
	7350 4700 7350 4900
Wire Wire Line
	7700 4700 7700 4900
Wire Wire Line
	9550 4700 9550 4900
Wire Wire Line
	9850 4700 9850 4900
Wire Wire Line
	10500 4750 10500 4900
Wire Wire Line
	9400 4000 9550 4000
Wire Wire Line
	9550 4000 9550 4300
Wire Wire Line
	9400 3800 10000 3800
Wire Wire Line
	10500 3800 10500 4250
Wire Wire Line
	9850 3650 9850 4300
Connection ~ 9850 3800
Wire Wire Line
	9850 3150 9850 3000
$Comp
L LED D3
U 1 1 54694BC3
P 10200 3800
F 0 "D3" H 10175 3885 40  0000 C CNN
F 1 "LED green" H 10200 3710 40  0000 C CNN
F 2 "Ruwai:LED-0805" H 10200 3800 60  0001 C CNN
F 3 "" H 10200 3800 60  0000 C CNN
F 4 "Knightbright" H 10200 3800 60  0001 C CNN "Manu"
F 5 "KP-2012SGC" H 10200 3800 60  0001 C CNN "Manu#"
F 6 "0805" H 10200 3800 60  0001 C CNN "Package"
F 7 "LED green" H 10200 3800 60  0001 C CNN "Desc"
	1    10200 3800
	1    0    0    -1  
$EndComp
Wire Wire Line
	9850 3000 10100 3000
Wire Wire Line
	10400 3800 10500 3800
$Comp
L GND-RESCUE-adc_main_shield #PWR092
U 1 1 546953C4
P 8000 4900
F 0 "#PWR092" H 8000 4900 30  0001 C CNN
F 1 "GND" H 8000 4830 30  0001 C CNN
F 2 "" H 8000 4900 60  0000 C CNN
F 3 "" H 8000 4900 60  0000 C CNN
	1    8000 4900
	1    0    0    -1  
$EndComp
Wire Wire Line
	8100 4000 8000 4000
Wire Wire Line
	8000 3900 8000 4900
Wire Wire Line
	8100 3900 8000 3900
Connection ~ 8000 4000
$Comp
L TPS79133 U8
U 1 1 546955DA
P 8750 3900
F 0 "U8" H 8450 3650 60  0000 C CNN
F 1 "TPS79133" H 8600 4150 60  0000 C CNN
F 2 "Ruwai:SOT23-5" H 9100 3650 60  0001 C CNN
F 3 "" H 8800 3850 60  0000 C CNN
F 4 "Texas Instruments" H 8750 3450 60  0001 L CNN "Manu"
F 5 "TPS79133DBVT" H 8750 3350 60  0001 L CNN "Manu#"
F 6 "SOT23 5-pin" H 8750 3250 60  0001 L CNN "Package"
F 7 "Single Output LDO, 100mA, Fixed(3.3V), High PSRR, Low Noise" H 8750 3150 60  0001 L CNN "Desc"
	1    8750 3900
	1    0    0    -1  
$EndComp
Wire Wire Line
	7700 4300 7700 3800
Wire Wire Line
	7200 3800 8100 3800
Wire Wire Line
	7350 4300 7350 3800
Connection ~ 7700 3800
$Comp
L Resistor R22
U 1 1 54696291
P 6950 3800
F 0 "R22" V 7030 3800 40  0000 C CNN
F 1 "10" V 6957 3801 40  0000 C CNN
F 2 "Ruwai:Resistor_SMD0805_ReflowWave" V 6880 3800 30  0001 C CNN
F 3 "" V 7030 3800 30  0000 C CNN
F 4 "Yageo" H 6950 3300 60  0001 L CNN "Manu"
F 5 "RC0805FR-0710RL" H 6950 3200 60  0001 L CNN "Manu#"
F 6 "0805" H 6950 3100 60  0001 L CNN "Package"
F 7 "Custom Description" H 6950 3000 60  0001 L CNN "Desc"
	1    6950 3800
	0    1    1    0   
$EndComp
$Comp
L DIODE D10
U 1 1 5469633E
P 6250 3800
F 0 "D10" H 6250 3900 40  0000 C CNN
F 1 "S1K" H 6250 3700 40  0000 C CNN
F 2 "Ruwai:diode_SMA_reflow" H 6250 3800 60  0001 C CNN
F 3 "" H 6250 3800 60  0000 C CNN
F 4 "Taiwan Semiconductor" H 6250 3800 60  0001 C CNN "Manu"
F 5 "HS1K R3" H 6250 3800 60  0001 C CNN "Manu#"
F 6 "SMA" H 6250 3800 60  0001 C CNN "Package"
F 7 "Custom description." H 6250 3800 60  0001 C CNN "Desc"
	1    6250 3800
	1    0    0    -1  
$EndComp
Connection ~ 7350 3800
Wire Wire Line
	6450 3800 6700 3800
Wire Wire Line
	5800 3800 6050 3800
Wire Wire Line
	5050 3800 5400 3800
Text HLabel 5200 750  2    60   Output ~ 0
5V
Text HLabel 1000 1550 0    60   Input ~ 0
5.1V
Text HLabel 5050 3800 0    60   Input ~ 0
5.1V
Text HLabel 10100 3000 2    60   Output ~ 0
3.3V_P
Text HLabel 5200 5050 2    60   Output ~ 0
5V_PGA
Text HLabel 1000 5850 0    60   Input ~ 0
5.1V
$Comp
L PWR_FLAG #FLG093
U 1 1 546E2F7D
P 5100 700
F 0 "#FLG093" H 5100 795 30  0001 C CNN
F 1 "PWR_FLAG" H 5100 880 30  0000 C CNN
F 2 "" H 5100 700 60  0000 C CNN
F 3 "" H 5100 700 60  0000 C CNN
	1    5100 700 
	1    0    0    -1  
$EndComp
Wire Wire Line
	5100 700  5100 750 
Connection ~ 5100 750 
$Comp
L PWR_FLAG #FLG094
U 1 1 546E7842
P 3050 5750
F 0 "#FLG094" H 3050 5845 30  0001 C CNN
F 1 "PWR_FLAG" H 3050 5930 30  0000 C CNN
F 2 "" H 3050 5750 60  0000 C CNN
F 3 "" H 3050 5750 60  0000 C CNN
	1    3050 5750
	1    0    0    -1  
$EndComp
Wire Wire Line
	3050 5850 3050 5750
$Comp
L PWR_FLAG #FLG095
U 1 1 546E798C
P 3050 1450
F 0 "#FLG095" H 3050 1545 30  0001 C CNN
F 1 "PWR_FLAG" H 3050 1630 30  0000 C CNN
F 2 "" H 3050 1450 60  0000 C CNN
F 3 "" H 3050 1450 60  0000 C CNN
	1    3050 1450
	1    0    0    -1  
$EndComp
Wire Wire Line
	3050 1550 3050 1450
$Comp
L PWR_FLAG #FLG096
U 1 1 546E7A5D
P 8000 3700
F 0 "#FLG096" H 8000 3795 30  0001 C CNN
F 1 "PWR_FLAG" H 8000 3880 30  0000 C CNN
F 2 "" H 8000 3700 60  0000 C CNN
F 3 "" H 8000 3700 60  0000 C CNN
	1    8000 3700
	1    0    0    -1  
$EndComp
Wire Wire Line
	8000 3700 8000 3800
Connection ~ 8000 3800
$Comp
L PWR_FLAG #FLG097
U 1 1 546EFA32
P 9950 2900
F 0 "#FLG097" H 9950 2995 30  0001 C CNN
F 1 "PWR_FLAG" H 9950 3080 30  0000 C CNN
F 2 "" H 9950 2900 60  0000 C CNN
F 3 "" H 9950 2900 60  0000 C CNN
	1    9950 2900
	1    0    0    -1  
$EndComp
Wire Wire Line
	9950 2900 9950 3000
Connection ~ 9950 3000
$Comp
L inductor L8
U 1 1 546D01AB
P 1400 5850
F 0 "L8" H 1400 5900 40  0000 C BNN
F 1 "10uH" H 1400 5800 40  0000 C CNN
F 2 "Ruwai:Inductor_SMD0805_ReflowWave" H 1396 5850 10  0001 C CNN
F 3 "" H 1300 5850 60  0000 C CNN
F 4 "Taiyo Yuden" H 1400 5850 60  0001 L BNN "Manu"
F 5 "BRL2012T100M" H 1400 5850 60  0001 L BNN "Manu#"
F 6 "0805" H 1400 5850 60  0001 L BNN "Package"
F 7 "Custom description." H 1400 5850 60  0001 C CNN "Desc"
	1    1400 5850
	1    0    0    -1  
$EndComp
$Comp
L inductor L6
U 1 1 546D04D8
P 5600 3800
F 0 "L6" H 5600 3850 40  0000 C BNN
F 1 "10uH" H 5600 3750 40  0000 C CNN
F 2 "Ruwai:Inductor_SMD0805_ReflowWave" H 5596 3800 10  0001 C CNN
F 3 "" H 5500 3800 60  0000 C CNN
F 4 "Taiyo Yuden" H 5600 3800 60  0001 L BNN "Manu"
F 5 "BRL2012T100M" H 5600 3800 60  0001 L BNN "Manu#"
F 6 "0805" H 5600 3800 60  0001 L BNN "Package"
F 7 "Custom description." H 5600 3800 60  0001 C CNN "Desc"
	1    5600 3800
	1    0    0    -1  
$EndComp
$EndSCHEMATC
