EESchema Schematic File Version 2
LIBS:ruwai
LIBS:power
LIBS:device
LIBS:transistors
LIBS:conn
LIBS:linear
LIBS:regul
LIBS:74xx
LIBS:cmos4000
LIBS:adc-dac
LIBS:memory
LIBS:xilinx
LIBS:microcontrollers
LIBS:dsp
LIBS:microchip
LIBS:analog_switches
LIBS:motorola
LIBS:texas
LIBS:intel
LIBS:audio
LIBS:interface
LIBS:digital-audio
LIBS:philips
LIBS:display
LIBS:cypress
LIBS:siliconi
LIBS:opto
LIBS:atmel
LIBS:contrib
LIBS:valves
LIBS:adc_ai_pga-cache
EELAYER 25 0
EELAYER END
$Descr A4 11693 8268
encoding utf-8
Sheet 2 6
Title "Ruwai ADC analog interface with PGA"
Date "2017-09-15"
Rev "3"
Comp "copyright Mertl Research GmbH 2014"
Comment1 ""
Comment2 ""
Comment3 ""
Comment4 "This documentation describes Open Hardware and is licensed under the CERN OHL v. 1.2."
$EndDescr
$Comp
L PGA281 U2
U 1 1 546F1658
P 3800 5550
F 0 "U2" H 3450 5050 60  0000 C CNN
F 1 "PGA281" H 3550 6050 60  0000 C CNN
F 2 "SSOP_Packages:TSSOP-16_4.4x5mm_Pitch0.65mm" H 4950 5050 60  0001 C CNN
F 3 "" H 3800 5550 60  0000 C CNN
F 4 "Texas Instruments" H 3800 4800 60  0001 L CNN "Manu"
F 5 "PGA281AIPW" H 3800 4700 60  0001 L CNN "Manu#"
F 6 "TSSOP 16-pin" H 3800 4600 60  0001 L CNN "Package"
F 7 "Zero-Drift, High Voltage Programmable Gain Amplifier" H 3800 4500 60  0001 L CNN "Desc"
	1    3800 5550
	1    0    0    -1  
$EndComp
$Comp
L PCF8574_DGV_PW U1
U 1 1 546F1742
P 3825 6825
F 0 "U1" H 3475 6225 60  0000 C CNN
F 1 "PCF8574_DGV_PW" H 3825 7425 60  0000 C CNN
F 2 "Ruwai:TSSOP-20_4.4x6.5mm_Pitch0.65mm" H 5025 6225 60  0001 C CNN
F 3 "" H 3825 6825 60  0000 C CNN
F 4 "Texas Instruments" H 3825 6075 60  0001 L CNN "Manu"
F 5 "PCF8574PWR" H 3825 5975 60  0001 L CNN "Manu#"
F 6 "TSSOP 20-pin" H 3825 5875 60  0001 L CNN "Package"
F 7 "Remote 8-Bit I/O Expander for I2C-Bus" H 3825 5775 60  0001 L CNN "Desc"
	1    3825 6825
	1    0    0    -1  
$EndComp
$Comp
L Resistor R19
U 1 1 546F10E4
P 8775 1375
F 0 "R19" V 8855 1375 40  0000 C CNN
F 1 "10k" V 8782 1376 40  0000 C CNN
F 2 "Ruwai:Resistor_SMD0102_ReflowWave" V 8705 1375 30  0001 C CNN
F 3 "" V 8855 1375 30  0000 C CNN
F 4 "Yageo" H 8775 875 60  0001 L CNN "Manu"
F 5 "RC0805FR-0710KL" H 8775 775 60  0001 L CNN "Manu#"
F 6 "0805" H 8775 675 60  0001 L CNN "Package"
F 7 " " H 8775 575 60  0001 L CNN "Desc"
	1    8775 1375
	0    1    1    0   
$EndComp
$Comp
L Resistor R16
U 1 1 546F107B
P 8075 1375
F 0 "R16" V 8155 1375 40  0000 C CNN
F 1 "10k" V 8082 1376 40  0000 C CNN
F 2 "Ruwai:Resistor_SMD0102_ReflowWave" V 8005 1375 30  0001 C CNN
F 3 "" V 8155 1375 30  0000 C CNN
F 4 "Yageo" H 8075 875 60  0001 L CNN "Manu"
F 5 "RC0805FR-0710KL" H 8075 775 60  0001 L CNN "Manu#"
F 6 "0805" H 8075 675 60  0001 L CNN "Package"
F 7 " " H 8075 575 60  0001 L CNN "Desc"
	1    8075 1375
	0    1    1    0   
$EndComp
$Comp
L Resistor R13
U 1 1 546F11E9
P 6125 1525
F 0 "R13" V 6205 1525 40  0000 C CNN
F 1 "10k" V 6132 1526 40  0000 C CNN
F 2 "Ruwai:Resistor_SMD0102_ReflowWave" V 6055 1525 30  0001 C CNN
F 3 "" V 6205 1525 30  0000 C CNN
F 4 "Yageo" H 6125 1025 60  0001 L CNN "Manu"
F 5 "RC0805FR-0710KL" H 6125 925 60  0001 L CNN "Manu#"
F 6 "0805" H 6125 825 60  0001 L CNN "Package"
F 7 " " H 6125 725 60  0001 L CNN "Desc"
	1    6125 1525
	0    1    1    0   
$EndComp
$Comp
L Resistor R12
U 1 1 546F124F
P 5075 1525
F 0 "R12" V 5155 1525 40  0000 C CNN
F 1 "10k" V 5082 1526 40  0000 C CNN
F 2 "Ruwai:Resistor_SMD0102_ReflowWave" V 5005 1525 30  0001 C CNN
F 3 "" V 5155 1525 30  0000 C CNN
F 4 "Yageo" H 5075 1025 60  0001 L CNN "Manu"
F 5 "RC0805FR-0710KL" H 5075 925 60  0001 L CNN "Manu#"
F 6 "0805" H 5075 825 60  0001 L CNN "Package"
F 7 " " H 5075 725 60  0001 L CNN "Desc"
	1    5075 1525
	0    1    1    0   
$EndComp
$Comp
L Resistor R10
U 1 1 546F1294
P 4375 1525
F 0 "R10" V 4455 1525 40  0000 C CNN
F 1 "10k" V 4382 1526 40  0000 C CNN
F 2 "Ruwai:Resistor_SMD0102_ReflowWave" V 4305 1525 30  0001 C CNN
F 3 "" V 4455 1525 30  0000 C CNN
F 4 "Yageo" H 4375 1025 60  0001 L CNN "Manu"
F 5 "RC0805FR-0710KL" H 4375 925 60  0001 L CNN "Manu#"
F 6 "0805" H 4375 825 60  0001 L CNN "Package"
F 7 " " H 4375 725 60  0001 L CNN "Desc"
	1    4375 1525
	0    1    1    0   
$EndComp
$Comp
L Capacitor C17
U 1 1 546F16D8
P 8425 1025
F 0 "C17" H 8425 1125 40  0000 L CNN
F 1 "47nF" H 8431 940 40  0000 L CNN
F 2 "Ruwai:Capacitor_SMD1206_ReflowWave" H 8463 875 30  0001 C CNN
F 3 "" H 8425 1125 60  0000 C CNN
F 4 "Murata" H 8475 625 60  0001 L CNN "Manu"
F 5 "GRM31M5C1H473JA01L" H 8475 525 60  0001 L CNN "Manu#"
F 6 "1206" H 8475 425 60  0001 L CNN "Package"
F 7 "Custom Description" H 8425 675 60  0001 L CNN "Desc"
	1    8425 1025
	1    0    0    -1  
$EndComp
$Comp
L Capacitor C12
U 1 1 546F174B
P 5775 1125
F 0 "C12" H 5775 1225 40  0000 L CNN
F 1 "4.7nF" H 5781 1040 40  0000 L CNN
F 2 "Ruwai:Capacitor_SMD0805_ReflowWave" H 5813 975 30  0001 C CNN
F 3 "" H 5775 1225 60  0000 C CNN
F 4 "Murata" H 5825 725 60  0001 L CNN "Manu"
F 5 "GRM2165C1H472JA01D" H 5825 625 60  0001 L CNN "Manu#"
F 6 "0805" H 5825 525 60  0001 L CNN "Package"
F 7 "Custom Description" H 5775 775 60  0001 L CNN "Desc"
	1    5775 1125
	1    0    0    -1  
$EndComp
$Comp
L Capacitor C11
U 1 1 546F17B5
P 5475 1125
F 0 "C11" H 5475 1225 40  0000 L CNN
F 1 "22nF" H 5481 1040 40  0000 L CNN
F 2 "Ruwai:Capacitor_SMD0805_ReflowWave" H 5513 975 30  0001 C CNN
F 3 "" H 5475 1225 60  0000 C CNN
F 4 "Kemet" H 5525 725 60  0001 L CNN "Manu"
F 5 "CGA4J2C0G1H223J125AA" H 5525 625 60  0001 L CNN "Manu#"
F 6 "0805" H 5525 525 60  0001 L CNN "Package"
F 7 "Custom Description" H 5475 775 60  0001 L CNN "Desc"
	1    5475 1125
	1    0    0    -1  
$EndComp
$Comp
L Capacitor C16
U 1 1 546F3187
P 9125 2025
F 0 "C16" H 9125 2125 40  0000 L CNN
F 1 "2.2nF" H 9131 1940 40  0000 L CNN
F 2 "Ruwai:Capacitor_SMD0805_ReflowWave" H 9163 1875 30  0001 C CNN
F 3 "" H 9125 2125 60  0000 C CNN
F 4 "Multicomp" H 9175 1625 60  0001 L CNN "Manu"
F 5 "MCU0805C222JCT " H 9175 1525 60  0001 L CNN "Manu#"
F 6 "0805" H 9175 1425 60  0001 L CNN "Package"
F 7 "Custom Description" H 9125 1675 60  0001 L CNN "Desc"
	1    9125 2025
	1    0    0    -1  
$EndComp
$Comp
L Capacitor C8
U 1 1 546F3253
P 6475 2025
F 0 "C8" H 6475 2125 40  0000 L CNN
F 1 "3.3nF" H 6481 1940 40  0000 L CNN
F 2 "Ruwai:Capacitor_SMD0805_ReflowWave" H 6513 1875 30  0001 C CNN
F 3 "" H 6475 2125 60  0000 C CNN
F 4 "Murata" H 6525 1625 60  0001 L CNN "Manu"
F 5 "GRM2165C1H332JA01D" H 6525 1525 60  0001 L CNN "Manu#"
F 6 "0805" H 6525 1425 60  0001 L CNN "Package"
F 7 "Custom Description" H 6475 1675 60  0001 L CNN "Desc"
	1    6475 2025
	1    0    0    -1  
$EndComp
$Comp
L Capacitor C9
U 1 1 546F32BE
P 4725 2025
F 0 "C9" H 4725 2125 40  0000 L CNN
F 1 "10nF" H 4731 1940 40  0000 L CNN
F 2 "Ruwai:Capacitor_SMD0805_ReflowWave" H 4763 1875 30  0001 C CNN
F 3 "" H 4725 2125 60  0000 C CNN
F 4 "Kemet" H 4775 1625 60  0001 L CNN "Manu"
F 5 "C0805C103J3GACTU" H 4775 1525 60  0001 L CNN "Manu#"
F 6 "0805" H 4775 1425 60  0001 L CNN "Package"
F 7 "Custom Description" H 4725 1675 60  0001 L CNN "Desc"
	1    4725 2025
	1    0    0    -1  
$EndComp
$Comp
L Resistor R17
U 1 1 546F4445
P 8075 2675
F 0 "R17" V 8155 2675 40  0000 C CNN
F 1 "10k" V 8082 2676 40  0000 C CNN
F 2 "Ruwai:Resistor_SMD0102_ReflowWave" V 8005 2675 30  0001 C CNN
F 3 "" V 8155 2675 30  0000 C CNN
F 4 "Yageo" H 8075 2175 60  0001 L CNN "Manu"
F 5 "RC0805FR-0710KL" H 8075 2075 60  0001 L CNN "Manu#"
F 6 "0805" H 8075 1975 60  0001 L CNN "Package"
F 7 " " H 8075 1875 60  0001 L CNN "Desc"
	1    8075 2675
	0    1    1    0   
$EndComp
$Comp
L Resistor R18
U 1 1 546F44BF
P 8775 2675
F 0 "R18" V 8855 2675 40  0000 C CNN
F 1 "10k" V 8782 2676 40  0000 C CNN
F 2 "Ruwai:Resistor_SMD0102_ReflowWave" V 8705 2675 30  0001 C CNN
F 3 "" V 8855 2675 30  0000 C CNN
F 4 "Yageo" H 8775 2175 60  0001 L CNN "Manu"
F 5 "RC0805FR-0710KL" H 8775 2075 60  0001 L CNN "Manu#"
F 6 "0805" H 8775 1975 60  0001 L CNN "Package"
F 7 " " H 8775 1875 60  0001 L CNN "Desc"
	1    8775 2675
	0    1    1    0   
$EndComp
$Comp
L Capacitor C18
U 1 1 546F452B
P 8425 3025
F 0 "C18" H 8425 3125 40  0000 L CNN
F 1 "47nF" H 8431 2940 40  0000 L CNN
F 2 "Ruwai:Capacitor_SMD1206_ReflowWave" H 8463 2875 30  0001 C CNN
F 3 "" H 8425 3125 60  0000 C CNN
F 4 "Murata" H 8475 2625 60  0001 L CNN "Manu"
F 5 "GRM31M5C1H473JA01L" H 8475 2525 60  0001 L CNN "Manu#"
F 6 "1206" H 8475 2425 60  0001 L CNN "Package"
F 7 "Custom Description" H 8425 2675 60  0001 L CNN "Desc"
	1    8425 3025
	1    0    0    -1  
$EndComp
$Comp
L Resistor R14
U 1 1 546F4E72
P 6125 2525
F 0 "R14" V 6205 2525 40  0000 C CNN
F 1 "10k" V 6132 2526 40  0000 C CNN
F 2 "Ruwai:Resistor_SMD0102_ReflowWave" V 6055 2525 30  0001 C CNN
F 3 "" V 6205 2525 30  0000 C CNN
F 4 "Yageo" H 6125 2025 60  0001 L CNN "Manu"
F 5 "RC0805FR-0710KL" H 6125 1925 60  0001 L CNN "Manu#"
F 6 "0805" H 6125 1825 60  0001 L CNN "Package"
F 7 " " H 6125 1725 60  0001 L CNN "Desc"
	1    6125 2525
	0    1    1    0   
$EndComp
$Comp
L Resistor R15
U 1 1 546F4ED8
P 5075 2525
F 0 "R15" V 5155 2525 40  0000 C CNN
F 1 "10k" V 5082 2526 40  0000 C CNN
F 2 "Ruwai:Resistor_SMD0102_ReflowWave" V 5005 2525 30  0001 C CNN
F 3 "" V 5155 2525 30  0000 C CNN
F 4 "Yageo" H 5075 2025 60  0001 L CNN "Manu"
F 5 "RC0805FR-0710KL" H 5075 1925 60  0001 L CNN "Manu#"
F 6 "0805" H 5075 1825 60  0001 L CNN "Package"
F 7 " " H 5075 1725 60  0001 L CNN "Desc"
	1    5075 2525
	0    1    1    0   
$EndComp
$Comp
L Resistor R11
U 1 1 546F4F37
P 4375 2525
F 0 "R11" V 4455 2525 40  0000 C CNN
F 1 "10k" V 4382 2526 40  0000 C CNN
F 2 "Ruwai:Resistor_SMD0102_ReflowWave" V 4305 2525 30  0001 C CNN
F 3 "" V 4455 2525 30  0000 C CNN
F 4 "Yageo" H 4375 2025 60  0001 L CNN "Manu"
F 5 "RC0805FR-0710KL" H 4375 1925 60  0001 L CNN "Manu#"
F 6 "0805" H 4375 1825 60  0001 L CNN "Package"
F 7 " " H 4375 1725 60  0001 L CNN "Desc"
	1    4375 2525
	0    1    1    0   
$EndComp
$Comp
L Capacitor C13
U 1 1 546F4FFD
P 5775 2925
F 0 "C13" H 5775 3025 40  0000 L CNN
F 1 "4.7nF" H 5781 2840 40  0000 L CNN
F 2 "Ruwai:Capacitor_SMD0805_ReflowWave" H 5813 2775 30  0001 C CNN
F 3 "" H 5775 3025 60  0000 C CNN
F 4 "Murata" H 5825 2525 60  0001 L CNN "Manu"
F 5 "GRM2165C1H472JA01D" H 5825 2425 60  0001 L CNN "Manu#"
F 6 "0805" H 5825 2325 60  0001 L CNN "Package"
F 7 "Custom Description" H 5775 2575 60  0001 L CNN "Desc"
	1    5775 2925
	1    0    0    -1  
$EndComp
$Comp
L Capacitor C14
U 1 1 546F5090
P 5475 2925
F 0 "C14" H 5475 3025 40  0000 L CNN
F 1 "22nF" H 5481 2840 40  0000 L CNN
F 2 "Ruwai:Capacitor_SMD0805_ReflowWave" H 5513 2775 30  0001 C CNN
F 3 "" H 5475 3025 60  0000 C CNN
F 4 "Kemet" H 5525 2525 60  0001 L CNN "Manu"
F 5 "CGA4J2C0G1H223J125AA" H 5525 2425 60  0001 L CNN "Manu#"
F 6 "0805" H 5525 2325 60  0001 L CNN "Package"
F 7 "Custom Description" H 5475 2575 60  0001 L CNN "Desc"
	1    5475 2925
	1    0    0    -1  
$EndComp
$Comp
L GND #PWR01
U 1 1 546F5C9B
P 10225 5050
F 0 "#PWR01" H 10225 5050 30  0001 C CNN
F 1 "GND" H 10225 4980 30  0001 C CNN
F 2 "" H 10225 5050 60  0000 C CNN
F 3 "" H 10225 5050 60  0000 C CNN
	1    10225 5050
	1    0    0    -1  
$EndComp
$Comp
L GND #PWR02
U 1 1 546F5D01
P 10225 6375
F 0 "#PWR02" H 10225 6375 30  0001 C CNN
F 1 "GND" H 10225 6305 30  0001 C CNN
F 2 "" H 10225 6375 60  0000 C CNN
F 3 "" H 10225 6375 60  0000 C CNN
	1    10225 6375
	1    0    0    -1  
$EndComp
$Comp
L inductor L3
U 1 1 546F60EA
P 9300 4025
F 0 "L3" H 9300 4075 40  0000 C BNN
F 1 "1uH" H 9300 3975 40  0000 C CNN
F 2 "Ruwai:Inductor_SMD0805_ReflowWave" H 9200 4025 60  0001 C CNN
F 3 "" H 9200 4025 60  0000 C CNN
F 4 "Taiyo Yuden" H 9300 3825 60  0001 L BNN "Manu"
F 5 "BRL2012T1R0M " H 9300 3725 60  0001 L BNN "Manu#"
F 6 "0805" H 9300 3625 60  0001 L BNN "Package"
F 7 "Custom description." H 9300 3525 60  0001 L BNN "Desc"
	1    9300 4025
	1    0    0    -1  
$EndComp
$Comp
L Capacitor C10
U 1 1 546F61EC
P 9675 4500
F 0 "C10" H 9675 4600 40  0000 L CNN
F 1 "100nF" H 9681 4415 40  0000 L CNN
F 2 "Ruwai:Capacitor_SMD0805_ReflowWave" H 9713 4350 30  0001 C CNN
F 3 "" H 9675 4600 60  0000 C CNN
F 4 "Murata" H 9725 4100 60  0001 L CNN "Manu"
F 5 "GCM21BR71H104KA37L" H 9725 4000 60  0001 L CNN "Manu#"
F 6 "0805" H 9725 3900 60  0001 L CNN "Package"
F 7 "Custom Description" H 9675 4150 60  0001 L CNN "Desc"
	1    9675 4500
	1    0    0    -1  
$EndComp
$Comp
L GND #PWR03
U 1 1 546F6315
P 9675 5050
F 0 "#PWR03" H 9675 5050 30  0001 C CNN
F 1 "GND" H 9675 4980 30  0001 C CNN
F 2 "" H 9675 5050 60  0000 C CNN
F 3 "" H 9675 5050 60  0000 C CNN
	1    9675 5050
	1    0    0    -1  
$EndComp
$Comp
L GND #PWR04
U 1 1 546F6340
P 9750 6375
F 0 "#PWR04" H 9750 6375 30  0001 C CNN
F 1 "GND" H 9750 6305 30  0001 C CNN
F 2 "" H 9750 6375 60  0000 C CNN
F 3 "" H 9750 6375 60  0000 C CNN
	1    9750 6375
	1    0    0    -1  
$EndComp
Text HLabel 8950 4025 0    60   Input ~ 0
5V_PGA
Text HLabel 8900 5350 0    60   Input ~ 0
5V_PGA
Text Label 2950 7275 2    60   ~ 0
PGA_G0
Text Label 4725 7275 0    60   ~ 0
PGA_G1
Text Label 4725 7175 0    60   ~ 0
PGA_G2
Text Label 4725 6975 0    60   ~ 0
PGA_G3
Text Label 4725 6775 0    60   ~ 0
PGA_G4
Text Label 2975 5800 2    60   ~ 0
PGA_G0
Text Label 2975 5700 2    60   ~ 0
PGA_G1
Text Label 2975 5600 2    60   ~ 0
PGA_G2
Text Label 2975 5500 2    60   ~ 0
PGA_G3
Text Label 2975 5400 2    60   ~ 0
PGA_G4
NoConn ~ 4425 6475
NoConn ~ 4425 6375
NoConn ~ 3225 6375
$Comp
L GND #PWR05
U 1 1 546FD14F
P 3075 7650
F 0 "#PWR05" H 3075 7650 30  0001 C CNN
F 1 "GND" H 3075 7580 30  0001 C CNN
F 2 "" H 3075 7650 60  0000 C CNN
F 3 "" H 3075 7650 60  0000 C CNN
	1    3075 7650
	1    0    0    -1  
$EndComp
Text HLabel 2950 6675 0    60   Input ~ 0
SDA_3
Text HLabel 2950 6475 0    60   Input ~ 0
SCL_3
$Comp
L Resistor R2
U 1 1 546FD8C7
P 1825 6775
F 0 "R2" V 1905 6775 40  0000 C CNN
F 1 "10" V 1832 6776 40  0000 C CNN
F 2 "Ruwai:Resistor_SMD0805_ReflowWave" V 1755 6775 30  0001 C CNN
F 3 "" V 1905 6775 30  0000 C CNN
F 4 "Yageo" H 1825 6275 60  0001 L CNN "Manu"
F 5 "RC0805FR-0710RL" H 1825 6175 60  0001 L CNN "Manu#"
F 6 "0805" H 1825 6075 60  0001 L CNN "Package"
F 7 "Custom Description" H 1825 5975 60  0001 L CNN "Desc"
	1    1825 6775
	0    1    1    0   
$EndComp
$Comp
L GND #PWR06
U 1 1 546FDD8E
P 2350 7650
F 0 "#PWR06" H 2350 7650 30  0001 C CNN
F 1 "GND" H 2350 7580 30  0001 C CNN
F 2 "" H 2350 7650 60  0000 C CNN
F 3 "" H 2350 7650 60  0000 C CNN
	1    2350 7650
	1    0    0    -1  
$EndComp
Text HLabel 1350 6775 0    60   Input ~ 0
3.3V_P
Text Label 3000 5900 2    60   ~ 0
PGA_VON
Text Label 4675 5900 0    60   ~ 0
PGA_VOP
$Comp
L GND #PWR07
U 1 1 546FF58F
P 5375 6375
F 0 "#PWR07" H 5375 6375 30  0001 C CNN
F 1 "GND" H 5375 6305 30  0001 C CNN
F 2 "" H 5375 6375 60  0000 C CNN
F 3 "" H 5375 6375 60  0000 C CNN
	1    5375 6375
	1    0    0    -1  
$EndComp
Text HLabel 6525 5800 2    60   Input ~ 0
ADC_VCOM
Text HLabel 6525 5700 2    60   Input ~ 0
5V_PGA
$Comp
L GND #PWR08
U 1 1 547004E8
P 5625 6375
F 0 "#PWR08" H 5625 6375 30  0001 C CNN
F 1 "GND" H 5625 6305 30  0001 C CNN
F 2 "" H 5625 6375 60  0000 C CNN
F 3 "" H 5625 6375 60  0000 C CNN
	1    5625 6375
	1    0    0    -1  
$EndComp
$Comp
L GND #PWR09
U 1 1 54700EC6
P 5125 6375
F 0 "#PWR09" H 5125 6375 30  0001 C CNN
F 1 "GND" H 5125 6305 30  0001 C CNN
F 2 "" H 5125 6375 60  0000 C CNN
F 3 "" H 5125 6375 60  0000 C CNN
	1    5125 6375
	1    0    0    -1  
$EndComp
$Comp
L GND #PWR010
U 1 1 54701548
P 5325 5575
F 0 "#PWR010" H 5325 5575 30  0001 C CNN
F 1 "GND" H 5325 5505 30  0001 C CNN
F 2 "" H 5325 5575 60  0000 C CNN
F 3 "" H 5325 5575 60  0000 C CNN
	1    5325 5575
	1    0    0    -1  
$EndComp
$Comp
L Resistor R7
U 1 1 547017A6
P 5800 5000
F 0 "R7" V 5880 5000 40  0000 C CNN
F 1 "22" V 5807 5001 40  0000 C CNN
F 2 "Ruwai:Resistor_SMD0805_ReflowWave" V 5730 5000 30  0001 C CNN
F 3 "" V 5880 5000 30  0000 C CNN
F 4 "Yageo" H 5800 4500 60  0001 L CNN "Manu"
F 5 "RC0805FR-0722RL" H 5800 4400 60  0001 L CNN "Manu#"
F 6 "0805" H 5800 4300 60  0001 L CNN "Package"
F 7 "Custom Description" H 5800 4200 60  0001 L CNN "Desc"
	1    5800 5000
	0    1    1    0   
$EndComp
Text HLabel 6175 5000 2    60   Input ~ 0
+15V_PGA
$Comp
L GND #PWR011
U 1 1 547021AA
P 5050 4850
F 0 "#PWR011" H 5050 4850 30  0001 C CNN
F 1 "GND" H 5050 4780 30  0001 C CNN
F 2 "" H 5050 4850 60  0000 C CNN
F 3 "" H 5050 4850 60  0000 C CNN
	1    5050 4850
	1    0    0    -1  
$EndComp
Text HLabel 6175 4150 2    60   Input ~ 0
-15V_PGA
Text Label 3975 1525 2    60   ~ 0
PGA_VOP
Text Label 3975 2525 2    60   ~ 0
PGA_VON
$Comp
L inductor L1
U 1 1 546F43D7
P 1575 3150
F 0 "L1" H 1575 3200 40  0000 C BNN
F 1 "47uH" H 1575 3100 40  0000 C CNN
F 2 "Ruwai:Inductor_SMD0805_ReflowWave" H 1475 3150 60  0001 C CNN
F 3 "" H 1475 3150 60  0000 C CNN
F 4 "Taiyo Yuden" H 1575 2950 60  0001 L BNN "Manu"
F 5 "BRL2012T470M" H 1575 2850 60  0001 L BNN "Manu#"
F 6 "0805" H 1575 2750 60  0001 L BNN "Package"
F 7 "Custom description." H 1575 2650 60  0001 L BNN "Desc"
	1    1575 3150
	1    0    0    -1  
$EndComp
$Comp
L Resistor R1
U 1 1 546F45EB
P 2225 3150
F 0 "R1" V 2305 3150 40  0000 C CNN
F 1 "47" V 2232 3151 40  0000 C CNN
F 2 "Ruwai:Resistor_SMD0805_ReflowWave" V 2155 3150 30  0001 C CNN
F 3 "" V 2305 3150 30  0000 C CNN
F 4 "Yageo" H 2225 2650 60  0001 L CNN "Manu"
F 5 "RC0805FR-0747RL" H 2225 2550 60  0001 L CNN "Manu#"
F 6 "0805" H 2225 2450 60  0001 L CNN "Package"
F 7 "Custom Description" H 2225 2350 60  0001 L CNN "Desc"
	1    2225 3150
	0    -1   -1   0   
$EndComp
$Comp
L Capacitor C2
U 1 1 546F4741
P 2625 3550
F 0 "C2" H 2625 3650 40  0000 L CNN
F 1 "47nF" H 2631 3465 40  0000 L CNN
F 2 "Ruwai:Capacitor_SMD1206_ReflowWave" H 2663 3400 30  0001 C CNN
F 3 "" H 2625 3650 60  0000 C CNN
F 4 "Murata" H 2675 3150 60  0001 L CNN "Manu"
F 5 "GRM31M5C1H473JA01L" H 2675 3050 60  0001 L CNN "Manu#"
F 6 "1206" H 2675 2950 60  0001 L CNN "Package"
F 7 "Custom Description" H 2625 3200 60  0001 L CNN "Desc"
	1    2625 3550
	1    0    0    -1  
$EndComp
$Comp
L Varistance R5
U 1 1 546F602D
P 3025 3550
F 0 "R5" H 3125 3600 40  0000 R BNN
F 1 "14VRMS" H 2925 3475 40  0000 L TNN
F 2 "Ruwai:Resistor_SMD0805_ReflowWave" H 3075 3500 60  0001 C CNN
F 3 "" V 3025 3550 60  0000 C CNN
F 4 "Epcos" H 3025 3350 60  0001 L BNN "Manu"
F 5 "B72510E0140K062" H 3025 3250 60  0001 L BNN "Manu#"
F 6 "0805" H 3025 3150 60  0001 L BNN "Package"
F 7 "Custom description." H 3025 3050 60  0001 L BNN "Desc"
	1    3025 3550
	0    -1   -1   0   
$EndComp
$Comp
L Resistor R4
U 1 1 546F649A
P 3575 3150
F 0 "R4" V 3655 3150 40  0000 C CNN
F 1 "2.2k" V 3582 3151 40  0000 C CNN
F 2 "Ruwai:Resistor_SMD0805_ReflowWave" V 3505 3150 30  0001 C CNN
F 3 "" V 3655 3150 30  0000 C CNN
F 4 "Yageo" H 3575 2650 60  0001 L CNN "Manu"
F 5 "RC0805FR-072K2L" H 3575 2550 60  0001 L CNN "Manu#"
F 6 "0805" H 3575 2450 60  0001 L CNN "Package"
F 7 "Custom Description" H 3575 2350 60  0001 L CNN "Desc"
	1    3575 3150
	0    -1   -1   0   
$EndComp
$Comp
L Capacitor C3
U 1 1 546F6519
P 3975 3550
F 0 "C3" H 3975 3650 40  0000 L CNN
F 1 "1nF" H 3981 3465 40  0000 L CNN
F 2 "Ruwai:Capacitor_SMD0805_ReflowWave" H 4013 3400 30  0001 C CNN
F 3 "" H 3975 3650 60  0000 C CNN
F 4 "Kemet" H 4025 3150 60  0001 L CNN "Manu"
F 5 "C0805C102J5GACTU" H 4025 3050 60  0001 L CNN "Manu#"
F 6 "0805" H 4025 2950 60  0001 L CNN "Package"
F 7 "Custom Description" H 3975 3200 60  0001 L CNN "Desc"
	1    3975 3550
	1    0    0    -1  
$EndComp
$Comp
L Resistor R78
U 1 1 546F6593
P 1625 3350
F 0 "R78" V 1705 3350 40  0000 C CNN
F 1 "100k" V 1632 3351 40  0000 C CNN
F 2 "Ruwai:Resistor_SMD0805_ReflowWave" V 1555 3350 30  0001 C CNN
F 3 "" V 1705 3350 30  0000 C CNN
F 4 "Yageo" H 1625 2850 60  0001 L CNN "Manu"
F 5 "RC0805FR-07100KL" H 1625 2750 60  0001 L CNN "Manu#"
F 6 "0805" H 1625 2650 60  0001 L CNN "Package"
F 7 "Custom Description" H 1625 2550 60  0001 L CNN "Desc"
	1    1625 3350
	0    -1   -1   0   
$EndComp
$Comp
L Resistor R3
U 1 1 546F88F1
P 2225 3950
F 0 "R3" V 2305 3950 40  0000 C CNN
F 1 "47" V 2232 3951 40  0000 C CNN
F 2 "Ruwai:Resistor_SMD0805_ReflowWave" V 2155 3950 30  0001 C CNN
F 3 "" V 2305 3950 30  0000 C CNN
F 4 "Yageo" H 2225 3450 60  0001 L CNN "Manu"
F 5 "RC0805FR-0747RL" H 2225 3350 60  0001 L CNN "Manu#"
F 6 "0805" H 2225 3250 60  0001 L CNN "Package"
F 7 "Custom Description" H 2225 3150 60  0001 L CNN "Desc"
	1    2225 3950
	0    -1   -1   0   
$EndComp
$Comp
L Resistor R6
U 1 1 546F8999
P 3575 3950
F 0 "R6" V 3655 3950 40  0000 C CNN
F 1 "2.2k" V 3582 3951 40  0000 C CNN
F 2 "Ruwai:Resistor_SMD0805_ReflowWave" V 3505 3950 30  0001 C CNN
F 3 "" V 3655 3950 30  0000 C CNN
F 4 "Yageo" H 3575 3450 60  0001 L CNN "Manu"
F 5 "RC0805FR-072K2L" H 3575 3350 60  0001 L CNN "Manu#"
F 6 "0805" H 3575 3250 60  0001 L CNN "Package"
F 7 "Custom Description" H 3575 3150 60  0001 L CNN "Desc"
	1    3575 3950
	0    -1   -1   0   
$EndComp
$Comp
L Resistor R79
U 1 1 546F8A04
P 1625 3750
F 0 "R79" V 1705 3750 40  0000 C CNN
F 1 "100k" V 1632 3751 40  0000 C CNN
F 2 "Ruwai:Resistor_SMD0805_ReflowWave" V 1555 3750 30  0001 C CNN
F 3 "" V 1705 3750 30  0000 C CNN
F 4 "Yageo" H 1625 3250 60  0001 L CNN "Manu"
F 5 "RC0805FR-07100KL" H 1625 3150 60  0001 L CNN "Manu#"
F 6 "0805" H 1625 3050 60  0001 L CNN "Package"
F 7 "Custom Description" H 1625 2950 60  0001 L CNN "Desc"
	1    1625 3750
	0    -1   -1   0   
$EndComp
$Comp
L inductor L2
U 1 1 546F8A5C
P 1575 3950
F 0 "L2" H 1575 4000 40  0000 C BNN
F 1 "47uH" H 1575 3900 40  0000 C CNN
F 2 "Ruwai:Inductor_SMD0805_ReflowWave" H 1475 3950 60  0001 C CNN
F 3 "" H 1475 3950 60  0000 C CNN
F 4 "Taiyo Yuden" H 1575 3750 60  0001 L BNN "Manu"
F 5 "BRL2012T470M" H 1575 3650 60  0001 L BNN "Manu#"
F 6 "0805" H 1575 3550 60  0001 L BNN "Package"
F 7 "Custom description." H 1575 3450 60  0001 L BNN "Desc"
	1    1575 3950
	1    0    0    -1  
$EndComp
$Comp
L GND #PWR012
U 1 1 546F8C4D
P 2225 3650
F 0 "#PWR012" H 2225 3650 30  0001 C CNN
F 1 "GND" H 2225 3580 30  0001 C CNN
F 2 "" H 2225 3650 60  0000 C CNN
F 3 "" H 2225 3650 60  0000 C CNN
	1    2225 3650
	1    0    0    -1  
$EndComp
Wire Wire Line
	9025 1375 9225 1375
Wire Wire Line
	8325 1375 8525 1375
Wire Wire Line
	10150 1225 10525 1225
Connection ~ 8425 1375
Wire Wire Line
	8425 825  8425 675 
Wire Wire Line
	8425 675  10275 675 
Wire Wire Line
	10275 675  10275 1225
Connection ~ 10275 1225
Wire Wire Line
	7550 1375 7825 1375
Wire Wire Line
	6375 1525 6625 1525
Wire Wire Line
	5325 1525 5875 1525
Wire Wire Line
	5775 1325 5775 1525
Connection ~ 5775 1525
Wire Wire Line
	5475 1325 5475 1525
Connection ~ 5475 1525
Wire Wire Line
	5475 925  5475 675 
Wire Wire Line
	5475 675  7675 675 
Wire Wire Line
	7675 675  7675 1375
Connection ~ 7675 1375
Wire Wire Line
	5775 925  5775 675 
Connection ~ 5775 675 
Wire Wire Line
	4625 1525 4825 1525
Wire Wire Line
	6625 1225 6575 1225
Wire Wire Line
	6575 1225 6575 675 
Connection ~ 6575 675 
Wire Wire Line
	8425 1375 8425 1225
Wire Wire Line
	9225 1075 9125 1075
Wire Wire Line
	9125 1075 9125 675 
Connection ~ 9125 675 
Wire Wire Line
	9125 1375 9125 1825
Connection ~ 9125 1375
Wire Wire Line
	6475 1825 6475 1525
Connection ~ 6475 1525
Wire Wire Line
	4725 1825 4725 1525
Connection ~ 4725 1525
Wire Wire Line
	9025 2675 9225 2675
Wire Wire Line
	8325 2675 8525 2675
Wire Wire Line
	7550 2675 7825 2675
Wire Wire Line
	8425 2825 8425 2675
Connection ~ 8425 2675
Wire Wire Line
	10150 2825 10525 2825
Wire Wire Line
	10275 3375 10275 2825
Wire Wire Line
	8425 3375 10275 3375
Wire Wire Line
	8425 3375 8425 3225
Connection ~ 10275 2825
Wire Wire Line
	9125 2225 9125 2675
Connection ~ 9125 2675
Wire Wire Line
	9225 2975 9125 2975
Wire Wire Line
	9125 2975 9125 3375
Connection ~ 9125 3375
Wire Wire Line
	6375 2525 6625 2525
Wire Wire Line
	5325 2525 5875 2525
Wire Wire Line
	4625 2525 4825 2525
Wire Wire Line
	4725 2225 4725 2525
Connection ~ 4725 2525
Wire Wire Line
	5475 2725 5475 2525
Connection ~ 5475 2525
Wire Wire Line
	5775 2725 5775 2525
Connection ~ 5775 2525
Wire Wire Line
	7675 3375 7675 2675
Wire Wire Line
	5475 3375 7675 3375
Wire Wire Line
	5475 3375 5475 3125
Connection ~ 7675 2675
Wire Wire Line
	5775 3125 5775 3375
Connection ~ 5775 3375
Wire Wire Line
	6475 2225 6475 2525
Connection ~ 6475 2525
Wire Wire Line
	6625 2825 6475 2825
Wire Wire Line
	6475 2825 6475 3375
Connection ~ 6475 3375
Wire Wire Line
	10225 4875 10225 5050
Wire Wire Line
	10225 6200 10225 6375
Wire Wire Line
	10225 4025 10225 4125
Wire Wire Line
	9500 4025 10225 4025
Wire Wire Line
	9750 6025 9750 6375
Wire Wire Line
	10225 5350 10225 5450
Wire Wire Line
	9450 5350 10225 5350
Wire Wire Line
	9750 5625 9750 5350
Connection ~ 9750 5350
Wire Wire Line
	9050 5350 8900 5350
Wire Wire Line
	9675 4300 9675 4025
Connection ~ 9675 4025
Wire Wire Line
	9675 4700 9675 5050
Wire Wire Line
	9100 4025 8950 4025
Wire Wire Line
	4425 7275 4725 7275
Wire Wire Line
	4425 7175 4725 7175
Wire Wire Line
	4425 6975 4725 6975
Wire Wire Line
	4425 6775 4725 6775
Wire Wire Line
	2975 5400 3200 5400
Wire Wire Line
	2975 5500 3200 5500
Wire Wire Line
	2975 5600 3200 5600
Wire Wire Line
	2975 5700 3200 5700
Wire Wire Line
	2975 5800 3200 5800
Wire Wire Line
	3225 6875 3075 6875
Wire Wire Line
	3075 6875 3075 7650
Wire Wire Line
	3225 6975 3075 6975
Connection ~ 3075 6975
Wire Wire Line
	3225 7175 3075 7175
Connection ~ 3075 7175
Wire Wire Line
	2075 6775 3225 6775
Wire Wire Line
	3225 6675 2950 6675
Wire Wire Line
	3225 6475 2950 6475
Wire Wire Line
	2350 7400 2350 7650
Wire Wire Line
	2350 6775 2350 7000
Connection ~ 2350 6775
Connection ~ 2200 6775
Wire Wire Line
	1575 6775 1350 6775
Wire Wire Line
	4400 5300 4675 5300
Wire Wire Line
	4400 5400 4675 5400
Wire Wire Line
	3200 5900 3000 5900
Wire Wire Line
	4400 5900 4675 5900
Wire Wire Line
	5375 6300 5375 6375
Wire Wire Line
	4400 5800 6525 5800
Wire Wire Line
	5375 5800 5375 5900
Connection ~ 5375 5800
Wire Wire Line
	4400 5700 5825 5700
Wire Wire Line
	5625 6375 5625 6300
Wire Wire Line
	5625 5900 5625 5700
Connection ~ 5625 5700
Wire Wire Line
	6325 5700 6525 5700
Wire Wire Line
	4400 5600 5125 5600
Wire Wire Line
	5125 5600 5125 6375
Wire Wire Line
	4400 5500 5150 5500
Wire Wire Line
	5150 5500 5150 5000
Wire Wire Line
	5150 5000 5550 5000
Wire Wire Line
	5325 5475 5325 5575
Wire Wire Line
	5325 5075 5325 5000
Connection ~ 5325 5000
Wire Wire Line
	6050 5000 6175 5000
Wire Wire Line
	4825 4675 4825 4775
Wire Wire Line
	4825 4775 5300 4775
Wire Wire Line
	5300 4775 5300 4675
Wire Wire Line
	5050 4850 5050 4775
Connection ~ 5050 4775
Wire Wire Line
	4400 5200 4600 5200
Wire Wire Line
	4600 4150 5550 4150
Wire Wire Line
	4825 4275 4825 4150
Connection ~ 4825 4150
Wire Wire Line
	5300 4275 5300 4150
Connection ~ 5300 4150
Wire Wire Line
	6050 4150 6175 4150
Wire Wire Line
	4125 1525 3975 1525
Wire Wire Line
	4125 2525 3975 2525
Wire Wire Line
	3225 7275 2950 7275
Wire Wire Line
	2200 5200 3200 5200
Wire Wire Line
	975  3150 1375 3150
Wire Wire Line
	1875 3350 1975 3350
Wire Wire Line
	1975 3350 1975 3750
Wire Wire Line
	1975 3750 1875 3750
Wire Wire Line
	1375 3350 1275 3350
Wire Wire Line
	1275 3350 1275 3150
Connection ~ 1275 3150
Wire Wire Line
	1975 3550 2225 3550
Wire Wire Line
	2225 3550 2225 3650
Connection ~ 1975 3550
Wire Wire Line
	1775 3150 1975 3150
Wire Wire Line
	2475 3150 3325 3150
Wire Wire Line
	2625 3350 2625 3150
Connection ~ 2625 3150
Wire Wire Line
	3025 3350 3025 3150
Connection ~ 3025 3150
Wire Wire Line
	2475 3950 3325 3950
Wire Wire Line
	1775 3950 1975 3950
Wire Wire Line
	975  3950 1375 3950
Wire Wire Line
	1375 3750 1275 3750
Wire Wire Line
	1275 3750 1275 3950
Connection ~ 1275 3950
Wire Wire Line
	2625 3750 2625 3950
Connection ~ 2625 3950
Wire Wire Line
	3025 3750 3025 3950
Connection ~ 3025 3950
Wire Wire Line
	3825 3150 4275 3150
Wire Wire Line
	3825 3950 4275 3950
Wire Wire Line
	3975 3750 3975 3950
Connection ~ 3975 3950
Wire Wire Line
	3975 3350 3975 3150
Connection ~ 3975 3150
Text HLabel 975  3150 0    60   Input ~ 0
AINP1
Text HLabel 975  3950 0    60   Input ~ 0
AINN1
Text Label 4275 3150 0    60   ~ 0
PGA_INP
Text Label 4275 3950 0    60   ~ 0
PGA_INN
$Comp
L inductor L4
U 1 1 546FBDD3
P 9250 5350
F 0 "L4" H 9250 5400 40  0000 C BNN
F 1 "1uH" H 9250 5300 40  0000 C CNN
F 2 "Ruwai:Inductor_SMD0805_ReflowWave" H 9150 5350 60  0001 C CNN
F 3 "" H 9150 5350 60  0000 C CNN
F 4 "Taiyo Yuden" H 9250 5150 60  0001 L BNN "Manu"
F 5 "BRL2012T1R0M " H 9250 5050 60  0001 L BNN "Manu#"
F 6 "0805" H 9250 4950 60  0001 L BNN "Package"
F 7 "Custom description." H 9250 4850 60  0001 L BNN "Desc"
	1    9250 5350
	1    0    0    -1  
$EndComp
$Comp
L Capacitor C15
U 1 1 546FC370
P 9750 5825
F 0 "C15" H 9750 5925 40  0000 L CNN
F 1 "100nF" H 9756 5740 40  0000 L CNN
F 2 "Ruwai:Capacitor_SMD0805_ReflowWave" H 9788 5675 30  0001 C CNN
F 3 "" H 9750 5925 60  0000 C CNN
F 4 "Murata" H 9800 5425 60  0001 L CNN "Manu"
F 5 "GCM21BR71H104KA37L" H 9800 5325 60  0001 L CNN "Manu#"
F 6 "0805" H 9800 5225 60  0001 L CNN "Package"
F 7 "Custom Description" H 9750 5475 60  0001 L CNN "Desc"
	1    9750 5825
	1    0    0    -1  
$EndComp
$Comp
L Capacitor C1
U 1 1 546FCC56
P 2350 7200
F 0 "C1" H 2350 7300 40  0000 L CNN
F 1 "100nF" H 2356 7115 40  0000 L CNN
F 2 "Ruwai:Capacitor_SMD0805_ReflowWave" H 2388 7050 30  0001 C CNN
F 3 "" H 2350 7300 60  0000 C CNN
F 4 "Murata" H 2400 6800 60  0001 L CNN "Manu"
F 5 "GCM21BR71H104KA37L" H 2400 6700 60  0001 L CNN "Manu#"
F 6 "0805" H 2400 6600 60  0001 L CNN "Package"
F 7 "Custom Description" H 2350 6850 60  0001 L CNN "Desc"
	1    2350 7200
	1    0    0    -1  
$EndComp
$Comp
L Capacitor C7
U 1 1 546FCF5B
P 5375 6100
F 0 "C7" H 5375 6200 40  0000 L CNN
F 1 "100nF" H 5381 6015 40  0000 L CNN
F 2 "Ruwai:Capacitor_SMD0805_ReflowWave" H 5413 5950 30  0001 C CNN
F 3 "" H 5375 6200 60  0000 C CNN
F 4 "Murata" H 5425 5700 60  0001 L CNN "Manu"
F 5 "GCM21BR71H104KA37L" H 5425 5600 60  0001 L CNN "Manu#"
F 6 "0805" H 5425 5500 60  0001 L CNN "Package"
F 7 "Custom Description" H 5375 5750 60  0001 L CNN "Desc"
	1    5375 6100
	1    0    0    -1  
$EndComp
$Comp
L Capacitor C6
U 1 1 546FD154
P 5625 6100
F 0 "C6" H 5625 6200 40  0000 L CNN
F 1 "470nF" H 5631 6015 40  0000 L CNN
F 2 "Ruwai:Capacitor_SMD0805_ReflowWave" H 5663 5950 30  0001 C CNN
F 3 "" H 5625 6200 60  0000 C CNN
F 4 "Samsung Electro-Mechanics" H 5675 5700 60  0001 L CNN "Manu"
F 5 "CL21B474KBF4PNG" H 5675 5600 60  0001 L CNN "Manu#"
F 6 "0805" H 5675 5500 60  0001 L CNN "Package"
F 7 "Custom Description" H 5625 5750 60  0001 L CNN "Desc"
	1    5625 6100
	1    0    0    -1  
$EndComp
$Comp
L Capacitor C4
U 1 1 546FD498
P 5325 5275
F 0 "C4" H 5325 5375 40  0000 L CNN
F 1 "470nF" H 5331 5190 40  0000 L CNN
F 2 "Ruwai:Capacitor_SMD0805_ReflowWave" H 5363 5125 30  0001 C CNN
F 3 "" H 5325 5375 60  0000 C CNN
F 4 "Samsung Electro-Mechanics" H 5375 4875 60  0001 L CNN "Manu"
F 5 "CL21B474KBF4PNG" H 5375 4775 60  0001 L CNN "Manu#"
F 6 "0805" H 5375 4675 60  0001 L CNN "Package"
F 7 "Custom Description" H 5325 4925 60  0001 L CNN "Desc"
	1    5325 5275
	1    0    0    -1  
$EndComp
$Comp
L Capacitor C5
U 1 1 546FD5C8
P 4825 4475
F 0 "C5" H 4825 4575 40  0000 L CNN
F 1 "470nF" H 4831 4390 40  0000 L CNN
F 2 "Ruwai:Capacitor_SMD0805_ReflowWave" H 4863 4325 30  0001 C CNN
F 3 "" H 4825 4575 60  0000 C CNN
F 4 "Samsung Electro-Mechanics" H 4875 4075 60  0001 L CNN "Manu"
F 5 "CL21B474KBF4PNG" H 4875 3975 60  0001 L CNN "Manu#"
F 6 "0805" H 4875 3875 60  0001 L CNN "Package"
F 7 "Custom Description" H 4825 4125 60  0001 L CNN "Desc"
	1    4825 4475
	1    0    0    -1  
$EndComp
$Comp
L Resistor R9
U 1 1 546FDD67
P 6075 5700
F 0 "R9" V 6155 5700 40  0000 C CNN
F 1 "10" V 6082 5701 40  0000 C CNN
F 2 "Ruwai:Resistor_SMD0805_ReflowWave" V 6005 5700 30  0001 C CNN
F 3 "" V 6155 5700 30  0000 C CNN
F 4 "Yageo" H 6075 5200 60  0001 L CNN "Manu"
F 5 "RC0805FR-0710RL" H 6075 5100 60  0001 L CNN "Manu#"
F 6 "0805" H 6075 5000 60  0001 L CNN "Package"
F 7 "Custom Description" H 6075 4900 60  0001 L CNN "Desc"
	1    6075 5700
	0    1    1    0   
$EndComp
$Comp
L Resistor R8
U 1 1 546FE2C1
P 5800 4150
F 0 "R8" V 5880 4150 40  0000 C CNN
F 1 "22" V 5807 4151 40  0000 C CNN
F 2 "Ruwai:Resistor_SMD0805_ReflowWave" V 5730 4150 30  0001 C CNN
F 3 "" V 5880 4150 30  0000 C CNN
F 4 "Yageo" H 5800 3650 60  0001 L CNN "Manu"
F 5 "RC0805FR-0722RL" H 5800 3550 60  0001 L CNN "Manu#"
F 6 "0805" H 5800 3450 60  0001 L CNN "Package"
F 7 "Custom Description" H 5800 3350 60  0001 L CNN "Desc"
	1    5800 4150
	0    1    1    0   
$EndComp
$Comp
L DiodeSchottky D1
U 1 1 546FEDB1
P 5300 4475
F 0 "D1" H 5300 4575 40  0000 C CNN
F 1 "BAS386" H 5300 4375 40  0000 C CNN
F 2 "Ruwai:Diode_SMD0102_ReflowWave" H 5300 4475 60  0001 C CNN
F 3 "" H 5300 4475 60  0000 C CNN
F 4 "Vishay" H 5300 4225 60  0001 L BNN "Manu"
F 5 "BAS386-TR" H 5300 4125 60  0001 L BNN "Manu#"
F 6 "0102" H 5300 4025 60  0001 L BNN "Package"
F 7 "Custom description." H 5300 3925 60  0001 L BNN "Desc"
	1    5300 4475
	0    1    1    0   
$EndComp
Text Notes 3850 7200 1    60   ~ 0
I2C address: 20h
Text Label 4675 5300 0    60   ~ 0
PGA_INN
Text Label 4675 5400 0    60   ~ 0
PGA_INP
Wire Wire Line
	4600 5200 4600 4150
Text HLabel 10525 1225 2    60   Output ~ 0
PGA1_OUTP
Text HLabel 10525 2825 2    60   Output ~ 0
PGA1_OUTN
$Comp
L PWR_FLAG #FLG013
U 1 1 5475C5E9
P 10225 4025
F 0 "#FLG013" H 10225 4120 30  0001 C CNN
F 1 "PWR_FLAG" H 10225 4205 30  0000 C CNN
F 2 "" H 10225 4025 60  0000 C CNN
F 3 "" H 10225 4025 60  0000 C CNN
	1    10225 4025
	0    1    1    0   
$EndComp
$Comp
L PWR_FLAG #FLG014
U 1 1 5475D2CE
P 10225 5350
F 0 "#FLG014" H 10225 5445 30  0001 C CNN
F 1 "PWR_FLAG" H 10225 5530 30  0000 C CNN
F 2 "" H 10225 5350 60  0000 C CNN
F 3 "" H 10225 5350 60  0000 C CNN
	1    10225 5350
	0    1    1    0   
$EndComp
$Comp
L PWR_FLAG #FLG015
U 1 1 5475D53F
P 2350 6775
F 0 "#FLG015" H 2350 6870 30  0001 C CNN
F 1 "PWR_FLAG" H 2350 6955 30  0000 C CNN
F 2 "" H 2350 6775 60  0000 C CNN
F 3 "" H 2350 6775 60  0000 C CNN
	1    2350 6775
	1    0    0    -1  
$EndComp
$Comp
L PWR_FLAG #FLG016
U 1 1 5475D76F
P 5300 4150
F 0 "#FLG016" H 5300 4245 30  0001 C CNN
F 1 "PWR_FLAG" H 5300 4330 30  0000 C CNN
F 2 "" H 5300 4150 60  0000 C CNN
F 3 "" H 5300 4150 60  0000 C CNN
	1    5300 4150
	1    0    0    -1  
$EndComp
$Comp
L PWR_FLAG #FLG017
U 1 1 5475D8B9
P 5325 5000
F 0 "#FLG017" H 5325 5095 30  0001 C CNN
F 1 "PWR_FLAG" H 5325 5180 30  0000 C CNN
F 2 "" H 5325 5000 60  0000 C CNN
F 3 "" H 5325 5000 60  0000 C CNN
	1    5325 5000
	1    0    0    -1  
$EndComp
$Comp
L PWR_FLAG #FLG018
U 1 1 5475D8F8
P 5625 5700
F 0 "#FLG018" H 5625 5795 30  0001 C CNN
F 1 "PWR_FLAG" H 5625 5880 30  0000 C CNN
F 2 "" H 5625 5700 60  0000 C CNN
F 3 "" H 5625 5700 60  0000 C CNN
	1    5625 5700
	1    0    0    -1  
$EndComp
$Comp
L GND #PWR019
U 1 1 5475D99F
P 4575 7650
F 0 "#PWR019" H 4575 7650 30  0001 C CNN
F 1 "GND" H 4575 7580 30  0001 C CNN
F 2 "" H 4575 7650 60  0000 C CNN
F 3 "" H 4575 7650 60  0000 C CNN
	1    4575 7650
	1    0    0    -1  
$EndComp
Wire Wire Line
	4425 6875 4575 6875
Wire Wire Line
	4575 6875 4575 7650
NoConn ~ 4425 6675
$Comp
L LED D5
U 1 1 5475E0A0
P 1825 5300
F 0 "D5" H 1800 5385 40  0000 C CNN
F 1 "LED" H 1825 5210 40  0000 C CNN
F 2 "Ruwai:LED-0805" H 1825 5300 60  0001 C CNN
F 3 "" H 1825 5300 60  0001 C CNN
F 4 "Knightbright" H 1825 5300 60  0001 C CNN "Manu"
F 5 "KP-2012SRC-PRV" H 1825 5300 60  0001 C CNN "Manu#"
F 6 "0805" H 1825 5300 60  0001 C CNN "Package"
	1    1825 5300
	-1   0    0    1   
$EndComp
$Comp
L Resistor R77
U 1 1 5475E386
P 1450 5650
F 0 "R77" V 1530 5650 40  0000 C CNN
F 1 "2.2k" V 1457 5651 40  0000 C CNN
F 2 "Ruwai:Resistor_SMD0805_ReflowWave" V 1380 5650 30  0001 C CNN
F 3 "" V 1530 5650 30  0000 C CNN
F 4 "Yageo" H 1450 5150 60  0001 L CNN "Manu"
F 5 "RC0805FR-072K2L" H 1450 5050 60  0001 L CNN "Manu#"
F 6 "0805" H 1450 4950 60  0001 L CNN "Package"
F 7 "Custom Description" H 1450 4850 60  0001 L CNN "Desc"
	1    1450 5650
	-1   0    0    1   
$EndComp
$Comp
L GND #PWR020
U 1 1 5475E49A
P 1450 6050
F 0 "#PWR020" H 1450 6050 30  0001 C CNN
F 1 "GND" H 1450 5980 30  0001 C CNN
F 2 "" H 1450 6050 60  0000 C CNN
F 3 "" H 1450 6050 60  0000 C CNN
	1    1450 6050
	1    0    0    -1  
$EndComp
Wire Wire Line
	3200 5300 2025 5300
Wire Wire Line
	1625 5300 1450 5300
Wire Wire Line
	1450 5300 1450 5400
Wire Wire Line
	1450 5900 1450 6050
Wire Wire Line
	2200 5200 2200 6775
$Comp
L OPA2209 U3
U 1 1 59BC39BE
P 6975 2675
F 0 "U3" H 7200 2850 60  0000 C CNN
F 1 "OPA2209" H 7300 2475 60  0000 C CNN
F 2 "SSOP_Packages:MSOP-8_3x3mm_Pitch0.65mm" H 6975 2225 60  0001 L CNN
F 3 "" H 6975 2675 60  0000 C CNN
F 4 "Texas Instruments" H 6975 2125 60  0001 L CNN "Manu"
F 5 "OPA2209AIDGKT" H 6975 2025 60  0001 L CNN "Manu#"
F 6 "VSSOP 8-pin" H 6975 1925 60  0001 L CNN "Package"
F 7 " " H 6975 1825 60  0001 L CNN "Desc"
	1    6975 2675
	1    0    0    -1  
$EndComp
$Comp
L OPA2209 U3
U 2 1 59BC45F3
P 6975 1375
F 0 "U3" H 7200 1550 60  0000 C CNN
F 1 "OPA2209" H 7300 1175 60  0000 C CNN
F 2 "SSOP_Packages:MSOP-8_3x3mm_Pitch0.65mm" H 6975 925 60  0001 L CNN
F 3 "" H 6975 1375 60  0000 C CNN
F 4 "Texas Instruments" H 6975 825 60  0001 L CNN "Manu"
F 5 "OPA2209AIDGKT" H 6975 725 60  0001 L CNN "Manu#"
F 6 "VSSOP 8-pin" H 6975 625 60  0001 L CNN "Package"
F 7 " " H 6975 525 60  0001 L CNN "Desc"
	2    6975 1375
	1    0    0    1   
$EndComp
$Comp
L OPA2209 U3
U 3 1 59BC488F
P 10175 4500
F 0 "U3" H 10400 4675 60  0000 C CNN
F 1 "OPA2209" H 10500 4300 60  0000 C CNN
F 2 "SSOP_Packages:MSOP-8_3x3mm_Pitch0.65mm" H 10175 4050 60  0001 L CNN
F 3 "" H 10175 4500 60  0000 C CNN
F 4 "Texas Instruments" H 10175 3950 60  0001 L CNN "Manu"
F 5 "OPA2209AIDGKT" H 10175 3850 60  0001 L CNN "Manu#"
F 6 "VSSOP 8-pin" H 10175 3750 60  0001 L CNN "Package"
F 7 " " H 10175 3650 60  0001 L CNN "Desc"
	3    10175 4500
	1    0    0    -1  
$EndComp
$Comp
L OPA2209 U4
U 1 1 59BC4E72
P 9575 2825
F 0 "U4" H 9800 3000 60  0000 C CNN
F 1 "OPA2209" H 9900 2625 60  0000 C CNN
F 2 "SSOP_Packages:MSOP-8_3x3mm_Pitch0.65mm" H 9575 2375 60  0001 L CNN
F 3 "" H 9575 2825 60  0000 C CNN
F 4 "Texas Instruments" H 9575 2275 60  0001 L CNN "Manu"
F 5 "OPA2209AIDGKT" H 9575 2175 60  0001 L CNN "Manu#"
F 6 "VSSOP 8-pin" H 9575 2075 60  0001 L CNN "Package"
F 7 " " H 9575 1975 60  0001 L CNN "Desc"
	1    9575 2825
	1    0    0    -1  
$EndComp
$Comp
L OPA2209 U4
U 2 1 59BC52C2
P 9575 1225
F 0 "U4" H 9800 1400 60  0000 C CNN
F 1 "OPA2209" H 9900 1025 60  0000 C CNN
F 2 "SSOP_Packages:MSOP-8_3x3mm_Pitch0.65mm" H 9575 775 60  0001 L CNN
F 3 "" H 9575 1225 60  0000 C CNN
F 4 "Texas Instruments" H 9575 675 60  0001 L CNN "Manu"
F 5 "OPA2209AIDGKT" H 9575 575 60  0001 L CNN "Manu#"
F 6 "VSSOP 8-pin" H 9575 475 60  0001 L CNN "Package"
F 7 " " H 9575 375 60  0001 L CNN "Desc"
	2    9575 1225
	1    0    0    1   
$EndComp
$Comp
L OPA2209 U4
U 3 1 59BC5644
P 10175 5825
F 0 "U4" H 10400 6000 60  0000 C CNN
F 1 "OPA2209" H 10500 5625 60  0000 C CNN
F 2 "SSOP_Packages:MSOP-8_3x3mm_Pitch0.65mm" H 10175 5375 60  0001 L CNN
F 3 "" H 10175 5825 60  0000 C CNN
F 4 "Texas Instruments" H 10175 5275 60  0001 L CNN "Manu"
F 5 "OPA2209AIDGKT" H 10175 5175 60  0001 L CNN "Manu#"
F 6 "VSSOP 8-pin" H 10175 5075 60  0001 L CNN "Package"
F 7 " " H 10175 4975 60  0001 L CNN "Desc"
	3    10175 5825
	1    0    0    -1  
$EndComp
$EndSCHEMATC
