EESchema Schematic File Version 4
EELAYER 30 0
EELAYER END
$Descr A4 11693 8268
encoding utf-8
Sheet 5 5
Title "Ruwai Power Supply Two"
Date "2020-02-25"
Rev "1"
Comp "Mertl Research GmbH"
Comment1 ""
Comment2 ""
Comment3 ""
Comment4 "This documentation describes Open Hardware and is licensed under the CERN OHL v. 1.2."
$EndDescr
$Comp
L ruwai:BeagleBoneBlack U5
U 1 1 5E5055CD
P 4600 4000
F 0 "U5" H 4575 6837 60  0000 C CNN
F 1 "BeagleBoneBlack" H 4575 6731 60  0000 C CNN
F 2 "Ruwai:BeagleBoneBlack_PinHeader_Vertical_SMD" H 4900 1050 60  0000 C CNN
F 3 "" H 4950 900 60  0000 C CNN
F 4 "BeagleBone" H 4650 1150 60  0001 L CNN "Manu"
F 5 "BeagleBoneBlack" H 4650 1050 60  0001 L CNN "Manu#"
F 6 "2x2x23 pin" H 4650 950 60  0001 L CNN "Package"
F 7 "Single board computer." H 4650 850 60  0001 L CNN "Desc"
	1    4600 4000
	1    0    0    -1  
$EndComp
$Comp
L power:GND #PWR06
U 1 1 5E51B1B3
P 2900 1600
F 0 "#PWR06" H 2900 1350 50  0001 C CNN
F 1 "GND" H 2905 1427 50  0000 C CNN
F 2 "" H 2900 1600 50  0001 C CNN
F 3 "" H 2900 1600 50  0001 C CNN
	1    2900 1600
	1    0    0    -1  
$EndComp
Wire Wire Line
	3750 1500 2900 1500
Wire Wire Line
	2900 1500 2900 1600
$Comp
L power:GND #PWR07
U 1 1 5E51B928
P 2900 4450
F 0 "#PWR07" H 2900 4200 50  0001 C CNN
F 1 "GND" H 2905 4277 50  0000 C CNN
F 2 "" H 2900 4450 50  0001 C CNN
F 3 "" H 2900 4450 50  0001 C CNN
	1    2900 4450
	1    0    0    -1  
$EndComp
$Comp
L power:GND #PWR08
U 1 1 5E51BC9D
P 3000 6700
F 0 "#PWR08" H 3000 6450 50  0001 C CNN
F 1 "GND" H 3005 6527 50  0000 C CNN
F 2 "" H 3000 6700 50  0001 C CNN
F 3 "" H 3000 6700 50  0001 C CNN
	1    3000 6700
	1    0    0    -1  
$EndComp
Wire Wire Line
	3750 6550 3600 6550
Wire Wire Line
	3000 6550 3000 6700
Wire Wire Line
	3750 6450 3600 6450
Wire Wire Line
	3600 6450 3600 6550
Connection ~ 3600 6550
Wire Wire Line
	3600 6550 3000 6550
Wire Wire Line
	3750 4350 2900 4350
Wire Wire Line
	2900 4350 2900 4450
$Comp
L power:GND #PWR010
U 1 1 5E51F141
P 6500 4450
F 0 "#PWR010" H 6500 4200 50  0001 C CNN
F 1 "GND" H 6505 4277 50  0000 C CNN
F 2 "" H 6500 4450 50  0001 C CNN
F 3 "" H 6500 4450 50  0001 C CNN
	1    6500 4450
	1    0    0    -1  
$EndComp
Wire Wire Line
	5400 6550 5650 6550
Wire Wire Line
	6600 6550 6600 6700
Wire Wire Line
	5400 6450 5650 6450
Wire Wire Line
	5650 6450 5650 6550
Connection ~ 5650 6550
Wire Wire Line
	5650 6550 6600 6550
Wire Wire Line
	5400 4350 6500 4350
Wire Wire Line
	6500 4350 6500 4450
Wire Wire Line
	5400 1500 6400 1500
Wire Wire Line
	6400 1500 6400 1600
Wire Wire Line
	3750 4550 3600 4550
Text HLabel 3600 4550 0    50   Input ~ 0
VDD_5V
Text HLabel 5600 4450 2    50   Output ~ 0
3.3V
Wire Wire Line
	3750 4850 3600 4850
Wire Wire Line
	3750 4950 3600 4950
Text HLabel 3600 4850 0    50   Input ~ 0
UART4_RXD
Text HLabel 3600 4950 0    50   Output ~ 0
UART4_TXD
Text HLabel 5600 4650 2    50   Output ~ 0
SYS_5V
$Comp
L ruwai:70543-0009 P4
U 1 1 5E536697
P 9650 2300
F 0 "P4" H 9728 2341 50  0000 L CNN
F 1 "70543-0009" H 9728 2250 50  0000 L CNN
F 2 "Ruwai:Molex_SL_70543-0009" H 10250 1750 60  0001 C CNN
F 3 "" H 9650 2850 60  0000 C CNN
F 4 "Molex" H 9650 1600 60  0001 L CNN "Manu"
F 5 "70553-0009" H 9650 1500 60  0001 L CNN "Manu#"
F 6 "1x10 pins; 2.54mm pitch" H 9650 1400 60  0001 L CNN "Package"
F 7 "Molex 70553-0009 plug connector 1x10 pins, header, straight" H 9650 1300 60  0001 L CNN "Desc"
	1    9650 2300
	1    0    0    -1  
$EndComp
Wire Wire Line
	9450 1950 9300 1950
Text Label 9300 1950 2    50   ~ 0
SYS_5V
Wire Wire Line
	9450 2050 8800 2050
Wire Wire Line
	8800 2050 8800 2150
Wire Wire Line
	3750 1800 3550 1800
Wire Wire Line
	5400 1800 5600 1800
Wire Wire Line
	3750 2000 3550 2000
Wire Wire Line
	3750 2100 3550 2100
Wire Wire Line
	3750 2200 3550 2200
Wire Wire Line
	3750 2300 3550 2300
Wire Wire Line
	9450 2250 8550 2250
Wire Wire Line
	8550 2250 8550 2300
$Comp
L power:GND #PWR013
U 1 1 5E5438DE
P 8550 2300
F 0 "#PWR013" H 8550 2050 50  0001 C CNN
F 1 "GND" H 8555 2127 50  0000 C CNN
F 2 "" H 8550 2300 50  0001 C CNN
F 3 "" H 8550 2300 50  0001 C CNN
	1    8550 2300
	1    0    0    -1  
$EndComp
Wire Wire Line
	9450 2150 9300 2150
Wire Wire Line
	9450 2350 9300 2350
Wire Wire Line
	9450 2450 9300 2450
Wire Wire Line
	9450 2550 9300 2550
Wire Wire Line
	9450 2650 9300 2650
Wire Wire Line
	9450 2750 9300 2750
Text Label 3550 1800 2    50   ~ 0
GPIO_66
Text Label 5600 1800 0    50   ~ 0
GPIO_67
Text Label 3550 2000 2    50   ~ 0
GPIO_45
Text Label 3550 2100 2    50   ~ 0
GPIO_23
Text Label 3550 2200 2    50   ~ 0
GPIO_47
Text Label 3550 2300 2    50   ~ 0
GPIO_27
Text Label 9300 2150 2    50   ~ 0
GPIO_66
Text Label 9300 2350 2    50   ~ 0
GPIO_67
Text Label 9300 2450 2    50   ~ 0
GPIO_45
Text Label 9300 2550 2    50   ~ 0
GPIO_23
Text Label 9300 2650 2    50   ~ 0
GPIO_47
Text Label 9300 2750 2    50   ~ 0
GPIO_27
Text Notes 8600 1700 0    50   ~ 0
LDC Connector\n66: rs; 67: e; 45: db4; 23: db5; 47: db6; 27: db7
$Comp
L ruwai:R_POT RV1
U 1 1 5E555951
P 8150 2150
F 0 "RV1" H 8081 2196 50  0000 R CNN
F 1 "R_POT" H 8081 2105 50  0000 R CNN
F 2 "Potentiometer_THT:Potentiometer_Bourns_3386F_Vertical" H 8150 2150 50  0001 C CNN
F 3 "" H 8150 2150 50  0001 C CNN
F 4 "Bourns" H 8150 1750 50  0001 L CNN "Manu"
F 5 "3386F-1-103LF" H 8150 1650 50  0001 L CNN "Manu#"
F 6 "THM" H 8150 1550 50  0001 L CNN "Package"
F 7 "10kΩ Through Hole Trimmer Potentiometer 0.5W Top Adjust Bourns 3386 Series" H 8150 1450 50  0001 L CNN "Desc"
	1    8150 2150
	1    0    0    -1  
$EndComp
Wire Wire Line
	8150 2000 8150 1850
Wire Wire Line
	8150 2300 8150 2400
Wire Wire Line
	8150 2400 8000 2400
Text Label 8000 2400 2    50   ~ 0
SYS_5V
Wire Wire Line
	8300 2150 8800 2150
NoConn ~ 3750 1600
NoConn ~ 3750 1700
NoConn ~ 3750 1900
NoConn ~ 3750 2400
NoConn ~ 3750 2500
NoConn ~ 3750 2600
NoConn ~ 3750 2700
NoConn ~ 3750 2800
NoConn ~ 3750 2900
NoConn ~ 3750 3000
NoConn ~ 3750 3100
NoConn ~ 3750 3200
NoConn ~ 3750 3300
NoConn ~ 3750 3400
NoConn ~ 3750 3500
NoConn ~ 3750 3600
NoConn ~ 3750 3700
NoConn ~ 5400 3700
NoConn ~ 5400 3600
NoConn ~ 5400 3500
NoConn ~ 5400 3400
NoConn ~ 5400 3300
NoConn ~ 5400 3200
NoConn ~ 5400 3100
NoConn ~ 5400 3000
NoConn ~ 5400 2900
NoConn ~ 5400 2800
NoConn ~ 5400 2700
NoConn ~ 5400 2600
NoConn ~ 5400 2500
NoConn ~ 5400 2400
NoConn ~ 5400 2300
NoConn ~ 5400 2200
NoConn ~ 5400 2100
NoConn ~ 5400 2000
NoConn ~ 5400 1900
NoConn ~ 5400 1700
NoConn ~ 5400 1600
NoConn ~ 3750 4750
NoConn ~ 3750 5050
NoConn ~ 3750 5150
NoConn ~ 3750 5250
NoConn ~ 3750 5350
NoConn ~ 3750 5550
NoConn ~ 3750 5650
NoConn ~ 3750 5750
NoConn ~ 3750 5850
NoConn ~ 3750 5950
NoConn ~ 3750 6050
NoConn ~ 3750 6150
NoConn ~ 3750 6250
NoConn ~ 3750 6350
NoConn ~ 5400 6350
NoConn ~ 5400 6250
NoConn ~ 5400 6150
NoConn ~ 5400 6050
NoConn ~ 5400 5950
NoConn ~ 5400 5850
NoConn ~ 5400 5750
NoConn ~ 5400 5650
NoConn ~ 5400 5550
NoConn ~ 5400 5450
NoConn ~ 5400 5350
NoConn ~ 5400 5250
NoConn ~ 5400 5150
NoConn ~ 5400 5050
NoConn ~ 5400 4950
NoConn ~ 5400 4850
NoConn ~ 5400 4750
$Comp
L power:GND #PWR0102
U 1 1 5E5C4050
P 7750 1900
F 0 "#PWR0102" H 7750 1650 50  0001 C CNN
F 1 "GND" H 7755 1727 50  0000 C CNN
F 2 "" H 7750 1900 50  0001 C CNN
F 3 "" H 7750 1900 50  0001 C CNN
	1    7750 1900
	1    0    0    -1  
$EndComp
Wire Wire Line
	7750 1850 7750 1900
$Comp
L power:GND #PWR0103
U 1 1 5E5E3839
P 6600 6700
F 0 "#PWR0103" H 6600 6450 50  0001 C CNN
F 1 "GND" H 6605 6527 50  0000 C CNN
F 2 "" H 6600 6700 50  0001 C CNN
F 3 "" H 6600 6700 50  0001 C CNN
	1    6600 6700
	1    0    0    -1  
$EndComp
Wire Wire Line
	8150 1850 7750 1850
Wire Wire Line
	8150 1850 9450 1850
Connection ~ 8150 1850
$Comp
L power:GND #PWR0104
U 1 1 5E509B5D
P 6400 1600
F 0 "#PWR0104" H 6400 1350 50  0001 C CNN
F 1 "GND" H 6405 1427 50  0000 C CNN
F 2 "" H 6400 1600 50  0001 C CNN
F 3 "" H 6400 1600 50  0001 C CNN
	1    6400 1600
	1    0    0    -1  
$EndComp
Wire Wire Line
	5400 4450 5600 4450
Wire Wire Line
	5400 4650 5600 4650
NoConn ~ 5400 4550
NoConn ~ 3750 4650
NoConn ~ 3750 4450
$Comp
L ruwai:DS1820_(TO-92) U6
U 1 1 5E556DFC
P 9600 3750
F 0 "U6" H 9272 3697 60  0000 R CNN
F 1 "DS1820_(TO-92)" H 9272 3803 60  0000 R CNN
F 2 "Package_TO_SOT_THT:TO-92L_Inline_Wide" H 9600 2950 60  0001 L CNN
F 3 "" H 9700 3500 60  0000 C CNN
F 4 "Manufacturer" H 9600 3350 60  0001 L CNN "Manu"
F 5 "Manufacturer part number" H 9600 3250 60  0001 L CNN "Manu#"
F 6 "The package of the part." H 9600 3150 60  0001 L CNN "Package"
F 7 "Custom Description" H 9600 3050 60  0001 L CNN "Desc"
	1    9600 3750
	-1   0    0    1   
$EndComp
Wire Wire Line
	9400 3650 9250 3650
Wire Wire Line
	9400 3850 9250 3850
Wire Wire Line
	9250 3850 9250 4000
$Comp
L power:GND #PWR09
U 1 1 5E559F78
P 9250 4000
F 0 "#PWR09" H 9250 3750 50  0001 C CNN
F 1 "GND" H 9255 3827 50  0000 C CNN
F 2 "" H 9250 4000 50  0001 C CNN
F 3 "" H 9250 4000 50  0001 C CNN
	1    9250 4000
	1    0    0    -1  
$EndComp
Wire Wire Line
	3750 5450 3600 5450
Text Label 3600 5450 2    50   ~ 0
GPIO_49
$Comp
L ruwai:Resistor 4.7k1
U 1 1 5E55C9D7
P 8750 3500
F 0 "4.7k1" H 8821 3538 40  0000 L CNN
F 1 "Resistor" H 8821 3462 40  0000 L CNN
F 2 "Ruwai:Resistor_SMD0805_ReflowWave" V 8680 3500 30  0001 C CNN
F 3 "" V 8830 3500 30  0000 C CNN
F 4 "Manufacturer" H 8750 3000 60  0001 L CNN "Manu"
F 5 "Manufacturer part number" H 8750 2900 60  0001 L CNN "Manu#"
F 6 "The package of the part." H 8750 2800 60  0001 L CNN "Package"
F 7 "Custom Description" H 8750 2700 60  0001 L CNN "Desc"
	1    8750 3500
	1    0    0    -1  
$EndComp
Wire Wire Line
	9400 3750 8750 3750
Text Label 8300 3750 2    50   ~ 0
GPIO_49
Connection ~ 8750 3750
Wire Wire Line
	8300 3750 8750 3750
Wire Wire Line
	9250 3650 9250 3250
Wire Wire Line
	9250 3250 8750 3250
Connection ~ 8750 3250
Wire Wire Line
	8750 3250 8300 3250
Text Label 8300 3250 2    50   ~ 0
3.3V
$EndSCHEMATC
