(module SOT23-5 (layer F.Cu) (tedit 54D71B0F)
  (attr smd)
  (fp_text reference SOT23-5 (at -2.1 0 90) (layer F.SilkS)
    (effects (font (size 0.65 0.65) (thickness 0.125)))
  )
  (fp_text value VAL*** (at 0 0) (layer F.SilkS) hide
    (effects (font (size 0.635 0.635) (thickness 0.127)))
  )
  (fp_line (start -1.6 1.8) (end -1.6 -1.8) (layer F.CrtYd) (width 0.15))
  (fp_line (start 1.7 1.8) (end -1.6 1.8) (layer F.CrtYd) (width 0.15))
  (fp_line (start 1.7 -1.8) (end 1.7 1.8) (layer F.CrtYd) (width 0.15))
  (fp_line (start -1.6 -1.8) (end 1.7 -1.8) (layer F.CrtYd) (width 0.15))
  (fp_line (start 1.524 -0.889) (end 1.524 0.889) (layer F.SilkS) (width 0.3))
  (fp_line (start 1.524 0.889) (end -1.524 0.889) (layer F.SilkS) (width 0.3))
  (fp_line (start -1.524 0.889) (end -1.524 -0.889) (layer F.SilkS) (width 0.3))
  (fp_line (start -1.524 -0.889) (end 1.524 -0.889) (layer F.SilkS) (width 0.3))
  (pad 1 smd rect (at -0.9525 1.27) (size 0.508 0.762) (layers F.Cu F.Paste F.Mask))
  (pad 3 smd rect (at 0.9525 1.27) (size 0.508 0.762) (layers F.Cu F.Paste F.Mask))
  (pad 5 smd rect (at -0.9525 -1.27) (size 0.508 0.762) (layers F.Cu F.Paste F.Mask))
  (pad 2 smd rect (at 0 1.27) (size 0.508 0.762) (layers F.Cu F.Paste F.Mask))
  (pad 4 smd rect (at 0.9525 -1.27) (size 0.508 0.762) (layers F.Cu F.Paste F.Mask))
  (model smd/SOT23_5.wrl
    (at (xyz 0 0 0))
    (scale (xyz 0.1 0.1 0.1))
    (rotate (xyz 0 0 0))
  )
)
