/* XPM */
static char * folder_11x11_xpm[] = {
"42 42 684 2",
"  	c None",
". 	c #FEC7E4",
"+ 	c #FEC1E2",
"@ 	c #FDBCDF",
"# 	c #FDB2DB",
"$ 	c #FDA9D7",
"% 	c #FDCAE4",
"& 	c #FDC6E3",
"* 	c #FDC1E0",
"= 	c #FDC0E0",
"- 	c #FDC1E1",
"; 	c #FDBCDE",
"> 	c #FCACD6",
", 	c #FCA7D4",
"' 	c #FCA5D3",
") 	c #FBC5E1",
"! 	c #FBC3E0",
"~ 	c #FCC2E0",
"{ 	c #FCC0DF",
"] 	c #FBBCDD",
"^ 	c #FCBCDD",
"/ 	c #FCBDDD",
"( 	c #FBB5D9",
"_ 	c #FAA7D2",
": 	c #F99DCC",
"< 	c #F89ECC",
"[ 	c #F79DCC",
"} 	c #F69CCA",
"| 	c #F49BC9",
"1 	c #F39DC9",
"2 	c #E89AC2",
"3 	c #FCC1DD",
"4 	c #FBBFDC",
"5 	c #FBBADA",
"6 	c #FBB8D9",
"7 	c #FBB9D9",
"8 	c #FAB9D9",
"9 	c #F9B8D8",
"0 	c #F8B7D8",
"a 	c #F6B1D3",
"b 	c #F099C5",
"c 	c #EF93C1",
"d 	c #EF92C0",
"e 	c #F09BC5",
"f 	c #F3A5CC",
"g 	c #F4A9CE",
"h 	c #F6ADD1",
"i 	c #F8B1D4",
"j 	c #F7AACF",
"k 	c #F89AC4",
"l 	c #FF94C0",
"m 	c #FE93C0",
"n 	c #FABFDB",
"o 	c #F9B4D5",
"p 	c #F9B3D5",
"q 	c #F9B3D6",
"r 	c #F8B2D4",
"s 	c #F7B2D3",
"t 	c #F5B0D1",
"u 	c #F4B2D2",
"v 	c #F4B6D4",
"w 	c #F4B8D6",
"x 	c #F4B9D6",
"y 	c #F5B9D6",
"z 	c #F5B4D3",
"A 	c #F5ABCF",
"B 	c #F6B1D2",
"C 	c #F8B5D5",
"D 	c #FAB8D7",
"E 	c #FAB5D5",
"F 	c #F9B0D3",
"G 	c #F9AED1",
"H 	c #F8A3CA",
"I 	c #F696C1",
"J 	c #F68EBC",
"K 	c #F88FBC",
"L 	c #FF90BD",
"M 	c #F8B7D6",
"N 	c #F8AFD1",
"O 	c #F5ADCE",
"P 	c #F2ACCD",
"Q 	c #F1AACB",
"R 	c #F1A9CB",
"S 	c #F1ABCB",
"T 	c #F3B8D3",
"U 	c #F5C0D9",
"V 	c #F7C2DB",
"W 	c #F9C5DE",
"X 	c #FAC5DE",
"Y 	c #FABCD9",
"Z 	c #F9B8D7",
"` 	c #F9B7D5",
" .	c #F8AED1",
"..	c #F8ADD0",
"+.	c #F8ACD0",
"@.	c #F7A1C7",
"#.	c #F58DBA",
"$.	c #F58CBA",
"%.	c #F58BBA",
"&.	c #F88CB9",
"*.	c #FF8CBA",
"=.	c #FE8CB9",
"-.	c #F6B0D0",
";.	c #F6A9CC",
">.	c #EFA5C7",
",.	c #F3B2D0",
"'.	c #F7BCD8",
").	c #F9BFDA",
"!.	c #FAC0DB",
"~.	c #FABAD8",
"{.	c #F9B5D5",
"].	c #F9B6D5",
"^.	c #F8B0D0",
"/.	c #F7A8CD",
"(.	c #F7A9CD",
"_.	c #F7A9CC",
":.	c #F7A8CC",
"<.	c #F6A1C7",
"[.	c #F58FBB",
"}.	c #F485B5",
"|.	c #F587B5",
"1.	c #F486B5",
"2.	c #F886B4",
"3.	c #FF88B6",
"4.	c #FF89B7",
"5.	c #F5AACB",
"6.	c #F5A3C8",
"7.	c #F4A3C7",
"8.	c #EF9FC2",
"9.	c #F4AFCD",
"0.	c #F8B3D2",
"a.	c #F9B4D3",
"b.	c #F8B4D3",
"c.	c #F8B3D1",
"d.	c #F8B4D2",
"e.	c #F9B4D1",
"f.	c #F7A8CA",
"g.	c #F6A5C9",
"h.	c #F7A5C9",
"i.	c #F693BC",
"j.	c #F381B0",
"k.	c #F483B1",
"l.	c #F482B1",
"m.	c #F382B0",
"n.	c #F581B0",
"o.	c #F481B0",
"p.	c #F882B1",
"q.	c #FF84B3",
"r.	c #FE85B3",
"s.	c #F3A3C5",
"t.	c #F29DC1",
"u.	c #F39DC1",
"v.	c #EC99BD",
"w.	c #F3AAC9",
"x.	c #F9AFCF",
"y.	c #F9AFCE",
"z.	c #F9ADCD",
"A.	c #F6A3C7",
"B.	c #F5A0C5",
"C.	c #F5A1C5",
"D.	c #F6A0C5",
"E.	c #F488B4",
"F.	c #F27CAC",
"G.	c #F37DAC",
"H.	c #F27DAC",
"I.	c #F37CAC",
"J.	c #F37CAB",
"K.	c #F47CAB",
"L.	c #F87DAD",
"M.	c #FF80AF",
"N.	c #FF81B0",
"O.	c #F09CBF",
"P.	c #F095BB",
"Q.	c #EA92B6",
"R.	c #F1A5C5",
"S.	c #F7ABCC",
"T.	c #F7ABCB",
"U.	c #F8ABCC",
"V.	c #F8A9CB",
"W.	c #F59DC2",
"X.	c #F59CC2",
"Y.	c #F59CC1",
"Z.	c #F59BC1",
"`.	c #F178A8",
" +	c #F177A7",
".+	c #F277A7",
"++	c #F377A7",
"@+	c #F477A7",
"#+	c #F87AA9",
"$+	c #FF7DAD",
"%+	c #FE7EAD",
"&+	c #EE95B9",
"*+	c #EE8EB5",
"=+	c #E88BB0",
"-+	c #F09FC0",
";+	c #F7A7C8",
">+	c #F8A7C8",
",+	c #F7A5C7",
"'+	c #F499BF",
")+	c #F599BE",
"!+	c #F598BE",
"~+	c #F499BE",
"{+	c #F17CAA",
"]+	c #F074A3",
"^+	c #F074A4",
"/+	c #F173A4",
"(+	c #F274A4",
"_+	c #F273A4",
":+	c #F474A4",
"<+	c #F373A4",
"[+	c #F877A7",
"}+	c #FF7AAA",
"|+	c #FF7BAA",
"1+	c #EC8CB2",
"2+	c #EC86AE",
"3+	c #EC85AE",
"4+	c #E582AA",
"5+	c #EE99BB",
"6+	c #F6A1C4",
"7+	c #F7A1C3",
"8+	c #F7A0C2",
"9+	c #F394BB",
"0+	c #F394BA",
"a+	c #F495BB",
"b+	c #F17BA8",
"c+	c #F070A0",
"d+	c #F06FA0",
"e+	c #F16FA0",
"f+	c #F170A0",
"g+	c #F270A0",
"h+	c #F370A1",
"i+	c #F270A1",
"j+	c #F470A1",
"k+	c #F471A1",
"l+	c #F974A4",
"m+	c #FF78A8",
"n+	c #FF79A8",
"o+	c #E884AB",
"p+	c #E97EA7",
"q+	c #E97DA7",
"r+	c #E27AA2",
"s+	c #ED92B6",
"t+	c #F69DC0",
"u+	c #F79CC0",
"v+	c #F69CC0",
"w+	c #F492B8",
"x+	c #F490B8",
"y+	c #F491B7",
"z+	c #F490B7",
"A+	c #F392B7",
"B+	c #F388B2",
"C+	c #F06C9E",
"D+	c #EF6C9D",
"E+	c #F16D9D",
"F+	c #F16C9D",
"G+	c #F16C9E",
"H+	c #F26D9E",
"I+	c #F36E9E",
"J+	c #F46E9F",
"K+	c #F971A2",
"L+	c #FF75A5",
"M+	c #FF76A5",
"N+	c #E57BA4",
"O+	c #E674A0",
"P+	c #DE729C",
"Q+	c #EB8CB0",
"R+	c #F698BC",
"S+	c #F698BD",
"T+	c #F38EB5",
"U+	c #F48DB5",
"V+	c #F48DB4",
"W+	c #F48EB4",
"X+	c #F490B6",
"Y+	c #F06D9E",
"Z+	c #F06A9B",
"`+	c #F1699B",
" @	c #F16A9B",
".@	c #F26A9B",
"+@	c #F36A9C",
"@@	c #F36B9C",
"#@	c #F46B9C",
"$@	c #F56B9C",
"%@	c #F56C9D",
"&@	c #FA709F",
"*@	c #FF72A3",
"=@	c #FE74A3",
"-@	c #E1739D",
";@	c #E36B98",
">@	c #E26B98",
",@	c #DB6994",
"'@	c #E984AA",
")@	c #F693BA",
"!@	c #F68FB6",
"~@	c #F38BB3",
"{@	c #F38AB2",
"]@	c #F48AB2",
"^@	c #F48BB3",
"/@	c #F27EA9",
"(@	c #F06698",
"_@	c #F06899",
":@	c #F16899",
"<@	c #F26899",
"[@	c #F2699A",
"}@	c #F3689A",
"|@	c #F4699A",
"1@	c #F5699A",
"2@	c #F56A9A",
"3@	c #F66A9B",
"4@	c #FA6D9D",
"5@	c #FF70A0",
"6@	c #FE71A1",
"7@	c #DD6994",
"8@	c #DE6190",
"9@	c #DF6190",
"0@	c #D75E8C",
"a@	c #E77DA5",
"b@	c #F68EB5",
"c@	c #F588B1",
"d@	c #F588B0",
"e@	c #F587AF",
"f@	c #F487B0",
"g@	c #F487AF",
"h@	c #F26C9C",
"i@	c #F26697",
"j@	c #F36697",
"k@	c #F46697",
"l@	c #F46798",
"m@	c #F56798",
"n@	c #F66798",
"o@	c #F76799",
"p@	c #F66899",
"q@	c #FB6A9B",
"r@	c #FF6D9E",
"s@	c #FF6F9E",
"t@	c #DA608D",
"u@	c #DB5888",
"v@	c #D45584",
"w@	c #E6759F",
"x@	c #F686AF",
"y@	c #F586AE",
"z@	c #F585AE",
"A@	c #F684AD",
"B@	c #F584AD",
"C@	c #F582AC",
"D@	c #F36898",
"E@	c #F36596",
"F@	c #F46596",
"G@	c #F46597",
"H@	c #F56596",
"I@	c #F56597",
"J@	c #F66596",
"K@	c #F66697",
"L@	c #F76697",
"M@	c #F86697",
"N@	c #FB6899",
"O@	c #FF6A9B",
"P@	c #FF6B9C",
"Q@	c #D55886",
"R@	c #D74F81",
"S@	c #D74E80",
"T@	c #CF4C7C",
"U@	c #E36C97",
"V@	c #F783AD",
"W@	c #F782AB",
"X@	c #F681AB",
"Y@	c #F682AB",
"Z@	c #F681AA",
"`@	c #F579A5",
" #	c #F46495",
".#	c #F46395",
"+#	c #F56394",
"@#	c #F56395",
"##	c #F66495",
"$#	c #F76495",
"%#	c #F86495",
"&#	c #F96495",
"*#	c #FC6697",
"=#	c #FF6798",
"-#	c #FF6899",
";#	c #CE4E7D",
">#	c #CE4477",
",#	c #CE4377",
"'#	c #C74173",
")#	c #DE5F8D",
"!#	c #F880AA",
"~#	c #F77FA9",
"{#	c #F67EA9",
"]#	c #F77EA8",
"^#	c #F77DA8",
"/#	c #F680AA",
"(#	c #F56797",
"_#	c #F46394",
":#	c #F46294",
"<#	c #F56294",
"[#	c #F56293",
"}#	c #F66294",
"|#	c #F66293",
"1#	c #F76293",
"2#	c #F76294",
"3#	c #F86294",
"4#	c #F96294",
"5#	c #FC6395",
"6#	c #FF6496",
"7#	c #FF6495",
"8#	c #C54575",
"9#	c #C43B6E",
"0#	c #C43A6D",
"a#	c #BB3265",
"b#	c #D95B89",
"c#	c #F87CA7",
"d#	c #F77CA6",
"e#	c #F77BA6",
"f#	c #F77BA5",
"g#	c #F67AA5",
"h#	c #F776A2",
"i#	c #F56092",
"j#	c #F66193",
"k#	c #F66192",
"l#	c #F66092",
"m#	c #F76091",
"n#	c #F76092",
"o#	c #F85F91",
"p#	c #F86092",
"q#	c #F95F91",
"r#	c #F96092",
"s#	c #FA5F91",
"t#	c #FD6093",
"u#	c #FF6093",
"v#	c #FE6093",
"w#	c #BC3E6D",
"x#	c #B93366",
"y#	c #B93165",
"z#	c #B12D5E",
"A#	c #D55583",
"B#	c #F879A5",
"C#	c #F878A3",
"D#	c #F877A3",
"E#	c #F876A2",
"F#	c #F76797",
"G#	c #F66091",
"H#	c #F65F91",
"I#	c #F75F91",
"J#	c #F75E90",
"K#	c #F85E90",
"L#	c #F95D90",
"M#	c #F95E90",
"N#	c #FA5D90",
"O#	c #FB5C90",
"P#	c #FD5D90",
"Q#	c #FF5D90",
"R#	c #FF5C90",
"S#	c #B33767",
"T#	c #AF2E5F",
"U#	c #AE2C5E",
"V#	c #A72A5A",
"W#	c #D1527F",
"X#	c #FA75A1",
"Y#	c #F973A0",
"Z#	c #F9729F",
"`#	c #F8719E",
" $	c #F85D8F",
".$	c #F85C8F",
"+$	c #F85C8E",
"@$	c #F95C8E",
"#$	c #F95B8E",
"$$	c #FA5B8E",
"%$	c #FB5A8E",
"&$	c #FB5A8D",
"*$	c #FB598E",
"=$	c #FB598D",
"-$	c #FC588C",
";$	c #FE578C",
">$	c #FD568B",
",$	c #AA3362",
"'$	c #A42A5A",
")$	c #A3295A",
"!$	c #9E2857",
"~$	c #CC4E7C",
"{$	c #FA709E",
"]$	c #F96E9D",
"^$	c #FA6E9C",
"/$	c #FA6D9B",
"($	c #FA6E9B",
"_$	c #F85B8E",
":$	c #F95A8E",
"<$	c #F9598E",
"[$	c #F9598D",
"}$	c #FA588D",
"|$	c #FA588C",
"1$	c #FA568B",
"2$	c #FA558A",
"3$	c #FA5389",
"4$	c #F95188",
"5$	c #F94F87",
"6$	c #F84D86",
"7$	c #F94B84",
"8$	c #FA4984",
"9$	c #F84681",
"0$	c #A3305E",
"a$	c #9A2756",
"b$	c #942553",
"c$	c #C84A78",
"d$	c #FB6B9A",
"e$	c #FA6999",
"f$	c #FA6898",
"g$	c #FA6798",
"h$	c #FA6697",
"i$	c #FA5A8D",
"j$	c #FA598D",
"k$	c #F9588D",
"l$	c #F9578B",
"m$	c #F9568B",
"n$	c #F95589",
"o$	c #F95389",
"p$	c #F95087",
"q$	c #F84E86",
"r$	c #F74C85",
"s$	c #F64A84",
"t$	c #F74983",
"u$	c #F64782",
"v$	c #F54481",
"w$	c #F5427F",
"x$	c #F43F7E",
"y$	c #F33C7C",
"z$	c #F3397A",
"A$	c #F13678",
"B$	c #992D58",
"C$	c #912553",
"D$	c #912552",
"E$	c #8C2450",
"F$	c #C34673",
"G$	c #FB6495",
"H$	c #FB6394",
"I$	c #FB6293",
"J$	c #FB6093",
"K$	c #F95489",
"L$	c #F95288",
"M$	c #F85086",
"N$	c #F74D85",
"O$	c #F74B84",
"P$	c #F64A82",
"Q$	c #F54581",
"R$	c #F34280",
"S$	c #F34180",
"T$	c #F3417F",
"U$	c #F1407F",
"V$	c #F13F7E",
"W$	c #EF3C7D",
"X$	c #EE397C",
"Y$	c #ED3578",
"Z$	c #ED2F75",
"`$	c #EC2A72",
" %	c #EC266F",
".%	c #8A2650",
"+%	c #8A224F",
"@%	c #89224E",
"#%	c #85214C",
"$%	c #BE3F6D",
"%%	c #FB5D8F",
"&%	c #FA5A8E",
"*%	c #F9568C",
"=%	c #F8548A",
"-%	c #F85189",
";%	c #F64883",
">%	c #F64681",
",%	c #F54480",
"'%	c #F54380",
")%	c #F3417E",
"!%	c #F2407E",
"~%	c #F13E7E",
"{%	c #F03F7E",
"]%	c #EE3F7F",
"^%	c #EE4080",
"/%	c #EE4181",
"(%	c #ED4182",
"_%	c #ED4183",
":%	c #EC4082",
"<%	c #EC3C7F",
"[%	c #EA367B",
"}%	c #EB2E76",
"|%	c #ED2671",
"1%	c #E61F6A",
"2%	c #B71652",
"3%	c #7A1E44",
"4%	c #831E4A",
"5%	c #821E49",
"6%	c #7F1D48",
"7%	c #B83465",
"8%	c #F44A85",
"9%	c #F54983",
"0%	c #F44683",
"a%	c #F44581",
"b%	c #F33E7D",
"c%	c #F23D7D",
"d%	c #F13D7D",
"e%	c #F03D7D",
"f%	c #EF3D7E",
"g%	c #EE3D7E",
"h%	c #ED3F80",
"i%	c #ED4081",
"j%	c #ED4283",
"k%	c #ED4384",
"l%	c #ED4586",
"m%	c #EC4587",
"n%	c #EC4486",
"o%	c #EB4184",
"p%	c #EC3C81",
"q%	c #EC357C",
"r%	c #EE2C76",
"s%	c #D32165",
"t%	c #8B1241",
"u%	c #21040F",
"v%	c #6B1539",
"w%	c #7C1742",
"x%	c #78163F",
"y%	c #AD275A",
"z%	c #EC3979",
"A%	c #EE387A",
"B%	c #EF387B",
"C%	c #EF387C",
"D%	c #EE3A7C",
"E%	c #ED3C7F",
"F%	c #ED4082",
"G%	c #EC4384",
"H%	c #EC4485",
"I%	c #ED4587",
"J%	c #EE4487",
"K%	c #F04287",
"L%	c #F34186",
"M%	c #E53C7D",
"N%	c #CF3671",
"O%	c #BB2F64",
"P%	c #A32655",
"Q%	c #811C42",
"R%	c #53122B",
"S%	c #13060A",
"T%	c #000000",
"U%	c #5F0D2D",
"V%	c #771038",
"W%	c #6F0E34",
"X%	c #610C2D",
"Y%	c #971A49",
"Z%	c #E32B6F",
"`%	c #E72D74",
" &	c #EB3279",
".&	c #EC367C",
"+&	c #EC3C80",
"@&	c #EC4083",
"#&	c #EB4285",
"$&	c #EC4285",
"%&	c #EC4084",
"&&	c #ED3E82",
"*&	c #F03E81",
"=&	c #DB3874",
"-&	c #AE2F5D",
";&	c #792442",
">&	c #30131D",
",&	c #0B0709",
"'&	c #49071F",
")&	c #6A072C",
"!&	c #580525",
"~&	c #3E0319",
"{&	c #981346",
"]&	c #DD2069",
"^&	c #EB2671",
"/&	c #F42F79",
"(&	c #EC3579",
"_&	c #D53570",
":&	c #BD3266",
"<&	c #A62E5A",
"[&	c #8C274C",
"}&	c #6E203B",
"|&	c #481727",
"1&	c #19040C",
"2&	c #6E0D2F",
"3&	c #5D0423",
"4&	c #710E30",
"5&	c #BD2358",
"6&	c #A4204C",
"7&	c #781C3A",
"8&	c #32101B",
"9&	c #010403",
"0&	c #240912",
"a&	c #0D0307",
"                                                                                    ",
"                                                                                    ",
"                                                          . + @ # $                 ",
"                                            % & * = = - ; > , ' ' '                 ",
"                                ) ! ~ { ] ^ ^ ^ / / ( _ : < [ } | 1 2               ",
"                  3 4 5 6 7 7 7 7 7 7 6 7 8 9 0 a b c d e f g h i j k l m           ",
"            n o p p p q o p r s a t u v w x y z A B C D E F G H I J K L L           ",
"            M N N O P Q R S T U V W X Y Z `  .....+.+.+.+.@.#.$.%.%.&.*.=.          ",
"            -.;.;.>.,.'.).!.~.{.].{.{.].^./.(.(._.:._.<.[.}.|.|.1.1.2.3.4.          ",
"            5.6.7.8.9.0.a.b.c.d.0.0.e.f.g.h.h.g.g.h.i.j.k.l.l.m.n.o.p.q.r.          ",
"            s.t.u.v.w.x.x.x.x.y.x.z.A.B.C.C.C.D.D.E.F.G.F.H.G.I.J.K.L.M.N.          ",
"            O.P.P.Q.R.S.T.U.U.T.V.W.W.X.Y.Y.Y.Z.H.`.`. +`..+++.+@+++#+$+%+          ",
"            &+*+*+=+-+;+>+;+;+,+'+)+)+!+)+!+~+{+]+^+^+/+/+/+(+_+:+<+[+}+|+          ",
"            1+2+3+4+5+6+6+7+8+9+9+0+0+0+0+a+b+c+d+e+f+e+g+f+h+i+j+k+l+m+n+          ",
"            o+p+q+r+s+t+u+v+w+x+y+z+z+y+A+B+C+D+D+E+F+G+E+H+H+I+I+J+K+L+M+          ",
"            N+O+O+P+Q+R+S+z+T+U+V+V+U+W+X+Y+Z+Z+`+ @ @.@.@+@@@#@$@%@&@*@=@          ",
"            -@;@>@,@'@)@!@~@{@{@{@]@]@^@/@(@_@_@:@:@:@<@[@}@|@1@2@3@4@5@6@          ",
"            7@8@9@0@a@b@c@d@d@e@f@g@f@f@h@i@i@i@i@j@j@k@k@l@m@n@o@p@q@r@s@          ",
"            t@u@u@v@w@x@y@z@A@B@B@B@z@C@D@E@E@E@E@F@G@H@I@J@K@L@L@M@N@O@P@          ",
"            Q@R@S@T@U@V@V@W@X@X@Y@Z@Y@`@ # #.#+#@#+#@#####$#%#%#&#%#*#=#-#          ",
"            ;#>#,#'#)#!#~#{#]#]#^#]#/#(#_#_#:#<#[#<#}#|#}#1#2#3#4#4#5#6#7#          ",
"            8#9#0#a#b#c#d#e#f#g#g#g#h#i#j#k#k#l#l#m#n#n#o#p#q#r#s#s#t#u#v#          ",
"            w#x#y#z#A#B#C#D#E#h#h#h#F#l#l#G#H#I#I#J#J#K#K#L#M#N#O#O#P#Q#R#          ",
"            S#T#U#V#W#X#Y#Y#Z#Z#Z#`#m#J#K#K# $.$+$@$#$#$$$$$%$&$*$=$-$;$>$          ",
"            ,$'$)$!$~${$]$^$/$/$($&#.$.$_$_$#$:$<$[$}$|$1$2$3$4$5$6$7$8$9$          ",
"            0$a$a$b$c$d$e$f$g$f$h$i$j$j$k$l$m$n$o$p$q$r$s$t$u$v$w$x$y$z$A$          ",
"            B$C$D$E$F$*#G$H$I$J$}$K$L$M$N$O$P$u$Q$v$R$S$T$U$V$W$X$Y$Z$`$ %          ",
"            .%+%@%#%$%%%&%*%=%-%;%>%,%'%)%!%V$~%{%]%^%/%(%_%:%<%[%}%|%1%2%          ",
"            3%4%5%6%7%8%9%0%a%b%c%d%e%f%g%h%i%j%k%l%l%m%n%o%p%q%r%s%t%u%            ",
"            v%w%w%x%y%z%A%B%C%D%E%h%F%G%H%n%I%J%K%L%M%N%O%P%Q%R%S%                  ",
"          T%U%V%W%X%Y%Z%`% &.&+&@&#&$&%&&&*&=&-&;&>&,&                              ",
"            '&)&!&~&{&]&^&/&(&_&:&<&[&}&|&                                          ",
"            1&2&3&4&5&6&7&8&9&                                                      ",
"                0&a&                                                                ",
"                                                                                    ",
"                                                                                    ",
"                                                                                    ",
"                                                                                    ",
"                                                                                    ",
"                                                                                    ",
"                                                                                    ",
"                                                                                    "};
