/* XPM */
static char * app_11x11_xpm[] = {
"128 128 2136 2",
"  	c None",
". 	c #F5B4D5",
"+ 	c #F4B3D6",
"@ 	c #F5B4D7",
"# 	c #F5B4D6",
"$ 	c #F5B5D7",
"% 	c #F5B5D6",
"& 	c #F5B6D7",
"* 	c #F4B4D6",
"= 	c #F5B3D7",
"- 	c #F4B3D7",
"; 	c #F5B3D6",
"> 	c #F5B3D5",
", 	c #F4AFD4",
"' 	c #F1A8CD",
") 	c #F0A0C8",
"! 	c #EE97C3",
"~ 	c #ED96C3",
"{ 	c #ED9AC5",
"] 	c #F09FC7",
"^ 	c #F0A5CD",
"/ 	c #F3ADD1",
"( 	c #F3AFD3",
"_ 	c #F4B2D5",
": 	c #F5B5D5",
"< 	c #F3ADD2",
"[ 	c #EE99C4",
"} 	c #EC8EBB",
"| 	c #EB88B9",
"1 	c #EC8BBB",
"2 	c #EB8DBB",
"3 	c #EC8CBA",
"4 	c #EB8BBB",
"5 	c #EC8DBB",
"6 	c #EC8AB9",
"7 	c #EB8BB9",
"8 	c #EC8DBA",
"9 	c #ED92BE",
"0 	c #EE98C3",
"a 	c #F1A6CC",
"b 	c #F6B5D6",
"c 	c #F6B4D5",
"d 	c #F5B2D3",
"e 	c #F0A0C9",
"f 	c #ED8CBA",
"g 	c #EB8BBA",
"h 	c #EA8AB8",
"i 	c #EB8AB9",
"j 	c #EB8CBA",
"k 	c #EC89B9",
"l 	c #EC8CB9",
"m 	c #EC8BBA",
"n 	c #EC8CBB",
"o 	c #ED8EBD",
"p 	c #EC94C1",
"q 	c #F1A1CA",
"r 	c #F3AED1",
"s 	c #F4B4D7",
"t 	c #F4A9CF",
"u 	c #EE90BD",
"v 	c #EA88B8",
"w 	c #EB8AB8",
"x 	c #EA8CBA",
"y 	c #EA8ABA",
"z 	c #EA8BB9",
"A 	c #EA8AB9",
"B 	c #EA8CBB",
"C 	c #EC8FBC",
"D 	c #ED8FBD",
"E 	c #ED90BD",
"F 	c #ED97C1",
"G 	c #F2A6CC",
"H 	c #F5B2D4",
"I 	c #F6B5D7",
"J 	c #F4AFD2",
"K 	c #ED97C2",
"L 	c #E98AB9",
"M 	c #EB88B8",
"N 	c #EA89B8",
"O 	c #EA8BBA",
"P 	c #EB8CBB",
"Q 	c #EC8BB9",
"R 	c #EC8EBC",
"S 	c #ED8CBB",
"T 	c #ED8FBC",
"U 	c #ED90BE",
"V 	c #EC90BE",
"W 	c #EC90BD",
"X 	c #EC94BE",
"Y 	c #F1A3CB",
"Z 	c #F4B0D4",
"` 	c #F5B6D6",
" .	c #F6B6D7",
"..	c #F2A0CA",
"+.	c #E989B8",
"@.	c #EA87B8",
"#.	c #EA89B6",
"$.	c #EA88B9",
"%.	c #EB89B8",
"&.	c #EA88B6",
"*.	c #EA8DBB",
"=.	c #EB8EBC",
"-.	c #EB91BD",
";.	c #EC92BE",
">.	c #EC91BF",
",.	c #ED95C0",
"'.	c #F2A4CB",
").	c #F4B1D4",
"!.	c #EF8DC5",
"~.	c #F3AACF",
"{.	c #EB90BC",
"].	c #EB88B7",
"^.	c #EB87B7",
"/.	c #EA87B6",
"(.	c #EB87B6",
"_.	c #EA88B7",
":.	c #EA89B9",
"<.	c #EA8DBA",
"[.	c #EA8EBC",
"}.	c #EC8EBD",
"|.	c #EC91BD",
"1.	c #EC91BE",
"2.	c #EC93BF",
"3.	c #EC94C0",
"4.	c #ED95BE",
"5.	c #EF99C3",
"6.	c #F3A9CF",
"7.	c #F19BCC",
"8.	c #F5AFD2",
"9.	c #EF9BC5",
"0.	c #EA89B7",
"a.	c #EA87B7",
"b.	c #E989B7",
"c.	c #EA86B6",
"d.	c #EA87B5",
"e.	c #E988B7",
"f.	c #EB8BB8",
"g.	c #E989B9",
"h.	c #EB8ABB",
"i.	c #EC8FBD",
"j.	c #ED93C0",
"k.	c #EE93C0",
"l.	c #ED96C0",
"m.	c #EE96C1",
"n.	c #EF95C1",
"o.	c #F1A4CA",
"p.	c #F6B8D8",
"q.	c #F19ACA",
"r.	c #F1A4CB",
"s.	c #EB8EBB",
"t.	c #EB87B8",
"u.	c #E886B6",
"v.	c #E986B5",
"w.	c #E986B6",
"x.	c #E987B5",
"y.	c #EA87B9",
"z.	c #EB8EBD",
"A.	c #EC8DBC",
"B.	c #EA8FBC",
"C.	c #ED92C0",
"D.	c #EE95C2",
"E.	c #EE97C2",
"F.	c #F098C4",
"G.	c #F1A1C9",
"H.	c #F4B5D5",
"I.	c #E988B8",
"J.	c #E887B7",
"K.	c #EA86B8",
"L.	c #E887B6",
"M.	c #E987B7",
"N.	c #EA85B6",
"O.	c #EB8DBC",
"P.	c #EF94C0",
"Q.	c #EF99C4",
"R.	c #F2A7CD",
"S.	c #F4B4D5",
"T.	c #F6BEDA",
"U.	c #EA72BA",
"V.	c #F09FC8",
"W.	c #EA8BB8",
"X.	c #EA8AB7",
"Y.	c #EA86B7",
"Z.	c #E987B6",
"`.	c #E985B5",
" +	c #E887B5",
".+	c #E886B7",
"++	c #E989B6",
"@+	c #E989BA",
"#+	c #EC8FBE",
"$+	c #ED91BD",
"%+	c #EE93BF",
"&+	c #ED95BF",
"*+	c #EE94C1",
"=+	c #F09AC4",
"-+	c #F4AFD1",
";+	c #F5B8D7",
">+	c #F7C4DF",
",+	c #EC7FBF",
"'+	c #E44DAA",
")+	c #F4AAD0",
"!+	c #EB86B9",
"~+	c #E886B5",
"{+	c #E985B6",
"]+	c #E888B5",
"^+	c #EA85B5",
"/+	c #E889B9",
"(+	c #EA89BA",
"_+	c #EC8CBC",
":+	c #ED91BF",
"<+	c #EE93BE",
"[+	c #EE95C1",
"}+	c #ED96C1",
"|+	c #F2A4CA",
"1+	c #F4B3D5",
"2+	c #F7C1DC",
"3+	c #F7C8E1",
"4+	c #E969B6",
"5+	c #E44EAA",
"6+	c #E550AB",
"7+	c #F4B2D4",
"8+	c #F09BC4",
"9+	c #EB8ABA",
"0+	c #EB89B7",
"a+	c #E988B6",
"b+	c #E985B7",
"c+	c #E885B6",
"d+	c #E98AB8",
"e+	c #EC8AB8",
"f+	c #ED8DBA",
"g+	c #ED90BC",
"h+	c #EC92BF",
"i+	c #EE91C0",
"j+	c #F3ADCF",
"k+	c #F5BAD9",
"l+	c #FAD9EA",
"m+	c #F4B7DA",
"n+	c #E656AD",
"o+	c #E44FAA",
"p+	c #F5B7D6",
"q+	c #F2A8CF",
"r+	c #EB85B5",
"s+	c #E885B4",
"t+	c #E986B4",
"u+	c #E885B5",
"v+	c #EB8FBD",
"w+	c #F1A2C9",
"x+	c #F7C9E1",
"y+	c #FAE3F0",
"z+	c #EF90CA",
"A+	c #E54EAB",
"B+	c #F4B7D7",
"C+	c #F3B1D3",
"D+	c #F099C4",
"E+	c #EB85B6",
"F+	c #E786B4",
"G+	c #EA84B6",
"H+	c #E986B7",
"I+	c #EE8FBD",
"J+	c #EE99C3",
"K+	c #F3ADD0",
"L+	c #F6C2DC",
"M+	c #FBE6F1",
"N+	c #FAD9EC",
"O+	c #EC6ABA",
"P+	c #E74FAB",
"Q+	c #E750AB",
"R+	c #E54FAA",
"S+	c #E450AB",
"T+	c #F4B7D6",
"U+	c #F1A5CC",
"V+	c #EC90BC",
"W+	c #EB8DBA",
"X+	c #EA86B4",
"Y+	c #EB89BA",
"Z+	c #EB8CBC",
"`+	c #ED8EBC",
" @	c #F9D5E9",
".@	c #FEF7FA",
"+@	c #F5AED9",
"@@	c #EC56B0",
"#@	c #EA51AE",
"$@	c #E850AD",
"%@	c #E750AC",
"&@	c #E650AC",
"*@	c #F5B7D7",
"=@	c #F4AED1",
"-@	c #EF98C3",
";@	c #EB8CB9",
">@	c #EB89B9",
",@	c #EC88B8",
"'@	c #EC87B7",
")@	c #E985B4",
"!@	c #EB86B8",
"~@	c #EF9BC4",
"{@	c #F6C0DC",
"]@	c #FBE8F2",
"^@	c #FAD6EC",
"/@	c #F376C2",
"(@	c #EF54B2",
"_@	c #ED52B0",
":@	c #EB52AF",
"<@	c #E951AE",
"[@	c #E851AD",
"}@	c #E650AB",
"|@	c #E54FAB",
"1@	c #F5B3D4",
"2@	c #EA86B5",
"3@	c #EB85B8",
"4@	c #ED94C0",
"5@	c #F2AACE",
"6@	c #F8D1E5",
"7@	c #FBE2F0",
"8@	c #F68ECD",
"9@	c #F354B4",
"0@	c #F355B5",
"a@	c #F154B3",
"b@	c #EF53B2",
"c@	c #EC53B0",
"d@	c #E751AD",
"e@	c #EE97C1",
"f@	c #EB87B9",
"g@	c #EA85B8",
"h@	c #EE9FC7",
"i@	c #F5BDDA",
"j@	c #F9D9EA",
"k@	c #F7AAD8",
"l@	c #F25AB5",
"m@	c #F353B4",
"n@	c #F554B5",
"o@	c #F454B5",
"p@	c #F253B3",
"q@	c #F154B4",
"r@	c #EC53AF",
"s@	c #EA52AE",
"t@	c #E750AD",
"u@	c #F0A2C8",
"v@	c #EE90BE",
"w@	c #EB86B7",
"x@	c #EA8DBC",
"y@	c #F4ADD3",
"z@	c #F5B7D8",
"A@	c #F6B9DC",
"B@	c #F063B7",
"C@	c #F04EB0",
"D@	c #F353B3",
"E@	c #F453B4",
"F@	c #F555B6",
"G@	c #F254B4",
"H@	c #ED51AF",
"I@	c #E64FAC",
"J@	c #F4B6D7",
"K@	c #F4ADD1",
"L@	c #EE96C3",
"M@	c #EB90BE",
"N@	c #EB8FBC",
"O@	c #F6BCDA",
"P@	c #F5BDDB",
"Q@	c #EF77BE",
"R@	c #EB49AB",
"S@	c #EF50B0",
"T@	c #F152B2",
"U@	c #F452B3",
"V@	c #F654B6",
"W@	c #F755B7",
"X@	c #F455B5",
"Y@	c #F053B2",
"Z@	c #EE52B0",
"`@	c #E951AD",
" #	c #E74FAC",
".#	c #E450AA",
"+#	c #F0A2C9",
"@#	c #EF9BC6",
"##	c #F5B2D5",
"$#	c #EF8DC4",
"%#	c #E94CA9",
"&#	c #EB4CAB",
"*#	c #ED4DAD",
"=#	c #F04EAF",
"-#	c #F24FB0",
";#	c #F451B2",
">#	c #F653B5",
",#	c #F754B6",
"'#	c #F653B6",
")#	c #F555B5",
"!#	c #EE52B1",
"~#	c #EC52B0",
"{#	c #E551AB",
"]#	c #EB89B6",
"^#	c #E987B8",
"/#	c #E888B7",
"(#	c #EA8BBB",
"_#	c #F2AAD0",
":#	c #F5B9D9",
"<#	c #F1A5CE",
"[#	c #E65AAD",
"}#	c #E544A3",
"|#	c #E748A6",
"1#	c #EB4AA9",
"2#	c #EE4CAC",
"3#	c #F24EAF",
"4#	c #F450B2",
"5#	c #F451B3",
"6#	c #F852B6",
"7#	c #F853B6",
"8#	c #F754B8",
"9#	c #F656B6",
"0#	c #F655B6",
"a#	c #F454B4",
"b#	c #F053B3",
"c#	c #EC52AF",
"d#	c #F6B8D7",
"e#	c #EC93BE",
"f#	c #EC8EBE",
"g#	c #EA90BE",
"h#	c #EC8FBA",
"i#	c #EC8DBD",
"j#	c #E887B8",
"k#	c #F0A1CA",
"l#	c #F4B5D6",
"m#	c #E770B5",
"n#	c #DF419E",
"o#	c #E143A0",
"p#	c #E445A2",
"q#	c #E847A6",
"r#	c #EC49A8",
"s#	c #F04BAD",
"t#	c #F34DB0",
"u#	c #F54FB2",
"v#	c #F752B4",
"w#	c #F954B7",
"x#	c #F955B7",
"y#	c #F854B7",
"z#	c #F655B7",
"A#	c #F153B3",
"B#	c #ED52B1",
"C#	c #EB53AF",
"D#	c #F4AED2",
"E#	c #ED92BF",
"F#	c #EE92BF",
"G#	c #ED90C0",
"H#	c #E98ABA",
"I#	c #EA8CBC",
"J#	c #F4B0D3",
"K#	c #F6BDDA",
"L#	c #EC8DC2",
"M#	c #DE439D",
"N#	c #DC3E9A",
"O#	c #DE3F9D",
"P#	c #E1419F",
"Q#	c #E344A2",
"R#	c #E846A5",
"S#	c #EC48A9",
"T#	c #F04BAC",
"U#	c #F44DB1",
"V#	c #F64FB2",
"W#	c #F850B5",
"X#	c #F953B7",
"Y#	c #F855B7",
"Z#	c #F554B6",
"`#	c #EE53B1",
" $	c #F6B7D6",
".$	c #F6B3D5",
"+$	c #F0A4C9",
"@$	c #EE96C2",
"#$	c #ED93BF",
"$$	c #ED91BE",
"%$	c #F3AACD",
"&$	c #F6B9D8",
"*$	c #DF54A4",
"=$	c #DA3896",
"-$	c #DB3C99",
";$	c #DC3D99",
">$	c #DE3E9B",
",$	c #DF409D",
"'$	c #E2409F",
")$	c #E745A4",
"!$	c #EC47A9",
"~$	c #F14AAD",
"{$	c #F44CB0",
"]$	c #F64DB3",
"^$	c #F850B4",
"/$	c #F952B6",
"($	c #F5B8D6",
"_$	c #EF9BC3",
":$	c #EE94C0",
"<$	c #EC8FBB",
"[$	c #E888B8",
"}$	c #F0A2CA",
"|$	c #E672B3",
"1$	c #D83593",
"2$	c #D83995",
"3$	c #D83894",
"4$	c #D93995",
"5$	c #DA3A97",
"6$	c #DF3E9B",
"7$	c #E1419E",
"8$	c #E642A1",
"9$	c #EB45A6",
"0$	c #F049AC",
"a$	c #F44BAE",
"b$	c #F64EB1",
"c$	c #F851B5",
"d$	c #F853B7",
"e$	c #F6B8D6",
"f$	c #F2A5CB",
"g$	c #EC95C0",
"h$	c #EE95C0",
"i$	c #EC8ABA",
"j$	c #F4B1D3",
"k$	c #EB8EC2",
"l$	c #D83E96",
"m$	c #D63591",
"n$	c #D73591",
"o$	c #D63691",
"p$	c #D73793",
"q$	c #D83793",
"r$	c #DA3996",
"s$	c #DB3A97",
"t$	c #DD3D98",
"u$	c #E03F9D",
"v$	c #E641A2",
"w$	c #EA44A6",
"x$	c #F049AB",
"y$	c #F34AAE",
"z$	c #F850B3",
"A$	c #F852B5",
"B$	c #F854B6",
"C$	c #F754B5",
"D$	c #EC93C0",
"E$	c #ED94BF",
"F$	c #EC92C0",
"G$	c #F6B6D6",
"H$	c #F6BAD8",
"I$	c #DC519F",
"J$	c #D32F8C",
"K$	c #D5338E",
"L$	c #D5328E",
"M$	c #D5348F",
"N$	c #D63590",
"O$	c #D83692",
"P$	c #DA3997",
"Q$	c #DC3B98",
"R$	c #DF3E9C",
"S$	c #E3419F",
"T$	c #E944A5",
"U$	c #ED47A9",
"V$	c #F34BAE",
"W$	c #F54CB1",
"X$	c #F74FB3",
"Y$	c #F750B5",
"Z$	c #F753B6",
"`$	c #F6B5D5",
" %	c #F3A5CB",
".%	c #EE98C4",
"+%	c #EF99C1",
"@%	c #EF97C3",
"#%	c #ED95C1",
"$%	c #ED92BD",
"%%	c #ED90BF",
"&%	c #ED8EBA",
"*%	c #EC8EBA",
"=%	c #E46FAF",
"-%	c #D5308D",
";%	c #D3318C",
">%	c #D3308C",
",%	c #D5318C",
"'%	c #D4318C",
")%	c #D4318E",
"!%	c #D6338E",
"~%	c #D6348F",
"{%	c #D93793",
"]%	c #DF3C99",
"^%	c #E3409F",
"/%	c #E844A4",
"(%	c #F04AAE",
"_%	c #F650B4",
":%	c #F751B4",
"<%	c #F5B8D8",
"[%	c #F5B0D2",
"}%	c #F09FC6",
"|%	c #EF98C2",
"1%	c #EF95C0",
"2%	c #ED95C2",
"3%	c #ED94C1",
"4%	c #EE91BF",
"5%	c #EB8FBB",
"6%	c #EB8DBD",
"7%	c #ED8BB9",
"8%	c #EA8CB9",
"9%	c #ED8DBB",
"0%	c #F5B1D4",
"a%	c #F7BDDB",
"b%	c #EB8DBF",
"c%	c #D73C93",
"d%	c #D32F8B",
"e%	c #D22F8A",
"f%	c #D32F8A",
"g%	c #D42F8C",
"h%	c #D22F8B",
"i%	c #D4318D",
"j%	c #D5328D",
"k%	c #D6338F",
"l%	c #D73692",
"m%	c #DA3B97",
"n%	c #DE3C9A",
"o%	c #E2409E",
"p%	c #E743A3",
"q%	c #EB47A8",
"r%	c #EF49AB",
"s%	c #F34EB0",
"t%	c #F2A9CE",
"u%	c #EF9CC6",
"v%	c #EF97C2",
"w%	c #F096C3",
"x%	c #EC8DB9",
"y%	c #EC8BB8",
"z%	c #EC8CB8",
"A%	c #F4ABCF",
"B%	c #F6B7D7",
"C%	c #F6BBD9",
"D%	c #F1A5CD",
"E%	c #DB4E9C",
"F%	c #D22A88",
"G%	c #D22E8A",
"H%	c #D22E89",
"I%	c #D32D8A",
"J%	c #D12E8A",
"K%	c #D32E8A",
"L%	c #D4308C",
"M%	c #DE3F9C",
"N%	c #E23F9E",
"O%	c #E644A3",
"P%	c #E947A7",
"Q%	c #F5B1D2",
"R%	c #EF98C4",
"S%	c #EF98C1",
"T%	c #EF96C3",
"U%	c #EE96C0",
"V%	c #ED8EBE",
"W%	c #ED8EBB",
"X%	c #E26CAD",
"Y%	c #D32E8B",
"Z%	c #D22D89",
"`%	c #D22D88",
" &	c #D12C88",
".&	c #D12D87",
"+&	c #D22C87",
"@&	c #D12D88",
"#&	c #D3308B",
"$&	c #D4308D",
"%&	c #D4328E",
"&&	c #D73590",
"*&	c #DA3995",
"=&	c #DC3C98",
"-&	c #DE3E9C",
";&	c #E2429F",
">&	c #F09DC6",
",&	c #F098C3",
"'&	c #F099C3",
")&	c #EF96C2",
"!&	c #EF96C1",
"~&	c #ED93C1",
"{&	c #F09BC5",
"]&	c #F4B1D2",
"^&	c #F7BDDA",
"/&	c #E988BD",
"(&	c #D63890",
"_&	c #D22D8A",
":&	c #D22C88",
"<&	c #D12B87",
"[&	c #D12C87",
"}&	c #D02B86",
"|&	c #D5318D",
"1&	c #D73592",
"2&	c #D93894",
"3&	c #DA3A96",
"4&	c #DC3C9A",
"5&	c #DE409D",
"6&	c #F3A6CB",
"7&	c #EF9AC3",
"8&	c #EF9AC5",
"9&	c #EF95C2",
"0&	c #ED8DB9",
"a&	c #F4ACD1",
"b&	c #F7BAD9",
"c&	c #DA479A",
"d&	c #D42D8B",
"e&	c #D22E8B",
"f&	c #D32D89",
"g&	c #D12B86",
"h&	c #D32E89",
"i&	c #D63490",
"j&	c #D83792",
"k&	c #D93A96",
"l&	c #DB3B98",
"m&	c #F09AC5",
"n&	c #F097C2",
"o&	c #ED93BE",
"p&	c #EE8FBC",
"q&	c #F5B9D7",
"r&	c #E167AB",
"s&	c #D32B8A",
"t&	c #D22B87",
"u&	c #D02B87",
"v&	c #D12A85",
"w&	c #D73691",
"x&	c #D73792",
"y&	c #F5B6D5",
"z&	c #F3ABCF",
"A&	c #F09CC6",
"B&	c #EF9CC5",
"C&	c #EE9AC3",
"D&	c #EF97C1",
"E&	c #EF96C0",
"F&	c #EC91BC",
"G&	c #ED8DBC",
"H&	c #F09EC8",
"I&	c #F6BAD7",
"J&	c #E984BC",
"K&	c #D42F8B",
"L&	c #D42E8B",
"M&	c #D22B88",
"N&	c #D22C89",
"O&	c #D12A87",
"P&	c #D22F89",
"Q&	c #D6308F",
"R&	c #D93A95",
"S&	c #F2A4CC",
"T&	c #EF9CC4",
"U&	c #EC95BF",
"V&	c #EA8FBD",
"W&	c #EE91BC",
"X&	c #F4B0D2",
"Y&	c #F6BDDB",
"Z&	c #EF9ECA",
"`&	c #DB469B",
" *	c #D52E8D",
".*	c #D32E8C",
"+*	c #F6B7D8",
"@*	c #F1A2CA",
"#*	c #F09DC9",
"$*	c #EF9CC7",
"%*	c #EF9AC4",
"&*	c #EE9AC2",
"**	c #EF97C4",
"=*	c #F096C2",
"-*	c #F094C1",
";*	c #ED8FBE",
">*	c #ED8FBF",
",*	c #F3A9CE",
"'*	c #F6BAD9",
")*	c #F4AFD3",
"!*	c #E161A9",
"~*	c #D52D8D",
"{*	c #D42F8D",
"]*	c #D32C89",
"^*	c #D3308D",
"/*	c #D6328F",
"(*	c #D63491",
"_*	c #D93B98",
":*	c #F6B8D9",
"<*	c #F5B9D8",
"[*	c #F4AFD0",
"}*	c #EF9FC9",
"|*	c #F09DC7",
"1*	c #EF9EC8",
"2*	c #F09CC5",
"3*	c #ED9AC4",
"4*	c #EE91BE",
"5*	c #F2ABD0",
"6*	c #E87BB8",
"7*	c #D73693",
"8*	c #D5318E",
"9*	c #D52F8E",
"0*	c #D6308D",
"a*	c #D32D8B",
"b*	c #D32D88",
"c*	c #D52F8D",
"d*	c #D5338F",
"e*	c #F5B3D0",
"f*	c #F09FC9",
"g*	c #EF9DC6",
"h*	c #EF9DC7",
"i*	c #F09BC2",
"j*	c #EC92BD",
"k*	c #EE97C6",
"l*	c #DA3F97",
"m*	c #D52D8C",
"n*	c #D52F8C",
"o*	c #D42D8A",
"p*	c #D42E8A",
"q*	c #D5308C",
"r*	c #F5B9D6",
"s*	c #F4B0CF",
"t*	c #F2ACCC",
"u*	c #F0A4CA",
"v*	c #EF9EC7",
"w*	c #EF99C6",
"x*	c #EE90BF",
"y*	c #EB90BD",
"z*	c #F3B0D4",
"A*	c #F2A8D0",
"B*	c #EE96C5",
"C*	c #E883BB",
"D*	c #E36CAE",
"E*	c #DF5FA6",
"F*	c #DD509E",
"G*	c #D73C92",
"H*	c #D32B89",
"I*	c #D22789",
"J*	c #D32C8B",
"K*	c #D6308E",
"L*	c #D63390",
"M*	c #D93893",
"N*	c #F5B9D5",
"O*	c #F4AFCD",
"P*	c #F2ACCD",
"Q*	c #F2ADCC",
"R*	c #F0A1C9",
"S*	c #F09DC8",
"T*	c #F09AC6",
"U*	c #F2A5CC",
"V*	c #F6B9D9",
"W*	c #F6BADA",
"X*	c #F6BBDA",
"Y*	c #F3AED2",
"Z*	c #ED95C5",
"`*	c #E87EB8",
" =	c #E36AAD",
".=	c #DE56A2",
"+=	c #D93F97",
"@=	c #D62D8D",
"#=	c #D63391",
"$=	c #F5B7D3",
"%=	c #F4B0CE",
"&=	c #F5ADCD",
"*=	c #F3ADCD",
"==	c #F2ACCB",
"-=	c #EFA0C8",
";=	c #EF9FC7",
">=	c #F09EC7",
",=	c #EE9AC4",
"'=	c #EF99C2",
")=	c #EE92BE",
"!=	c #EE92C0",
"~=	c #EC90BF",
"{=	c #EF91BD",
"]=	c #F3A8CE",
"^=	c #F7BCDB",
"/=	c #F7BEDC",
"(=	c #F6B7D9",
"_=	c #F6B8D4",
":=	c #F4AECC",
"<=	c #F1ADCB",
"[=	c #F3ACCD",
"}=	c #EE9AC5",
"|=	c #EE94BF",
"1=	c #ED91C0",
"2=	c #EE98C2",
"3=	c #EE98C1",
"4=	c #EE99C5",
"5=	c #F3AACE",
"6=	c #F5B1D3",
"7=	c #F5B8D9",
"8=	c #F3A6D0",
"9=	c #F5B9D4",
"0=	c #F4B1CF",
"a=	c #F4B1CE",
"b=	c #F3AFCD",
"c=	c #F3AECC",
"d=	c #F2ADCD",
"e=	c #F09AC3",
"f=	c #EE9BC5",
"g=	c #F19FC7",
"h=	c #F19FC8",
"i=	c #F1A8CE",
"j=	c #F5B0D3",
"k=	c #F6B6D8",
"l=	c #F5BAD5",
"m=	c #F4B2CE",
"n=	c #F3B1CE",
"o=	c #F3B1CF",
"p=	c #F3AFCE",
"q=	c #F3AFCC",
"r=	c #F1ADCC",
"s=	c #F09DC5",
"t=	c #F09BC6",
"u=	c #EE95C3",
"v=	c #ED94BE",
"w=	c #F09CC7",
"x=	c #F2A1CA",
"y=	c #F1A3CA",
"z=	c #F1A5CB",
"A=	c #F2A9CD",
"B=	c #F3ABD1",
"C=	c #F6BBD7",
"D=	c #F4B3CF",
"E=	c #F5B2D0",
"F=	c #F4B3D0",
"G=	c #F4B0CD",
"H=	c #F1AECC",
"I=	c #F2AECC",
"J=	c #F2ADCB",
"K=	c #EF9DC5",
"L=	c #EF99C5",
"M=	c #EC94BF",
"N=	c #ED99C4",
"O=	c #EF9AC6",
"P=	c #F0A4CC",
"Q=	c #F0A5CB",
"R=	c #F1A7CD",
"S=	c #F1A6CD",
"T=	c #EA74BA",
"U=	c #E44DA9",
"V=	c #F6B9D7",
"W=	c #F6BBD6",
"X=	c #F5B6D1",
"Y=	c #F3B0CE",
"Z=	c #F2AECD",
"`=	c #F2AECA",
" -	c #EFA0CA",
".-	c #EC92C1",
"+-	c #F09EC6",
"@-	c #F1A0C9",
"#-	c #F1A2CB",
"$-	c #F2A6CD",
"%-	c #F2A7CE",
"&-	c #E96BB6",
"*-	c #E44CA8",
"=-	c #F5BAD6",
"--	c #F5B8D4",
";-	c #F3B3D0",
">-	c #F19EC8",
",-	c #EF9EC6",
"'-	c #EE97C4",
")-	c #F1A0C8",
"!-	c #F0A4CB",
"~-	c #F1A7CE",
"{-	c #F1A0CD",
"]-	c #E656AC",
"^-	c #E550AA",
"/-	c #ED85C2",
"(-	c #F4B9D5",
"_-	c #ED96C2",
":-	c #EC96C2",
"<-	c #ED94C2",
"[-	c #F09CC4",
"}-	c #F19EC7",
"|-	c #F1A1C8",
"1-	c #F2A1C9",
"2-	c #F0A5CC",
"3-	c #F2A6CB",
"4-	c #F3A7CC",
"5-	c #EC7DBF",
"6-	c #E44DA8",
"7-	c #E44CA7",
"8-	c #E760B0",
"9-	c #EC84C0",
"0-	c #F19FCD",
"a-	c #F7BEDB",
"b-	c #F3AFD2",
"c-	c #F099C5",
"d-	c #F1A4C9",
"e-	c #F2A5CD",
"f-	c #F2A8CD",
"g-	c #F4A9CD",
"h-	c #F4B3D4",
"i-	c #F39ECE",
"j-	c #E857AE",
"k-	c #E64FAB",
"l-	c #E44EA9",
"m-	c #E34DA8",
"n-	c #E34CA7",
"o-	c #E249A5",
"p-	c #E045A2",
"q-	c #DF409E",
"r-	c #DF4DA2",
"s-	c #E35FAA",
"t-	c #E570B3",
"u-	c #E87FBA",
"v-	c #EB8CC0",
"w-	c #EE9BC7",
"x-	c #F1A8CF",
"y-	c #F2ABD1",
"z-	c #F7BEDD",
"A-	c #F7BFDD",
"B-	c #F7BDDC",
"C-	c #F7BCDA",
"D-	c #F3ACD1",
"E-	c #F098C2",
"F-	c #F1A3C9",
"G-	c #F1A4CC",
"H-	c #EE6FBB",
"I-	c #E94DAB",
"J-	c #E851AE",
"K-	c #E54DA8",
"L-	c #E34BA6",
"M-	c #E047A3",
"N-	c #DF46A0",
"O-	c #DC419D",
"P-	c #D02885",
"Q-	c #CF2684",
"R-	c #CE2481",
"S-	c #CE2381",
"T-	c #CD2380",
"U-	c #D1328A",
"V-	c #D4388F",
"W-	c #D4368E",
"X-	c #E26CAE",
"Y-	c #F3AED3",
"Z-	c #EE97C0",
"`-	c #ED99C3",
" ;	c #F19FC9",
".;	c #F1A5CA",
"+;	c #F2A6CE",
"@;	c #F489C7",
"#;	c #EE50AF",
"$;	c #EC50AE",
"%;	c #EA50AD",
"&;	c #E34EA9",
"*;	c #E24AA5",
"=;	c #E147A3",
"-;	c #DE449F",
";;	c #DD419E",
">;	c #D2308B",
",;	c #D12E88",
"';	c #CF2B85",
");	c #CE2B85",
"!;	c #CF2A84",
"~;	c #D02C87",
"{;	c #DF61A6",
"];	c #F0A0C7",
"^;	c #F0A0CA",
"/;	c #F2A3C9",
"(;	c #F1A3CC",
"_;	c #F79FD0",
":;	c #F65EB9",
"<;	c #F351B3",
"[;	c #EF51B0",
"};	c #EB51AE",
"|;	c #E950AC",
"1;	c #E148A3",
"2;	c #E044A1",
"3;	c #DD419C",
"4;	c #DC3F9A",
"5;	c #D93A97",
"6;	c #D73893",
"7;	c #D53590",
"8;	c #D02D87",
"9;	c #D02A85",
"0;	c #DD60A4",
"a;	c #ED98C3",
"b;	c #EE99C2",
"c;	c #EE9CC5",
"d;	c #F0A3CB",
"e;	c #F4B2D3",
"f;	c #F5BBD9",
"g;	c #F7ABD5",
"h;	c #FC6FC3",
"i;	c #FC50B7",
"j;	c #F753B5",
"k;	c #EF52B0",
"l;	c #E550AC",
"m;	c #E64FAA",
"n;	c #DF45A0",
"o;	c #DD439E",
"p;	c #DA3C98",
"q;	c #D73892",
"r;	c #D3338D",
"s;	c #DE60A4",
"t;	c #F1A9CF",
"u;	c #F6BCDB",
"v;	c #F2A5CA",
"w;	c #EE9CC4",
"x;	c #F1A2C8",
"y;	c #F0A3C9",
"z;	c #F0A3CA",
"A;	c #F6B4D8",
"B;	c #FB7EC6",
"C;	c #FF54BA",
"D;	c #FF58BC",
"E;	c #FD54B9",
"F;	c #F853B5",
"G;	c #F253B4",
"H;	c #EE51AF",
"I;	c #E64EAB",
"J;	c #E34BA7",
"K;	c #E249A4",
"L;	c #DF46A3",
"M;	c #DD439D",
"N;	c #DC409C",
"O;	c #DA3C97",
"P;	c #D73994",
"Q;	c #D3318D",
"R;	c #E063A8",
"S;	c #F1AAD0",
"T;	c #ED9BC4",
"U;	c #EF9DC8",
"V;	c #F4ADD2",
"W;	c #F588C7",
"X;	c #FA51B4",
"Y;	c #FE51BA",
"Z;	c #FF55B9",
"`;	c #FF54BC",
" >	c #FC54B9",
".>	c #E850AC",
"+>	c #E149A4",
"@>	c #E048A3",
"#>	c #DF439E",
"$>	c #DC409B",
"%>	c #DB3D99",
"&>	c #D83794",
"*>	c #E266AC",
"=>	c #F2A8CE",
"->	c #EE9BC6",
";>	c #EE9BC4",
">>	c #EE9DC7",
",>	c #F1A0C7",
"'>	c #F0A2CB",
")>	c #F093C8",
"!>	c #EB51AC",
"~>	c #F148AC",
"{>	c #F74DB2",
"]>	c #FD51B7",
"^>	c #FF56BA",
"/>	c #F251B2",
"(>	c #ED51B0",
"_>	c #E950AD",
":>	c #E851AC",
"<>	c #DE43A0",
"[>	c #DB3D9A",
"}>	c #E56BB0",
"|>	c #EE9EC6",
"1>	c #F09DCA",
"2>	c #E455A7",
"3>	c #E340A0",
"4>	c #E945A5",
"5>	c #F048AB",
"6>	c #F54BAF",
"7>	c #FB4FB6",
"8>	c #FE52B9",
"9>	c #FE53BA",
"0>	c #FC53B8",
"a>	c #F252B3",
"b>	c #E975B8",
"c>	c #F19DC6",
"d>	c #F19EC6",
"e>	c #E15CA8",
"f>	c #DB3B97",
"g>	c #E1409E",
"h>	c #E642A2",
"i>	c #EE47A9",
"j>	c #FA4CB2",
"k>	c #FD50B7",
"l>	c #FD52B8",
"m>	c #F352B3",
"n>	c #EE51B0",
"o>	c #EA4FAD",
"p>	c #F6BCD7",
"q>	c #F4B9D2",
"r>	c #F2AACC",
"s>	c #F2A3CB",
"t>	c #F2A2CB",
"u>	c #F0A1C8",
"v>	c #F19DC7",
"w>	c #EFA3CA",
"x>	c #F2A7CC",
"y>	c #E063AA",
"z>	c #D73290",
"A>	c #DD3B98",
"B>	c #E03E9D",
"C>	c #E540A0",
"D>	c #EB46A7",
"E>	c #F149AD",
"F>	c #F64CB0",
"G>	c #FA50B5",
"H>	c #FC52B8",
"I>	c #EF52B2",
"J>	c #EB50AD",
"K>	c #F6BDD8",
"L>	c #F5BAD3",
"M>	c #F4B4CF",
"N>	c #F5B3CF",
"O>	c #F3B0CD",
"P>	c #F2A7CB",
"Q>	c #F5AFD3",
"R>	c #E46EAF",
"S>	c #D52E8C",
"T>	c #DA3895",
"U>	c #DC3B97",
"V>	c #DE3E9A",
"W>	c #E943A4",
"X>	c #EF47AA",
"Y>	c #F54BB0",
"Z>	c #FA4FB4",
"`>	c #F552B4",
" ,	c #F052B1",
".,	c #EC50AF",
"+,	c #E951AC",
"@,	c #F6BED8",
"#,	c #F7BCD4",
"$,	c #F4B6D0",
"%,	c #F5B5CF",
"&,	c #F5B5CE",
"*,	c #F4B5CF",
"=,	c #F5B5D1",
"-,	c #F2A2C9",
";,	c #F2A2CA",
">,	c #EFA2C9",
",,	c #F1A6CB",
"',	c #E577B3",
"),	c #D42E8C",
"!,	c #D73390",
"~,	c #DB3995",
"{,	c #DD3C99",
"],	c #E743A2",
"^,	c #EE48AA",
"/,	c #F94DB3",
"(,	c #FC51B8",
"_,	c #FC53B9",
":,	c #FB51B8",
"<,	c #F652B5",
"[,	c #ED50B0",
"},	c #F5BDD8",
"|,	c #F6BED5",
"1,	c #F5B8D1",
"2,	c #F5B8D2",
"3,	c #F4B7D0",
"4,	c #F5B6D0",
"5,	c #F4B7D1",
"6,	c #F4AED3",
"7,	c #E781B9",
"8,	c #D3318B",
"9,	c #D73490",
"0,	c #D83592",
"a,	c #DD3C98",
"b,	c #E1409D",
"c,	c #E541A1",
"d,	c #EC47A7",
"e,	c #F249AD",
"f,	c #FD53B9",
"g,	c #F6BED9",
"h,	c #F6BFD6",
"i,	c #F6BCD4",
"j,	c #F5B9D1",
"k,	c #F6B7D0",
"l,	c #F4B4D0",
"m,	c #F2A3CA",
"n,	c #F1A1CB",
"o,	c #F0A5C9",
"p,	c #E887BC",
"q,	c #D4378D",
"r,	c #CF2785",
"s,	c #E442A0",
"t,	c #E946A6",
"u,	c #F04AAD",
"v,	c #F64DB0",
"w,	c #FB51B6",
"x,	c #FC52BA",
"y,	c #FD54BA",
"z,	c #FA54B8",
"A,	c #F6C1D7",
"B,	c #F5BDD3",
"C,	c #F5BBD3",
"D,	c #F5BBD2",
"E,	c #F5BAD2",
"F,	c #F5B9D2",
"G,	c #F4B8D1",
"H,	c #F5B7D0",
"I,	c #F4B7CF",
"J,	c #F3ACCE",
"K,	c #F1A7CB",
"L,	c #F0A6CC",
"M,	c #F3A4CB",
"N,	c #E888BB",
"O,	c #D53D8F",
"P,	c #CE2482",
"Q,	c #CF2884",
"R,	c #CE2580",
"S,	c #D02984",
"T,	c #CF2985",
"U,	c #D02985",
"V,	c #D12B88",
"W,	c #DF3F9C",
"X,	c #E342A0",
"Y,	c #E845A4",
"Z,	c #FB51B5",
"`,	c #F7C2D8",
" '	c #F7BED5",
".'	c #F6BCD5",
"+'	c #F5BCD2",
"@'	c #F6BCD6",
"#'	c #F6BBD3",
"$'	c #F6BAD2",
"%'	c #F5B7D1",
"&'	c #F4B5D0",
"*'	c #F3A7CD",
"='	c #F1A7CC",
"-'	c #F3A6CC",
";'	c #F3ACD0",
">'	c #F8C0DD",
",'	c #EB92C2",
"''	c #D44190",
")'	c #CC217F",
"!'	c #CD2682",
"~'	c #CC2480",
"{'	c #CD2581",
"]'	c #CD2580",
"^'	c #CE2783",
"/'	c #CF2783",
"('	c #D02A86",
"_'	c #E343A1",
":'	c #E746A6",
"<'	c #ED49AB",
"['	c #F44EB1",
"}'	c #F6BCD9",
"|'	c #F7C3D9",
"1'	c #F7C0D6",
"2'	c #F6BED4",
"3'	c #F7BED4",
"4'	c #F7BDD4",
"5'	c #F5BCD5",
"6'	c #F6BDD3",
"7'	c #F5BCD3",
"8'	c #F6BBD1",
"9'	c #F5BAD4",
"0'	c #F6BBD2",
"a'	c #F5B9D3",
"b'	c #F4B9D1",
"c'	c #ED9AC6",
"d'	c #D44090",
"e'	c #CC237E",
"f'	c #CC2581",
"g'	c #CB247E",
"h'	c #CC227E",
"i'	c #CC237F",
"j'	c #CD2681",
"k'	c #CE2782",
"l'	c #CF2883",
"m'	c #D6318E",
"n'	c #DC3E9B",
"o'	c #E0419E",
"p'	c #E244A1",
"q'	c #E848A7",
"r'	c #F7C2DA",
"s'	c #F6C3D8",
"t'	c #F7BFD4",
"u'	c #F6BFD5",
"v'	c #F5BED4",
"w'	c #F5BCD4",
"x'	c #F6BDD5",
"y'	c #F6BCD3",
"z'	c #F4B5D1",
"A'	c #F3A8CF",
"B'	c #F2A9CF",
"C'	c #F1A9CE",
"D'	c #EE9CC8",
"E'	c #D74995",
"F'	c #CB237E",
"G'	c #CA237E",
"H'	c #CB217C",
"I'	c #CB247F",
"J'	c #CD2480",
"K'	c #CF2A85",
"L'	c #D12A86",
"M'	c #DD3E9B",
"N'	c #E346A4",
"O'	c #F7C1DA",
"P'	c #F7C4D9",
"Q'	c #F6C0D6",
"R'	c #F6C0D5",
"S'	c #F6BFD4",
"T'	c #F5BDD4",
"U'	c #F5BDD5",
"V'	c #F6BBD4",
"W'	c #F4BAD3",
"X'	c #D74796",
"Y'	c #CC217D",
"Z'	c #CB227D",
"`'	c #CB237D",
" )	c #CA207C",
".)	c #CA227D",
"+)	c #CA217C",
"@)	c #CC247F",
"#)	c #CC2580",
"$)	c #DA3793",
"%)	c #DA3B98",
"&)	c #F6BFD9",
"*)	c #F7C5DA",
"=)	c #F7C2D7",
"-)	c #F7C0D5",
";)	c #F7BFD6",
">)	c #F6BDD4",
",)	c #F5BBD4",
"')	c #F6B9D2",
"))	c #F4AACF",
"!)	c #F2AACF",
"~)	c #F3AAD0",
"{)	c #F3ABD0",
"])	c #F3AED0",
"^)	c #DB519C",
"/)	c #CD2180",
"()	c #CD257F",
"_)	c #CC227D",
":)	c #DC3D9A",
"<)	c #F6BDD9",
"[)	c #F7C5D9",
"})	c #F7C4D8",
"|)	c #F7C2D6",
"1)	c #F7C1D7",
"2)	c #F6C1D4",
"3)	c #F6C0D7",
"4)	c #F5BFD4",
"5)	c #F7BFD5",
"6)	c #F5BFD5",
"7)	c #F5BED5",
"8)	c #F4B3D1",
"9)	c #F4ACD0",
"0)	c #F4B5D7",
"a)	c #DC559F",
"b)	c #CE2280",
"c)	c #CF2682",
"d)	c #CD247F",
"e)	c #CD227F",
"f)	c #CB207C",
"g)	c #CA207B",
"h)	c #CC247E",
"i)	c #CD2781",
"j)	c #CE2883",
"k)	c #F7C4DA",
"l)	c #F6C6D8",
"m)	c #F7C3D7",
"n)	c #F6C1D6",
"o)	c #F7C1D5",
"p)	c #F7C1D6",
"q)	c #F4BED4",
"r)	c #DE58A0",
"s)	c #CF2484",
"t)	c #D02884",
"u)	c #D02784",
"v)	c #CE2480",
"w)	c #CE2380",
"x)	c #CD237E",
"y)	c #CD227E",
"z)	c #D83994",
"A)	c #F7C0DA",
"B)	c #F7C7D9",
"C)	c #F7C3D8",
"D)	c #F5C0D5",
"E)	c #F6BED6",
"F)	c #F5BBD5",
"G)	c #F4ABD1",
"H)	c #F4ACCF",
"I)	c #E169AB",
"J)	c #D4358D",
"K)	c #D63B90",
"L)	c #D23089",
"M)	c #CF2381",
"N)	c #CE207F",
"O)	c #CD1F7F",
"P)	c #CE2080",
"Q)	c #CF227F",
"R)	c #CF2280",
"S)	c #CF2380",
"T)	c #CE2681",
"U)	c #CF2984",
"V)	c #F8C6DB",
"W)	c #F7C6D8",
"X)	c #F7C5D7",
"Y)	c #F7C4D6",
"Z)	c #F5C0D6",
"`)	c #F5BFD6",
" !	c #F5BED6",
".!	c #F5B4D2",
"+!	c #F7BBDA",
"@!	c #F2ACD1",
"#!	c #F1A4CD",
"$!	c #EA85BA",
"%!	c #E470AF",
"&!	c #DF5CA3",
"*!	c #DB4C9A",
"=!	c #D73D90",
"-!	c #D33189",
";!	c #D02282",
">!	c #D12683",
",!	c #D12986",
"'!	c #F6C2DA",
")!	c #F8C7DA",
"!!	c #F7C5D8",
"~!	c #F2A9D0",
"{!	c #EF9EC9",
"]!	c #E881B9",
"^!	c #E164A9",
"/!	c #DE53A0",
"(!	c #F7C7DA",
"_!	c #F7C6DA",
":!	c #F8C5D8",
"<!	c #F6C4D8",
"[!	c #F7C4D7",
"}!	c #F6C1D5",
"|!	c #F3B0D2",
"1!	c #F2B0D2",
"2!	c #F3AFD1",
"3!	c #F3B0D3",
"4!	c #F8C8DA",
"5!	c #F6C7D9",
"6!	c #F6C4D7",
"7!	c #F6C2D6",
"8!	c #F7C0D7",
"9!	c #F5C1D6",
"0!	c #F3B1D5",
"a!	c #F3B1D2",
"b!	c #F4B0D1",
"c!	c #F4AED4",
"d!	c #EF96C8",
"e!	c #F5B2D6",
"f!	c #F7C6DB",
"g!	c #F6C7D8",
"h!	c #F6C2D7",
"i!	c #F6BFD7",
"j!	c #F4B1D5",
"k!	c #F5B0D4",
"l!	c #F3A8D1",
"m!	c #F7C7D8",
"n!	c #F7C6D9",
"o!	c #F8C5D7",
"p!	c #F8C4D8",
"q!	c #F8C1D7",
"r!	c #F5C0D7",
"s!	c #F5BFD7",
"t!	c #F5B8D5",
"u!	c #F4B3D3",
"v!	c #F098C9",
"w!	c #F196CA",
"x!	c #F7C9DA",
"y!	c #F8C7D9",
"z!	c #F7C6D7",
"A!	c #F6C5D8",
"B!	c #F8C5D9",
"C!	c #F8C3D8",
"D!	c #F8C2D8",
"E!	c #F6C1D8",
"F!	c #F5B7D5",
"G!	c #F5B3D3",
"H!	c #F4B4D4",
"I!	c #F5B4D4",
"J!	c #E657AC",
"K!	c #EB76BB",
"L!	c #F6C0DA",
"M!	c #F7C8D9",
"N!	c #F8C3D7",
"O!	c #F6C2D8",
"P!	c #F8C2D7",
"Q!	c #F4B7D4",
"R!	c #F4B2D6",
"S!	c #F2A5D0",
"T!	c #E653AC",
"U!	c #E553AC",
"V!	c #EB78BC",
"W!	c #F2A3CF",
"X!	c #F7C8DB",
"Y!	c #F8C8D9",
"Z!	c #F8C6D8",
"`!	c #F8C4D7",
" ~	c #F8C4D9",
".~	c #F6B4D6",
"+~	c #F6B3D4",
"@~	c #EE84C1",
"#~	c #E54DA9",
"$~	c #E54EA9",
"%~	c #E24AA8",
"&~	c #E558AE",
"*~	c #E86AB5",
"=~	c #ED88C2",
"-~	c #F7BFDA",
";~	c #F7C3DA",
">~	c #F6C7DA",
",~	c #F9C6DA",
"'~	c #F8C3D9",
")~	c #F7C1D8",
"!~	c #F6B9D6",
"~~	c #F2A1CE",
"{~	c #E75BAF",
"]~	c #E34CA8",
"^~	c #E144A2",
"/~	c #E047A2",
"(~	c #E152A5",
"_~	c #E25CA9",
":~	c #E570B2",
"<~	c #EC91C3",
"[~	c #F1A9D0",
"}~	c #F8C5DA",
"|~	c #F7BAD6",
"1~	c #F6B4D7",
"2~	c #F5AED4",
"3~	c #EC70BA",
"4~	c #E64CA9",
"5~	c #E54FA9",
"6~	c #DE429E",
"7~	c #DD3F9C",
"8~	c #D93895",
"9~	c #CF3087",
"0~	c #CF3287",
"a~	c #D13A8A",
"b~	c #D34590",
"c~	c #D95A9E",
"d~	c #DC61A2",
"e~	c #E172AD",
"f~	c #E37AB1",
"g~	c #E582B7",
"h~	c #E57CB4",
"i~	c #F8C6D9",
"j~	c #F8C3DA",
"k~	c #F37EC2",
"l~	c #E54EAA",
"m~	c #DE429F",
"n~	c #DA3E99",
"o~	c #D93B97",
"p~	c #D63692",
"q~	c #D3328C",
"r~	c #D12F89",
"s~	c #CE2983",
"t~	c #CB2780",
"u~	c #CA267E",
"v~	c #C9247D",
"w~	c #C9237B",
"x~	c #C8227A",
"y~	c #CB247C",
"z~	c #CD2981",
"A~	c #EA92C1",
"B~	c #F7C5DB",
"C~	c #F8C6DA",
"D~	c #F8C4DA",
"E~	c #F7C2D9",
"F~	c #F6B5D8",
"G~	c #F5B6D8",
"H~	c #F987CA",
"I~	c #F756B8",
"J~	c #F251B3",
"K~	c #EA50AE",
"L~	c #DF44A1",
"M~	c #D63793",
"N~	c #D4328D",
"O~	c #CF2B86",
"P~	c #CF2983",
"Q~	c #CB267F",
"R~	c #CA257E",
"S~	c #C9247C",
"T~	c #CA247C",
"U~	c #C9237C",
"V~	c #CF3788",
"W~	c #F2ADD1",
"X~	c #F8C5DB",
"Y~	c #F9C6DB",
"Z~	c #F8C2D9",
"`~	c #FB90CE",
" {	c #FF5EBE",
".{	c #FF57BC",
"+{	c #F956B8",
"@{	c #F052B2",
"#{	c #EB51AF",
"${	c #E34FAA",
"%{	c #E24BA7",
"&{	c #E148A4",
"*{	c #DF46A1",
"={	c #DD419D",
"-{	c #D93B96",
";{	c #D12F8A",
">{	c #D02D86",
",{	c #CE2A83",
"'{	c #CD2780",
"){	c #CC267E",
"!{	c #CB267E",
"~{	c #CA247D",
"{{	c #CA227B",
"]{	c #D8559B",
"^{	c #F7C8DA",
"/{	c #F7C3DB",
"({	c #FC90CE",
"_{	c #FF62C1",
":{	c #FE61C1",
"<{	c #FF61C0",
"[{	c #FF59BE",
"}{	c #FC56BA",
"|{	c #DD429E",
"1{	c #DC3F99",
"2{	c #D02D88",
"3{	c #CE2982",
"4{	c #CC2882",
"5{	c #CC2780",
"6{	c #CB237C",
"7{	c #F6C0D9",
"8{	c #F88DCB",
"9{	c #FF5DBE",
"0{	c #FE5FBF",
"a{	c #FF62BF",
"b{	c #FF64C1",
"c{	c #FF5FBF",
"d{	c #FE58BD",
"e{	c #F756B7",
"f{	c #F354B6",
"g{	c #E44FA9",
"h{	c #E046A1",
"i{	c #DE439E",
"j{	c #D83993",
"k{	c #D3328D",
"l{	c #D2318C",
"m{	c #CD2A83",
"n{	c #E98DBF",
"o{	c #F8CADB",
"p{	c #F5B5D8",
"q{	c #F28BC7",
"r{	c #F45CB6",
"s{	c #F94EB4",
"t{	c #FE55BA",
"u{	c #FF5CBE",
"v{	c #FF62C0",
"w{	c #FF5EBF",
"x{	c #FE59BC",
"y{	c #FA56B8",
"z{	c #E24BA6",
"A{	c #DE439F",
"B{	c #DD409D",
"C{	c #DA3C95",
"D{	c #D53691",
"E{	c #D4308A",
"F{	c #D2388D",
"G{	c #F7C4DB",
"H{	c #F8C9DB",
"I{	c #F8C9DA",
"J{	c #F8C8DB",
"K{	c #F8C7DB",
"L{	c #F9C7DB",
"M{	c #EE8DC5",
"N{	c #E857AD",
"O{	c #EA48A9",
"P{	c #F14BAE",
"Q{	c #F74EB3",
"R{	c #FE5ABD",
"S{	c #FF64C0",
"T{	c #FF60C0",
"U{	c #F654B5",
"V{	c #F153B2",
"W{	c #EC51B0",
"X{	c #DE45A1",
"Y{	c #DE429D",
"Z{	c #DB3F9B",
"`{	c #DB3D97",
" ]	c #D83A96",
".]	c #DA509E",
"+]	c #F7C9DB",
"@]	c #F7C7DB",
"#]	c #F8C7DC",
"$]	c #EC91C6",
"%]	c #E560AD",
"&]	c #E142A0",
"*]	c #E444A2",
"=]	c #EE4AAB",
"-]	c #FB50B6",
";]	c #FF55BB",
">]	c #FF5FBE",
",]	c #FF60BF",
"']	c #FF63BF",
")]	c #FD56BB",
"!]	c #F355B4",
"~]	c #E750AA",
"{]	c #DA3C96",
"]]	c #E268AD",
"^]	c #F8CADC",
"/]	c #F6BEDC",
"(]	c #F3BBDA",
"_]	c #EA94C5",
":]	c #DF5AA8",
"<]	c #DD3F9D",
"[]	c #DF419C",
"}]	c #E343A0",
"|]	c #E744A4",
"1]	c #F24BAD",
"2]	c #F94EB3",
"3]	c #FF52B9",
"4]	c #FF59BD",
"5]	c #FF60BE",
"6]	c #FE5EBF",
"7]	c #FE57BC",
"8]	c #FA56B9",
"9]	c #F8CBDB",
"0]	c #F8CADA",
"a]	c #F7CADB",
"b]	c #F7C7E1",
"c]	c #F6CBE2",
"d]	c #E990C3",
"e]	c #DD50A1",
"f]	c #D93996",
"g]	c #E1419D",
"h]	c #E542A2",
"i]	c #EA45A6",
"j]	c #F64CB2",
"k]	c #FE50B8",
"l]	c #FE58BC",
"m]	c #FF59BF",
"n]	c #FB57BA",
"o]	c #F7CBDB",
"p]	c #F8C9DC",
"q]	c #F7C5DF",
"r]	c #F9D3E7",
"s]	c #F3C3DE",
"t]	c #E88CC1",
"u]	c #DB4A9D",
"v]	c #DA3A95",
"w]	c #DF3F9B",
"x]	c #E240A0",
"y]	c #E845A3",
"z]	c #FF5DBF",
"A]	c #FF63C1",
"B]	c #FE5BBF",
"C]	c #FD56BC",
"D]	c #F855B8",
"E]	c #F8CBDA",
"F]	c #F9CADA",
"G]	c #F6BFDC",
"H]	c #F9D0E5",
"I]	c #FADFEE",
"J]	c #F1BAD9",
"K]	c #E372B1",
"L]	c #D73E95",
"M]	c #D63790",
"N]	c #D73791",
"O]	c #D93A94",
"P]	c #DB3C98",
"Q]	c #E0419F",
"R]	c #E643A3",
"S]	c #EC46A7",
"T]	c #F24AAD",
"U]	c #FE53B9",
"V]	c #FF5DBD",
"W]	c #FF63C0",
"X]	c #FF64C2",
"Y]	c #FF5FC0",
"Z]	c #F8CCE3",
"`]	c #FBE5F1",
" ^	c #EEB0D3",
".^	c #DE60A8",
"+^	c #D63992",
"@^	c #D5338D",
"#^	c #D6358F",
"$^	c #D7348F",
"%^	c #DB3A98",
"&^	c #DD3E98",
"*^	c #E0409D",
"=^	c #F04AAC",
"-^	c #F74CB2",
";^	c #FE50B7",
">^	c #FF5ABD",
",^	c #FF66C2",
"'^	c #FF65C1",
")^	c #F8CBDC",
"!^	c #F9CADB",
"~^	c #F7C3DE",
"{^	c #F9DAEB",
"]^	c #FCEFF6",
"^^	c #F6D7E9",
"/^	c #E88EC1",
"(^	c #DA499A",
"_^	c #D4338E",
":^	c #D4338D",
"<^	c #D53490",
"[^	c #D5368F",
"}^	c #D83893",
"|^	c #D83895",
"1^	c #DD3D99",
"2^	c #E441A1",
"3^	c #EF49AA",
"4^	c #F54DB0",
"5^	c #FC50B6",
"6^	c #F9CCDB",
"7^	c #F8CCDB",
"8^	c #F9CCDC",
"9^	c #F9CADC",
"0^	c #F7BEDA",
"a^	c #F8CDE4",
"b^	c #FCE9F3",
"c^	c #F8E2EF",
"d^	c #DE67AB",
"e^	c #D53B91",
"f^	c #D4318B",
"g^	c #D4348F",
"h^	c #D63690",
"i^	c #D83A94",
"j^	c #DB3A95",
"k^	c #ED49A9",
"l^	c #F34CB0",
"m^	c #F9CDDC",
"n^	c #F8CCDC",
"o^	c #F9DBEB",
"p^	c #F0BDDA",
"q^	c #E273B1",
"r^	c #D64294",
"s^	c #D3308A",
"t^	c #D12E89",
"u^	c #D02E89",
"v^	c #D2318B",
"w^	c #DD3E99",
"x^	c #E746A4",
"y^	c #EC4AA9",
"z^	c #F8CEDC",
"A^	c #F8CDDC",
"B^	c #F9CBDC",
"C^	c #F6BCD8",
"D^	c #F8CFE4",
"E^	c #F9DAEA",
"F^	c #F0B7D7",
"G^	c #E278B2",
"H^	c #D64194",
"I^	c #D02C86",
"J^	c #D22E88",
"K^	c #D32E88",
"L^	c #DB3D98",
"M^	c #DC3D98",
"N^	c #E0429E",
"O^	c #F8C6DC",
"P^	c #F8CDDB",
"Q^	c #F9CBDB",
"R^	c #F8C9E1",
"S^	c #F9D8EA",
"T^	c #F1BCD9",
"U^	c #E37AB5",
"V^	c #D2308A",
"W^	c #D02C88",
"X^	c #CF2D88",
"Y^	c #D12C86",
"Z^	c #DA3B96",
"`^	c #DB3E99",
" /	c #DB3F9A",
"./	c #F8CEDB",
"+/	c #F9CDDB",
"@/	c #F9CEDC",
"#/	c #F8C8DC",
"$/	c #F7C1DD",
"%/	c #FAD3E7",
"&/	c #F2B9D9",
"*/	c #E680B9",
"=/	c #D84396",
"-/	c #D12D89",
";/	c #CF2C86",
">/	c #D02B85",
",/	c #CE2A84",
"'/	c #D53591",
")/	c #DB3C97",
"!/	c #F9CEDD",
"~/	c #F6BEDB",
"{/	c #F8CBE2",
"]/	c #F2AFD3",
"^/	c #E47CB6",
"//	c #D74096",
"(/	c #CD2B83",
"_/	c #CD2983",
":/	c #CE2A85",
"</	c #CF2C87",
"[/	c #D4338F",
"}/	c #DB3C96",
"|/	c #F8CEDD",
"1/	c #F8C5DF",
"2/	c #F1A5CF",
"3/	c #E475B3",
"4/	c #D63E94",
"5/	c #D1308A",
"6/	c #CE2882",
"7/	c #CD2884",
"8/	c #CE2A87",
"9/	c #CF2A86",
"0/	c #CE2C84",
"a/	c #F9CDDD",
"b/	c #E46CAF",
"c/	c #D93C95",
"d/	c #D4308E",
"e/	c #D5328F",
"f/	c #CE2B86",
"g/	c #CE2985",
"h/	c #CC2783",
"i/	c #CD2883",
"j/	c #D02E88",
"k/	c #F9CFDD",
"l/	c #E465AD",
"m/	c #D83491",
"n/	c #D7358F",
"o/	c #D4328F",
"p/	c #D2318D",
"q/	c #CF2B83",
"r/	c #CD2982",
"s/	c #CD2882",
"t/	c #D53390",
"u/	c #F3A1CF",
"v/	c #ED76B8",
"w/	c #E757AA",
"x/	c #DE3999",
"y/	c #CE2B84",
"z/	c #CE2A86",
"A/	c #CE2984",
"B/	c #D02B88",
"C/	c #F097C9",
"D/	c #F4B0D5",
"E/	c #F5ADD4",
"F/	c #F5A6D1",
"G/	c #F596CC",
"H/	c #F677BF",
"I/	c #F560B7",
"J/	c #F249AC",
"K/	c #EC3EA4",
"L/	c #E73EA0",
"M/	c #E33D9D",
"N/	c #DD3B99",
"O/	c #DC3895",
"P/	c #D73593",
"Q/	c #CF2E89",
"R/	c #CF2B84",
"S/	c #CF2B87",
"T/	c #E863B1",
"U/	c #E963B2",
"V/	c #EC64B4",
"W/	c #EE5AB1",
"X/	c #F246AC",
"Y/	c #F548AE",
"Z/	c #F546AB",
"`/	c #F244A9",
" (	c #EE42A5",
".(	c #E13C9D",
"+(	c #DF3897",
"@(	c #DB3796",
"#(	c #CF2C85",
"$(	c #D02E87",
"%(	c #E24AA6",
"&(	c #E349A6",
"*(	c #E447A4",
"=(	c #E747A6",
"-(	c #EA46A7",
";(	c #EE49A9",
">(	c #F146AA",
",(	c #F446AC",
"'(	c #F544AC",
")(	c #F243A8",
"!(	c #EF40A4",
"~(	c #E93DA1",
"{(	c #E43B9C",
"](	c #DE3898",
"^(	c #DB3694",
"/(	c #D83391",
"((	c #CE2C86",
"_(	c #D1308B",
":(	c #D3318E",
"<(	c #D4328B",
"[(	c #E248A4",
"}(	c #E347A3",
"|(	c #E546A5",
"1(	c #EF45A8",
"2(	c #F245AA",
"3(	c #F443A9",
"4(	c #F342A7",
"5(	c #EF40A6",
"6(	c #EB3EA1",
"7(	c #E43A9C",
"8(	c #E03999",
"9(	c #DC3695",
"0(	c #D93491",
"a(	c #E146A2",
"b(	c #E146A1",
"c(	c #E543A3",
"d(	c #E943A5",
"e(	c #ED45A7",
"f(	c #F144A9",
"g(	c #F242A8",
"h(	c #F342A9",
"i(	c #F13FA5",
"j(	c #ED3DA3",
"k(	c #E53B9D",
"l(	c #E13899",
"m(	c #DD3695",
"n(	c #DA3593",
"o(	c #E145A1",
"p(	c #E244A2",
"q(	c #E443A1",
"r(	c #E742A2",
"s(	c #EB42A4",
"t(	c #EF43A6",
"u(	c #F141A6",
"v(	c #F23FA6",
"w(	c #F140A6",
"x(	c #ED3CA1",
"y(	c #E93CA0",
"z(	c #E3399A",
"A(	c #DE3796",
"B(	c #D5358F",
"C(	c #E144A0",
"D(	c #E243A0",
"E(	c #E542A1",
"F(	c #E942A4",
"G(	c #ED41A5",
"H(	c #F143A9",
"I(	c #F241A7",
"J(	c #F140A7",
"K(	c #EE3FA5",
"L(	c #EB3DA0",
"M(	c #E53A9C",
"N(	c #E03998",
"O(	c #DD3796",
"P(	c #DA3794",
"Q(	c #D63791",
"R(	c #E044A0",
"S(	c #E243A1",
"T(	c #E840A2",
"U(	c #EA41A4",
"V(	c #EF42A7",
"W(	c #F03FA4",
"X(	c #EC3EA3",
"Y(	c #E73DA0",
"Z(	c #E23B9B",
"`(	c #DE3A99",
" _	c #DC3897",
"._	c #DA3894",
"+_	c #E241A0",
"@_	c #E643A2",
"#_	c #E941A3",
"$_	c #EC42A5",
"%_	c #F042A6",
"&_	c #F142A7",
"*_	c #E93FA2",
"=_	c #E43E9F",
"-_	c #E13E9C",
";_	c #DC3B99",
">_	c #E442A1",
",_	c #E843A5",
"'_	c #EA43A5",
")_	c #EE44A7",
"!_	c #F144AA",
"~_	c #EF44A8",
"{_	c #EF42A6",
"]_	c #EB43A5",
"                                                                                                                                                                                                                                                                ",
"                                                                                                                                                                                                                                                                ",
"                                                                                                                                                                                                                                                                ",
"                                                                                                                                                                                        . + @ # $ % & % $ @ * = . -                                             ",
"                                                                                                                                                                                    ; # > , ' ) ! ! ~ { ] ^ / ( _ & # # # :                                     ",
"                                                                                                                                                                                # # * < [ } | 1 2 3 4 5 6 7 3 8 9 0 a ( . % b % c                               ",
"                                                                                                                                                                              * . d e f g h 4 i g j k l i 3 j m n n 5 o p q r b % b %                           ",
"                                                                                                                                                                          # # s t u v 2 v i w x y i h z A B i 4 j 8 3 C D } E F G H $ b I                       ",
"                                                                                                                                                                      # % # J K A L M N N M N N A M h h i A O A P Q R S T D U V W X Y Z `  .`                   ",
"                                                                                                                                                                    % b H ..7 A A h N +.N N @.#.$.%.M &.#.w h O z *.*.=.2 =.-.V ;.>.9 ,.'.> $ ).!.              ",
"                                                                                                                                                                . $ > ~.{.N $.h ].^./.^.(.%.M v ^._./.+.A N :.j <.j 2 [.}.C D |.1.2.3.4.,.5.6.# ` 7.            ",
"                                                                                                                                                            b % b 8.9.N 0.N N a.b.c.a.d.&.a.d._.&.a.].e.a.M f.g.g g 2 h.=.R T i.1.;.j.k.l.m.n.o.> p.q.          ",
"                                                                                                                                                          %  .> r.s.:.i _.t.e.$.c./.u././.v.w.x.c.w.y.b.v _.].i y P z z.2 A.B.E E 9 C.j.D.E.F.5.G.H.>           ",
"                                                                                                                                                       . .# r ,.I.g.N :.@.]./.c./.J.K.L.M.c.N.N.M.v.L.v N N 0.i f.g P 4 O.s.i.V E V 9 P.,.E.0 Q.R.S.T.U.        ",
"                                                                                                                                                    &  .> V.z O W.X._.a.Y.a.J.c.Z.Y.w.w.`.Z. +w.M..+++@._.@+:.:.6 O 3 P A.#+A.W $+;.%+&+D.*+=+-+;+>+,+'+        ",
"                                                                                                                                                I  .b )+;.N :.i I.M 0.!+Y.~+c.w.{+v.Y.]+^+w.`.Z.w.a.J./+J.+.+.(+3 _+P }.5 }.i.V :+<+<+[+}+|+1+2+3+4+5+6+6+      ",
"                                                                                                                                              & ` 7+8+O i 9+h %.a.0+a+a.b+u./.M.c.v.c+N.`.`.Z.w.J.Z.+.Z.N d+%.0.W.} e+f+i.}.E g+9 h+i+! j+k+l+m+n+o+6+6+6+      ",
"                                                                                                                                          & p+# q+>.g 7 h d+0+/.].w.(.x.r+b+/.s+{+^.t+u+N.Z.v.v.a+@.Z.N N $.A g 7 O A.}.R E v+>.;.i+w+. x+y+z+A+6+6+6+6+6+6+    ",
"                                                                                                                                      B+I ` C+D+m 9+j g i %.]._./._.M.a. +E+F+N.c.v.`.G+H+N.{+a.M.0.v N e.b.| 4 3 1 P i.#+D V I+J+K+L+M+N+O+P+Q+6+R+S+6+o+6+    ",
"                                                                                                                                    T+& # U+V+W+m n 9+w M N ].v ^.(.w.a.Y.N.N.v.c.X+G+c.Y.v.{+a.e.Z.e.:.Y+9+y 1 Z+S 2 `+g+i.9 r.%  @.@+@@@#@$@%@&@6+o+o+6+6+6+  ",
"                                                                                                                                *@B+` =@-@5 n ;@j >@7 $.,@v '@u.M./.`.H+v.)@N.)@!@c.Y.Y.a.N.@.].^.a.:.>@_.j A n 2 O.g+i.C ~@J {@]@^@/@(@_@:@<@[@}@}@o+|@6+6+6+  ",
"                                                                                                                              *@T+1@r.i.T 2 3 g k i O M v | @.&.^./.2@M.2@N.c.Y.3@K.H+`.c.@.M a.].>@%.z A P 4 g =.R T 4@5@H.6@7@8@9@0@a@b@c@#@[@d@&@6+o+|@6+6+  ",
"                                                                                                                          p+B+*@/ e@[.=.5 s.j i N N :.f@M a+^._.a.Z.a.c.e.Y.g@Y.Y.M.c./.M._.f@| %.:.%.h y W+O.2 =.n h@_ i@j@k@l@m@n@o@p@q@_@r@s@t@&@6+o+6+6+6+6+",
"                                                                                                                        & T+* u@v@i.v+i.} } W+O w w N v t.c.&.K.c._./.{+c.w.w@Z.d.a+e.a.M.L.A %.O i h P x@x v+P }+y@z@x+A@B@C@D@E@n@F@o@G@(@H@s@[@t@I@o+6+6+6+  ",
"                                                                                                                    *@*@J@K@L@D M@{.} R 2 O.4 y N | %.M.v w@w.d./.c.N.2@N.a+H+N.v @.3@| e.0.v z g h 9+<.g 5 N@G H.O@P@Q@R@S@T@U@V@V@W@V@X@Y@Z@:@`@[@ #Q+R+.#    ",
"                                                                                                                  *@B+* +#h+U W 1.C O.5 g y h %.N %._.0.^.I.^._.c.a.Z.I.++/.x.M e.&.O b.y y A A P ;@N@A.P @###*@O@$#%#&#*#=#-#;#>#>#,#'#)#G@!#~#<@$@{#6+6+      ",
"                                                                                                              ;+*@*@=@[ ;.:+$+V v+}.R j W+x 9+0.P 0.M M ]#M.N Y.e.^#v g.M.!@/#N _.:.e.v z O W.(#P 5 A 4@_#T+:#<#[#}#|#1#2#3#4#5#6#7#8#9#0#a#b#c#s@[@%@          ",
"                                                                                                            *@d#. w+e#C.e#;.f#g#s.h#i#O.g (#i 9+_.A A %./.g.I.j#N c.+.a+M.>@0.:.N d+f.j 9+P 2 x 5 C k#S.*@l#m#n#o#p#q#r#s#t#u#v#6#w#x#y#z#9@A#B#C#<@            ",
"                                                                                                        *@;+p+D#5.E#e#F#G#1.W i.i.O.W+8 m 4 7 0.:.w ;@0.M.$.@._.H#+.+.g.N g.N g A 4 A P O T I#4 [ J#*@K#L#M#N#O#P#Q#R#S#T#U#V#W#6#X#w#Y#z#Z#G@`#                ",
"                                                                                                       $;+.$+$[+@$2.#$$$V i.s.i.C 2 5 (#g g.h Y+A :.$.A v h N I.L M.h L L i y x y x 2 P R 7 2.%$& &$q+*$=$-$;$>$,$'$)$!$~${$]$^$/$X#w#y#0#F@D@                  ",
"                                                                                                  d#($` < _$P.:$j.C.h+U V i.W =.<$5 A.>@(#j P N A h N >@h 0.a++.[$A O >@:.B O W+3 2 g A.R }$. d#*@|$1$2$3$4$5$;$6$7$8$9$0$a$b$c$c$w#d$y#z#                      ",
"                                                                                                e$d#H.f$m.n.g$h$#$#$;.$$D V+O.C R i$3 5 9+O :.7 w z e+%.y.(#:.N i A O W+w 2 I#x i#}.j _$j$` &$k$l$m$n$o$p$q$r$s$t$u$v$w$x$y$b$z$A$7#B$C$                        ",
"                                                                                            p.d#*@=@~@:$[+4@D$4@E$h+W i.N@}.R s.A.l 2 j 7 g x N g P :.A z 7 y O j 4 j 3 m z s.5 3 F$%$G$H$q+I$J$K$L$L$M$N$O$O$P$Q$R$S$T$U$V$W$X$Y$Z$                            ",
"                                                                                          z@d#`$ %.%+%@%#%[+h+F#1.$%{.$+#+%%&%A.3 Z+>@j I#i O O w i Q i f.f 7 ;@>@j n 2 *%} I#C k#b p.% =%-%;%>%,%,%'%)%!%~%O${%s$]%^%/%!$(%t#_%:%                              ",
"                                                                                        <%*@[%}%0 |%E.1%2%3%E#h+:+4%#+z.=.5%R 6%7%8 f 7 8%j 7 g g ;@P z e+j 6 } A.8 A.9%R A.9.0%*@a%b%c%d%e%d%f%e%g%h%i%j%k%l%4$m%n%o%p%q%r%s%                                  ",
"                                                                                     $;+G$t%u%v%v%w%w%4@*+2.h+|.%%|.E W `+T =.2 R g x%W+P ;@g j n f.y%A.z%i$s.n n `+_+R E$A%B%C%D%E%F%G%H%G%I%J%K%e%L%-%L$k%n$4$s$M%N%O%P%                                      ",
"                                                                                  d#B%Q%G.R%-@S%[+T%U%m.#$D$9 $$U U V%N@5 A.W%W%R A.3 2 x@j P 1 Q 8 5 j n =.A.C R } g+r.: p.` X%d%Y%Z%`% &.&+&@&Z%Y%#&$&%&&&3$*&=&-&;&}#                                        ",
"                                                                              B%p.& K+>&,&'&R%)&!&1%[+E$~&#$>.W $$C N@E o }.Q R 3 5 5 5 f.O.i.m A.2 5 R 5 A.R D `+{&]&p.^&/&(&_&Z%:&<&<&[& &}&<&G%d%g%|&M$1&2&3&4&5&                                            ",
"                                                                            p.d#c 6&7&D+8&R%0 R%9&,.4@k.9 |.$+E#E D i.R i.} 5 5 R 2 0&O.8 2 j P *%n `+9%5 `+C n.a&& b&D%c&d&e&f&[&[&<&[&g&+& &G%h&J$i%L$i&j&k&l&                                                ",
"                                                                          p.B%J#) m&{&D+Q.|%n&)&e@h$4@2.o&h+E E D p&v+i.A.n `+2 f+S s.j 8 P #+} `+A.W%i.W%|.D%% q&> r&s&g%Y%f&:&+&t&u&v&:& &:&e%g%i%k%w&x&4$m%                                                  ",
"                                                                      p.<%y&z&A&B&=+C&m&Q.)&D&n.E&D$j.F&4%$+1.|.R N@o G&C C R `+O.2 x@R A.A.R D R D R i.H&> p.I&J&&&,%K&L&Z%M& &N&O&[&N&:&P&G%#&Q&M$N$p$R&                                                      ",
"                                                                    *@d#.$S&T&A&=+9.Q.5.!&!&[+D.#%E#%+U&%%$+u V #+V&i.W&} W%5%W%A.R 9%v+R D R W i.`+! X&z@Y&Z&`& *i%.*Y%f&N&N&:&:&[&N&`%G%d%g%j%!%k%2$                                                          ",
"                                                                  *@+*).@*#*>&$*u%%*Q.&*R%**=*-*#$3%D$E#|.|.$+W W R ;*i.>*T `+R D 9%s.=.W D i.U 1.,*& '*)*!*~*j%'%L&{*I%G%N&N&M&N&]*e%K%J$^*/*i&(*_*                                                            ",
"                                                              :*;+<*[*}*|*1*|*2*3*Q.Q.-@|%n&3%[+3%E$4*9 :+$+v@M@}.$+i.C } W%} D T <$V #+g+U `+%+5*p+&$6*7*L$8*9*0*a*K%a*b*f&_&_&H%K&c*8*-%d*m$j&                                                                ",
"                                                            p.<%q&e*+#f*H&g*h*2*i*%*7&v%)&m.:$[+*+#$#$$$j*E |.V }.V+i.u T `+C R i.i.`+T E W V ) # k*l*m*{*n*L%g%.*o*f&Y%f&K%Y%p*q*L%L$d*&&j&                                                                    ",
"                                                          :**@r*s*t*u*) v*A&B&{&w*8&5.! @%1%n.3%4@#$x*4*$$4*$$y*V+E i.N@I+;*$$v@E U W W %%1.$$V.H z*Z A*B*C*D*E*F*G*H*I*H*J*K*K*!%L*k%l%M*                                                                      ",
"                                                        p.<%N*O*P*Q*R*H&S*v*T*8&Q.3*-@|%v%@$j.4@j.4@j.:+1.E 1.W $+1.E T ;*T W F&;*;*E V :+4*1.k.U*@ ` z@p.V*W*X*C%:*z@Y*Z*`* =.=+=@=#=                                                                          ",
"                                                      p.<%$=%=&=*===-=;=$*>=B&m&,='=5.v%[+)&E$[+,.)=!=$$$+:+V U F&~=>*1.u %%$+I+:+$+V 9 {=;.!=E#e#E#D.@%2*u@r.]=D#1+% *@<%V*W*C%^=V*/=:*                                                                        ",
"                                                    (=d#_=s*:=<=[=<=) |*v*h*9.T*%*}=S%v%m.n.h$#$|=C.E#)=F#$$1=>.$$$$E ;.$+1.$+$+;.>.9 h+E#k.j.*+#$[+E.2=3=K 2=4=[ =+%*V.q R.5=6=. & p.:#7=:*V*z@8=                                                              ",
"                                                  p.&$9=0=a=b=c=t*d=e H&H&{&@#}=8&Q.e=@%)&@$*+4@:+k.%+%+F#$$:+$$1.>.$$p&1.$+|.;.;.)=;.h+,.k.4@F#m.h$@$E.! D+C&}={&f=u%B&|*V.-=g=h='.i=5@j=1+ .<%V*W*8=                                                          ",
"                                                k=<*l=m=n=o=p=q=r=Q*V.] s=t=T&8&,=7&@%|%)&u=#%m.v=<+E#F#E#:+;.|.$$$$h+E#$$E#;.9 F$E##%%+3%k.k.,.@$E.2=.%Q.R%8&~@{&A&w=>&V.) R*x=@*o.y=z=z=U+A=B=> & 7=Z                                                         ",
"                                                '*C=D=E=F=G=b=H=I=J=] >=v*K={&9.L=R%-@v%E.E.}+4@j.4@k.4%D$3%h+D$2.E#9 M=E#2.E#E##%E#%+j.:$m.E.0 }+2=-@N=[ O=T&@#h*|*) H&h=R*G.y=y=P=Q=R=S=t%t%5=).z@'*T=U=                                                      ",
"                                                z@V=W=X=a=Y=n=Z=`=J= -V.s=A&@#f=,=J+5.R%@%@$~ @$h$E$:$,.E$j.E##$j.e#E$#$E#.-j.k.4@@$4@[+D.E.U%e@! -@5.D+=+%*2*9.+-$*@-g=@*#-Y Y o.z=$-$-t%%-K@J@&$& &-*-o+R+                                                    ",
"                                                4+# V*&$=---;-n=<=J=] >->=,-{&f=%*%*+%5.v%2=1%e@m.j.,.k.j.k.j.C.D$C.D$M=2.4@j.,.%+#%E.}+E..%'-! 5.2=D+=+m&t=g*g*V.)-e e q y=Y !-z=a ~-R.5@).<%X*{-]-R+o+o+R+S+                                                  ",
"                                                o+^-/-Z O@V*&$&$=-(-j+G Y ) >=$*9.-@T%n.v%h$l.[+[+m.2%_-:$m.#$:-#$#$p <-[+4@[+<-@$_-m.@%'-! 5.e=.%~@f=9.B&[->=) }-) |-1-@*Y u*2-3-R.4-/ % V*+*5-'+R+R+R+6+S+R+                                                  ",
"                                                  o+6-7-8-9-0-'*a-O@'*V*V*z@B%$ * > > > b-r b-_#|*[+#%[+h$*+1%[+@$[+}+3%[+m.@$#%m.E.**! J+Q.0 c-D+8+{&w=s=u%s=H&)-|-@-y=!-d-D%e-f-g-h-p.O@i-j-k-R+R+R+R+R+S+6+                                                  ",
"                                                  o+l-m-n-o-p-q-r-s-t-u-v-w-x-y-X*z-A-/=a-B-C-% D-[ 2=@$E.m.*+D.@$2%m.D.v%L@@$@$v%0 v%R%J+E-=+t=8+$*@#H&>=V.] G.@-y=}$F-G-U+a %-j$& V*@ H-I-J-&@I@k-6+6+6+6+6+6+                                                ",
"                                                    K-l-L-o-M-N-O-N#k&o$$&_&P-Q-R-S-T-U-V-W-X-D-Y-_$[+@$! v%Z-@$m.D&m.v%m.e@-@! -@0 [ %*R%`-~@{&B&2*>=g*h=G. ;@-#-F-Y P=.;+;/ ` <*'*@;#;$;%;$@6+k-S+S+6+6+6+6+6+                                                ",
"                                                    6-&;7-*;=;-;;;N#3&x&K$>;,;[&';);!;~;{;D-X*b U*'=0 |%E.-@v%! |%|%@%-@D+@%5.5.%*L=D+_$2*{&u%B&s=v*] H&];^;/;w+(;+$y=2-5*> <%k+_;:;<;[;};|;t@ #.#S+6+6+6+6+6+6+                                                ",
"                                                      6-n-o-1;2;3;4;5;6;7;#&,;8;9;}&0;_#O@p.7+}$5.a;a;5.E.v%-@0 R%R%'=b;`-'&R%Q.[ m&%*B&8&c;A&>&h*>=>=w+|-e w+d;r.Y f-e;*@f;g;h;i;j;p@k;};<@}@l;m;}@R+S+6+6+6+6+                                                ",
"                                                      6-L-*;1;n;o;4;p;q;M$r;G%.&s;t;u;<%).v;=+5.L=,=D+,=%*Q.5.5.'&7&[ 5.8&5.m&9.w;,=9.B&A&h*g*>=}%>=e u@x;y;+$z;S=D#*@&$A;B;C;D;E;F;G;H;};|;Q+I;6+S+S+R+6+6+6+6+                                                ",
"                                                        K-J;K;L;M;N;O;P;~%Q;R;S;u;<%7+a s=B&%*{&8&8+}=%*7&,=L=}=C&4=%*T;8+@#B&9.t=c;2*>=U;|*V.g=) h=R*G.+#}$o.V;% :#<%W;X;Y;Z;`; >j;D@H@#@.>&@ #.#6+S+R+6+6+6+                                                  ",
"                                                          n-+>@>#>$>%>&>*>y-u;<%> =>|*B&s=|*A&g*t=9.m&->9.;>,=8&9.}=>>A&u%B&,-w=1*B&>=+->=>-,>G.|-q @-y;'>z&# p.O@)>!>~>{>]>C;^> >F;/>(>_>:>k-Q+|@6+R+6+6+6+                                                    ",
"                                                            *;M-<>[>}>< O@d#. A=V.];h=>=+-+-u%|*>&|*2*A&B&B&9.2*|>t=>>B&s=,-|*g*>=}-@-H&h=G. ;G.@*z;y=q+S.<%a%1>2>3>4>5>6>7>8>9>0>A$a>H@`@ #|@R+^-R+6+o+6+                                                      ",
"                                                                b>, C%H$H.5@R*R*w+V.h=];,->=+-H&,->&1*>&|*g*U;g*c>+->&H&>&}-}-H&d>) e G.R*+#y;}$Y %-e;<%O@A*e>f>M%g>h>i>y$j>k>8>l>7#m>n>o>|;I@I@|@S+R+                                                          ",
"                                                              V*V*H$p>q>r>}$s>x;t>|-u>)-] }%R*] H&H&] h*U;>=|*A&+-g=c>d>>=v>e )-e  ;+#u@+#}$w>x>j$*@X*).y>z>4$r$A>B>C>D>E>F>G>l>H>X#U@I>J>|;.>m;6+R+                                                            ",
"                                                          &$7=:#K>L>M>N>O>z;@*(;Y G.@-@*G.G.R*) ];-=];,>) V.) ) h=h=q )-e f*@-}$G.}$+#w+'>P>Q>*@W*% R>S>~%m$q$T>U>V>3>W>X>Y>Z>H>0>X#`> ,.,+,P+&@                                                                ",
"                                                      V*p.H$@,#,$,%,&,*,=,z=r.Y /;@*-,;,w+>,;,+#R*e q G.R*w+h=,>R*)-G.w+q @*R*@*'>+#z;,,D#*@'*z@',K&),-%)%!,n${%~,{,u$],^,V$/,(,_,:,<,/>[,_>                                                                    ",
"                                                  V*<%V*},|,1,2,3,4,5,4,%,d=U+r.y=r.Y o.z;y=z;w++#}$y=@*G.@*}$+#+#@*+##-@*z;+$(;y=a 6,$ :#<%7,8,M&]*Y%p*^*i%9,0,4$a,b,c,d,e,]$G>f,0>X#9@n>                                                                      ",
"                                              :*<%V*g,h,i,j,q>1,k,3,4,4,*,l,G-a U*r.r.U+a d-d-m,y=u*m,y=n,m,#-o.Y d;s>Y y;#-d;o,< % <*V*p,q,r,9;<&O&+&Z%#&-%k%l%2&=&R$s,t,u,v,w,x,y,z,                                                                          ",
"                                          V*7=<%T.A,B,C,C,D,E,F,G,G,G,H,4,I,J,K,U+U+z=L,2-M,'.S&z=o..;s>|+r.'.m,Y '.s>'.s>G =@$ <%a%N,O,P,Q,R,S,T,U,V,N&.*q*!%l%2&;$W,X,Y,r%V#Z,y,                                                                              ",
"                                        V*<%K#`, '.'+'@'i,#'D,$'E,L>j,%'1,5,&'*'x>' L,S=U+,,U+'.='G U+a .;U*z=z=U*G a -';'* <%>',''')'!'~'{']'^'/'U,(':&L&8*~%O$3&=&W,_':'<'['                                                                                  ",
"                                    V*<%}'|'1'2'3'4'5'6'7'i,8'9'0'a'j,j,1,5,b'J,i==>S=R=R.$-G G 3-G R.+;G f$,,$-a R.a&l#:*/=c'd'e'f'~'g'h'i'j'k'l'U,V,f&L%m'&&2&f>n'o'p'q'                                                                                      ",
"                                V*<%'*r's't'2'u'3'v'2'w'x'i,y'7'D,y'C,E,E,E,1,z'A'B'C'' C'' S=='=>f-R=R.A=C't%' K@. 7=/=D'E'i'~'F'G'H'h'e'I'J'j'^'K'L'e%>%k%l%*&[>M'#>N'                                                                                        ",
"                            V*<%V*O'P'Q'R'S'S'u'v'u'v'T'|,U'i,T'V'0'C,D,C,E,W'1,K+~.,*6.6.q+t%A=t%f-,*%-=>t%D#. p.u;}*X'Y']'Z'`' ).)+)G'Z'@)#)k'Q,g&N&g%8*O$$)%)M'N;                                                                                            ",
"                        V*:*:*&)*)=)-)Q'-);)R'S'u'u'S'|,x'2'>)w'T'w'+'i,,)L>C,W'')6.A%5=))!)~)~.~.{)~)~.])% p.C%D%^)/)()@)_)+)H'H'+)+).)@)j'k'l'u&N&K%L$m$p$m%:)                                                                                                ",
"                      V*<*<)[)})A,|)1)1'2)3)1'u'u'u'4)5)6)|,U'7)T'w'w'7'T'V'w'y'C,8)9)9){)))z&A%~)z&Z 0)p.X*S=a)b)c)J'd)e)h'f)Z'g)F'F'h)J'i)j)('`%d%Q;i&p$3&                                                                                                    ",
"                  V*<%'*k)l)1)=)m)n)n)1)1'o)p)R'Q'h,u'6)u'|,7)u'7)7)q)U'w'>)y'i,y'#'=@K@{)a&9)z&K+_ p+a%D%r)s)t)u)v)T-w)x)y)h'h'e'F'h'!'j)Q,9;@&h%$&n$z)                                                                                                        ",
"                :*<%A)B)C)C)C)m)C)`,=)1)n)1'1'1'R'R'1'u'R'D)6)6)u'7)E)U'4)>)i,2'w'F)a'< / K@G)K+H)> # I)J)K)L)g&M)N)O)P)Q)R)S)S-d)v)T)U)9;V,H%>%8*o$                                                                                                            ",
"            V*<%^&V)W)s'X)})=)Y)m)A,s'=)=)=)A,p)p)1'n)R'Z)h,h,`)h,u'6)4) !2'4'|,U'x'x'.!/ Y*/ D#< S.B%a%+!u;( @!#!D'.-$!%!&!*!=!-!;!>!,!:&d%j%M$                                                                                                                ",
"          :*V*'!)!!!})})})})})})})m)C)|)1)})1)n)p)o)o)Q'Q'R'n)Z)Z)-)R'h,E)E)7)E)|,7)>)|,e;Y*Y-b-r Y-> : : ` *@ .p.<%<%&$'*X*Y&^=+ ~!{!]!^!/!                                                                                                                    ",
"      V*<%<)(!_!!!l):!!!})X)})!!C)<![!=)C)=)1)1)=)1)p)Q'n)}!1)p)n)Q'u'Q'u'Q'h,Z)6)7)E)`)U'|!D#|!b-1!D#|!b-J 2!J#)*X&3!j$).> > b & +*<%V*X*O@V*:#;                                                                                                               ",
"    p.:*O'4!5!:!:!W)X)!!X)X)}):!})X)[!})6!m)C)P'=)7!=)=)n)p)n)p)p)1)}!Q'Q'8!Q'9!h,Z) !6)6)9'z*j$0!X&a!).X&J ( J#b!J J#c!j$J#)*J#J#C+)._ > $ B%z@V*:#y@d!                                                                                                        ",
"  e!V*f!(!g!W)!!:!W)W)!!!!:!!!:!!![)})s'[![![!h!C)|'=)C)=)=)1)=)n)1)p)1)1)3)A,3)Q'n)`)`)Q'i!(-3!J#j!e;J#[%j$).]&j=( ).k!).j$]&).).).e;).##j!7+> #  .p.'*Z                                                                                                       ",
"l!V*V)m!W)5!W)n!n!l)n!:!!!W)!!:!!!P'!!o!p![!P'P'C)k)C)=)<!|)q!|)q!7!=)1)h!1)=)A,n)A,A,3)r!s!3)t!7+j$u!7+1+_ ).).j$H X&0%; 0%0%j!####> > 1@h-> 7+_ 1@.  .V*v!                                                                                                    ",
"w!O@<)f!x!y!W)W)W)z!W)W):!:!W)A!W)!!!!z!X)})X)P'[)B![![!C)C!C!D!C!`,1)1)=)m)h!=)1)A,A,E!h!Q'Q'Q'F!##h-1+7+7+7+7+1+G!6=7+_ 1@7+##H!h-> H!1+7+I!> H # G$&$# J!&;                                                                                                  ",
"  K!& '*C%L!*)(!M!W)n!W)W)W):!n!:!W)[)B![)!!B!!!P'})C![!:!N!N!C)P'[!=)=)[!=)7!`,O!=)`,=)=)A,n)P!1)Q!1@1@1@. 7+H H R!S.> . . c . ##> 1+c . . . . # B%'*S!T!&;*-                                                                                                  ",
"  o+U!V!W!z@X*'*C%A)'!k))!X!Y!M!W)!!!![)!!!!B!n!Z!B!:![)`! ~!!C!C!o!P'})|'m)C)C)C)|'C)C)1)E!1)1)h!E!e$> . H!. . > . ; # # S.; . . > . .~. +~@ B%:*p.@~m-6-#~6-$~                                                                                                ",
"  R+R+$~%~&~*~=~{-y@u;O@X*'*C%}'-~O'r';~P'_!*))!B)y!>~,~p!!!!! ~*)P'|'C)P'C)P'})'~`,})`,C)`,`,E!=)1))~!~.$# # @ c . . > . . c # % # .~: %  $;+O@~~{~]~l-&;6-l-l-                                                                                                ",
"    R+o+o+7-n-o-^~/~(~_~:~J&<~Z&[~p.A-/=a%X*O@'*'*'*C%-~)!Z!:![)o!n!B!P'}~*)P'P'B! ~P'C!`,C)C)P!`,1)h!)~|~. b .~c b $ .~b % 1~c .~I %  .<%'*2~3~4~m;o+o+5~l-$~l-l-                                                                                              ",
"    o+o+l-U=n-*;M-N-6~7~8~n$)%@&,;9~0~a~b~c~d~e~f~g~h~^&r'i~_!n!}~n!:![)B![)P'B!V)p!j~P' ~B!D!C!P!D!`,D!`,@'.~b I G$ .% b .~# I I B%;+k+$ k~$;`@.>m;A+#~l~l-l~l-l-                                                                                              ",
"      R+l-o+7-*;=;n;m~n~o~p~q~r~~;s~t~u~v~w~x~w~y~z~A~'*B~i~B!_!(!i~n!_!*)n!C~_!!!B![) ~ ~ ~C)|'C)'~P!D~E~'~@,b F~G$b G~b & b *@<%<*k+H~I~J~B#K~.>P+A+l~l-$~5+l-R+5+                                                                                            ",
"      o+l-6-L-+>@>L~3;n'R&M~N~e%O~P~Q~R~v~S~T~U~V~W~V*X~>~)!y!(!(!B)_!i~_!B)C~C~i~Y~i~}~D~}~k)D~C)*)D~P'k)Z~;~|'d#I G~I G$*@p.:#'*`~ {.{+{n@@{#{.>P+m;R+l~l-${5+l-${                                                                                            ",
"        l-7-%{*;&{*{={4;-{x&M$;{>{,{'{){!{~{{{]{<*'*(!^{)!_!5!)!(!(!(!C~_!n!B)C~C~i~C~}~[)}~X~B!}~j~|'j~ ~j~'~'~/{K>k=*@<%k+'*({_{:{<{[{}{0#A#(><@.>I@l~5~5+l-o+R+R+                                                                                            ",
"          6-n-o-1;n;|{1{p;3$7;q~2{u&3{4{5{6{e~B-}'x!4!(!^{)!^{(!)!(!(!(!)!y!)!C~C~_!Y~,~B~_!}~X~*)X~}~*)D~B~ ~;~k)7{'*'*(=8{9{0{a{b{_{c{d{e{f{_@s@[@k-k-o+$~R+o+g{${                                                                                            ",
"          6-7-*;1;h{i{$>-$j{N$k{l{8;~;m{,{n{u;A)o{B)4!B)B)^{(!4!(!5!>~5!(!)!)!V)(!)!)!C~y!V)V)X~X~}~B~}~f!D~|'A)V*O@p{q{r{s{t{u{a{b{v{w{x{y{o@b@c#_>t@k-m;o+$~o+5+                                                                                              ",
"              z{&{/~A{B{n~C{6;D{;%E{8;F{_#V*G{H{4!4!^{I{^{^{^{^{X!J{(!4!J{B)(!)!C~K{(!C~_!L{C~}~_!C~*)V)k)T.V*K#j!M{N{O{P{Q{l>R{c{S{<{T{[{}{U{V{W{`@.>P+k-o+o+o+                                                                                                ",
"                  @>X{Y{Z{`{ ]x&K$;%.]# <*K{I{x!J{I{x!I{^{+]J{^{4!^{4!(!^{J{(!^{K{^{)!(!Y~@]V)V)_!#]r'<)<%C%7=$]%]&]*]P%=]{$-];]>],]']T{u{)],#!]Z@#@:>I@~]|@                                                                                                    ",
"                            {]2$(*]]V*C%^]+]I{4!I{x!+]I{^{H{I{X!x!J{^{J{H{4!@]J{)!Y~@](!@]f!(!K{r'C%'*/](]_]:]N#<][]}]|]U$1]2]3]4]5]v{v{6]7]8]o@b@c#`@%@k-                                                                                                      ",
"                                V*W*-~9]0]+]0]+]a]I{x!H{H{+]X!I{H{4!^{4!J{X!)!(!K{^{K{J{X!f!A)V*Y&b]c]d]e]f]k&-${,O#g]h]i]0$j]k]l]>]v{a{c{m]n]0#a@~##@                                                                                                          ",
"                              V*<%r'o]I{+]I{H{I{+]o{H{+]+]H{I{+]H{I{H{x!^{J{^{J{)!p]H{k)<):#q]r]s]t]u]l%z)3$ ]v]m%;$w]x]y]i>V$7>Z;z]a{A]_{B]C]D]G@                                                                                                              ",
"                            V*:*V)9]E]F]0]o{+]9]o{o]H{o{o{H{H{I{H{J{I{H{J{^{K{^{J{O'C%G]H]I]J]K]L]&&M]N$N]l%3$O]-{P]>$Q]R]S]T]s{U]V]W]b{X]Y]4]                                                                                                                  ",
"                          :*<*p]9]0]0]o]o{9]H{o{o{o{o{I{o{o{H{I{H{H{H{H{H{^{f!-~Y&Z]`]M+ ^.^+^@^K$k%!%#^$^x&n$z)O]%^&^*^s,t,=^-^;^>^<{,^'^                                                                                                                      ",
"                        <%C%)^E]9]o{9]9]0]I{9]a]9]o{o{o{I{H{o{!^H{H{o{H{'!}'~^{^]^^^/^(^K$'%j%_^_^:^%&j%<^N][^}^|^%)1^*^2^Y,3^4^5^D;c{                                                                                                                          ",
"                      <%T.6^7^9]9]9]9]9]7^8^)^9]o{o{0]9])^9^9^H{H{V)0^u;a^b^c^ ^d^e^f^>;P&'%;%e%;%i%;%_^g^~%h^6;i^j^N#u$;&)$k^l^G>                                                                                                                              ",
"                  V*<%O'm^7^7^7^7^m^9]n^n^o{)^)^n^9]9]o{o{o{(!O'}'>+o^y+p^q^r^h%s^P&t^P&t^u^G%r~#&v^'%_^K$o$3$z)k&%>w^q-_'x^y^                                                                                                                                  ",
"                V*V*G{z^A^9]7^n^n^6^7^n^7^n^9])^n^o{B^B^k)C^Y&D^E^F^G^H^v^2{H%t^I^.&2{J^8;P&e%K^>;$&N~d*N$N]|^2&L^M^O#N^p'                                                                                                                                      ",
"              V*:*O^P^P^A^m^n^7^n^n^6^n^7^7^Q^m^A^V)g,'*R^S^T^U^r^V^,;2{W^X^Y^';I^('>{V,2{t^;{>;#&k{~%d*x&}^ ]Z^`^ /                                                                                                                                            ",
"            V*V*p]./m^+/A^n^P^m^7^n^+/6^n^@/#/A)'*$/%/&/*/=/,;-/@&2{;/>/}&!;,/,/K'K'}&8;,;_&P&;%N~N~'/x&}^m%)/%>                                                                                                                                                ",
"          V*V*9]@/m^P^A^A^m^A^m^A^m^!/#/A)&$~/{/]/^///e%,;H%8;';K'(/';U)_/s~s~:/K'O~O~</t^f%>%Q;[/o$6;3$Z^}/                                                                                                                                                    ",
"        7='*n^|/m^A^!/m^@/A^@/@/#/A)k+u;1/2/3/4/K%d%5/e%;/>/K'K'6/,{6/j)s~7/8/9/0/}&.&@&e%'%)%M$p~z)k&)/                                                                                                                                                        ",
"      V*'*a/@/z^z^m^@/z^8^X~&)V*X*a%Z&b/c/d/e/N~L)-/[&I^f/,/g/s~s~h/s~z~j)i/:/';);2{j/>;N~@^~%p$z)                                                                                                                                                              ",
"    <%&$|/./k/a/n^K{L!C%:#'** L#l/3&m/m$n/o/p/;{t^I^[&q/';m{j)i/_/r/6/s/9/K'f/u&H%u^>%q~t/w&p$                                                                                                                                                                  ",
"  0-V*V)J{/{0^f;:#C%= u/v/w/x/=$2&l%m$M$Q;V^J%N&;/f/y/z/r/j)j)_/s/A/A/:/,/B/8;r~#&Q;K$~%                                                                                                                                                                        ",
"  C/j!D/j!E/F/G/H/I/J/K/L/M/N/O/P/9,_^q~i%s^`%Q/<&:/R/,/r/g/_/m{9;);I^S/8;e%;{;%_^i&                                                                                                                                                                            ",
"  7-T/U/V/W/=^X/Y/Z/`/ (L/.(+(@(1&L$_^#&f%e%`%@&2{';,/9;:/);,/z/#(~;$(V^e%v^:^                                                                                                                                                                                  ",
"  %(&(*(=(-(;(>(,('()(!(~({(](^(/(d*j%;%J$;{,; &`%2{8;</[&((-/X^t^_(;%:(<(                                                                                                                                                                                      ",
"    [(}(|()$S]1(2(3(4(5(6(7(8(9(0(z>|&^*s^P&r~J%$(j/t^,;K%5/d%d%'%i%                                                                                                                                                                                            ",
"    a(b(*]c(d(e(f(g(h(i(j(k(l(m(n(!,k%[/i%r;;%k{;%;%;%;%k{%&_^                                                                                                                                                                                                  ",
"      o(p(q(r(s(t(u(v(w(x(y(z(A(^(m/k%(*K$_^t/K$[^d*B(p~                                                                                                                                                                                                        ",
"      C(o#D(E(F(G(H(I(J(K(L(M(N(O(P(0,w&m$&&Q(l%N]                                                                                                                                                                                                              ",
"        R(S(s,T(U(V(u(J(W(X(Y(Z(`( _._2&k&4$                                                                                                                                                                                                                    ",
"          &]+_@_#_$_%_H(&_G(*_=_-_A>;_                                                                                                                                                                                                                          ",
"          o#S(>_,_'_)_!_~_{_]_                                                                                                                                                                                                                                  ",
"                                                                                                                                                                                                                                                                ",
"                                                                                                                                                                                                                                                                ",
"                                                                                                                                                                                                                                                                ",
"                                                                                                                                                                                                                                                                "};
