/* XPM */
static char * frameABR_xpm[] = {
"22 21 24 1",
" 	c None",
".	c #494546",
"+	c #32312F",
"@	c #484445",
"#	c #464344",
"$	c #454142",
"%	c #433F40",
"&	c #413E3F",
"*	c #403C3D",
"=	c #3E3A3B",
"-	c #3E3B3B",
";	c #3C393A",
">	c #3B3738",
",	c #3A3738",
"'	c #393636",
")	c #393536",
"!	c #373435",
"~	c #423D3F",
"{	c #363233",
"]	c #827A7C",
"^	c #646263",
"/	c #676364",
"(	c #6A6367",
"_	c #4D474B",
"                  ...+",
"                  ...+",
"                  ...+",
"                  ...+",
"                  ...+",
"                  ...+",
"                  ...+",
"                  @@@+",
"                  ###+",
"                  $$$+",
"                  %%%+",
"                  &&&+",
"                  ***+",
"                  =--+",
"                  ;;;+",
"                  >>,+",
"                  '))+",
"                  !!!+",
"~~~~~~~~~~~~~~~~~~{{{]",
"^^^^^^^^^^^^^^/^^^^^( ",
"____________________  "};
