/* XPM */
static char * titleAB_xpm[] = {
"4 18 18 1",
" 	c None",
".	c #585053",
"+	c #575053",
"@	c #575253",
"#	c #565052",
"$	c #544E50",
"%	c #534D4F",
"&	c #514C4D",
"*	c #4F4B4C",
"=	c #4E4A4B",
"-	c #4B4748",
";	c #4A4647",
">	c #494546",
",	c #484445",
"'	c #474344",
")	c #464243",
"!	c #454142",
"~	c #373535",
".+@@",
"####",
"$$$$",
"%%%%",
"&&&&",
"****",
"====",
"----",
";;;;",
">>>>",
",,,,",
"''''",
"))))",
"))))",
"!!!!",
"!!!!",
"!!!!",
"~~~~"};
