%!PS-Adobe-2.0 EPSF-2.0
%%Title: /home/hsasta/devicedetect.dia
%%Creator: Dia v0.96.1
%%CreationDate: Sat Apr  4 16:50:04 2009
%%For: hsasta
%%Orientation: Portrait
%%Magnification: 1.0000
%%BoundingBox: 0 0 530 432
%%BeginSetup
%%EndSetup
%%EndComments
%%BeginProlog
[ /.notdef /.notdef /.notdef /.notdef /.notdef /.notdef /.notdef /.notdef /.notdef /.notdef
/.notdef /.notdef /.notdef /.notdef /.notdef /.notdef /.notdef /.notdef /.notdef /.notdef
/.notdef /.notdef /.notdef /.notdef /.notdef /.notdef /.notdef /.notdef /.notdef /.notdef
/.notdef /.notdef /space /exclam /quotedbl /numbersign /dollar /percent /ampersand /quoteright
/parenleft /parenright /asterisk /plus /comma /hyphen /period /slash /zero /one
/two /three /four /five /six /seven /eight /nine /colon /semicolon
/less /equal /greater /question /at /A /B /C /D /E
/F /G /H /I /J /K /L /M /N /O
/P /Q /R /S /T /U /V /W /X /Y
/Z /bracketleft /backslash /bracketright /asciicircum /underscore /quoteleft /a /b /c
/d /e /f /g /h /i /j /k /l /m
/n /o /p /q /r /s /t /u /v /w
/x /y /z /braceleft /bar /braceright /asciitilde /.notdef /.notdef /.notdef
/.notdef /.notdef /.notdef /.notdef /.notdef /.notdef /.notdef /.notdef /.notdef /.notdef
/.notdef /.notdef /.notdef /.notdef /.notdef /.notdef /.notdef /.notdef /.notdef /.notdef
/.notdef /.notdef /.notdef /.notdef /.notdef /.notdef /.notdef /.notdef /.notdef /.notdef
/space /exclamdown /cent /sterling /currency /yen /brokenbar /section /dieresis /copyright
/ordfeminine /guillemotleft /logicalnot /hyphen /registered /macron /degree /plusminus /twosuperior /threesuperior
/acute /mu /paragraph /periodcentered /cedilla /onesuperior /ordmasculine /guillemotright /onequarter /onehalf
/threequarters /questiondown /Agrave /Aacute /Acircumflex /Atilde /Adieresis /Aring /AE /Ccedilla
/Egrave /Eacute /Ecircumflex /Edieresis /Igrave /Iacute /Icircumflex /Idieresis /Eth /Ntilde
/Ograve /Oacute /Ocircumflex /Otilde /Odieresis /multiply /Oslash /Ugrave /Uacute /Ucircumflex
/Udieresis /Yacute /Thorn /germandbls /agrave /aacute /acircumflex /atilde /adieresis /aring
/ae /ccedilla /egrave /eacute /ecircumflex /edieresis /igrave /iacute /icircumflex /idieresis
/eth /ntilde /ograve /oacute /ocircumflex /otilde /odieresis /divide /oslash /ugrave
/uacute /ucircumflex /udieresis /yacute /thorn /ydieresis] /isolatin1encoding exch def
/cp {closepath} bind def
/c {curveto} bind def
/f {fill} bind def
/a {arc} bind def
/ef {eofill} bind def
/ex {exch} bind def
/gr {grestore} bind def
/gs {gsave} bind def
/sa {save} bind def
/rs {restore} bind def
/l {lineto} bind def
/m {moveto} bind def
/rm {rmoveto} bind def
/n {newpath} bind def
/s {stroke} bind def
/sh {show} bind def
/slc {setlinecap} bind def
/slj {setlinejoin} bind def
/slw {setlinewidth} bind def
/srgb {setrgbcolor} bind def
/rot {rotate} bind def
/sc {scale} bind def
/sd {setdash} bind def
/ff {findfont} bind def
/sf {setfont} bind def
/scf {scalefont} bind def
/sw {stringwidth pop} bind def
/tr {translate} bind def

/ellipsedict 8 dict def
ellipsedict /mtrx matrix put
/ellipse
{ ellipsedict begin
   /endangle exch def
   /startangle exch def
   /yrad exch def
   /xrad exch def
   /y exch def
   /x exch def   /savematrix mtrx currentmatrix def
   x y tr xrad yrad sc
   0 0 1 startangle endangle arc
   savematrix setmatrix
   end
} def

/mergeprocs {
dup length
3 -1 roll
dup
length
dup
5 1 roll
3 -1 roll
add
array cvx
dup
3 -1 roll
0 exch
putinterval
dup
4 2 roll
putinterval
} bind def
/Times-Roman-latin1
    /Times-Roman findfont
    dup length dict begin
	{1 index /FID ne {def} {pop pop} ifelse} forall
	/Encoding isolatin1encoding def
    currentdict end
definefont pop
/Times-Italic-latin1
    /Times-Italic findfont
    dup length dict begin
	{1 index /FID ne {def} {pop pop} ifelse} forall
	/Encoding isolatin1encoding def
    currentdict end
definefont pop
/Times-Bold-latin1
    /Times-Bold findfont
    dup length dict begin
	{1 index /FID ne {def} {pop pop} ifelse} forall
	/Encoding isolatin1encoding def
    currentdict end
definefont pop
/Times-BoldItalic-latin1
    /Times-BoldItalic findfont
    dup length dict begin
	{1 index /FID ne {def} {pop pop} ifelse} forall
	/Encoding isolatin1encoding def
    currentdict end
definefont pop
/AvantGarde-Book-latin1
    /AvantGarde-Book findfont
    dup length dict begin
	{1 index /FID ne {def} {pop pop} ifelse} forall
	/Encoding isolatin1encoding def
    currentdict end
definefont pop
/AvantGarde-BookOblique-latin1
    /AvantGarde-BookOblique findfont
    dup length dict begin
	{1 index /FID ne {def} {pop pop} ifelse} forall
	/Encoding isolatin1encoding def
    currentdict end
definefont pop
/AvantGarde-Demi-latin1
    /AvantGarde-Demi findfont
    dup length dict begin
	{1 index /FID ne {def} {pop pop} ifelse} forall
	/Encoding isolatin1encoding def
    currentdict end
definefont pop
/AvantGarde-DemiOblique-latin1
    /AvantGarde-DemiOblique findfont
    dup length dict begin
	{1 index /FID ne {def} {pop pop} ifelse} forall
	/Encoding isolatin1encoding def
    currentdict end
definefont pop
/Bookman-Light-latin1
    /Bookman-Light findfont
    dup length dict begin
	{1 index /FID ne {def} {pop pop} ifelse} forall
	/Encoding isolatin1encoding def
    currentdict end
definefont pop
/Bookman-LightItalic-latin1
    /Bookman-LightItalic findfont
    dup length dict begin
	{1 index /FID ne {def} {pop pop} ifelse} forall
	/Encoding isolatin1encoding def
    currentdict end
definefont pop
/Bookman-Demi-latin1
    /Bookman-Demi findfont
    dup length dict begin
	{1 index /FID ne {def} {pop pop} ifelse} forall
	/Encoding isolatin1encoding def
    currentdict end
definefont pop
/Bookman-DemiItalic-latin1
    /Bookman-DemiItalic findfont
    dup length dict begin
	{1 index /FID ne {def} {pop pop} ifelse} forall
	/Encoding isolatin1encoding def
    currentdict end
definefont pop
/Courier-latin1
    /Courier findfont
    dup length dict begin
	{1 index /FID ne {def} {pop pop} ifelse} forall
	/Encoding isolatin1encoding def
    currentdict end
definefont pop
/Courier-Oblique-latin1
    /Courier-Oblique findfont
    dup length dict begin
	{1 index /FID ne {def} {pop pop} ifelse} forall
	/Encoding isolatin1encoding def
    currentdict end
definefont pop
/Courier-Bold-latin1
    /Courier-Bold findfont
    dup length dict begin
	{1 index /FID ne {def} {pop pop} ifelse} forall
	/Encoding isolatin1encoding def
    currentdict end
definefont pop
/Courier-BoldOblique-latin1
    /Courier-BoldOblique findfont
    dup length dict begin
	{1 index /FID ne {def} {pop pop} ifelse} forall
	/Encoding isolatin1encoding def
    currentdict end
definefont pop
/Helvetica-latin1
    /Helvetica findfont
    dup length dict begin
	{1 index /FID ne {def} {pop pop} ifelse} forall
	/Encoding isolatin1encoding def
    currentdict end
definefont pop
/Helvetica-Oblique-latin1
    /Helvetica-Oblique findfont
    dup length dict begin
	{1 index /FID ne {def} {pop pop} ifelse} forall
	/Encoding isolatin1encoding def
    currentdict end
definefont pop
/Helvetica-Bold-latin1
    /Helvetica-Bold findfont
    dup length dict begin
	{1 index /FID ne {def} {pop pop} ifelse} forall
	/Encoding isolatin1encoding def
    currentdict end
definefont pop
/Helvetica-BoldOblique-latin1
    /Helvetica-BoldOblique findfont
    dup length dict begin
	{1 index /FID ne {def} {pop pop} ifelse} forall
	/Encoding isolatin1encoding def
    currentdict end
definefont pop
/Helvetica-Narrow-latin1
    /Helvetica-Narrow findfont
    dup length dict begin
	{1 index /FID ne {def} {pop pop} ifelse} forall
	/Encoding isolatin1encoding def
    currentdict end
definefont pop
/Helvetica-Narrow-Oblique-latin1
    /Helvetica-Narrow-Oblique findfont
    dup length dict begin
	{1 index /FID ne {def} {pop pop} ifelse} forall
	/Encoding isolatin1encoding def
    currentdict end
definefont pop
/Helvetica-Narrow-Bold-latin1
    /Helvetica-Narrow-Bold findfont
    dup length dict begin
	{1 index /FID ne {def} {pop pop} ifelse} forall
	/Encoding isolatin1encoding def
    currentdict end
definefont pop
/Helvetica-Narrow-BoldOblique-latin1
    /Helvetica-Narrow-BoldOblique findfont
    dup length dict begin
	{1 index /FID ne {def} {pop pop} ifelse} forall
	/Encoding isolatin1encoding def
    currentdict end
definefont pop
/NewCenturySchoolbook-Roman-latin1
    /NewCenturySchoolbook-Roman findfont
    dup length dict begin
	{1 index /FID ne {def} {pop pop} ifelse} forall
	/Encoding isolatin1encoding def
    currentdict end
definefont pop
/NewCenturySchoolbook-Italic-latin1
    /NewCenturySchoolbook-Italic findfont
    dup length dict begin
	{1 index /FID ne {def} {pop pop} ifelse} forall
	/Encoding isolatin1encoding def
    currentdict end
definefont pop
/NewCenturySchoolbook-Bold-latin1
    /NewCenturySchoolbook-Bold findfont
    dup length dict begin
	{1 index /FID ne {def} {pop pop} ifelse} forall
	/Encoding isolatin1encoding def
    currentdict end
definefont pop
/NewCenturySchoolbook-BoldItalic-latin1
    /NewCenturySchoolbook-BoldItalic findfont
    dup length dict begin
	{1 index /FID ne {def} {pop pop} ifelse} forall
	/Encoding isolatin1encoding def
    currentdict end
definefont pop
/Palatino-Roman-latin1
    /Palatino-Roman findfont
    dup length dict begin
	{1 index /FID ne {def} {pop pop} ifelse} forall
	/Encoding isolatin1encoding def
    currentdict end
definefont pop
/Palatino-Italic-latin1
    /Palatino-Italic findfont
    dup length dict begin
	{1 index /FID ne {def} {pop pop} ifelse} forall
	/Encoding isolatin1encoding def
    currentdict end
definefont pop
/Palatino-Bold-latin1
    /Palatino-Bold findfont
    dup length dict begin
	{1 index /FID ne {def} {pop pop} ifelse} forall
	/Encoding isolatin1encoding def
    currentdict end
definefont pop
/Palatino-BoldItalic-latin1
    /Palatino-BoldItalic findfont
    dup length dict begin
	{1 index /FID ne {def} {pop pop} ifelse} forall
	/Encoding isolatin1encoding def
    currentdict end
definefont pop
/Symbol-latin1
    /Symbol findfont
definefont pop
/ZapfChancery-MediumItalic-latin1
    /ZapfChancery-MediumItalic findfont
    dup length dict begin
	{1 index /FID ne {def} {pop pop} ifelse} forall
	/Encoding isolatin1encoding def
    currentdict end
definefont pop
/ZapfDingbats-latin1
    /ZapfDingbats findfont
    dup length dict begin
	{1 index /FID ne {def} {pop pop} ifelse} forall
	/Encoding isolatin1encoding def
    currentdict end
definefont pop
28.346000 -28.346000 scale
-9.100000 -20.757500 translate
%%EndProlog


0.100000 slw
[] 0 sd
1.000000 1.000000 1.000000 srgb
n 16.150000 5.550000 m 16.150000 7.350000 l 20.510000 7.350000 l 20.510000 5.550000 l f
n 16.150000 6.450000 m 16.150000 6.450000 0.900000 0.900000 180.000000 270.000000 ellipse f
n 20.510000 6.450000 m 20.510000 6.450000 0.900000 0.900000 270.000000 360.000000 ellipse f
n 15.250000 6.450000 m 15.250000 6.450000 l 21.410000 6.450000 l 21.410000 6.450000 l f
n 16.150000 6.450000 m 16.150000 6.450000 0.900000 0.900000 90.000000 180.000000 ellipse f
n 20.510000 6.450000 m 20.510000 6.450000 0.900000 0.900000 0.000000 90.000000 ellipse f
0.000000 0.000000 0.000000 srgb
n 16.150000 5.550000 m 20.510000 5.550000 l s
n 16.150000 7.350000 m 20.510000 7.350000 l s
n 16.150000 6.450000 0.900000 0.900000 180.000000 270.000000 ellipse s
n 20.510000 6.450000 0.900000 0.900000 270.000000 360.000000 ellipse s
n 15.250000 6.450000 m 15.250000 6.450000 l s
n 21.410000 6.450000 m 21.410000 6.450000 l s
n 16.150000 6.450000 0.900000 0.900000 90.000000 180.000000 ellipse s
n 20.510000 6.450000 0.900000 0.900000 0.000000 90.000000 ellipse s
/Helvetica-latin1 ff 0.560000 scf sf
(new device found) 15.750000 6.452500 m 
dup sw 5.160000 exch sub 
16 div exch 0.0 exch 
 gs 1 -1 sc ashow gr
0.100000 slw
[] 0 sd
1.000000 1.000000 1.000000 srgb
n 16.100000 9.600000 m 16.100000 12.200000 l 20.647500 12.200000 l 20.647500 9.600000 l f
n 16.100000 10.600000 m 16.100000 10.600000 1.000000 1.000000 180.000000 270.000000 ellipse f
n 20.647500 10.600000 m 20.647500 10.600000 1.000000 1.000000 270.000000 360.000000 ellipse f
n 15.100000 10.600000 m 15.100000 11.200000 l 21.647500 11.200000 l 21.647500 10.600000 l f
n 16.100000 11.200000 m 16.100000 11.200000 1.000000 1.000000 90.000000 180.000000 ellipse f
n 20.647500 11.200000 m 20.647500 11.200000 1.000000 1.000000 0.000000 90.000000 ellipse f
0.000000 0.000000 0.000000 srgb
n 16.100000 9.600000 m 20.647500 9.600000 l s
n 16.100000 12.200000 m 20.647500 12.200000 l s
n 16.100000 10.600000 1.000000 1.000000 180.000000 270.000000 ellipse s
n 20.647500 10.600000 1.000000 1.000000 270.000000 360.000000 ellipse s
n 15.100000 10.600000 m 15.100000 11.200000 l s
n 21.647500 10.600000 m 21.647500 11.200000 l s
n 16.100000 11.200000 1.000000 1.000000 90.000000 180.000000 ellipse s
n 20.647500 11.200000 1.000000 1.000000 0.000000 90.000000 ellipse s
(look for appropiate) 15.600000 10.502500 m 
dup sw 5.547500 exch sub 
19 div exch 0.0 exch 
 gs 1 -1 sc ashow gr
(device driver) 16.467500 11.302500 m 
dup sw 3.812500 exch sub 
13 div exch 0.0 exch 
 gs 1 -1 sc ashow gr
0.100000 slw
[] 0 sd
1.000000 1.000000 1.000000 srgb
n 10.100000 13.000000 m 10.100000 15.600000 l 15.030000 15.600000 l 15.030000 13.000000 l f
n 10.100000 14.000000 m 10.100000 14.000000 1.000000 1.000000 180.000000 270.000000 ellipse f
n 15.030000 14.000000 m 15.030000 14.000000 1.000000 1.000000 270.000000 360.000000 ellipse f
n 9.100000 14.000000 m 9.100000 14.600000 l 16.030000 14.600000 l 16.030000 14.000000 l f
n 10.100000 14.600000 m 10.100000 14.600000 1.000000 1.000000 90.000000 180.000000 ellipse f
n 15.030000 14.600000 m 15.030000 14.600000 1.000000 1.000000 0.000000 90.000000 ellipse f
0.000000 0.000000 0.000000 srgb
n 10.100000 13.000000 m 15.030000 13.000000 l s
n 10.100000 15.600000 m 15.030000 15.600000 l s
n 10.100000 14.000000 1.000000 1.000000 180.000000 270.000000 ellipse s
n 15.030000 14.000000 1.000000 1.000000 270.000000 360.000000 ellipse s
n 9.100000 14.000000 m 9.100000 14.600000 l s
n 16.030000 14.000000 m 16.030000 14.600000 l s
n 10.100000 14.600000 1.000000 1.000000 90.000000 180.000000 ellipse s
n 15.030000 14.600000 1.000000 1.000000 0.000000 90.000000 ellipse s
(create device object) 9.600000 13.902500 m 
dup sw 5.930000 exch sub 
20 div exch 0.0 exch 
 gs 1 -1 sc ashow gr
(of driver's type) 10.358750 14.702500 m 
dup sw 4.412500 exch sub 
16 div exch 0.0 exch 
 gs 1 -1 sc ashow gr
0.100000 slw
[] 0 sd
1.000000 1.000000 1.000000 srgb
n 10.700000 18.550000 m 10.700000 20.350000 l 14.432500 20.350000 l 14.432500 18.550000 l f
n 10.700000 19.450000 m 10.700000 19.450000 0.900000 0.900000 180.000000 270.000000 ellipse f
n 14.432500 19.450000 m 14.432500 19.450000 0.900000 0.900000 270.000000 360.000000 ellipse f
n 9.800000 19.450000 m 9.800000 19.450000 l 15.332500 19.450000 l 15.332500 19.450000 l f
n 10.700000 19.450000 m 10.700000 19.450000 0.900000 0.900000 90.000000 180.000000 ellipse f
n 14.432500 19.450000 m 14.432500 19.450000 0.900000 0.900000 0.000000 90.000000 ellipse f
0.000000 0.000000 0.000000 srgb
n 10.700000 18.550000 m 14.432500 18.550000 l s
n 10.700000 20.350000 m 14.432500 20.350000 l s
n 10.700000 19.450000 0.900000 0.900000 180.000000 270.000000 ellipse s
n 14.432500 19.450000 0.900000 0.900000 270.000000 360.000000 ellipse s
n 9.800000 19.450000 m 9.800000 19.450000 l s
n 15.332500 19.450000 m 15.332500 19.450000 l s
n 10.700000 19.450000 0.900000 0.900000 90.000000 180.000000 ellipse s
n 14.432500 19.450000 0.900000 0.900000 0.000000 90.000000 ellipse s
(initialize device) 10.300000 19.452500 m 
dup sw 4.532500 exch sub 
17 div exch 0.0 exch 
 gs 1 -1 sc ashow gr
0.100000 slw
[] 0 sd
1.000000 1.000000 1.000000 srgb
n 23.100000 13.100000 m 23.100000 15.700000 l 26.787500 15.700000 l 26.787500 13.100000 l f
n 23.100000 14.100000 m 23.100000 14.100000 1.000000 1.000000 180.000000 270.000000 ellipse f
n 26.787500 14.100000 m 26.787500 14.100000 1.000000 1.000000 270.000000 360.000000 ellipse f
n 22.100000 14.100000 m 22.100000 14.700000 l 27.787500 14.700000 l 27.787500 14.100000 l f
n 23.100000 14.700000 m 23.100000 14.700000 1.000000 1.000000 90.000000 180.000000 ellipse f
n 26.787500 14.700000 m 26.787500 14.700000 1.000000 1.000000 0.000000 90.000000 ellipse f
0.000000 0.000000 0.000000 srgb
n 23.100000 13.100000 m 26.787500 13.100000 l s
n 23.100000 15.700000 m 26.787500 15.700000 l s
n 23.100000 14.100000 1.000000 1.000000 180.000000 270.000000 ellipse s
n 26.787500 14.100000 1.000000 1.000000 270.000000 360.000000 ellipse s
n 22.100000 14.100000 m 22.100000 14.700000 l s
n 27.787500 14.100000 m 27.787500 14.700000 l s
n 23.100000 14.700000 1.000000 1.000000 90.000000 180.000000 ellipse s
n 26.787500 14.700000 1.000000 1.000000 0.000000 90.000000 ellipse s
(create unknown) 22.600000 14.002500 m 
dup sw 4.687500 exch sub 
14 div exch 0.0 exch 
 gs 1 -1 sc ashow gr
(device object) 22.996250 14.802500 m 
dup sw 3.895000 exch sub 
13 div exch 0.0 exch 
 gs 1 -1 sc ashow gr
0.100000 slw
0 slc
n 18.330000 7.350000 m 18.330000 8.475000 l 18.373750 8.475000 l 18.373750 9.376393 l s
0.100000 slw
[] 0 sd
0 slj
0 slc
n 18.123750 8.988197 m 18.373750 9.488197 l 18.623750 8.988197 l s
/Helvetica-latin1 ff 0.560000 scf sf
0.100000 slw
0 slc
n 21.647500 10.900000 m 24.943750 10.900000 l 24.943750 12.876393 l s
0.100000 slw
[] 0 sd
0 slj
0 slc
n 24.693750 12.488197 m 24.943750 12.988197 l 25.193750 12.488197 l s
(not found) 21.842500 10.560000 m 
dup sw 2.815000 exch sub 
9 div exch 0.0 exch 
 gs 1 -1 sc ashow gr
0.100000 slw
0 slc
n 15.100000 10.900000 m 12.565000 10.900000 l 12.565000 12.776393 l s
0.100000 slw
[] 0 sd
0 slj
0 slc
n 12.315000 12.388197 m 12.565000 12.888197 l 12.815000 12.388197 l s
(found) 12.963750 10.610000 m 
dup sw 1.672500 exch sub 
5 div exch 0.0 exch 
 gs 1 -1 sc ashow gr
0.100000 slw
0 slc
n 12.565000 15.600000 m 12.565000 17.075000 l 12.566250 17.075000 l 12.566250 18.326393 l s
0.100000 slw
[] 0 sd
0 slj
0 slc
n 12.316250 17.938197 m 12.566250 18.438197 l 12.816250 17.938197 l s
showpage
