\relax 
\ifx\hyper@anchor\@undefined
\global \let \oldcontentsline\contentsline
\gdef \contentsline#1#2#3#4{\oldcontentsline{#1}{#2}{#3}}
\global \let \oldnewlabel\newlabel
\gdef \newlabel#1#2{\newlabelxx{#1}#2}
\gdef \newlabelxx#1#2#3#4#5#6{\oldnewlabel{#1}{{#2}{#3}}}
\AtEndDocument{\let \contentsline\oldcontentsline
\let \newlabel\oldnewlabel}
\else
\global \let \hyper@last\relax 
\fi

\@writefile{toc}{\contentsline {section}{\numberline {1}Introduction}{1}{section.1}}
\@writefile{toc}{\contentsline {section}{\numberline {2}Using Qanava}{1}{section.2}}
\@writefile{toc}{\contentsline {subsection}{\numberline {2.1}Installation}{1}{subsection.2.1}}
\@writefile{toc}{\contentsline {subsection}{\numberline {2.2}Configuring qmake to use Qanava}{1}{subsection.2.2}}
\@writefile{toc}{\contentsline {section}{\numberline {3}Architecture}{2}{section.3}}
\@writefile{toc}{\contentsline {subsection}{\numberline {3.1}Overview}{2}{subsection.3.1}}
\newlabel{sec:arch_overview}{{3.1}{2}{Overview\relax }{subsection.3.1}{}}
\@writefile{lof}{\contentsline {figure}{\numberline {1}{\ignorespaces  Graph Model View Overview}}{2}{figure.1}}
\newlabel{fig:qan-graph_model_overview}{{1}{2}{Overview\relax }{figure.1}{}}
\@writefile{toc}{\contentsline {subsection}{\numberline {3.2}Qanava Graph Item View}{2}{subsection.3.2}}
\newlabel{sec:arch_graphicsview}{{3.2}{2}{Qanava Graph Item View\relax }{subsection.3.2}{}}
\@writefile{lof}{\contentsline {figure}{\numberline {2}{\ignorespaces  Graph item view tool bar}}{2}{figure.2}}
\newlabel{fig:arch-graphitemview_tools.png}{{2}{2}{Qanava Graph Item View\relax }{figure.2}{}}
\@writefile{toc}{\contentsline {subsection}{\numberline {3.3}Graph Definition}{3}{subsection.3.3}}
\newlabel{sec:arch_graph}{{3.3}{3}{Graph Definition\relax }{subsection.3.3}{}}
\@writefile{lof}{\contentsline {figure}{\numberline {3}{\ignorespaces  Example graph topology}}{4}{figure.3}}
\newlabel{fig:graph-simple_topology}{{3}{4}{Graph Definition\relax }{figure.3}{}}
\@writefile{toc}{\contentsline {subsection}{\numberline {3.4}Attributes}{4}{subsection.3.4}}
\newlabel{sec:arch_attributes}{{3.4}{4}{Attributes\relax }{subsection.3.4}{}}
\@writefile{toc}{\contentsline {subsection}{\numberline {3.5}Styles}{4}{subsection.3.5}}
\newlabel{sec:arch_styles}{{3.5}{4}{Styles\relax }{subsection.3.5}{}}
\@writefile{toc}{\contentsline {subsection}{\numberline {3.6}Layouts}{5}{subsection.3.6}}
\newlabel{sec:arch_layout}{{3.6}{5}{Layouts\relax }{subsection.3.6}{}}
\@writefile{toc}{\contentsline {subsection}{\numberline {3.7}Using custom graphic nodes}{5}{subsection.3.7}}
\newlabel{sec:arch_custom}{{3.7}{5}{Using custom graphic nodes\relax }{subsection.3.7}{}}
\@writefile{lof}{\contentsline {figure}{\numberline {4}{\ignorespaces  Using custom graphic nodes}}{5}{figure.4}}
\newlabel{fig:06_09_29-qanava_custom-x11}{{4}{5}{Using custom graphic nodes\relax }{figure.4}{}}
\@writefile{toc}{\contentsline {subsection}{\numberline {3.8}Model and View}{5}{subsection.3.8}}
\newlabel{sec:arch_mvc}{{3.8}{5}{Model and View\relax }{subsection.3.8}{}}
\@writefile{lof}{\contentsline {figure}{\numberline {5}{\ignorespaces  Displaying an existing QT model (QDirModel)}}{6}{figure.5}}
\newlabel{fig:06_06_07-qanava-qtmodelx11}{{5}{6}{Model and View\relax }{figure.5}{}}
\@writefile{toc}{\contentsline {section}{\numberline {4}Utility Widgets}{6}{section.4}}
\newlabel{sec:ui}{{4}{6}{Utility Widgets\relax }{section.4}{}}
\@writefile{lof}{\contentsline {figure}{\numberline {6}{\ignorespaces  Node list widget}}{7}{figure.6}}
\newlabel{fig:ui-nodes_list}{{6}{7}{Utility Widgets\relax }{figure.6}{}}
\@writefile{lof}{\contentsline {figure}{\numberline {7}{\ignorespaces  Style editor widget}}{7}{figure.7}}
\newlabel{fig:ui-style_editor}{{7}{7}{Utility Widgets\relax }{figure.7}{}}
\@writefile{toc}{\contentsline {section}{\numberline {5}Samples}{7}{section.5}}
