<?xml version="1.0" encoding="UTF-8" standalone="no"?>
<!-- Created with Inkscape (http://www.inkscape.org/) -->
<svg
   xmlns:dc="http://purl.org/dc/elements/1.1/"
   xmlns:cc="http://web.resource.org/cc/"
   xmlns:rdf="http://www.w3.org/1999/02/22-rdf-syntax-ns#"
   xmlns:svg="http://www.w3.org/2000/svg"
   xmlns="http://www.w3.org/2000/svg"
   xmlns:xlink="http://www.w3.org/1999/xlink"
   xmlns:sodipodi="http://sodipodi.sourceforge.net/DTD/sodipodi-0.dtd"
   xmlns:inkscape="http://www.inkscape.org/namespaces/inkscape"
   id="svg2211"
   sodipodi:version="0.32"
   inkscape:version="0.44+devel"
   width="48"
   height="48"
   version="1.0"
   sodipodi:docbase="/media/hda6/home-2006-01-04-new/00New/coding/pygtk-shell/02-logo"
   sodipodi:docname="PyGTKShell-2.svg"
   inkscape:output_extension="org.inkscape.output.svg.inkscape">
  <metadata
     id="metadata2216">
    <rdf:RDF>
      <cc:Work
         rdf:about="">
        <dc:format>image/svg+xml</dc:format>
        <dc:type
           rdf:resource="http://purl.org/dc/dcmitype/StillImage" />
      </cc:Work>
    </rdf:RDF>
  </metadata>
  <defs
     id="defs2214">
    <linearGradient
       inkscape:collect="always"
       id="linearGradient10457">
      <stop
         style="stop-color:#729fcf;stop-opacity:1"
         offset="0"
         id="stop10459" />
      <stop
         style="stop-color:#3465a4;stop-opacity:1"
         offset="1"
         id="stop10461" />
    </linearGradient>
    <linearGradient
       inkscape:collect="always"
       id="linearGradient10447">
      <stop
         style="stop-color:#eeeeec;stop-opacity:1"
         offset="0"
         id="stop10449" />
      <stop
         style="stop-color:#888a85;stop-opacity:1"
         offset="1"
         id="stop10451" />
    </linearGradient>
    <linearGradient
       inkscape:collect="always"
       id="linearGradient10398">
      <stop
         style="stop-color:#729fcf;stop-opacity:1"
         offset="0"
         id="stop10400" />
      <stop
         style="stop-color:#204a87;stop-opacity:1"
         offset="1"
         id="stop10402" />
    </linearGradient>
    <linearGradient
       inkscape:collect="always"
       id="linearGradient10392">
      <stop
         style="stop-color:#8ae234;stop-opacity:1"
         offset="0"
         id="stop10394" />
      <stop
         style="stop-color:#4e9a06;stop-opacity:1"
         offset="1"
         id="stop10396" />
    </linearGradient>
    <linearGradient
       id="linearGradient10364"
       inkscape:collect="always">
      <stop
         id="stop10366"
         offset="0"
         style="stop-color:#ef2929;stop-opacity:1" />
      <stop
         id="stop10368"
         offset="1"
         style="stop-color:#a40000;stop-opacity:1" />
    </linearGradient>
    <linearGradient
       id="linearGradient10358">
      <stop
         id="stop10360"
         offset="0"
         style="stop-color:#73d216;stop-opacity:1" />
      <stop
         id="stop10362"
         offset="1"
         style="stop-color:#4e9a06;stop-opacity:1" />
    </linearGradient>
    <linearGradient
       id="linearGradient10352"
       inkscape:collect="always">
      <stop
         id="stop10354"
         offset="0"
         style="stop-color:#729fcf;stop-opacity:1" />
      <stop
         id="stop10356"
         offset="1"
         style="stop-color:#204a87;stop-opacity:1" />
    </linearGradient>
    <linearGradient
       inkscape:collect="always"
       id="linearGradient10312">
      <stop
         style="stop-color:#ef2929;stop-opacity:1"
         offset="0"
         id="stop10314" />
      <stop
         style="stop-color:#a40000;stop-opacity:1"
         offset="1"
         id="stop10316" />
    </linearGradient>
    <linearGradient
       id="linearGradient10296">
      <stop
         style="stop-color:#8ae234;stop-opacity:1"
         offset="0"
         id="stop10298" />
      <stop
         style="stop-color:#4e9a06;stop-opacity:1"
         offset="1"
         id="stop10300" />
    </linearGradient>
    <linearGradient
       inkscape:collect="always"
       id="linearGradient9378">
      <stop
         style="stop-color:#729fcf;stop-opacity:1"
         offset="0"
         id="stop9380" />
      <stop
         style="stop-color:#204a87;stop-opacity:1"
         offset="1"
         id="stop9382" />
    </linearGradient>
    <linearGradient
       inkscape:collect="always"
       xlink:href="#linearGradient9378"
       id="linearGradient9384"
       x1="34.24865"
       y1="14.075165"
       x2="37"
       y2="33.600666"
       gradientUnits="userSpaceOnUse"
       gradientTransform="matrix(1.7351351,0,0,1.7351351,-29.524324,-17.643243)" />
    <linearGradient
       inkscape:collect="always"
       xlink:href="#linearGradient10296"
       id="linearGradient10302"
       x1="14.832433"
       y1="1.7292131"
       x2="28.151354"
       y2="41.42754"
       gradientUnits="userSpaceOnUse"
       gradientTransform="matrix(0.6889599,0,0,0.7418412,7.8487488,4.195812)" />
    <linearGradient
       inkscape:collect="always"
       xlink:href="#linearGradient10312"
       id="linearGradient10318"
       x1="6.4000006"
       y1="13.727237"
       x2="12.108109"
       y2="33.931511"
       gradientUnits="userSpaceOnUse"
       gradientTransform="matrix(1.7135135,0,0,1.7135135,-3.7945945,-17.124324)" />
    <linearGradient
       inkscape:collect="always"
       xlink:href="#linearGradient9378"
       id="linearGradient10327"
       gradientUnits="userSpaceOnUse"
       gradientTransform="matrix(1.7351351,0,0,1.7351351,-29.524324,-17.643243)"
       x1="34.24865"
       y1="14.075165"
       x2="37"
       y2="33.600666" />
    <linearGradient
       inkscape:collect="always"
       xlink:href="#linearGradient10312"
       id="linearGradient10329"
       gradientUnits="userSpaceOnUse"
       gradientTransform="matrix(1.7135135,0,0,1.7135135,-3.7945945,-17.124324)"
       x1="6.4000006"
       y1="13.727237"
       x2="12.108109"
       y2="33.931511" />
    <linearGradient
       inkscape:collect="always"
       xlink:href="#linearGradient10296"
       id="linearGradient10331"
       gradientUnits="userSpaceOnUse"
       gradientTransform="matrix(0.6889599,0,0,0.7418412,7.8487488,4.195812)"
       x1="14.832433"
       y1="1.7292131"
       x2="28.151354"
       y2="41.42754" />
    <linearGradient
       inkscape:collect="always"
       xlink:href="#linearGradient10364"
       id="linearGradient10337"
       gradientUnits="userSpaceOnUse"
       gradientTransform="matrix(1.2558337,0,0,0.8106922,-0.670067,8.497065)"
       x1="6.4185438"
       y1="11.843139"
       x2="10.999998"
       y2="31.156738" />
    <linearGradient
       inkscape:collect="always"
       xlink:href="#linearGradient10352"
       id="linearGradient10378"
       gradientUnits="userSpaceOnUse"
       gradientTransform="matrix(1.6877906,-0.4521511,1.6244991,1.2955917,-24.335379,-15.526602)"
       x1="3.6942282"
       y1="28.517752"
       x2="-0.56125903"
       y2="35.176338" />
    <linearGradient
       inkscape:collect="always"
       xlink:href="#linearGradient10358"
       id="linearGradient10380"
       gradientUnits="userSpaceOnUse"
       gradientTransform="matrix(1.0256541,-0.2009943,0.4992567,0.9326287,27.363995,-9.9900661)"
       x1="-24.550459"
       y1="26.878899"
       x2="-28.312708"
       y2="39.595398" />
    <linearGradient
       inkscape:collect="always"
       xlink:href="#linearGradient10392"
       id="linearGradient10384"
       gradientUnits="userSpaceOnUse"
       gradientTransform="matrix(1.2558337,0,0,0.8106922,12.263683,2.6038751)"
       x1="6.4185438"
       y1="11.843139"
       x2="10.999998"
       y2="31.156738" />
    <linearGradient
       inkscape:collect="always"
       xlink:href="#linearGradient10398"
       id="linearGradient10388"
       gradientUnits="userSpaceOnUse"
       gradientTransform="matrix(1.2558337,0,0,0.8106922,25.197436,-3.2893156)"
       x1="6.4185438"
       y1="11.843139"
       x2="10.999998"
       y2="31.156738" />
    <linearGradient
       inkscape:collect="always"
       xlink:href="#linearGradient10364"
       id="linearGradient10410"
       gradientUnits="userSpaceOnUse"
       gradientTransform="matrix(1.2558337,0,0,0.8106922,-0.670067,8.497065)"
       x1="6.4185438"
       y1="11.843139"
       x2="10.999998"
       y2="31.156738" />
    <linearGradient
       inkscape:collect="always"
       xlink:href="#linearGradient10392"
       id="linearGradient10412"
       gradientUnits="userSpaceOnUse"
       gradientTransform="matrix(1.2558337,0,0,0.8106922,12.263683,2.6038751)"
       x1="6.4185438"
       y1="11.843139"
       x2="10.999998"
       y2="31.156738" />
    <linearGradient
       inkscape:collect="always"
       xlink:href="#linearGradient10398"
       id="linearGradient10414"
       gradientUnits="userSpaceOnUse"
       gradientTransform="matrix(1.2558337,0,0,0.8106922,25.197436,-3.2893156)"
       x1="6.4185438"
       y1="11.843139"
       x2="10.999998"
       y2="31.156738" />
    <linearGradient
       inkscape:collect="always"
       xlink:href="#linearGradient10398"
       id="linearGradient10417"
       gradientUnits="userSpaceOnUse"
       gradientTransform="matrix(0.9440782,-0.3436164,0.2218185,0.6094412,17.49483,16.266331)"
       x1="6.4185438"
       y1="11.843139"
       x2="10.999998"
       y2="31.156738" />
    <linearGradient
       inkscape:collect="always"
       xlink:href="#linearGradient10392"
       id="linearGradient10420"
       gradientUnits="userSpaceOnUse"
       gradientTransform="matrix(0.9440782,-0.3436164,0.2218185,0.6094412,7.6039994,16.266331)"
       x1="6.4185438"
       y1="11.843139"
       x2="10.999998"
       y2="31.156738" />
    <linearGradient
       inkscape:collect="always"
       xlink:href="#linearGradient10364"
       id="linearGradient10423"
       gradientUnits="userSpaceOnUse"
       gradientTransform="matrix(0.9440782,-0.3436164,0.2218185,0.6094412,-2.286832,16.266331)"
       x1="6.4185438"
       y1="11.843139"
       x2="10.999998"
       y2="31.156738" />
    <linearGradient
       inkscape:collect="always"
       xlink:href="#linearGradient10364"
       id="linearGradient10430"
       gradientUnits="userSpaceOnUse"
       gradientTransform="matrix(0.9440782,-0.3436164,0.2218185,0.6094412,-2.286832,16.266331)"
       x1="6.4185438"
       y1="11.843139"
       x2="10.999998"
       y2="31.156738" />
    <linearGradient
       inkscape:collect="always"
       xlink:href="#linearGradient10392"
       id="linearGradient10432"
       gradientUnits="userSpaceOnUse"
       gradientTransform="matrix(0.9440782,-0.3436164,0.2218185,0.6094412,7.6039994,16.266331)"
       x1="6.4185438"
       y1="11.843139"
       x2="10.999998"
       y2="31.156738" />
    <linearGradient
       inkscape:collect="always"
       xlink:href="#linearGradient10398"
       id="linearGradient10434"
       gradientUnits="userSpaceOnUse"
       gradientTransform="matrix(0.9440782,-0.3436164,0.2218185,0.6094412,17.49483,16.266331)"
       x1="6.4185438"
       y1="11.843139"
       x2="10.999998"
       y2="31.156738" />
    <linearGradient
       inkscape:collect="always"
       xlink:href="#linearGradient10398"
       id="linearGradient10437"
       gradientUnits="userSpaceOnUse"
       gradientTransform="matrix(1.1423346,-0.4157758,0.2684004,0.7374238,19.854037,8.8358184)"
       x1="6.4185438"
       y1="11.843139"
       x2="10.999998"
       y2="31.156738" />
    <linearGradient
       inkscape:collect="always"
       xlink:href="#linearGradient10392"
       id="linearGradient10440"
       gradientUnits="userSpaceOnUse"
       gradientTransform="matrix(1.1423346,-0.4157758,0.2684004,0.7374238,7.3089936,13.633916)"
       x1="6.4185438"
       y1="11.843139"
       x2="10.999998"
       y2="31.156738" />
    <linearGradient
       inkscape:collect="always"
       xlink:href="#linearGradient10364"
       id="linearGradient10443"
       gradientUnits="userSpaceOnUse"
       gradientTransform="matrix(1.1423346,-0.4157758,0.2684004,0.7374238,-5.2360463,18.432013)"
       x1="6.4185438"
       y1="11.843139"
       x2="10.999998"
       y2="31.156738" />
    <linearGradient
       inkscape:collect="always"
       xlink:href="#linearGradient10447"
       id="linearGradient10453"
       x1="25.102291"
       y1="26.786797"
       x2="42.956738"
       y2="43.934135"
       gradientUnits="userSpaceOnUse"
       gradientTransform="matrix(1,0,0,0.8666668,0,3.1999996)" />
    <linearGradient
       inkscape:collect="always"
       xlink:href="#linearGradient10457"
       id="linearGradient10463"
       x1="15.5"
       y1="4.625"
       x2="36.75"
       y2="14"
       gradientUnits="userSpaceOnUse" />
  </defs>
  <sodipodi:namedview
     inkscape:window-height="695"
     inkscape:window-width="1024"
     inkscape:pageshadow="2"
     inkscape:pageopacity="0.0"
     guidetolerance="10.0"
     gridtolerance="10000"
     objecttolerance="50"
     borderopacity="1.0"
     bordercolor="#666666"
     pagecolor="#ffffff"
     id="base"
     width="48px"
     height="48px"
     showgrid="false"
     showguides="true"
     inkscape:guide-bbox="true"
     inkscape:object-nodes="false"
     inkscape:object-points="false"
     inkscape:object-bbox="false"
     inkscape:object-paths="false"
     inkscape:zoom="10.041667"
     inkscape:cx="24"
     inkscape:cy="24"
     inkscape:window-x="0"
     inkscape:window-y="25"
     inkscape:current-layer="svg2211"
     inkscape:grid-points="false"
     inkscape:guide-points="true"
     inkscape:grid-bbox="true" />
  <g
     id="g10465">
    <rect
       y="4.5000005"
       x="1.5"
       height="39"
       width="45"
       id="rect10445"
       style="opacity:1;color:#000000;fill:url(#linearGradient10453);fill-opacity:1;fill-rule:evenodd;stroke:#2e3436;stroke-width:3.00000048;stroke-linecap:butt;stroke-linejoin:miter;marker:none;marker-start:none;marker-mid:none;marker-end:none;stroke-miterlimit:4;stroke-dasharray:none;stroke-dashoffset:0;stroke-opacity:1;visibility:visible;display:inline;overflow:visible;enable-background:accumulate" />
    <rect
       y="6"
       x="9"
       height="6"
       width="36"
       id="rect10455"
       style="opacity:1;color:#000000;fill:url(#linearGradient10463);fill-opacity:1.0;fill-rule:evenodd;stroke:none;stroke-width:3;stroke-linecap:butt;stroke-linejoin:miter;marker:none;marker-start:none;marker-mid:none;marker-end:none;stroke-miterlimit:4;stroke-dasharray:none;stroke-dashoffset:0;stroke-opacity:1;visibility:visible;display:inline;overflow:visible;enable-background:accumulate" />
  </g>
  <g
     id="g10469">
    <path
       sodipodi:nodetypes="ccccccc"
       id="path6701"
       d="M 0,22.154992 L 2.3162821,28.518925 L 13.771241,31.556654 L 6.9488468,41.246789 L 9.2651275,47.610722 L 22.909915,28.230449 L 0,22.154992 z "
       style="fill:url(#linearGradient10443);fill-opacity:1;fill-rule:evenodd;stroke:none;stroke-width:2;stroke-linecap:butt;stroke-linejoin:miter;stroke-miterlimit:4;stroke-dasharray:none;stroke-opacity:1" />
    <path
       style="fill:url(#linearGradient10440);fill-opacity:1;fill-rule:evenodd;stroke:none;stroke-width:2;stroke-linecap:butt;stroke-linejoin:miter;stroke-miterlimit:4;stroke-dasharray:none;stroke-opacity:1"
       d="M 12.545041,17.356895 L 14.861324,23.720828 L 26.31628,26.758555 L 19.493886,36.448692 L 21.810169,42.812625 L 35.454956,23.43235 L 12.545041,17.356895 z "
       id="path10382"
       sodipodi:nodetypes="ccccccc" />
    <path
       style="fill:url(#linearGradient10437);fill-opacity:1;fill-rule:evenodd;stroke:none;stroke-width:2;stroke-linecap:butt;stroke-linejoin:miter;stroke-miterlimit:4;stroke-dasharray:none;stroke-opacity:1"
       d="M 25.090084,12.558798 L 27.406367,18.922731 L 38.861325,21.960458 L 32.038932,31.650595 L 34.355213,38.014528 L 48,18.634253 L 25.090084,12.558798 z "
       id="path10386"
       sodipodi:nodetypes="ccccccc" />
  </g>
</svg>
