{
  "mapVersion": "0.2",
  "baseVersion": "7",
  "mapVersionString": "",
  "results": [
    {
      "ID": 23951,
      "Label": "Discovery Bay",
      "DEVICE_LOCATIONTYPE": "inside",
      "THINGSPEAK_PRIMARY_ID": "666159",
      "THINGSPEAK_PRIMARY_ID_READ_KEY": "3HITIJ4TWALLJ5AW",
      "THINGSPEAK_SECONDARY_ID": "666160",
      "THINGSPEAK_SECONDARY_ID_READ_KEY": "NLC6448DADF72908",
      "Lat": 22.295878,
      "Lon": 114.01181,
      "PM2_5Value": "3.65",
      "LastSeen": 1574174970,
      "Type": "PMS5003+PMS5003+BME280",
      "Hidden": "false",
      "Flag": 1,
      "DEVICE_BRIGHTNESS": "15",
      "DEVICE_HARDWAREDISCOVERED": "2.0+BME280+PMSX003-B+PMSX003-A",
      "Version": "4.11",
      "LastUpdateCheck": 1574172928,
      "Created": 1546297640,
      "Uptime": "20161",
      "RSSI": "-60",
      "Adc": "0.02",
      "p_0_3_um": "589.71",
      "p_0_5_um": "174.52",
      "p_1_0_um": "26.98",
      "p_2_5_um": "2.31",
      "p_5_0_um": "0.0",
      "p_10_0_um": "0.0",
      "pm1_0_cf_1": "2.31",
      "pm2_5_cf_1": "3.65",
      "pm10_0_cf_1": "4.12",
      "pm1_0_atm": "2.31",
      "pm2_5_atm": "3.65",
      "pm10_0_atm": "4.12",
      "isOwner": 0,
      "humidity": "44",
      "temp_f": "82",
      "pressure": "1008.41",
      "AGE": 0,
      "Stats": "{\"v\":3.65,\"v1\":5.14,\"v2\":10.45,\"v3\":15.71,\"v4\":25.62,\"v5\":27.06,\"v6\":26.74,\"pm\":3.65,\"lastModified\":1574174970050,\"timeSinceModified\":120053}"
    },
    {
      "ID": 23952,
      "ParentID": 23951,
      "Label": "Discovery Bay B",
      "THINGSPEAK_PRIMARY_ID": "666161",
      "THINGSPEAK_PRIMARY_ID_READ_KEY": "865KIK7BIB0018GR",
      "THINGSPEAK_SECONDARY_ID": "666162",
      "THINGSPEAK_SECONDARY_ID_READ_KEY": "XTWTX9X8KVX6T4PT",
      "Lat": 22.295878,
      "Lon": 114.01181,
      "PM2_5Value": "4.87",
      "LastSeen": 1574174970,
      "Hidden": "false",
      "Flag": 1,
      "Created": 1546297640,
      "Adc": "0.02",
      "p_0_3_um": "614.54",
      "p_0_5_um": "176.65",
      "p_1_0_um": "33.97",
      "p_2_5_um": "6.42",
      "p_5_0_um": "0.93",
      "p_10_0_um": "0.42",
      "pm1_0_cf_1": "2.14",
      "pm2_5_cf_1": "4.87",
      "pm10_0_cf_1": "5.83",
      "pm1_0_atm": "2.14",
      "pm2_5_atm": "4.87",
      "pm10_0_atm": "5.83",
      "isOwner": 0,
      "AGE": 0,
      "Stats": "{\"v\":4.87,\"v1\":5.55,\"v2\":10.73,\"v3\":15.97,\"v4\":25.86,\"v5\":27.28,\"v6\":26.98,\"pm\":4.87,\"lastModified\":1574174970050,\"timeSinceModified\":120053}"
    }
  ]
}