material poolball15
{
	receive_shadows on
	technique
	{
		pass
		{
			ambient 0.500000 0.500000 0.500000 1.000000
			diffuse 0.558431 0.558431 0.558431 1.000000
			specular 0.500000 0.500000 0.500000 1.000000 12.500000
			emissive 0.000000 0.000000 0.000000 1.000000
			texture_unit
			{
				texture ball15.tif
				tex_address_mode wrap
				filtering trilinear
			}
		}
	}
}
