[2J[1;1H
[0;31mred [1mbold
[0;34mblue [1mbold
[0mwhite [1mwhite
[0;33mbrown [1myellow



[0;36;1m*******************************************************************************[0m
[0;36;1m|[0m                    [0;33;1mHello and welcome to The Forest's Edge!                  [0;36;1m|[0m
[0;36;1m*******************************************************************************[0m
