First name,Last name,Permission date,Age,Gender,Relation,Hometown location,Networks,If deleted,Facebook id,Current location,Affiliations,Friends invited,Status
fff,ccccc,1950-08-19 00:00:00 UTC,49,female,Single,bgbgbg,fvfvfvf,false,149521,fvfvfvf,fvfvfv,0,Set
fff,ccccc,1950-08-19 00:00:00 UTC,49,female,Single,bgbgbg,fvfvfvf,false,149521,fvfvfvf,fvfvfv,0,Set
Bulos,Arabic,2009-08-13 10:00:22 UTC,14,male,Engaged,Ukraine/Kharkivs'ka Oblast'/Lozova,,false,100000023326502,,Facebook Platform Developer Test Accounts ,11,is using http://zamerli.com to send free SMS in Jordan.
Cecilia,Einstein,2009-08-17 14:18:44 UTC,24,female,Single,Netherlands/Utrecht/Utrecht,,false,651930250,,Netherlands AIESEC Hogeschool Utrecht UPanamericana MX ,8,is using http://zamerli.com to send free SMS in Jordan.
Cecilia,Einstein,2009-08-17 14:18:44 UTC,24,female,Single,Netherlands/Utrecht/Utrecht,,false,651930250,,Netherlands AIESEC Hogeschool Utrecht UPanamericana MX ,8,is using http://zamerli.com to send free SMS in Jordan.
Ahmed,Hatamleh,2009-08-17 14:31:16 UTC,17,male,Single,Jordan//Amman,,false,728210837,,Jordan ,8,is using http://zamerli.com to send free SMS in Jordan.
Ahmed,Hatamleh,2009-08-17 14:31:16 UTC,17,male,Single,Jordan//Amman,,false,728210837,,Jordan ,8,is using http://zamerli.com to send free SMS in Jordan.
Thaer,Omari,2009-08-17 19:06:17 UTC,17,male,Single,Jordan//Amman,,false,527344066,,"",5,is using http://zamerli.com to send free SMS in Jordan.
Thaer,Omari,2009-08-17 19:06:17 UTC,17,male,Single,Jordan//Amman,,false,527344066,,"",5,is using http://zamerli.com to send free SMS in Jordan.
Firas,Feddah,2009-08-18 12:30:53 UTC,18,male,Married,"",,false,649446360,,Terra Sancta College University of Jordan ,0,"installed the Play 99.6 Prize Application. You, too, can win really cool prizes http://apps.facebook.com/playprize/?from=1. This month's prize is a brand new BlackBerry smartphone. "
Firas,Feddah,2009-08-18 12:30:53 UTC,18,male,Married,"",,false,649446360,,Terra Sancta College University of Jordan ,0,"installed the Play 99.6 Prize Application. You, too, can win really cool prizes http://apps.facebook.com/playprize/?from=1. This month's prize is a brand new BlackBerry smartphone. "
Ruba,Zabaneh,2009-08-18 15:04:50 UTC,19,female,"","",,false,636195245,,Jordan | ,8,is using http://zamerli.com to send free SMS in Jordan.
Ruba,Zabaneh,2009-08-18 15:04:50 UTC,19,female,"","",,false,636195245,,Jordan | ,8,is using http://zamerli.com to send free SMS in Jordan.
Amer,Al-Saleh,2009-08-18 17:24:11 UTC,23,male,Single,"",,false,521325397,,Jordan | University of Jordan | ,2,"installed the Play 99.6 Prize Application. You, too, can win really cool prizes http://apps.facebook.com/playprize/?from=1. This month's prize is a brand new BlackBerry smartphone. "
Amer,Al-Saleh,2009-08-18 17:24:11 UTC,23,male,Single,"",,false,521325397,,Jordan | University of Jordan | ,2,"installed the Play 99.6 Prize Application. You, too, can win really cool prizes http://apps.facebook.com/playprize/?from=1. This month's prize is a brand new BlackBerry smartphone. "
Rana,Zabaneh,2009-08-18 18:39:36 UTC,,female,Single,"",,false,879490696,,Jordan | ,0,"installed the Play 99.6 Prize Application. You, too, can win really cool prizes http://apps.facebook.com/playprize/?from=1. This month's prize is a brand new BlackBerry smartphone. "
Rana,Zabaneh,2009-08-18 18:39:36 UTC,,female,Single,"",,false,879490696,,Jordan | ,0,"installed the Play 99.6 Prize Application. You, too, can win really cool prizes http://apps.facebook.com/playprize/?from=1. This month's prize is a brand new BlackBerry smartphone. "
Areen,Sh,2009-08-18 18:47:03 UTC,20,"",Single,"",,false,559281216,,Our Lady Of Nazareth Academy | Jordan | ,8,"installed the Play 99.6 Prize Application. You, too, can win really cool prizes http://apps.facebook.com/playprize/?from=1. This month's prize is a brand new BlackBerry smartphone. "
Areen,Sh,2009-08-18 18:47:03 UTC,20,"",Single,"",,false,559281216,,Our Lady Of Nazareth Academy | Jordan | ,8,"installed the Play 99.6 Prize Application. You, too, can win really cool prizes http://apps.facebook.com/playprize/?from=1. This month's prize is a brand new BlackBerry smartphone. "
Zeina,Alsaber,2009-08-18 19:05:14 UTC,15,female,Single,"",,false,711546774,,Our Lady Of Nazareth Academy | Jordan | ,5,"installed the Play 99.6 Prize Application. You, too, can win really cool prizes http://apps.facebook.com/playprize/?from=1. This month's prize is a brand new BlackBerry smartphone. "
Zeina,Alsaber,2009-08-18 19:05:14 UTC,15,female,Single,"",,false,711546774,,Our Lady Of Nazareth Academy | Jordan | ,5,"installed the Play 99.6 Prize Application. You, too, can win really cool prizes http://apps.facebook.com/playprize/?from=1. This month's prize is a brand new BlackBerry smartphone. "
NAdia,Makdah,2009-08-18 19:25:27 UTC,15,female,"","",,false,716995416,,"",0,"installed the Play 99.6 Prize Application. You, too, can win really cool prizes http://apps.facebook.com/playprize/?from=1. This month's prize is a brand new BlackBerry smartphone. "
NAdia,Makdah,2009-08-18 19:25:27 UTC,15,female,"","",,false,716995416,,"",0,"installed the Play 99.6 Prize Application. You, too, can win really cool prizes http://apps.facebook.com/playprize/?from=1. This month's prize is a brand new BlackBerry smartphone. "
Jehad,Bukhari,2009-08-19 09:21:29 UTC,15,female,Single,Jordan//`Amman,,false,1182227626,,"Our Lady Of Nazareth Academy | Roanoke, VA | ",0,"installed the Play 99.6 Prize Application. You, too, can win really cool prizes http://apps.facebook.com/playprize/?from=12. This month's prize is a brand new BlackBerry smartphone. "
Jehad,Bukhari,2009-08-19 09:21:29 UTC,15,female,Single,Jordan//`Amman,,false,1182227626,,"Our Lady Of Nazareth Academy | Roanoke, VA | ",0,"installed the Play 99.6 Prize Application. You, too, can win really cool prizes http://apps.facebook.com/playprize/?from=12. This month's prize is a brand new BlackBerry smartphone. "
????,????? ???,2009-08-20 07:11:47 UTC,28,male,Married,"",,false,516054981,,MIT | Jordan | ,1,"has just installed the Play 99.6 Ultimate Prize Application to win a Blackberry Curve from Zain. You, too, could win: http://apps.facebook.com/playprize/?from=12."
????,????? ???,2009-08-20 07:11:47 UTC,28,male,Married,"",,false,516054981,,MIT | Jordan | ,1,"has just installed the Play 99.6 Ultimate Prize Application to win a Blackberry Curve from Zain. You, too, could win: http://apps.facebook.com/playprize/?from=12."
Jamil',ALmaadina,2009-08-20 07:26:37 UTC,,female,It's Complicated,"",,false,1830650936,,"",1,"has just installed the Play 99.6 Ultimate Prize Application to win a Blackberry Curve from Zain. You, too, could win: http://apps.facebook.com/playprize/?from=12."
Omar,Konsul,2009-08-24 08:35:02 UTC,23,"","","",,false,626945366,,Saudi Arabia | ,0,"installed the Play 99.6 Ultimate Prize Application to win a Blackberry Curve from Zain. You, too, could win: http://apps.facebook.com/playprize/?from=12."
Jamil',ALmaadina,2009-08-30 07:03:32 UTC,,female,It's Complicated,"",,false,1830650936,,"",0,"installed the Play 99.6 Ultimate Prize Application to win a Blackberry Curve from Zain. You, too, could win: http://apps.facebook.com/playprize/?from=12. (was updated after code mistake - this writing can see only admin)"
Pavel,Obod,2009-09-03 12:40:36 UTC,25,male,Single,Ukraine/Kharkivs'ka Oblast'/Kharkov,,false,1382916266,,Ukraine | ,0,"installed the Play 99.6 Ultimate Prize Application to win a Blackberry Curve from Zain. You, too, could win: http://apps.facebook.com/playprize/?from=12"
