%!PS-Adobe-3.0
%%Creator: cairo 1.4.12 (http://cairographics.org)
%%CreationDate: Sat Jun 28 16:51:33 2008
%%Pages: 1
%%BoundingBox: 0 0 100 100
%%DocumentData: Clean7Bit
%%LanguageLevel: 2
%%EndComments
%%BeginProlog
/C{curveto}bind def
/F{fill}bind def
/G{setgray}bind def
/L{lineto}bind def
/M{moveto}bind def
/P{closepath}bind def
/R{setrgbcolor}bind def
/S{show}bind def
/xS{xshow}bind def
/yS{yshow}bind def
/xyS{xyshow}bind def
%%EndProlog
% _cairo_ps_surface_emit_font_subsets
%%Page: 1 1
%%BeginPageSetup
%%PageBoundingBox: 0 0 100 100
gsave 0 100 translate 1.0 -1.0 scale 
%%EndPageSetup
% _cairo_ps_surface_stroke
0 0 1 R
gsave
50 50 moveto -15536 -15536 lineto [1 0 0 1 0 0] concat
2 setlinewidth
0 setlinecap
0 setlinejoin
10 setmiterlimit
stroke
grestore
% _cairo_ps_surface_stroke
0 1 0 R
gsave
50 50 moveto 15536 -15536 lineto [1 0 0 1 0 0] concat
2 setlinewidth
0 setlinecap
0 setlinejoin
10 setmiterlimit
stroke
grestore
% _cairo_ps_surface_stroke
1 0 0 R
gsave
50 50 moveto -15536 15536 lineto [1 0 0 1 0 0] concat
2 setlinewidth
0 setlinecap
0 setlinejoin
10 setmiterlimit
stroke
grestore
% _cairo_ps_surface_stroke
1 1 0 R
gsave
50 50 moveto 15536 15536 lineto [1 0 0 1 0 0] concat
2 setlinewidth
0 setlinecap
0 setlinejoin
10 setmiterlimit
stroke
grestore
grestore
showpage
%%Trailer
%%EOF
