set term tikz color solid
set output "adaptive.tex"
set nokey
set zrange [0:1]
set ztics 0,1,0.5
set xrange [-13:11]
set yrange [-10:3]
set isosample 30,30

f31(x,y) = (((5.18499994277954<x && x<7.31500005722046) && (-2.31500005722046<y && y<-0.184999942779541)) ? 0 : 1/0)
f30(x,y) = (((3.625<x && x<8.875) && (-6.375<y && y<-1.125)) ? 0 : 1/0)
f3neg1(x,y) = (((4.67999994754791<x && x<7.82000005245209) && (-7.82000005245209<y && y<-4.67999994754791)) ? 0 : 1/0)
f21(x,y) = (((-1.25<x && x<8.75) && (-6.25<y && y<3.75)) ? 0 : 1/0)
f20(x,y) = (((2.64999997615814<x && x<4.85000002384186) && (-4.85000002384186<y && y<-2.64999997615814)) ? 0 : 1/0)
f2neg1(x,y) = (((2.88499999046326<x && x<4.61500000953674) && (-7.11500000953674<y && y<-5.38499999046326)) ? 0 : 1/0)
f10(x,y) = (((-2.45499992370605<x && x<4.95499992370605) && (-7.45499992370605<y && y<-0.0450000762939453)) ? 0 : 1/0)
f00(x,y) = (((-3.39499998092651<x && x<0.894999980926514) && (-5.89499998092651<y && y<-1.60500001907349)) ? 0 : 1/0)
fneg41(x,y) = (((-12.3650000095367<x && x<-10.1349999904633) && (-2.36500000953674<y && y<-0.134999990463257)) ? 0 : 1/0)
fneg40(x,y) = (((-14.3650000095367<x && x<-8.13499999046326) && (-6.86500000953674<y && y<-0.634999990463257)) ? 0 : 1/0)
fneg4neg1(x,y) = (((-13.0549999475479<x && x<-9.44500005245209) && (-8.05499994754791<y && y<-4.44500005245209)) ? 0 : 1/0)
fneg31(x,y) = (((-12.7149999141693<x && x<-4.78500008583069) && (-5.21499991416931<y && y<2.71499991416931)) ? 0 : 1/0)
fneg30(x,y) = (((-9.09499999880791<x && x<-8.40500000119209) && (-4.09499999880791<y && y<-3.40500000119209)) ? 0 : 1/0)
fneg3neg1(x,y) = (((-11.4549999237061<x && x<-6.04500007629395) && (-8.95499992370605<y && y<-3.54500007629395)) ? 0  : 1/0)
fneg20(x,y) = (((-11.25<x && x<-1.25) && (-8.75<y && y<1.25)) ? 0 : 1/0)
fneg10(x,y) = (((-6.76500010490417<x && x<-0.734999895095825) && (-6.76500010490417<y && y<-0.734999895095825)) ? 0 : 1/0)
splot f31(x,y) notitle, \
      f30(x,y) notitle, \
      f3neg1(x,y) notitle, \
      f21(x,y) notitle, \
      f20(x,y) notitle, \
      f2neg1(x,y) notitle, \
      f10(x,y) notitle, \
      f00(x,y) notitle, \
      fneg41(x,y) notitle, \
      fneg40(x,y) notitle, \
      fneg4neg1(x,y) notitle, \
      fneg31(x,y) notitle, \
      fneg30(x,y) notitle, \
      fneg3neg1(x,y) notitle, \
      fneg20(x,y) notitle, \
      fneg10(x,y) notitle
