set term tikz color solid
set output "global-offset.tex"
set nokey
set isosample 20,20
set xrange[-5:5]
set yrange[-5:5]
set zrange [0:1]
set ztics 0,1,0.5

f31(x,y) = (((-5<x && x<5) && (-5<y && y<5)) ? 0 : 1/0)
f30(x,y) = (((-0.944999992847443<x && x<0.944999992847443) && (-0.944999992847443<y && y<0.944999992847443)) ? 0   : 1/0)
f3neg1(x,y) = (((-5<x && x<5) && (-5<y && y<5)) ? 0 : 1/0)
f20(x,y) = (((-5<x && x<5) && (-5<y && y<5)) ? 0 : 1/0)
f10(x,y) = (((-4.34000015258789<x && x<4.34000015258789) && (-4.34000015258789<y && y<4.34000015258789)) ? 0 : 1/0)
fneg41(x,y) = (((-5<x && x<5) && (-5<y && y<5)) ? 0 : 1/0)
fneg4neg1(x,y) = (((-5<x && x<5) && (-5<y && y<5)) ? 0 : 1/0)
fneg31(x,y) = (((-4.80000019073486<x && x<4.80000019073486) && (-4.80000019073486<y && y<4.80000019073486)) ? 0 : 1/0)
fneg30(x,y) = (((-5<x && x<5) && (-5<y && y<5)) ? 0 : 1/0)
fneg3neg1(x,y) = (((-4.34499979019165<x && x<4.34499979019165) && (-4.34499979019165<y && y<4.34499979019165)) ? 0 : 1/0)
fneg10(x,y) = (((-4.15000009536743<x && x<4.15000009536743) && (-4.15000009536743<y && y<4.15000009536743)) ? 0 : 1/0)
f31(x,y) = (((-5<x && x<5) && (-5<y && y<5)) ? 0 : 1/0)
f30(x,y) = (((-0.944999992847443<x && x<0.944999992847443) && (-0.944999992847443<y && y<0.944999992847443)) ? 0 : 1/0)
f3neg1(x,y) = (((-5<x && x<5) && (-5<y && y<5)) ? 0 : 1/0)
f20(x,y) = (((-5<x && x<5) && (-5<y && y<5)) ? 0 : 1/0)
f10(x,y) = (((-4.34000015258789<x && x<4.34000015258789) && (-4.34000015258789<y && y<4.34000015258789)) ? 0 : 1/0)
splot f31(x,y) notitle, \
        f30(x,y) notitle, \
        f3neg1(x,y) notitle, \
        f20(x,y) notitle, \
        f10(x,y) notitle, \
        fneg41(x,y) notitle, \
        fneg4neg1(x,y) notitle, \
        fneg31(x,y) notitle, \
        fneg30(x,y) notitle, \
        fneg3neg1(x,y) notitle, \
        fneg10(x,y) notitle, \
        f31(x,y) notitle, \
        f30(x,y) notitle, \
        f3neg1(x,y) notitle, \
        f20(x,y) notitle, \
        f10(x,y) notitle
