%!PS-Adobe-3.0 EPSF-3.0
%%Title: graph/solution/11.eps
%%Creator: matplotlib version 0.99.0, http://matplotlib.sourceforge.net/
%%CreationDate: Mon Dec 21 22:36:02 2009
%%Orientation: portrait
%%BoundingBox: -166 216 778 576
%%EndComments
%%BeginProlog
/mpldict 8 dict def
mpldict begin
/m { moveto } bind def
/l { lineto } bind def
/r { rlineto } bind def
/c { curveto } bind def
/cl { closepath } bind def
/box {
m
1 index 0 r
0 exch r
neg 0 r
cl
} bind def
/clipbox {
box
clip
newpath
} bind def
%!PS-Adobe-3.0 Resource-Font
%%Title: Bitstream Vera Sans
%%Copyright: Copyright (c) 2003 by Bitstream, Inc. All Rights Reserved.
%%Creator: Converted from TrueType by PPR
25 dict begin
/_d{bind def}bind def
/_m{moveto}_d
/_l{lineto}_d
/_cl{closepath eofill}_d
/_c{curveto}_d
/_sc{7 -1 roll{setcachedevice}{pop pop pop pop pop pop}ifelse}_d
/_e{exec}_d
/FontName /BitstreamVeraSans-Roman def
/PaintType 0 def
/FontMatrix[.001 0 0 .001 0 0]def
/FontBBox[-182 -235 1287 928]def
/FontType 3 def
/Encoding StandardEncoding def
/FontInfo 10 dict dup begin
/FamilyName (Bitstream Vera Sans) def
/FullName (Bitstream Vera Sans) def
/Notice (Copyright (c) 2003 by Bitstream, Inc. All Rights Reserved. Bitstream Vera is a trademark of Bitstream, Inc.) def
/Weight (Roman) def
/Version (Release 1.10) def
/ItalicAngle 0.0 def
/isFixedPitch false def
/UnderlinePosition -213 def
/UnderlineThickness 143 def
end readonly def
/CharStrings 25 dict dup begin
/space{318 0 0 0 0 0 _sc
}_d
/period{318 0 107 0 210 124 _sc
107 124 _m
210 124 _l
210 0 _l
107 0 _l
107 124 _l
_cl}_d
/zero{636 0 66 -13 570 742 _sc
318 664 _m
267 664 229 639 203 589 _c
177 539 165 464 165 364 _c
165 264 177 189 203 139 _c
229 89 267 64 318 64 _c
369 64 407 89 433 139 _c
458 189 471 264 471 364 _c
471 464 458 539 433 589 _c
407 639 369 664 318 664 _c
318 742 _m
399 742 461 709 505 645 _c
548 580 570 486 570 364 _c
570 241 548 147 505 83 _c
461 19 399 -13 318 -13 _c
236 -13 173 19 130 83 _c
87 147 66 241 66 364 _c
66 486 87 580 130 645 _c
173 709 236 742 318 742 _c
_cl}_d
/one{636 0 110 0 544 729 _sc
124 83 _m
285 83 _l
285 639 _l
110 604 _l
110 694 _l
284 729 _l
383 729 _l
383 83 _l
544 83 _l
544 0 _l
124 0 _l
124 83 _l
_cl}_d
/two{{636 0 73 0 536 742 _sc
192 83 _m
536 83 _l
536 0 _l
73 0 _l
73 83 _l
110 121 161 173 226 239 _c
290 304 331 346 348 365 _c
380 400 402 430 414 455 _c
426 479 433 504 433 528 _c
433 566 419 598 392 622 _c
365 646 330 659 286 659 _c
255 659 222 653 188 643 _c
154 632 117 616 78 594 _c
78 694 _l
118 710 155 722 189 730 _c
223 738 255 742 284 742 _c
359 742 419 723 464 685 _c
509 647 532 597 532 534 _c
532 504 526 475 515 449 _c
504 422 484 390 454 354 _c
446 344 420 317 376 272 _c
332 227 271 164 192 83 _c
_cl}_e}_d
/three{{636 0 76 -13 556 742 _sc
406 393 _m
453 383 490 362 516 330 _c
542 298 556 258 556 212 _c
556 140 531 84 482 45 _c
432 6 362 -13 271 -13 _c
240 -13 208 -10 176 -4 _c
144 1 110 10 76 22 _c
76 117 _l
103 101 133 89 166 81 _c
198 73 232 69 268 69 _c
330 69 377 81 409 105 _c
441 129 458 165 458 212 _c
458 254 443 288 413 312 _c
383 336 341 349 287 349 _c
202 349 _l
202 430 _l
291 430 _l
339 430 376 439 402 459 _c
428 478 441 506 441 543 _c
441 580 427 609 401 629 _c
374 649 336 659 287 659 _c
260 659 231 656 200 650 _c
169 644 135 635 98 623 _c
98 711 _l
135 721 170 729 203 734 _c
235 739 266 742 296 742 _c
}_e{370 742 429 725 473 691 _c
517 657 539 611 539 553 _c
539 513 527 479 504 451 _c
481 423 448 403 406 393 _c
_cl}_e}_d
/five{{636 0 77 -13 549 729 _sc
108 729 _m
495 729 _l
495 646 _l
198 646 _l
198 467 _l
212 472 227 476 241 478 _c
255 480 270 482 284 482 _c
365 482 429 459 477 415 _c
525 370 549 310 549 234 _c
549 155 524 94 475 51 _c
426 8 357 -13 269 -13 _c
238 -13 207 -10 175 -6 _c
143 -1 111 6 77 17 _c
77 116 _l
106 100 136 88 168 80 _c
199 72 232 69 267 69 _c
323 69 368 83 401 113 _c
433 143 450 183 450 234 _c
450 284 433 324 401 354 _c
368 384 323 399 267 399 _c
241 399 214 396 188 390 _c
162 384 135 375 108 363 _c
108 729 _l
_cl}_e}_d
/A{684 0 8 0 676 729 _sc
342 632 _m
208 269 _l
476 269 _l
342 632 _l
286 729 _m
398 729 _l
676 0 _l
573 0 _l
507 187 _l
178 187 _l
112 0 _l
8 0 _l
286 729 _l
_cl}_d
/E{632 0 98 0 568 729 _sc
98 729 _m
559 729 _l
559 646 _l
197 646 _l
197 430 _l
544 430 _l
544 347 _l
197 347 _l
197 83 _l
568 83 _l
568 0 _l
98 0 _l
98 729 _l
_cl}_d
/I{295 0 98 0 197 729 _sc
98 729 _m
197 729 _l
197 0 _l
98 0 _l
98 729 _l
_cl}_d
/a{{613 0 60 -13 522 560 _sc
343 275 _m
270 275 220 266 192 250 _c
164 233 150 205 150 165 _c
150 133 160 107 181 89 _c
202 70 231 61 267 61 _c
317 61 357 78 387 114 _c
417 149 432 196 432 255 _c
432 275 _l
343 275 _l
522 312 _m
522 0 _l
432 0 _l
432 83 _l
411 49 385 25 355 10 _c
325 -5 287 -13 243 -13 _c
187 -13 142 2 109 33 _c
76 64 60 106 60 159 _c
60 220 80 266 122 298 _c
163 329 224 345 306 345 _c
432 345 _l
432 354 _l
432 395 418 427 391 450 _c
364 472 326 484 277 484 _c
245 484 215 480 185 472 _c
155 464 127 453 100 439 _c
100 522 _l
}_e{132 534 164 544 195 550 _c
226 556 256 560 286 560 _c
365 560 424 539 463 498 _c
502 457 522 395 522 312 _c
_cl}_e}_d
/c{{550 0 55 -13 488 560 _sc
488 526 _m
488 442 _l
462 456 437 466 411 473 _c
385 480 360 484 334 484 _c
276 484 230 465 198 428 _c
166 391 150 339 150 273 _c
150 206 166 154 198 117 _c
230 80 276 62 334 62 _c
360 62 385 65 411 72 _c
437 79 462 90 488 104 _c
488 21 _l
462 9 436 0 410 -5 _c
383 -10 354 -13 324 -13 _c
242 -13 176 12 128 64 _c
79 115 55 185 55 273 _c
55 362 79 432 128 483 _c
177 534 244 560 330 560 _c
358 560 385 557 411 551 _c
437 545 463 537 488 526 _c
_cl}_e}_d
/e{{615 0 55 -13 562 560 _sc
562 296 _m
562 252 _l
149 252 _l
153 190 171 142 205 110 _c
238 78 284 62 344 62 _c
378 62 412 66 444 74 _c
476 82 509 95 541 113 _c
541 28 _l
509 14 476 3 442 -3 _c
408 -9 373 -13 339 -13 _c
251 -13 182 12 131 62 _c
80 112 55 181 55 268 _c
55 357 79 428 127 481 _c
175 533 241 560 323 560 _c
397 560 455 536 498 489 _c
540 441 562 377 562 296 _c
472 322 _m
471 371 457 410 431 440 _c
404 469 368 484 324 484 _c
274 484 234 469 204 441 _c
174 413 156 373 152 322 _c
472 322 _l
_cl}_e}_d
/h{634 0 91 0 549 760 _sc
549 330 _m
549 0 _l
459 0 _l
459 327 _l
459 379 448 417 428 443 _c
408 469 378 482 338 482 _c
289 482 251 466 223 435 _c
195 404 181 362 181 309 _c
181 0 _l
91 0 _l
91 760 _l
181 760 _l
181 462 _l
202 494 227 519 257 535 _c
286 551 320 560 358 560 _c
420 560 468 540 500 501 _c
532 462 549 405 549 330 _c
_cl}_d
/i{278 0 94 0 184 760 _sc
94 547 _m
184 547 _l
184 0 _l
94 0 _l
94 547 _l
94 760 _m
184 760 _l
184 646 _l
94 646 _l
94 760 _l
_cl}_d
/l{278 0 94 0 184 760 _sc
94 760 _m
184 760 _l
184 0 _l
94 0 _l
94 760 _l
_cl}_d
/m{{974 0 91 0 889 560 _sc
520 442 _m
542 482 569 511 600 531 _c
631 550 668 560 711 560 _c
767 560 811 540 842 500 _c
873 460 889 403 889 330 _c
889 0 _l
799 0 _l
799 327 _l
799 379 789 418 771 444 _c
752 469 724 482 686 482 _c
639 482 602 466 575 435 _c
548 404 535 362 535 309 _c
535 0 _l
445 0 _l
445 327 _l
445 379 435 418 417 444 _c
398 469 369 482 331 482 _c
285 482 248 466 221 435 _c
194 404 181 362 181 309 _c
181 0 _l
91 0 _l
91 547 _l
181 547 _l
181 462 _l
201 495 226 520 255 536 _c
283 552 317 560 357 560 _c
397 560 430 550 458 530 _c
486 510 506 480 520 442 _c
}_e{_cl}_e}_d
/n{634 0 91 0 549 560 _sc
549 330 _m
549 0 _l
459 0 _l
459 327 _l
459 379 448 417 428 443 _c
408 469 378 482 338 482 _c
289 482 251 466 223 435 _c
195 404 181 362 181 309 _c
181 0 _l
91 0 _l
91 547 _l
181 547 _l
181 462 _l
202 494 227 519 257 535 _c
286 551 320 560 358 560 _c
420 560 468 540 500 501 _c
532 462 549 405 549 330 _c
_cl}_d
/p{{635 0 91 -207 580 560 _sc
181 82 _m
181 -207 _l
91 -207 _l
91 547 _l
181 547 _l
181 464 _l
199 496 223 520 252 536 _c
281 552 316 560 356 560 _c
422 560 476 533 518 481 _c
559 428 580 359 580 273 _c
580 187 559 117 518 65 _c
476 13 422 -13 356 -13 _c
316 -13 281 -5 252 10 _c
223 25 199 49 181 82 _c
487 273 _m
487 339 473 390 446 428 _c
418 466 381 485 334 485 _c
286 485 249 466 222 428 _c
194 390 181 339 181 273 _c
181 207 194 155 222 117 _c
249 79 286 61 334 61 _c
381 61 418 79 446 117 _c
473 155 487 207 487 273 _c
_cl}_e}_d
/s{{521 0 54 -13 472 560 _sc
443 531 _m
443 446 _l
417 458 391 468 364 475 _c
336 481 308 485 279 485 _c
234 485 200 478 178 464 _c
156 450 145 430 145 403 _c
145 382 153 366 169 354 _c
185 342 217 330 265 320 _c
296 313 _l
360 299 405 279 432 255 _c
458 230 472 195 472 151 _c
472 100 452 60 412 31 _c
372 1 316 -13 246 -13 _c
216 -13 186 -10 154 -5 _c
122 0 89 8 54 20 _c
54 113 _l
87 95 120 82 152 74 _c
184 65 216 61 248 61 _c
290 61 323 68 346 82 _c
368 96 380 117 380 144 _c
380 168 371 187 355 200 _c
339 213 303 226 247 238 _c
216 245 _l
160 257 119 275 95 299 _c
70 323 58 356 58 399 _c
58 450 76 490 112 518 _c
148 546 200 560 268 560 _c
}_e{301 560 332 557 362 552 _c
391 547 418 540 443 531 _c
_cl}_e}_d
/t{392 0 27 0 368 702 _sc
183 702 _m
183 547 _l
368 547 _l
368 477 _l
183 477 _l
183 180 _l
183 135 189 106 201 94 _c
213 81 238 75 276 75 _c
368 75 _l
368 0 _l
276 0 _l
206 0 158 13 132 39 _c
106 65 93 112 93 180 _c
93 477 _l
27 477 _l
27 547 _l
93 547 _l
93 702 _l
183 702 _l
_cl}_d
/x{592 0 29 0 559 547 _sc
549 547 _m
351 281 _l
559 0 _l
453 0 _l
294 215 _l
135 0 _l
29 0 _l
241 286 _l
47 547 _l
153 547 _l
298 352 _l
443 547 _l
549 547 _l
_cl}_d
/y{592 0 30 -207 562 547 _sc
322 -50 _m
296 -114 271 -157 247 -177 _c
223 -197 191 -207 151 -207 _c
79 -207 _l
79 -132 _l
132 -132 _l
156 -132 175 -126 189 -114 _c
203 -102 218 -75 235 -31 _c
251 9 _l
30 547 _l
125 547 _l
296 119 _l
467 547 _l
562 547 _l
322 -50 _l
_cl}_d
/z{525 0 43 0 482 547 _sc
55 547 _m
482 547 _l
482 465 _l
144 72 _l
482 72 _l
482 0 _l
43 0 _l
43 82 _l
381 475 _l
55 475 _l
55 547 _l
_cl}_d
/minus{838 0 106 272 732 355 _sc
106 355 _m
732 355 _l
732 272 _l
106 272 _l
106 355 _l
_cl}_d
end readonly def

/BuildGlyph
 {exch begin
 CharStrings exch
 2 copy known not{pop /.notdef}if
 true 3 1 roll get exec
 end}_d

/BuildChar {
 1 index /Encoding get exch get
 1 index /BuildGlyph get exec
}_d

FontName currentdict end definefont pop
end
%%EndProlog
mpldict begin
-166.32 216 translate
944.64 360 0 0 clipbox
1.000 setlinewidth
1 setlinejoin
2 setlinecap
[] 0 setdash
1.000 setgray
gsave
0 0 m
944.64 0 l
944.64 360 l
0 360 l
0 0 l
gsave
fill
grestore
stroke
grestore
gsave
94.464 36 m
850.176 36 l
850.176 324 l
94.464 324 l
94.464 36 l
fill
grestore
1.000 0.000 0.000 setrgbcolor
gsave
755.7 288 94.46 36 clipbox
94.464 180 m
98.2426 165.762 l
102.021 152.915 l
105.8 142.712 l
109.578 136.151 l
113.357 133.873 l
117.135 136.1 l
120.914 142.614 l
124.692 152.781 l
128.471 165.607 l
136.028 194.091 l
139.807 206.969 l
143.585 217.215 l
147.364 223.831 l
151.142 226.17 l
154.921 224.003 l
158.7 217.543 l
162.478 207.421 l
166.257 194.626 l
177.592 153.252 l
181.371 142.97 l
185.149 136.308 l
188.928 133.918 l
192.707 136.033 l
196.485 142.446 l
200.264 152.532 l
204.042 165.306 l
215.378 206.716 l
219.156 217.042 l
222.935 223.758 l
226.714 226.208 l
230.492 224.154 l
234.271 217.795 l
238.049 207.754 l
241.828 195.011 l
253.164 153.589 l
256.942 143.228 l
260.721 136.466 l
264.499 133.964 l
268.278 135.967 l
272.056 142.278 l
275.835 152.282 l
279.613 165.003 l
290.949 206.459 l
294.728 216.864 l
298.506 223.68 l
302.285 226.241 l
306.063 224.299 l
309.842 218.042 l
313.62 208.082 l
317.399 195.392 l
328.735 153.925 l
332.513 143.485 l
336.292 136.623 l
340.07 134.009 l
343.849 135.899 l
347.628 142.108 l
351.406 152.03 l
355.185 164.697 l
366.52 206.196 l
370.299 216.678 l
374.077 223.593 l
377.856 226.266 l
381.635 224.435 l
385.413 218.281 l
389.192 208.403 l
392.97 195.766 l
404.306 154.255 l
408.084 143.737 l
411.863 136.775 l
415.642 134.05 l
419.42 135.827 l
423.199 141.933 l
426.977 151.772 l
430.756 164.383 l
442.092 205.922 l
445.87 216.481 l
449.649 223.495 l
453.427 226.278 l
457.206 224.559 l
460.984 218.507 l
464.763 208.71 l
468.541 196.131 l
472.32 181.695 l
476.099 153.68 l
479.877 128.475 l
483.656 108.83 l
487.434 96.6498 l
491.213 93.1132 l
494.991 98.5544 l
498.77 112.432 l
502.548 133.381 l
506.327 159.345 l
513.884 215.899 l
517.663 240.947 l
521.441 260.469 l
525.22 272.549 l
528.998 276 l
532.777 270.475 l
536.556 256.505 l
540.334 235.446 l
544.113 209.345 l
551.67 152.426 l
555.448 127.15 l
559.227 107.374 l
563.005 95.0238 l
566.784 91.2965 l
570.563 96.549 l
574.341 110.261 l
578.12 131.087 l
581.898 156.987 l
589.455 213.615 l
593.234 238.801 l
597.012 258.516 l
600.791 270.83 l
604.57 274.532 l
608.348 269.256 l
612.127 255.511 l
615.905 234.633 l
619.684 208.655 l
627.241 151.773 l
631.02 126.412 l
634.798 106.496 l
638.577 93.965 l
642.355 90.0362 l
646.134 95.0886 l
649.912 108.624 l
653.691 129.315 l
657.469 155.138 l
665.027 211.816 l
668.805 237.129 l
672.584 257.026 l
676.362 269.561 l
680.141 273.505 l
683.919 268.469 l
687.698 254.94 l
691.476 234.236 l
695.255 208.372 l
702.812 151.513 l
706.591 126.061 l
710.369 105.998 l
714.148 93.2776 l
717.926 89.1391 l
721.705 93.9827 l
725.484 107.332 l
729.262 127.879 l
733.041 153.615 l
740.598 210.324 l
744.376 235.754 l
748.155 255.825 l
751.933 268.573 l
755.712 272.752 l
759.491 267.949 l
763.269 254.629 l
767.048 234.092 l
770.826 208.338 l
778.383 151.491 l
782.162 125.942 l
785.94 105.725 l
789.719 92.8105 l
793.498 88.4559 l
797.276 93.0838 l
801.055 106.239 l
804.833 126.635 l
808.612 152.276 l
816.169 209 l
819.948 234.539 l
823.726 254.776 l
827.505 267.731 l
831.283 272.137 l
835.062 267.561 l
838.84 254.446 l
842.619 234.071 l
846.397 208.422 l
850.176 180 l
850.176 180 l
stroke
grestore
0.000 0.502 0.000 setrgbcolor
gsave
755.7 288 94.46 36 clipbox
94.464 179.565 m
98.2426 165.315 l
102.021 152.552 l
105.8 142.526 l
109.578 136.214 l
113.357 134.227 l
117.135 136.747 l
120.914 143.514 l
124.692 153.849 l
128.471 166.726 l
136.028 194.895 l
139.807 207.414 l
143.585 217.205 l
147.364 223.313 l
151.142 225.15 l
154.921 222.548 l
158.7 215.776 l
162.478 205.512 l
166.257 192.778 l
173.814 165.047 l
177.592 152.782 l
181.371 143.235 l
185.149 137.339 l
188.928 135.661 l
192.707 138.356 l
196.485 145.144 l
200.264 155.347 l
207.821 181.713 l
211.599 195.274 l
215.378 207.303 l
219.156 216.622 l
222.935 222.324 l
226.714 223.859 l
230.492 221.089 l
234.271 214.3 l
238.049 204.171 l
245.606 178.144 l
249.385 164.816 l
253.164 153.034 l
256.942 143.951 l
260.721 138.453 l
264.499 137.069 l
268.278 139.924 l
272.056 146.725 l
275.835 156.792 l
283.392 182.506 l
287.171 195.616 l
290.949 207.168 l
294.728 216.032 l
298.506 221.344 l
302.285 222.592 l
306.063 219.668 l
309.842 212.87 l
313.62 202.88 l
321.178 177.502 l
324.956 164.619 l
328.735 153.306 l
332.513 144.671 l
336.292 139.554 l
340.07 138.449 l
343.849 141.452 l
347.628 148.257 l
351.406 158.182 l
358.963 183.25 l
362.742 195.92 l
366.52 207.009 l
370.299 215.432 l
374.077 220.369 l
377.856 221.346 l
381.635 218.279 l
385.413 211.482 l
389.192 201.634 l
396.749 176.897 l
400.527 164.449 l
404.306 153.591 l
408.084 145.386 l
411.863 140.632 l
415.642 139.783 l
419.42 142.911 l
423.199 149.69 l
426.977 159.436 l
434.534 183.722 l
438.313 195.824 l
442.092 206.254 l
445.87 213.94 l
449.649 218.068 l
453.427 218.151 l
457.206 214.079 l
460.984 206.129 l
464.763 194.935 l
472.32 166.811 l
476.099 152.345 l
479.877 139.369 l
483.656 129.13 l
487.434 122.7 l
491.213 120.88 l
494.991 124.128 l
498.77 132.487 l
502.548 145.547 l
506.327 162.426 l
517.663 221.057 l
521.441 237.073 l
525.22 248.279 l
528.998 253.36 l
532.777 251.633 l
536.556 243.173 l
540.334 228.819 l
544.113 210.071 l
555.448 147.837 l
559.227 131.958 l
563.005 121.26 l
566.784 116.701 l
570.563 118.682 l
574.341 127.014 l
578.12 140.908 l
581.898 159.021 l
593.234 219.634 l
597.012 235.136 l
600.791 245.45 l
604.57 249.576 l
608.348 247.12 l
612.127 238.314 l
615.905 224.002 l
619.684 205.567 l
631.02 144.554 l
634.798 129.009 l
638.577 118.664 l
642.355 114.52 l
646.134 116.976 l
649.912 125.793 l
653.691 140.104 l
657.469 158.497 l
668.805 219.087 l
672.584 234.44 l
676.362 244.584 l
680.141 248.517 l
683.919 245.847 l
687.698 236.838 l
691.476 222.375 l
695.255 203.879 l
706.591 143.232 l
710.369 127.933 l
714.148 117.868 l
717.926 114.022 l
721.705 116.766 l
725.484 125.827 l
729.262 140.31 l
733.041 158.786 l
744.376 219.093 l
748.155 234.2 l
751.933 244.05 l
755.712 247.672 l
759.491 244.706 l
763.269 235.443 l
767.048 220.791 l
770.826 202.186 l
782.162 141.765 l
785.94 126.701 l
789.719 116.92 l
793.498 113.38 l
797.276 116.426 l
801.055 125.753 l
804.833 140.444 l
808.612 159.049 l
816.169 200.473 l
819.948 219.213 l
823.726 234.115 l
827.505 243.709 l
831.283 247.053 l
835.062 243.813 l
838.84 234.308 l
842.619 219.469 l
846.397 200.754 l
850.176 180 l
850.176 180 l
stroke
grestore
0.500 setlinewidth
0 setlinecap
[1 3] 0 setdash
0.000 setgray
gsave
755.7 288 94.46 36 clipbox
94.464 36 m
94.464 324 l
stroke
grestore
[] 0 setdash
gsave
/o {
gsave
newpath
translate
0 0 m
0 4 l
stroke
grestore
} bind def
94.464 36 o
grestore
gsave
/o {
gsave
newpath
translate
0 0 m
0 -4 l
stroke
grestore
} bind def
94.464 324 o
grestore
/BitstreamVeraSans-Roman findfont
12.000 scalefont
setfont
gsave
66.612437 22.921875 translate
0.000000 rotate
0.000000 0.171875 m /zero glyphshow
7.634766 0.171875 m /period glyphshow
11.449219 0.171875 m /zero glyphshow
19.083984 0.171875 m /zero glyphshow
26.718750 0.171875 m /zero glyphshow
34.353516 0.171875 m /zero glyphshow
41.988281 0.171875 m /zero glyphshow
49.623047 0.171875 m /zero glyphshow
grestore
[1 3] 0 setdash
gsave
755.7 288 94.46 36 clipbox
283.392 36 m
283.392 324 l
stroke
grestore
[] 0 setdash
gsave
/o {
gsave
newpath
translate
0 0 m
0 4 l
stroke
grestore
} bind def
283.392 36 o
grestore
gsave
/o {
gsave
newpath
translate
0 0 m
0 -4 l
stroke
grestore
} bind def
283.392 324 o
grestore
gsave
255.665437 22.921875 translate
0.000000 rotate
0.000000 0.171875 m /zero glyphshow
7.634766 0.171875 m /period glyphshow
11.449219 0.171875 m /zero glyphshow
19.083984 0.171875 m /zero glyphshow
26.718750 0.171875 m /zero glyphshow
34.353516 0.171875 m /zero glyphshow
41.988281 0.171875 m /zero glyphshow
49.623047 0.171875 m /five glyphshow
grestore
[1 3] 0 setdash
gsave
755.7 288 94.46 36 clipbox
472.32 36 m
472.32 324 l
stroke
grestore
[] 0 setdash
gsave
/o {
gsave
newpath
translate
0 0 m
0 4 l
stroke
grestore
} bind def
472.32 36 o
grestore
gsave
/o {
gsave
newpath
translate
0 0 m
0 -4 l
stroke
grestore
} bind def
472.32 324 o
grestore
gsave
444.468437 22.921875 translate
0.000000 rotate
0.000000 0.171875 m /zero glyphshow
7.634766 0.171875 m /period glyphshow
11.449219 0.171875 m /zero glyphshow
19.083984 0.171875 m /zero glyphshow
26.718750 0.171875 m /zero glyphshow
34.353516 0.171875 m /zero glyphshow
41.988281 0.171875 m /one glyphshow
49.623047 0.171875 m /zero glyphshow
grestore
[1 3] 0 setdash
gsave
755.7 288 94.46 36 clipbox
661.248 36 m
661.248 324 l
stroke
grestore
[] 0 setdash
gsave
/o {
gsave
newpath
translate
0 0 m
0 4 l
stroke
grestore
} bind def
661.248 36 o
grestore
gsave
/o {
gsave
newpath
translate
0 0 m
0 -4 l
stroke
grestore
} bind def
661.248 324 o
grestore
gsave
633.521437 22.921875 translate
0.000000 rotate
0.000000 0.171875 m /zero glyphshow
7.634766 0.171875 m /period glyphshow
11.449219 0.171875 m /zero glyphshow
19.083984 0.171875 m /zero glyphshow
26.718750 0.171875 m /zero glyphshow
34.353516 0.171875 m /zero glyphshow
41.988281 0.171875 m /one glyphshow
49.623047 0.171875 m /five glyphshow
grestore
[1 3] 0 setdash
gsave
755.7 288 94.46 36 clipbox
850.176 36 m
850.176 324 l
stroke
grestore
[] 0 setdash
gsave
/o {
gsave
newpath
translate
0 0 m
0 4 l
stroke
grestore
} bind def
850.176 36 o
grestore
gsave
/o {
gsave
newpath
translate
0 0 m
0 -4 l
stroke
grestore
} bind def
850.176 324 o
grestore
gsave
822.324437 22.921875 translate
0.000000 rotate
0.000000 0.171875 m /zero glyphshow
7.634766 0.171875 m /period glyphshow
11.449219 0.171875 m /zero glyphshow
19.083984 0.171875 m /zero glyphshow
26.718750 0.171875 m /zero glyphshow
34.353516 0.171875 m /zero glyphshow
41.988281 0.171875 m /two glyphshow
49.623047 0.171875 m /zero glyphshow
grestore
469.687 11.359 m
(z) show
[1 3] 0 setdash
gsave
755.7 288 94.46 36 clipbox
94.464 41.5865 m
850.176 41.5865 l
stroke
grestore
[] 0 setdash
gsave
/o {
gsave
newpath
translate
0 0 m
4 0 l
stroke
grestore
} bind def
94.464 41.5865 o
grestore
gsave
/o {
gsave
newpath
translate
0 0 m
-4 0 l
stroke
grestore
} bind def
850.176 41.5865 o
grestore
gsave
74.995250 37.047421 translate
0.000000 rotate
0.000000 0.171875 m /minus glyphshow
10.054688 0.171875 m /three glyphshow
grestore
[1 3] 0 setdash
gsave
755.7 288 94.46 36 clipbox
94.464 87.7243 m
850.176 87.7243 l
stroke
grestore
[] 0 setdash
gsave
/o {
gsave
newpath
translate
0 0 m
4 0 l
stroke
grestore
} bind def
94.464 87.7243 o
grestore
gsave
/o {
gsave
newpath
translate
0 0 m
-4 0 l
stroke
grestore
} bind def
850.176 87.7243 o
grestore
gsave
75.229625 83.271197 translate
0.000000 rotate
0.000000 0.000000 m /minus glyphshow
10.054688 0.000000 m /two glyphshow
grestore
[1 3] 0 setdash
gsave
755.7 288 94.46 36 clipbox
94.464 133.862 m
850.176 133.862 l
stroke
grestore
[] 0 setdash
gsave
/o {
gsave
newpath
translate
0 0 m
4 0 l
stroke
grestore
} bind def
94.464 133.862 o
grestore
gsave
/o {
gsave
newpath
translate
0 0 m
-4 0 l
stroke
grestore
} bind def
850.176 133.862 o
grestore
gsave
75.135875 129.487161 translate
0.000000 rotate
0.000000 0.000000 m /minus glyphshow
10.054688 0.000000 m /one glyphshow
grestore
[1 3] 0 setdash
gsave
755.7 288 94.46 36 clipbox
94.464 180 m
850.176 180 l
stroke
grestore
[] 0 setdash
gsave
/o {
gsave
newpath
translate
0 0 m
4 0 l
stroke
grestore
} bind def
94.464 180 o
grestore
gsave
/o {
gsave
newpath
translate
0 0 m
-4 0 l
stroke
grestore
} bind def
850.176 180 o
grestore
gsave
84.417125 175.460938 translate
0.000000 rotate
0.000000 0.171875 m /zero glyphshow
grestore
[1 3] 0 setdash
gsave
755.7 288 94.46 36 clipbox
94.464 226.138 m
850.176 226.138 l
stroke
grestore
[] 0 setdash
gsave
/o {
gsave
newpath
translate
0 0 m
4 0 l
stroke
grestore
} bind def
94.464 226.138 o
grestore
gsave
/o {
gsave
newpath
translate
0 0 m
-4 0 l
stroke
grestore
} bind def
850.176 226.138 o
grestore
gsave
85.245250 221.762839 translate
0.000000 rotate
0.000000 0.000000 m /one glyphshow
grestore
[1 3] 0 setdash
gsave
755.7 288 94.46 36 clipbox
94.464 272.276 m
850.176 272.276 l
stroke
grestore
[] 0 setdash
gsave
/o {
gsave
newpath
translate
0 0 m
4 0 l
stroke
grestore
} bind def
94.464 272.276 o
grestore
gsave
/o {
gsave
newpath
translate
0 0 m
-4 0 l
stroke
grestore
} bind def
850.176 272.276 o
grestore
gsave
84.901500 267.822553 translate
0.000000 rotate
0.000000 0.000000 m /two glyphshow
grestore
[1 3] 0 setdash
gsave
755.7 288 94.46 36 clipbox
94.464 318.414 m
850.176 318.414 l
stroke
grestore
[] 0 setdash
gsave
/o {
gsave
newpath
translate
0 0 m
4 0 l
stroke
grestore
} bind def
94.464 318.414 o
grestore
gsave
/o {
gsave
newpath
translate
0 0 m
-4 0 l
stroke
grestore
} bind def
850.176 318.414 o
grestore
gsave
84.714000 313.874454 translate
0.000000 rotate
0.000000 0.171875 m /three glyphshow
grestore
69.995 173.445 m
gsave
90 rotate
(Ex) show
grestore
1.000 setlinewidth
2 setlinecap
gsave
94.464 324 m
850.176 324 l
stroke
grestore
gsave
850.176 36 m
850.176 324 l
stroke
grestore
gsave
94.464 36 m
850.176 36 l
stroke
grestore
gsave
94.464 36 m
94.464 324 l
stroke
grestore
gsave
320.809 329.173 m
623.831 329.173 l
623.831 354.24 l
320.809 354.24 l
320.809 329.173 l
cl
gsave
1.000 setgray
fill
grestore
stroke
grestore
1.000 0.000 0.000 setrgbcolor
gsave
330.889 342.879 m
351.049 342.879 l
stroke
grestore
0.000 setgray
/BitstreamVeraSans-Roman findfont
14.400 scalefont
setfont
366.889 334.933 m
0 2.906 rmoveto
(Analytical) show
0.000 0.502 0.000 setrgbcolor
gsave
469.165 342.879 m
489.325 342.879 l
stroke
grestore
0.000 setgray
505.165 334.933 m
0 2.906 rmoveto
(Implicit scheme) show

end
showpage
