%!PS-Adobe-3.0 EPSF-3.0
%%Title: /home/muha/src/python/project/14.eps
%%Creator: matplotlib version 0.99.0, http://matplotlib.sourceforge.net/
%%CreationDate: Sun Dec 27 14:58:38 2009
%%Orientation: portrait
%%BoundingBox: -166 216 778 576
%%EndComments
%%BeginProlog
/mpldict 8 dict def
mpldict begin
/m { moveto } bind def
/l { lineto } bind def
/r { rlineto } bind def
/c { curveto } bind def
/cl { closepath } bind def
/box {
m
1 index 0 r
0 exch r
neg 0 r
cl
} bind def
/clipbox {
box
clip
newpath
} bind def
%!PS-Adobe-3.0 Resource-Font
%%Title: Bitstream Vera Sans
%%Copyright: Copyright (c) 2003 by Bitstream, Inc. All Rights Reserved.
%%Creator: Converted from TrueType by PPR
25 dict begin
/_d{bind def}bind def
/_m{moveto}_d
/_l{lineto}_d
/_cl{closepath eofill}_d
/_c{curveto}_d
/_sc{7 -1 roll{setcachedevice}{pop pop pop pop pop pop}ifelse}_d
/_e{exec}_d
/FontName /BitstreamVeraSans-Roman def
/PaintType 0 def
/FontMatrix[.001 0 0 .001 0 0]def
/FontBBox[-182 -235 1287 928]def
/FontType 3 def
/Encoding StandardEncoding def
/FontInfo 10 dict dup begin
/FamilyName (Bitstream Vera Sans) def
/FullName (Bitstream Vera Sans) def
/Notice (Copyright (c) 2003 by Bitstream, Inc. All Rights Reserved. Bitstream Vera is a trademark of Bitstream, Inc.) def
/Weight (Roman) def
/Version (Release 1.10) def
/ItalicAngle 0.0 def
/isFixedPitch false def
/UnderlinePosition -213 def
/UnderlineThickness 143 def
end readonly def
/CharStrings 24 dict dup begin
/space{318 0 0 0 0 0 _sc
}_d
/period{318 0 107 0 210 124 _sc
107 124 _m
210 124 _l
210 0 _l
107 0 _l
107 124 _l
_cl}_d
/zero{636 0 66 -13 570 742 _sc
318 664 _m
267 664 229 639 203 589 _c
177 539 165 464 165 364 _c
165 264 177 189 203 139 _c
229 89 267 64 318 64 _c
369 64 407 89 433 139 _c
458 189 471 264 471 364 _c
471 464 458 539 433 589 _c
407 639 369 664 318 664 _c
318 742 _m
399 742 461 709 505 645 _c
548 580 570 486 570 364 _c
570 241 548 147 505 83 _c
461 19 399 -13 318 -13 _c
236 -13 173 19 130 83 _c
87 147 66 241 66 364 _c
66 486 87 580 130 645 _c
173 709 236 742 318 742 _c
_cl}_d
/one{636 0 110 0 544 729 _sc
124 83 _m
285 83 _l
285 639 _l
110 604 _l
110 694 _l
284 729 _l
383 729 _l
383 83 _l
544 83 _l
544 0 _l
124 0 _l
124 83 _l
_cl}_d
/two{{636 0 73 0 536 742 _sc
192 83 _m
536 83 _l
536 0 _l
73 0 _l
73 83 _l
110 121 161 173 226 239 _c
290 304 331 346 348 365 _c
380 400 402 430 414 455 _c
426 479 433 504 433 528 _c
433 566 419 598 392 622 _c
365 646 330 659 286 659 _c
255 659 222 653 188 643 _c
154 632 117 616 78 594 _c
78 694 _l
118 710 155 722 189 730 _c
223 738 255 742 284 742 _c
359 742 419 723 464 685 _c
509 647 532 597 532 534 _c
532 504 526 475 515 449 _c
504 422 484 390 454 354 _c
446 344 420 317 376 272 _c
332 227 271 164 192 83 _c
_cl}_e}_d
/five{{636 0 77 -13 549 729 _sc
108 729 _m
495 729 _l
495 646 _l
198 646 _l
198 467 _l
212 472 227 476 241 478 _c
255 480 270 482 284 482 _c
365 482 429 459 477 415 _c
525 370 549 310 549 234 _c
549 155 524 94 475 51 _c
426 8 357 -13 269 -13 _c
238 -13 207 -10 175 -6 _c
143 -1 111 6 77 17 _c
77 116 _l
106 100 136 88 168 80 _c
199 72 232 69 267 69 _c
323 69 368 83 401 113 _c
433 143 450 183 450 234 _c
450 284 433 324 401 354 _c
368 384 323 399 267 399 _c
241 399 214 396 188 390 _c
162 384 135 375 108 363 _c
108 729 _l
_cl}_e}_d
/A{684 0 8 0 676 729 _sc
342 632 _m
208 269 _l
476 269 _l
342 632 _l
286 729 _m
398 729 _l
676 0 _l
573 0 _l
507 187 _l
178 187 _l
112 0 _l
8 0 _l
286 729 _l
_cl}_d
/E{632 0 98 0 568 729 _sc
98 729 _m
559 729 _l
559 646 _l
197 646 _l
197 430 _l
544 430 _l
544 347 _l
197 347 _l
197 83 _l
568 83 _l
568 0 _l
98 0 _l
98 729 _l
_cl}_d
/I{295 0 98 0 197 729 _sc
98 729 _m
197 729 _l
197 0 _l
98 0 _l
98 729 _l
_cl}_d
/a{{613 0 60 -13 522 560 _sc
343 275 _m
270 275 220 266 192 250 _c
164 233 150 205 150 165 _c
150 133 160 107 181 89 _c
202 70 231 61 267 61 _c
317 61 357 78 387 114 _c
417 149 432 196 432 255 _c
432 275 _l
343 275 _l
522 312 _m
522 0 _l
432 0 _l
432 83 _l
411 49 385 25 355 10 _c
325 -5 287 -13 243 -13 _c
187 -13 142 2 109 33 _c
76 64 60 106 60 159 _c
60 220 80 266 122 298 _c
163 329 224 345 306 345 _c
432 345 _l
432 354 _l
432 395 418 427 391 450 _c
364 472 326 484 277 484 _c
245 484 215 480 185 472 _c
155 464 127 453 100 439 _c
100 522 _l
}_e{132 534 164 544 195 550 _c
226 556 256 560 286 560 _c
365 560 424 539 463 498 _c
502 457 522 395 522 312 _c
_cl}_e}_d
/c{{550 0 55 -13 488 560 _sc
488 526 _m
488 442 _l
462 456 437 466 411 473 _c
385 480 360 484 334 484 _c
276 484 230 465 198 428 _c
166 391 150 339 150 273 _c
150 206 166 154 198 117 _c
230 80 276 62 334 62 _c
360 62 385 65 411 72 _c
437 79 462 90 488 104 _c
488 21 _l
462 9 436 0 410 -5 _c
383 -10 354 -13 324 -13 _c
242 -13 176 12 128 64 _c
79 115 55 185 55 273 _c
55 362 79 432 128 483 _c
177 534 244 560 330 560 _c
358 560 385 557 411 551 _c
437 545 463 537 488 526 _c
_cl}_e}_d
/e{{615 0 55 -13 562 560 _sc
562 296 _m
562 252 _l
149 252 _l
153 190 171 142 205 110 _c
238 78 284 62 344 62 _c
378 62 412 66 444 74 _c
476 82 509 95 541 113 _c
541 28 _l
509 14 476 3 442 -3 _c
408 -9 373 -13 339 -13 _c
251 -13 182 12 131 62 _c
80 112 55 181 55 268 _c
55 357 79 428 127 481 _c
175 533 241 560 323 560 _c
397 560 455 536 498 489 _c
540 441 562 377 562 296 _c
472 322 _m
471 371 457 410 431 440 _c
404 469 368 484 324 484 _c
274 484 234 469 204 441 _c
174 413 156 373 152 322 _c
472 322 _l
_cl}_e}_d
/h{634 0 91 0 549 760 _sc
549 330 _m
549 0 _l
459 0 _l
459 327 _l
459 379 448 417 428 443 _c
408 469 378 482 338 482 _c
289 482 251 466 223 435 _c
195 404 181 362 181 309 _c
181 0 _l
91 0 _l
91 760 _l
181 760 _l
181 462 _l
202 494 227 519 257 535 _c
286 551 320 560 358 560 _c
420 560 468 540 500 501 _c
532 462 549 405 549 330 _c
_cl}_d
/i{278 0 94 0 184 760 _sc
94 547 _m
184 547 _l
184 0 _l
94 0 _l
94 547 _l
94 760 _m
184 760 _l
184 646 _l
94 646 _l
94 760 _l
_cl}_d
/l{278 0 94 0 184 760 _sc
94 760 _m
184 760 _l
184 0 _l
94 0 _l
94 760 _l
_cl}_d
/m{{974 0 91 0 889 560 _sc
520 442 _m
542 482 569 511 600 531 _c
631 550 668 560 711 560 _c
767 560 811 540 842 500 _c
873 460 889 403 889 330 _c
889 0 _l
799 0 _l
799 327 _l
799 379 789 418 771 444 _c
752 469 724 482 686 482 _c
639 482 602 466 575 435 _c
548 404 535 362 535 309 _c
535 0 _l
445 0 _l
445 327 _l
445 379 435 418 417 444 _c
398 469 369 482 331 482 _c
285 482 248 466 221 435 _c
194 404 181 362 181 309 _c
181 0 _l
91 0 _l
91 547 _l
181 547 _l
181 462 _l
201 495 226 520 255 536 _c
283 552 317 560 357 560 _c
397 560 430 550 458 530 _c
486 510 506 480 520 442 _c
}_e{_cl}_e}_d
/n{634 0 91 0 549 560 _sc
549 330 _m
549 0 _l
459 0 _l
459 327 _l
459 379 448 417 428 443 _c
408 469 378 482 338 482 _c
289 482 251 466 223 435 _c
195 404 181 362 181 309 _c
181 0 _l
91 0 _l
91 547 _l
181 547 _l
181 462 _l
202 494 227 519 257 535 _c
286 551 320 560 358 560 _c
420 560 468 540 500 501 _c
532 462 549 405 549 330 _c
_cl}_d
/p{{635 0 91 -207 580 560 _sc
181 82 _m
181 -207 _l
91 -207 _l
91 547 _l
181 547 _l
181 464 _l
199 496 223 520 252 536 _c
281 552 316 560 356 560 _c
422 560 476 533 518 481 _c
559 428 580 359 580 273 _c
580 187 559 117 518 65 _c
476 13 422 -13 356 -13 _c
316 -13 281 -5 252 10 _c
223 25 199 49 181 82 _c
487 273 _m
487 339 473 390 446 428 _c
418 466 381 485 334 485 _c
286 485 249 466 222 428 _c
194 390 181 339 181 273 _c
181 207 194 155 222 117 _c
249 79 286 61 334 61 _c
381 61 418 79 446 117 _c
473 155 487 207 487 273 _c
_cl}_e}_d
/s{{521 0 54 -13 472 560 _sc
443 531 _m
443 446 _l
417 458 391 468 364 475 _c
336 481 308 485 279 485 _c
234 485 200 478 178 464 _c
156 450 145 430 145 403 _c
145 382 153 366 169 354 _c
185 342 217 330 265 320 _c
296 313 _l
360 299 405 279 432 255 _c
458 230 472 195 472 151 _c
472 100 452 60 412 31 _c
372 1 316 -13 246 -13 _c
216 -13 186 -10 154 -5 _c
122 0 89 8 54 20 _c
54 113 _l
87 95 120 82 152 74 _c
184 65 216 61 248 61 _c
290 61 323 68 346 82 _c
368 96 380 117 380 144 _c
380 168 371 187 355 200 _c
339 213 303 226 247 238 _c
216 245 _l
160 257 119 275 95 299 _c
70 323 58 356 58 399 _c
58 450 76 490 112 518 _c
148 546 200 560 268 560 _c
}_e{301 560 332 557 362 552 _c
391 547 418 540 443 531 _c
_cl}_e}_d
/t{392 0 27 0 368 702 _sc
183 702 _m
183 547 _l
368 547 _l
368 477 _l
183 477 _l
183 180 _l
183 135 189 106 201 94 _c
213 81 238 75 276 75 _c
368 75 _l
368 0 _l
276 0 _l
206 0 158 13 132 39 _c
106 65 93 112 93 180 _c
93 477 _l
27 477 _l
27 547 _l
93 547 _l
93 702 _l
183 702 _l
_cl}_d
/x{592 0 29 0 559 547 _sc
549 547 _m
351 281 _l
559 0 _l
453 0 _l
294 215 _l
135 0 _l
29 0 _l
241 286 _l
47 547 _l
153 547 _l
298 352 _l
443 547 _l
549 547 _l
_cl}_d
/y{592 0 30 -207 562 547 _sc
322 -50 _m
296 -114 271 -157 247 -177 _c
223 -197 191 -207 151 -207 _c
79 -207 _l
79 -132 _l
132 -132 _l
156 -132 175 -126 189 -114 _c
203 -102 218 -75 235 -31 _c
251 9 _l
30 547 _l
125 547 _l
296 119 _l
467 547 _l
562 547 _l
322 -50 _l
_cl}_d
/z{525 0 43 0 482 547 _sc
55 547 _m
482 547 _l
482 465 _l
144 72 _l
482 72 _l
482 0 _l
43 0 _l
43 82 _l
381 475 _l
55 475 _l
55 547 _l
_cl}_d
/minus{838 0 106 272 732 355 _sc
106 355 _m
732 355 _l
732 272 _l
106 272 _l
106 355 _l
_cl}_d
end readonly def

/BuildGlyph
 {exch begin
 CharStrings exch
 2 copy known not{pop /.notdef}if
 true 3 1 roll get exec
 end}_d

/BuildChar {
 1 index /Encoding get exch get
 1 index /BuildGlyph get exec
}_d

FontName currentdict end definefont pop
end
%%EndProlog
mpldict begin
-166.32 216 translate
944.64 360 0 0 clipbox
1.000 setlinewidth
1 setlinejoin
2 setlinecap
[] 0 setdash
1.000 setgray
gsave
0 0 m
944.64 0 l
944.64 360 l
0 360 l
0 0 l
gsave
fill
grestore
stroke
grestore
gsave
94.464 36 m
850.176 36 l
850.176 324 l
94.464 324 l
94.464 36 l
fill
grestore
1.000 0.000 0.000 setrgbcolor
gsave
755.7 288 94.46 36 clipbox
94.464 180 m
98.2426 150.239 l
102.021 123.378 l
105.8 102.041 l
109.578 88.3128 l
113.357 83.5284 l
117.135 88.1491 l
120.914 101.725 l
124.692 122.931 l
128.471 149.691 l
136.028 209.12 l
139.807 235.987 l
143.585 257.36 l
147.364 271.146 l
151.142 276 l
154.921 271.449 l
158.7 257.931 l
162.478 236.762 l
166.257 210.008 l
173.814 150.485 l
177.592 123.516 l
181.371 102.011 l
185.149 88.0719 l
188.928 83.0526 l
192.707 87.4376 l
196.485 100.8 l
200.264 121.836 l
204.042 148.485 l
215.378 234.877 l
219.156 256.413 l
222.935 270.407 l
226.714 275.491 l
230.492 271.171 l
234.271 257.863 l
238.049 236.859 l
241.828 210.212 l
253.164 123.612 l
256.942 101.938 l
260.721 87.7857 l
264.499 82.5298 l
268.278 86.6765 l
272.056 99.8221 l
275.835 120.685 l
279.613 147.22 l
290.949 233.694 l
294.728 255.391 l
298.506 269.588 l
302.285 274.9 l
306.063 270.81 l
309.842 257.71 l
313.62 236.871 l
317.399 210.329 l
328.735 123.618 l
332.513 101.774 l
336.292 87.4072 l
340.07 81.9128 l
343.849 85.8179 l
347.628 98.7432 l
351.406 119.429 l
355.185 145.845 l
366.52 232.389 l
370.299 254.242 l
374.077 268.639 l
377.856 274.175 l
381.635 270.313 l
385.413 257.419 l
389.192 236.742 l
392.97 210.304 l
404.306 123.479 l
408.084 101.462 l
411.863 86.8804 l
415.642 81.1455 l
419.42 84.8049 l
423.199 97.5048 l
426.977 118.01 l
430.756 144.304 l
442.092 230.9 l
445.87 252.907 l
449.649 267.497 l
453.427 273.252 l
457.206 269.616 l
460.984 256.928 l
464.763 236.409 l
468.541 210.07 l
479.877 123.128 l
483.656 100.932 l
487.434 86.1356 l
491.213 80.1609 l
494.991 83.5658 l
498.77 96.0301 l
502.548 116.355 l
506.327 142.528 l
517.663 229.152 l
521.441 251.32 l
525.22 266.084 l
528.998 272.031 l
532.777 268.641 l
536.556 256.194 l
540.334 235.779 l
547.891 181.228 l
551.67 179.855 l
563.005 180.003 l
597.012 179.987 l
699.034 180 l
850.176 180 l
850.176 180 l
stroke
grestore
0.000 0.000 1.000 setrgbcolor
gsave
755.7 288 94.46 36 clipbox
94.464 180 m
94.464 0 l
99.5259 0 m
99.5259 360 l
103.576 360 m
103.576 0 l
107.48 0 m
107.48 360 l
111.337 360 m
111.337 0 l
115.172 0 m
115.172 360 l
118.995 360 m
118.995 0 l
122.811 0 m
122.811 360 l
126.623 360 m
126.623 0 l
130.431 0 m
130.431 360 l
134.237 360 m
134.237 0 l
138.042 0 m
138.042 360 l
141.845 360 m
141.845 0 l
145.647 0 m
145.647 360 l
149.449 360 m
149.449 0 l
153.25 0 m
153.25 360 l
157.051 360 m
157.051 0 l
160.851 0 m
160.851 360 l
164.651 360 m
164.651 0 l
168.451 0 m
168.451 360 l
172.251 360 m
172.251 0 l
176.05 0 m
176.05 360 l
179.85 360 m
179.85 0 l
183.649 0 m
183.649 360 l
187.448 360 m
187.448 0 l
191.248 0 m
191.248 360 l
195.047 360 m
195.047 0 l
198.846 0 m
198.846 360 l
202.646 360 m
202.646 0 l
206.445 0 m
206.445 360 l
210.244 360 m
210.244 0 l
214.044 0 m
214.044 360 l
217.843 360 m
217.843 0 l
221.643 0 m
221.643 360 l
225.443 360 m
225.443 0 l
229.243 0 m
229.243 360 l
233.043 360 m
233.043 0 l
236.843 0 m
236.843 360 l
240.644 360 m
240.644 0 l
244.444 0 m
244.444 360 l
248.245 360 m
248.245 0 l
252.046 0 m
252.046 360 l
255.847 360 m
255.847 0 l
259.648 0 m
259.648 360 l
263.45 360 m
263.45 0 l
267.252 0 m
267.252 360 l
271.054 360 m
271.054 0 l
274.856 0 m
274.856 360 l
278.659 360 m
278.659 0 l
282.462 0 m
282.462 360 l
286.265 360 m
286.265 0 l
290.068 0 m
290.068 360 l
293.872 360 m
293.872 0 l
297.676 0 m
297.676 360 l
301.481 360 m
301.481 0 l
305.286 0 m
305.286 360 l
309.091 360 m
309.091 0 l
312.897 0 m
312.897 360 l
316.703 360 m
316.703 0 l
320.51 0 m
320.51 360 l
324.317 360 m
324.317 0 l
328.125 0 m
328.125 360 l
331.933 360 m
331.933 0 l
335.742 0 m
335.742 360 l
339.552 360 m
339.552 0 l
343.362 0 m
343.362 360 l
347.172 360 m
347.172 0 l
350.984 0 m
350.984 360 l
354.796 360 m
354.796 0 l
358.609 0 m
358.609 360 l
362.423 360 m
362.423 0 l
366.238 0 m
366.238 360 l
370.053 360 m
370.053 0 l
373.87 0 m
373.87 360 l
377.688 360 m
377.688 0 l
381.506 0 m
381.506 360 l
385.326 360 m
385.326 0 l
389.148 0 m
389.148 360 l
392.97 360 m
392.97 180 l
850.176 180 l
850.176 180 l
stroke
grestore
0.000 0.502 0.000 setrgbcolor
gsave
755.7 288 94.46 36 clipbox
94.464 180 m
98.2426 117.36 l
102.021 106.666 l
105.8 104.009 l
109.578 108.53 l
113.357 118.841 l
117.135 133.223 l
128.471 182.722 l
132.25 196.156 l
136.028 206.281 l
139.807 212.639 l
143.585 215.17 l
147.364 214.168 l
151.142 210.203 l
154.921 204.033 l
170.035 173.989 l
173.814 168.628 l
177.592 164.973 l
181.371 163.117 l
185.149 162.979 l
188.928 164.334 l
192.707 166.855 l
200.264 173.824 l
207.821 180.805 l
211.599 183.532 l
215.378 185.498 l
219.156 186.628 l
222.935 186.932 l
226.714 186.494 l
230.492 185.45 l
238.049 182.258 l
245.606 178.814 l
253.164 176.286 l
256.942 175.571 l
260.721 175.247 l
268.278 175.634 l
275.835 176.938 l
287.171 179.142 l
294.728 180.016 l
302.285 180.171 l
313.62 179.346 l
332.513 177.565 l
343.849 177.324 l
392.97 177.826 l
419.42 177.334 l
442.092 177.719 l
464.763 178.716 l
483.656 180.243 l
506.327 182.887 l
525.22 184.971 l
540.334 185.953 l
555.448 186.113 l
570.563 185.548 l
597.012 183.67 l
627.241 181.672 l
653.691 180.668 l
687.698 180.157 l
759.491 180.003 l
850.176 180 l
850.176 180 l
stroke
grestore
0.500 setlinewidth
0 setlinecap
[1 3] 0 setdash
0.000 setgray
gsave
755.7 288 94.46 36 clipbox
94.464 36 m
94.464 324 l
stroke
grestore
[] 0 setdash
gsave
/o {
gsave
newpath
translate
0 0 m
0 4 l
stroke
grestore
} bind def
94.464 36 o
grestore
gsave
/o {
gsave
newpath
translate
0 0 m
0 -4 l
stroke
grestore
} bind def
94.464 324 o
grestore
/BitstreamVeraSans-Roman findfont
12.000 scalefont
setfont
gsave
66.612437 22.921875 translate
0.000000 rotate
0.000000 0.171875 m /zero glyphshow
7.634766 0.171875 m /period glyphshow
11.449219 0.171875 m /zero glyphshow
19.083984 0.171875 m /zero glyphshow
26.718750 0.171875 m /zero glyphshow
34.353516 0.171875 m /zero glyphshow
41.988281 0.171875 m /zero glyphshow
49.623047 0.171875 m /zero glyphshow
grestore
[1 3] 0 setdash
gsave
755.7 288 94.46 36 clipbox
283.392 36 m
283.392 324 l
stroke
grestore
[] 0 setdash
gsave
/o {
gsave
newpath
translate
0 0 m
0 4 l
stroke
grestore
} bind def
283.392 36 o
grestore
gsave
/o {
gsave
newpath
translate
0 0 m
0 -4 l
stroke
grestore
} bind def
283.392 324 o
grestore
gsave
255.665437 22.921875 translate
0.000000 rotate
0.000000 0.171875 m /zero glyphshow
7.634766 0.171875 m /period glyphshow
11.449219 0.171875 m /zero glyphshow
19.083984 0.171875 m /zero glyphshow
26.718750 0.171875 m /zero glyphshow
34.353516 0.171875 m /zero glyphshow
41.988281 0.171875 m /zero glyphshow
49.623047 0.171875 m /five glyphshow
grestore
[1 3] 0 setdash
gsave
755.7 288 94.46 36 clipbox
472.32 36 m
472.32 324 l
stroke
grestore
[] 0 setdash
gsave
/o {
gsave
newpath
translate
0 0 m
0 4 l
stroke
grestore
} bind def
472.32 36 o
grestore
gsave
/o {
gsave
newpath
translate
0 0 m
0 -4 l
stroke
grestore
} bind def
472.32 324 o
grestore
gsave
444.468437 22.921875 translate
0.000000 rotate
0.000000 0.171875 m /zero glyphshow
7.634766 0.171875 m /period glyphshow
11.449219 0.171875 m /zero glyphshow
19.083984 0.171875 m /zero glyphshow
26.718750 0.171875 m /zero glyphshow
34.353516 0.171875 m /zero glyphshow
41.988281 0.171875 m /one glyphshow
49.623047 0.171875 m /zero glyphshow
grestore
[1 3] 0 setdash
gsave
755.7 288 94.46 36 clipbox
661.248 36 m
661.248 324 l
stroke
grestore
[] 0 setdash
gsave
/o {
gsave
newpath
translate
0 0 m
0 4 l
stroke
grestore
} bind def
661.248 36 o
grestore
gsave
/o {
gsave
newpath
translate
0 0 m
0 -4 l
stroke
grestore
} bind def
661.248 324 o
grestore
gsave
633.521437 22.921875 translate
0.000000 rotate
0.000000 0.171875 m /zero glyphshow
7.634766 0.171875 m /period glyphshow
11.449219 0.171875 m /zero glyphshow
19.083984 0.171875 m /zero glyphshow
26.718750 0.171875 m /zero glyphshow
34.353516 0.171875 m /zero glyphshow
41.988281 0.171875 m /one glyphshow
49.623047 0.171875 m /five glyphshow
grestore
[1 3] 0 setdash
gsave
755.7 288 94.46 36 clipbox
850.176 36 m
850.176 324 l
stroke
grestore
[] 0 setdash
gsave
/o {
gsave
newpath
translate
0 0 m
0 4 l
stroke
grestore
} bind def
850.176 36 o
grestore
gsave
/o {
gsave
newpath
translate
0 0 m
0 -4 l
stroke
grestore
} bind def
850.176 324 o
grestore
gsave
822.324437 22.921875 translate
0.000000 rotate
0.000000 0.171875 m /zero glyphshow
7.634766 0.171875 m /period glyphshow
11.449219 0.171875 m /zero glyphshow
19.083984 0.171875 m /zero glyphshow
26.718750 0.171875 m /zero glyphshow
34.353516 0.171875 m /zero glyphshow
41.988281 0.171875 m /two glyphshow
49.623047 0.171875 m /zero glyphshow
grestore
469.687 11.359 m
(z) show
[1 3] 0 setdash
gsave
755.7 288 94.46 36 clipbox
94.464 83.6433 m
850.176 83.6433 l
stroke
grestore
[] 0 setdash
gsave
/o {
gsave
newpath
translate
0 0 m
4 0 l
stroke
grestore
} bind def
94.464 83.6433 o
grestore
gsave
/o {
gsave
newpath
translate
0 0 m
-4 0 l
stroke
grestore
} bind def
850.176 83.6433 o
grestore
gsave
63.370250 79.104268 translate
0.000000 rotate
0.000000 0.171875 m /minus glyphshow
10.054688 0.171875 m /one glyphshow
17.689453 0.171875 m /period glyphshow
21.503906 0.171875 m /zero glyphshow
grestore
[1 3] 0 setdash
gsave
755.7 288 94.46 36 clipbox
94.464 131.822 m
850.176 131.822 l
stroke
grestore
[] 0 setdash
gsave
/o {
gsave
newpath
translate
0 0 m
4 0 l
stroke
grestore
} bind def
94.464 131.822 o
grestore
gsave
/o {
gsave
newpath
translate
0 0 m
-4 0 l
stroke
grestore
} bind def
850.176 131.822 o
grestore
gsave
63.620250 127.282603 translate
0.000000 rotate
0.000000 0.171875 m /minus glyphshow
10.054688 0.171875 m /zero glyphshow
17.689453 0.171875 m /period glyphshow
21.503906 0.171875 m /five glyphshow
grestore
[1 3] 0 setdash
gsave
755.7 288 94.46 36 clipbox
94.464 180 m
850.176 180 l
stroke
grestore
[] 0 setdash
gsave
/o {
gsave
newpath
translate
0 0 m
4 0 l
stroke
grestore
} bind def
94.464 180 o
grestore
gsave
/o {
gsave
newpath
translate
0 0 m
-4 0 l
stroke
grestore
} bind def
850.176 180 o
grestore
gsave
72.964000 175.460938 translate
0.000000 rotate
0.000000 0.171875 m /zero glyphshow
7.634766 0.171875 m /period glyphshow
11.449219 0.171875 m /zero glyphshow
grestore
[1 3] 0 setdash
gsave
755.7 288 94.46 36 clipbox
94.464 228.178 m
850.176 228.178 l
stroke
grestore
[] 0 setdash
gsave
/o {
gsave
newpath
translate
0 0 m
4 0 l
stroke
grestore
} bind def
94.464 228.178 o
grestore
gsave
/o {
gsave
newpath
translate
0 0 m
-4 0 l
stroke
grestore
} bind def
850.176 228.178 o
grestore
gsave
73.214000 223.639272 translate
0.000000 rotate
0.000000 0.171875 m /zero glyphshow
7.634766 0.171875 m /period glyphshow
11.449219 0.171875 m /five glyphshow
grestore
[1 3] 0 setdash
gsave
755.7 288 94.46 36 clipbox
94.464 276.357 m
850.176 276.357 l
stroke
grestore
[] 0 setdash
gsave
/o {
gsave
newpath
translate
0 0 m
4 0 l
stroke
grestore
} bind def
94.464 276.357 o
grestore
gsave
/o {
gsave
newpath
translate
0 0 m
-4 0 l
stroke
grestore
} bind def
850.176 276.357 o
grestore
gsave
73.479625 271.817607 translate
0.000000 rotate
0.000000 0.171875 m /one glyphshow
7.634766 0.171875 m /period glyphshow
11.449219 0.171875 m /zero glyphshow
grestore
58.37 173.445 m
gsave
90 rotate
(Ex) show
grestore
1.000 setlinewidth
2 setlinecap
gsave
94.464 324 m
850.176 324 l
stroke
grestore
gsave
850.176 36 m
850.176 324 l
stroke
grestore
gsave
94.464 36 m
850.176 36 l
stroke
grestore
gsave
94.464 36 m
94.464 324 l
stroke
grestore
gsave
230.116 329.173 m
714.524 329.173 l
714.524 354.24 l
230.116 354.24 l
230.116 329.173 l
cl
gsave
1.000 setgray
fill
grestore
stroke
grestore
1.000 0.000 0.000 setrgbcolor
gsave
240.196 342.879 m
260.356 342.879 l
stroke
grestore
0.000 setgray
/BitstreamVeraSans-Roman findfont
14.400 scalefont
setfont
276.196 334.933 m
0 2.906 rmoveto
(Analytical) show
0.000 0.000 1.000 setrgbcolor
gsave
378.472 342.879 m
398.632 342.879 l
stroke
grestore
0.000 setgray
414.472 334.933 m
0 2.906 rmoveto
(Explicit scheme) show
0.000 0.502 0.000 setrgbcolor
gsave
559.858 342.879 m
580.018 342.879 l
stroke
grestore
0.000 setgray
595.858 334.933 m
0 2.906 rmoveto
(Implicit scheme) show

end
showpage
