%!PS-Adobe-3.0 EPSF-3.0
%%Title: graph/solution/10.eps
%%Creator: matplotlib version 0.99.0, http://matplotlib.sourceforge.net/
%%CreationDate: Mon Dec 21 22:35:22 2009
%%Orientation: portrait
%%BoundingBox: -166 216 778 576
%%EndComments
%%BeginProlog
/mpldict 8 dict def
mpldict begin
/m { moveto } bind def
/l { lineto } bind def
/r { rlineto } bind def
/c { curveto } bind def
/cl { closepath } bind def
/box {
m
1 index 0 r
0 exch r
neg 0 r
cl
} bind def
/clipbox {
box
clip
newpath
} bind def
%!PS-Adobe-3.0 Resource-Font
%%Title: Bitstream Vera Sans
%%Copyright: Copyright (c) 2003 by Bitstream, Inc. All Rights Reserved.
%%Creator: Converted from TrueType by PPR
25 dict begin
/_d{bind def}bind def
/_m{moveto}_d
/_l{lineto}_d
/_cl{closepath eofill}_d
/_c{curveto}_d
/_sc{7 -1 roll{setcachedevice}{pop pop pop pop pop pop}ifelse}_d
/_e{exec}_d
/FontName /BitstreamVeraSans-Roman def
/PaintType 0 def
/FontMatrix[.001 0 0 .001 0 0]def
/FontBBox[-182 -235 1287 928]def
/FontType 3 def
/Encoding StandardEncoding def
/FontInfo 10 dict dup begin
/FamilyName (Bitstream Vera Sans) def
/FullName (Bitstream Vera Sans) def
/Notice (Copyright (c) 2003 by Bitstream, Inc. All Rights Reserved. Bitstream Vera is a trademark of Bitstream, Inc.) def
/Weight (Roman) def
/Version (Release 1.10) def
/ItalicAngle 0.0 def
/isFixedPitch false def
/UnderlinePosition -213 def
/UnderlineThickness 143 def
end readonly def
/CharStrings 24 dict dup begin
/space{318 0 0 0 0 0 _sc
}_d
/period{318 0 107 0 210 124 _sc
107 124 _m
210 124 _l
210 0 _l
107 0 _l
107 124 _l
_cl}_d
/zero{636 0 66 -13 570 742 _sc
318 664 _m
267 664 229 639 203 589 _c
177 539 165 464 165 364 _c
165 264 177 189 203 139 _c
229 89 267 64 318 64 _c
369 64 407 89 433 139 _c
458 189 471 264 471 364 _c
471 464 458 539 433 589 _c
407 639 369 664 318 664 _c
318 742 _m
399 742 461 709 505 645 _c
548 580 570 486 570 364 _c
570 241 548 147 505 83 _c
461 19 399 -13 318 -13 _c
236 -13 173 19 130 83 _c
87 147 66 241 66 364 _c
66 486 87 580 130 645 _c
173 709 236 742 318 742 _c
_cl}_d
/one{636 0 110 0 544 729 _sc
124 83 _m
285 83 _l
285 639 _l
110 604 _l
110 694 _l
284 729 _l
383 729 _l
383 83 _l
544 83 _l
544 0 _l
124 0 _l
124 83 _l
_cl}_d
/two{{636 0 73 0 536 742 _sc
192 83 _m
536 83 _l
536 0 _l
73 0 _l
73 83 _l
110 121 161 173 226 239 _c
290 304 331 346 348 365 _c
380 400 402 430 414 455 _c
426 479 433 504 433 528 _c
433 566 419 598 392 622 _c
365 646 330 659 286 659 _c
255 659 222 653 188 643 _c
154 632 117 616 78 594 _c
78 694 _l
118 710 155 722 189 730 _c
223 738 255 742 284 742 _c
359 742 419 723 464 685 _c
509 647 532 597 532 534 _c
532 504 526 475 515 449 _c
504 422 484 390 454 354 _c
446 344 420 317 376 272 _c
332 227 271 164 192 83 _c
_cl}_e}_d
/five{{636 0 77 -13 549 729 _sc
108 729 _m
495 729 _l
495 646 _l
198 646 _l
198 467 _l
212 472 227 476 241 478 _c
255 480 270 482 284 482 _c
365 482 429 459 477 415 _c
525 370 549 310 549 234 _c
549 155 524 94 475 51 _c
426 8 357 -13 269 -13 _c
238 -13 207 -10 175 -6 _c
143 -1 111 6 77 17 _c
77 116 _l
106 100 136 88 168 80 _c
199 72 232 69 267 69 _c
323 69 368 83 401 113 _c
433 143 450 183 450 234 _c
450 284 433 324 401 354 _c
368 384 323 399 267 399 _c
241 399 214 396 188 390 _c
162 384 135 375 108 363 _c
108 729 _l
_cl}_e}_d
/A{684 0 8 0 676 729 _sc
342 632 _m
208 269 _l
476 269 _l
342 632 _l
286 729 _m
398 729 _l
676 0 _l
573 0 _l
507 187 _l
178 187 _l
112 0 _l
8 0 _l
286 729 _l
_cl}_d
/E{632 0 98 0 568 729 _sc
98 729 _m
559 729 _l
559 646 _l
197 646 _l
197 430 _l
544 430 _l
544 347 _l
197 347 _l
197 83 _l
568 83 _l
568 0 _l
98 0 _l
98 729 _l
_cl}_d
/I{295 0 98 0 197 729 _sc
98 729 _m
197 729 _l
197 0 _l
98 0 _l
98 729 _l
_cl}_d
/a{{613 0 60 -13 522 560 _sc
343 275 _m
270 275 220 266 192 250 _c
164 233 150 205 150 165 _c
150 133 160 107 181 89 _c
202 70 231 61 267 61 _c
317 61 357 78 387 114 _c
417 149 432 196 432 255 _c
432 275 _l
343 275 _l
522 312 _m
522 0 _l
432 0 _l
432 83 _l
411 49 385 25 355 10 _c
325 -5 287 -13 243 -13 _c
187 -13 142 2 109 33 _c
76 64 60 106 60 159 _c
60 220 80 266 122 298 _c
163 329 224 345 306 345 _c
432 345 _l
432 354 _l
432 395 418 427 391 450 _c
364 472 326 484 277 484 _c
245 484 215 480 185 472 _c
155 464 127 453 100 439 _c
100 522 _l
}_e{132 534 164 544 195 550 _c
226 556 256 560 286 560 _c
365 560 424 539 463 498 _c
502 457 522 395 522 312 _c
_cl}_e}_d
/c{{550 0 55 -13 488 560 _sc
488 526 _m
488 442 _l
462 456 437 466 411 473 _c
385 480 360 484 334 484 _c
276 484 230 465 198 428 _c
166 391 150 339 150 273 _c
150 206 166 154 198 117 _c
230 80 276 62 334 62 _c
360 62 385 65 411 72 _c
437 79 462 90 488 104 _c
488 21 _l
462 9 436 0 410 -5 _c
383 -10 354 -13 324 -13 _c
242 -13 176 12 128 64 _c
79 115 55 185 55 273 _c
55 362 79 432 128 483 _c
177 534 244 560 330 560 _c
358 560 385 557 411 551 _c
437 545 463 537 488 526 _c
_cl}_e}_d
/e{{615 0 55 -13 562 560 _sc
562 296 _m
562 252 _l
149 252 _l
153 190 171 142 205 110 _c
238 78 284 62 344 62 _c
378 62 412 66 444 74 _c
476 82 509 95 541 113 _c
541 28 _l
509 14 476 3 442 -3 _c
408 -9 373 -13 339 -13 _c
251 -13 182 12 131 62 _c
80 112 55 181 55 268 _c
55 357 79 428 127 481 _c
175 533 241 560 323 560 _c
397 560 455 536 498 489 _c
540 441 562 377 562 296 _c
472 322 _m
471 371 457 410 431 440 _c
404 469 368 484 324 484 _c
274 484 234 469 204 441 _c
174 413 156 373 152 322 _c
472 322 _l
_cl}_e}_d
/h{634 0 91 0 549 760 _sc
549 330 _m
549 0 _l
459 0 _l
459 327 _l
459 379 448 417 428 443 _c
408 469 378 482 338 482 _c
289 482 251 466 223 435 _c
195 404 181 362 181 309 _c
181 0 _l
91 0 _l
91 760 _l
181 760 _l
181 462 _l
202 494 227 519 257 535 _c
286 551 320 560 358 560 _c
420 560 468 540 500 501 _c
532 462 549 405 549 330 _c
_cl}_d
/i{278 0 94 0 184 760 _sc
94 547 _m
184 547 _l
184 0 _l
94 0 _l
94 547 _l
94 760 _m
184 760 _l
184 646 _l
94 646 _l
94 760 _l
_cl}_d
/l{278 0 94 0 184 760 _sc
94 760 _m
184 760 _l
184 0 _l
94 0 _l
94 760 _l
_cl}_d
/m{{974 0 91 0 889 560 _sc
520 442 _m
542 482 569 511 600 531 _c
631 550 668 560 711 560 _c
767 560 811 540 842 500 _c
873 460 889 403 889 330 _c
889 0 _l
799 0 _l
799 327 _l
799 379 789 418 771 444 _c
752 469 724 482 686 482 _c
639 482 602 466 575 435 _c
548 404 535 362 535 309 _c
535 0 _l
445 0 _l
445 327 _l
445 379 435 418 417 444 _c
398 469 369 482 331 482 _c
285 482 248 466 221 435 _c
194 404 181 362 181 309 _c
181 0 _l
91 0 _l
91 547 _l
181 547 _l
181 462 _l
201 495 226 520 255 536 _c
283 552 317 560 357 560 _c
397 560 430 550 458 530 _c
486 510 506 480 520 442 _c
}_e{_cl}_e}_d
/n{634 0 91 0 549 560 _sc
549 330 _m
549 0 _l
459 0 _l
459 327 _l
459 379 448 417 428 443 _c
408 469 378 482 338 482 _c
289 482 251 466 223 435 _c
195 404 181 362 181 309 _c
181 0 _l
91 0 _l
91 547 _l
181 547 _l
181 462 _l
202 494 227 519 257 535 _c
286 551 320 560 358 560 _c
420 560 468 540 500 501 _c
532 462 549 405 549 330 _c
_cl}_d
/p{{635 0 91 -207 580 560 _sc
181 82 _m
181 -207 _l
91 -207 _l
91 547 _l
181 547 _l
181 464 _l
199 496 223 520 252 536 _c
281 552 316 560 356 560 _c
422 560 476 533 518 481 _c
559 428 580 359 580 273 _c
580 187 559 117 518 65 _c
476 13 422 -13 356 -13 _c
316 -13 281 -5 252 10 _c
223 25 199 49 181 82 _c
487 273 _m
487 339 473 390 446 428 _c
418 466 381 485 334 485 _c
286 485 249 466 222 428 _c
194 390 181 339 181 273 _c
181 207 194 155 222 117 _c
249 79 286 61 334 61 _c
381 61 418 79 446 117 _c
473 155 487 207 487 273 _c
_cl}_e}_d
/s{{521 0 54 -13 472 560 _sc
443 531 _m
443 446 _l
417 458 391 468 364 475 _c
336 481 308 485 279 485 _c
234 485 200 478 178 464 _c
156 450 145 430 145 403 _c
145 382 153 366 169 354 _c
185 342 217 330 265 320 _c
296 313 _l
360 299 405 279 432 255 _c
458 230 472 195 472 151 _c
472 100 452 60 412 31 _c
372 1 316 -13 246 -13 _c
216 -13 186 -10 154 -5 _c
122 0 89 8 54 20 _c
54 113 _l
87 95 120 82 152 74 _c
184 65 216 61 248 61 _c
290 61 323 68 346 82 _c
368 96 380 117 380 144 _c
380 168 371 187 355 200 _c
339 213 303 226 247 238 _c
216 245 _l
160 257 119 275 95 299 _c
70 323 58 356 58 399 _c
58 450 76 490 112 518 _c
148 546 200 560 268 560 _c
}_e{301 560 332 557 362 552 _c
391 547 418 540 443 531 _c
_cl}_e}_d
/t{392 0 27 0 368 702 _sc
183 702 _m
183 547 _l
368 547 _l
368 477 _l
183 477 _l
183 180 _l
183 135 189 106 201 94 _c
213 81 238 75 276 75 _c
368 75 _l
368 0 _l
276 0 _l
206 0 158 13 132 39 _c
106 65 93 112 93 180 _c
93 477 _l
27 477 _l
27 547 _l
93 547 _l
93 702 _l
183 702 _l
_cl}_d
/x{592 0 29 0 559 547 _sc
549 547 _m
351 281 _l
559 0 _l
453 0 _l
294 215 _l
135 0 _l
29 0 _l
241 286 _l
47 547 _l
153 547 _l
298 352 _l
443 547 _l
549 547 _l
_cl}_d
/y{592 0 30 -207 562 547 _sc
322 -50 _m
296 -114 271 -157 247 -177 _c
223 -197 191 -207 151 -207 _c
79 -207 _l
79 -132 _l
132 -132 _l
156 -132 175 -126 189 -114 _c
203 -102 218 -75 235 -31 _c
251 9 _l
30 547 _l
125 547 _l
296 119 _l
467 547 _l
562 547 _l
322 -50 _l
_cl}_d
/z{525 0 43 0 482 547 _sc
55 547 _m
482 547 _l
482 465 _l
144 72 _l
482 72 _l
482 0 _l
43 0 _l
43 82 _l
381 475 _l
55 475 _l
55 547 _l
_cl}_d
/minus{838 0 106 272 732 355 _sc
106 355 _m
732 355 _l
732 272 _l
106 272 _l
106 355 _l
_cl}_d
end readonly def

/BuildGlyph
 {exch begin
 CharStrings exch
 2 copy known not{pop /.notdef}if
 true 3 1 roll get exec
 end}_d

/BuildChar {
 1 index /Encoding get exch get
 1 index /BuildGlyph get exec
}_d

FontName currentdict end definefont pop
end
%%EndProlog
mpldict begin
-166.32 216 translate
944.64 360 0 0 clipbox
1.000 setlinewidth
1 setlinejoin
2 setlinecap
[] 0 setdash
1.000 setgray
gsave
0 0 m
944.64 0 l
944.64 360 l
0 360 l
0 0 l
gsave
fill
grestore
stroke
grestore
gsave
94.464 36 m
850.176 36 l
850.176 324 l
94.464 324 l
94.464 36 l
fill
grestore
1.000 0.000 0.000 setrgbcolor
gsave
755.7 288 94.46 36 clipbox
94.464 180 m
98.2426 209.639 l
102.021 236.382 l
105.8 257.617 l
109.578 271.268 l
113.357 276 l
117.135 271.35 l
120.914 257.771 l
124.692 236.585 l
128.471 209.862 l
136.028 150.516 l
139.807 123.685 l
143.585 102.333 l
147.364 88.5432 l
151.142 83.66 l
154.921 88.1587 l
158.7 101.598 l
162.478 122.665 l
166.257 149.3 l
173.814 208.574 l
177.592 235.423 l
181.371 256.822 l
185.149 270.682 l
188.928 275.645 l
192.707 271.228 l
196.485 257.857 l
200.264 236.839 l
204.042 210.222 l
215.378 123.939 l
219.156 102.419 l
222.935 88.4179 l
226.714 83.2999 l
230.492 87.563 l
234.271 100.789 l
238.049 121.684 l
241.828 148.207 l
253.164 234.421 l
256.942 255.983 l
260.721 270.048 l
264.499 275.241 l
268.278 271.053 l
272.056 257.892 l
275.835 237.039 l
279.613 210.529 l
290.949 124.138 l
294.728 102.451 l
298.506 88.2372 l
302.285 82.8827 l
306.063 86.9078 l
309.842 99.9173 l
313.62 120.638 l
317.399 147.046 l
328.735 233.339 l
332.513 255.059 l
336.292 269.326 l
340.07 274.747 l
343.849 270.788 l
347.628 257.833 l
351.406 237.146 l
355.185 210.742 l
366.52 124.242 l
370.299 102.386 l
374.077 87.9582 l
377.856 82.3652 l
381.635 86.1499 l
385.413 98.9397 l
389.192 119.483 l
392.97 145.77 l
404.306 232.13 l
408.084 254.004 l
411.863 268.471 l
415.642 274.116 l
419.42 270.383 l
423.199 257.633 l
426.977 237.109 l
430.756 210.811 l
442.092 124.199 l
445.87 102.172 l
449.649 87.5286 l
453.427 81.6944 l
457.206 85.2353 l
460.984 97.8016 l
464.763 118.162 l
468.541 144.325 l
479.877 230.736 l
483.656 252.76 l
487.434 267.423 l
491.213 273.288 l
494.991 269.777 l
498.77 257.231 l
502.548 236.868 l
506.327 210.672 l
517.663 123.943 l
521.441 101.743 l
525.22 86.881 l
528.998 80.8022 l
532.777 84.0952 l
536.556 96.4332 l
540.334 116.606 l
544.113 142.639 l
555.448 229.084 l
559.227 251.252 l
563.005 266.104 l
566.784 272.184 l
570.563 268.893 l
574.341 256.545 l
578.12 236.34 l
581.898 210.244 l
593.234 123.388 l
597.012 101.012 l
600.791 85.927 l
604.57 79.5988 l
608.348 82.6386 l
612.127 94.7422 l
615.905 114.721 l
619.684 140.616 l
631.02 227.073 l
634.798 249.378 l
638.577 264.414 l
642.355 270.703 l
646.134 267.624 l
649.912 255.469 l
653.691 235.419 l
657.469 209.413 l
661.248 180.612 l
665.027 179.995 l
850.176 180 l
850.176 180 l
stroke
grestore
0.000 0.502 0.000 setrgbcolor
gsave
755.7 288 94.46 36 clipbox
94.464 180.906 m
98.2426 210.575 l
102.021 237.149 l
105.8 258.023 l
109.578 271.161 l
113.357 275.293 l
117.135 270.038 l
120.914 255.94 l
124.692 234.41 l
128.471 207.584 l
136.028 148.908 l
139.807 122.829 l
143.585 102.432 l
147.364 89.704 l
151.142 85.872 l
154.921 91.2846 l
158.7 105.381 l
162.478 126.747 l
166.257 153.261 l
173.814 210.996 l
177.592 236.532 l
181.371 256.406 l
185.149 268.677 l
188.928 272.162 l
192.707 266.543 l
196.485 252.397 l
200.264 231.14 l
204.042 204.88 l
211.599 147.962 l
215.378 122.902 l
219.156 103.484 l
222.935 91.6001 l
226.714 88.3932 l
230.492 94.1512 l
234.271 108.28 l
238.049 129.363 l
245.606 183.541 l
249.385 211.286 l
253.164 235.811 l
256.942 254.714 l
260.721 266.151 l
264.499 269.019 l
268.278 263.059 l
272.056 248.881 l
275.835 227.902 l
283.392 174.319 l
287.171 146.999 l
290.949 122.924 l
294.728 104.447 l
298.506 93.3665 l
302.285 90.7466 l
306.063 96.817 l
309.842 110.953 l
313.62 131.737 l
321.178 184.543 l
324.956 211.348 l
328.735 234.883 l
332.513 252.841 l
336.292 263.47 l
340.07 265.745 l
343.849 259.461 l
347.628 245.261 l
351.406 224.56 l
358.963 172.288 l
362.742 145.869 l
366.52 122.739 l
370.299 105.16 l
374.077 94.8399 l
377.856 92.7639 l
381.635 99.1099 l
385.413 113.224 l
389.192 133.687 l
396.749 185.11 l
400.527 210.982 l
404.306 233.541 l
408.084 250.574 l
411.863 260.412 l
415.642 262.107 l
419.42 255.515 l
423.199 241.295 l
426.977 220.864 l
434.534 169.868 l
438.313 144.311 l
442.092 122.09 l
445.87 105.372 l
449.649 95.7654 l
453.427 94.1914 l
457.206 100.784 l
460.984 114.852 l
464.763 134.973 l
472.32 185.02 l
476.099 209.976 l
479.877 231.569 l
483.656 247.705 l
487.434 256.799 l
491.213 257.942 l
494.991 251.047 l
498.77 236.84 l
502.548 216.723 l
510.106 166.975 l
513.884 142.296 l
517.663 121.017 l
521.441 105.149 l
525.22 96.2186 l
528.998 95.1474 l
532.777 102.046 l
536.556 116.132 l
540.334 135.919 l
547.891 184.634 l
551.67 208.863 l
555.448 229.653 l
559.227 244.876 l
563.005 253.153 l
566.784 253.876 l
570.563 247.019 l
574.341 233.068 l
578.12 213.2 l
589.455 140.866 l
593.234 121.034 l
597.012 106.444 l
600.791 98.1184 l
604.57 96.8494 l
608.348 103.205 l
612.127 117.176 l
615.905 137.709 l
627.241 211.714 l
631.02 229.764 l
634.798 240.839 l
638.577 244.728 l
642.355 242.445 l
646.134 235.754 l
661.248 199.728 l
665.027 193.493 l
668.805 188.854 l
672.584 185.587 l
676.362 183.397 l
680.141 181.994 l
683.919 181.131 l
691.476 180.331 l
706.591 180.02 l
831.283 180 l
850.176 180 l
850.176 180 l
stroke
grestore
0.500 setlinewidth
0 setlinecap
[1 3] 0 setdash
0.000 setgray
gsave
755.7 288 94.46 36 clipbox
94.464 36 m
94.464 324 l
stroke
grestore
[] 0 setdash
gsave
/o {
gsave
newpath
translate
0 0 m
0 4 l
stroke
grestore
} bind def
94.464 36 o
grestore
gsave
/o {
gsave
newpath
translate
0 0 m
0 -4 l
stroke
grestore
} bind def
94.464 324 o
grestore
/BitstreamVeraSans-Roman findfont
12.000 scalefont
setfont
gsave
66.612437 22.921875 translate
0.000000 rotate
0.000000 0.171875 m /zero glyphshow
7.634766 0.171875 m /period glyphshow
11.449219 0.171875 m /zero glyphshow
19.083984 0.171875 m /zero glyphshow
26.718750 0.171875 m /zero glyphshow
34.353516 0.171875 m /zero glyphshow
41.988281 0.171875 m /zero glyphshow
49.623047 0.171875 m /zero glyphshow
grestore
[1 3] 0 setdash
gsave
755.7 288 94.46 36 clipbox
283.392 36 m
283.392 324 l
stroke
grestore
[] 0 setdash
gsave
/o {
gsave
newpath
translate
0 0 m
0 4 l
stroke
grestore
} bind def
283.392 36 o
grestore
gsave
/o {
gsave
newpath
translate
0 0 m
0 -4 l
stroke
grestore
} bind def
283.392 324 o
grestore
gsave
255.665437 22.921875 translate
0.000000 rotate
0.000000 0.171875 m /zero glyphshow
7.634766 0.171875 m /period glyphshow
11.449219 0.171875 m /zero glyphshow
19.083984 0.171875 m /zero glyphshow
26.718750 0.171875 m /zero glyphshow
34.353516 0.171875 m /zero glyphshow
41.988281 0.171875 m /zero glyphshow
49.623047 0.171875 m /five glyphshow
grestore
[1 3] 0 setdash
gsave
755.7 288 94.46 36 clipbox
472.32 36 m
472.32 324 l
stroke
grestore
[] 0 setdash
gsave
/o {
gsave
newpath
translate
0 0 m
0 4 l
stroke
grestore
} bind def
472.32 36 o
grestore
gsave
/o {
gsave
newpath
translate
0 0 m
0 -4 l
stroke
grestore
} bind def
472.32 324 o
grestore
gsave
444.468437 22.921875 translate
0.000000 rotate
0.000000 0.171875 m /zero glyphshow
7.634766 0.171875 m /period glyphshow
11.449219 0.171875 m /zero glyphshow
19.083984 0.171875 m /zero glyphshow
26.718750 0.171875 m /zero glyphshow
34.353516 0.171875 m /zero glyphshow
41.988281 0.171875 m /one glyphshow
49.623047 0.171875 m /zero glyphshow
grestore
[1 3] 0 setdash
gsave
755.7 288 94.46 36 clipbox
661.248 36 m
661.248 324 l
stroke
grestore
[] 0 setdash
gsave
/o {
gsave
newpath
translate
0 0 m
0 4 l
stroke
grestore
} bind def
661.248 36 o
grestore
gsave
/o {
gsave
newpath
translate
0 0 m
0 -4 l
stroke
grestore
} bind def
661.248 324 o
grestore
gsave
633.521437 22.921875 translate
0.000000 rotate
0.000000 0.171875 m /zero glyphshow
7.634766 0.171875 m /period glyphshow
11.449219 0.171875 m /zero glyphshow
19.083984 0.171875 m /zero glyphshow
26.718750 0.171875 m /zero glyphshow
34.353516 0.171875 m /zero glyphshow
41.988281 0.171875 m /one glyphshow
49.623047 0.171875 m /five glyphshow
grestore
[1 3] 0 setdash
gsave
755.7 288 94.46 36 clipbox
850.176 36 m
850.176 324 l
stroke
grestore
[] 0 setdash
gsave
/o {
gsave
newpath
translate
0 0 m
0 4 l
stroke
grestore
} bind def
850.176 36 o
grestore
gsave
/o {
gsave
newpath
translate
0 0 m
0 -4 l
stroke
grestore
} bind def
850.176 324 o
grestore
gsave
822.324437 22.921875 translate
0.000000 rotate
0.000000 0.171875 m /zero glyphshow
7.634766 0.171875 m /period glyphshow
11.449219 0.171875 m /zero glyphshow
19.083984 0.171875 m /zero glyphshow
26.718750 0.171875 m /zero glyphshow
34.353516 0.171875 m /zero glyphshow
41.988281 0.171875 m /two glyphshow
49.623047 0.171875 m /zero glyphshow
grestore
469.687 11.359 m
(z) show
[1 3] 0 setdash
gsave
755.7 288 94.46 36 clipbox
94.464 83.915 m
850.176 83.915 l
stroke
grestore
[] 0 setdash
gsave
/o {
gsave
newpath
translate
0 0 m
4 0 l
stroke
grestore
} bind def
94.464 83.915 o
grestore
gsave
/o {
gsave
newpath
translate
0 0 m
-4 0 l
stroke
grestore
} bind def
850.176 83.915 o
grestore
gsave
63.370250 79.375914 translate
0.000000 rotate
0.000000 0.171875 m /minus glyphshow
10.054688 0.171875 m /one glyphshow
17.689453 0.171875 m /period glyphshow
21.503906 0.171875 m /zero glyphshow
grestore
[1 3] 0 setdash
gsave
755.7 288 94.46 36 clipbox
94.464 131.957 m
850.176 131.957 l
stroke
grestore
[] 0 setdash
gsave
/o {
gsave
newpath
translate
0 0 m
4 0 l
stroke
grestore
} bind def
94.464 131.957 o
grestore
gsave
/o {
gsave
newpath
translate
0 0 m
-4 0 l
stroke
grestore
} bind def
850.176 131.957 o
grestore
gsave
63.620250 127.418426 translate
0.000000 rotate
0.000000 0.171875 m /minus glyphshow
10.054688 0.171875 m /zero glyphshow
17.689453 0.171875 m /period glyphshow
21.503906 0.171875 m /five glyphshow
grestore
[1 3] 0 setdash
gsave
755.7 288 94.46 36 clipbox
94.464 180 m
850.176 180 l
stroke
grestore
[] 0 setdash
gsave
/o {
gsave
newpath
translate
0 0 m
4 0 l
stroke
grestore
} bind def
94.464 180 o
grestore
gsave
/o {
gsave
newpath
translate
0 0 m
-4 0 l
stroke
grestore
} bind def
850.176 180 o
grestore
gsave
72.964000 175.460938 translate
0.000000 rotate
0.000000 0.171875 m /zero glyphshow
7.634766 0.171875 m /period glyphshow
11.449219 0.171875 m /zero glyphshow
grestore
[1 3] 0 setdash
gsave
755.7 288 94.46 36 clipbox
94.464 228.043 m
850.176 228.043 l
stroke
grestore
[] 0 setdash
gsave
/o {
gsave
newpath
translate
0 0 m
4 0 l
stroke
grestore
} bind def
94.464 228.043 o
grestore
gsave
/o {
gsave
newpath
translate
0 0 m
-4 0 l
stroke
grestore
} bind def
850.176 228.043 o
grestore
gsave
73.214000 223.503449 translate
0.000000 rotate
0.000000 0.171875 m /zero glyphshow
7.634766 0.171875 m /period glyphshow
11.449219 0.171875 m /five glyphshow
grestore
[1 3] 0 setdash
gsave
755.7 288 94.46 36 clipbox
94.464 276.085 m
850.176 276.085 l
stroke
grestore
[] 0 setdash
gsave
/o {
gsave
newpath
translate
0 0 m
4 0 l
stroke
grestore
} bind def
94.464 276.085 o
grestore
gsave
/o {
gsave
newpath
translate
0 0 m
-4 0 l
stroke
grestore
} bind def
850.176 276.085 o
grestore
gsave
73.479625 271.545961 translate
0.000000 rotate
0.000000 0.171875 m /one glyphshow
7.634766 0.171875 m /period glyphshow
11.449219 0.171875 m /zero glyphshow
grestore
58.37 173.445 m
gsave
90 rotate
(Ex) show
grestore
1.000 setlinewidth
2 setlinecap
gsave
94.464 324 m
850.176 324 l
stroke
grestore
gsave
850.176 36 m
850.176 324 l
stroke
grestore
gsave
94.464 36 m
850.176 36 l
stroke
grestore
gsave
94.464 36 m
94.464 324 l
stroke
grestore
gsave
320.809 329.173 m
623.831 329.173 l
623.831 354.24 l
320.809 354.24 l
320.809 329.173 l
cl
gsave
1.000 setgray
fill
grestore
stroke
grestore
1.000 0.000 0.000 setrgbcolor
gsave
330.889 342.879 m
351.049 342.879 l
stroke
grestore
0.000 setgray
/BitstreamVeraSans-Roman findfont
14.400 scalefont
setfont
366.889 334.933 m
0 2.906 rmoveto
(Analytical) show
0.000 0.502 0.000 setrgbcolor
gsave
469.165 342.879 m
489.325 342.879 l
stroke
grestore
0.000 setgray
505.165 334.933 m
0 2.906 rmoveto
(Implicit scheme) show

end
showpage
