%!PS-Adobe-3.0 EPSF-3.0
%%Title: graph/solution/1.eps
%%Creator: matplotlib version 0.99.0, http://matplotlib.sourceforge.net/
%%CreationDate: Mon Dec 21 22:22:59 2009
%%Orientation: portrait
%%BoundingBox: -166 216 778 576
%%EndComments
%%BeginProlog
/mpldict 8 dict def
mpldict begin
/m { moveto } bind def
/l { lineto } bind def
/r { rlineto } bind def
/c { curveto } bind def
/cl { closepath } bind def
/box {
m
1 index 0 r
0 exch r
neg 0 r
cl
} bind def
/clipbox {
box
clip
newpath
} bind def
%!PS-Adobe-3.0 Resource-Font
%%Title: Bitstream Vera Sans
%%Copyright: Copyright (c) 2003 by Bitstream, Inc. All Rights Reserved.
%%Creator: Converted from TrueType by PPR
25 dict begin
/_d{bind def}bind def
/_m{moveto}_d
/_l{lineto}_d
/_cl{closepath eofill}_d
/_c{curveto}_d
/_sc{7 -1 roll{setcachedevice}{pop pop pop pop pop pop}ifelse}_d
/_e{exec}_d
/FontName /BitstreamVeraSans-Roman def
/PaintType 0 def
/FontMatrix[.001 0 0 .001 0 0]def
/FontBBox[-182 -235 1287 928]def
/FontType 3 def
/Encoding StandardEncoding def
/FontInfo 10 dict dup begin
/FamilyName (Bitstream Vera Sans) def
/FullName (Bitstream Vera Sans) def
/Notice (Copyright (c) 2003 by Bitstream, Inc. All Rights Reserved. Bitstream Vera is a trademark of Bitstream, Inc.) def
/Weight (Roman) def
/Version (Release 1.10) def
/ItalicAngle 0.0 def
/isFixedPitch false def
/UnderlinePosition -213 def
/UnderlineThickness 143 def
end readonly def
/CharStrings 23 dict dup begin
/space{318 0 0 0 0 0 _sc
}_d
/period{318 0 107 0 210 124 _sc
107 124 _m
210 124 _l
210 0 _l
107 0 _l
107 124 _l
_cl}_d
/zero{636 0 66 -13 570 742 _sc
318 664 _m
267 664 229 639 203 589 _c
177 539 165 464 165 364 _c
165 264 177 189 203 139 _c
229 89 267 64 318 64 _c
369 64 407 89 433 139 _c
458 189 471 264 471 364 _c
471 464 458 539 433 589 _c
407 639 369 664 318 664 _c
318 742 _m
399 742 461 709 505 645 _c
548 580 570 486 570 364 _c
570 241 548 147 505 83 _c
461 19 399 -13 318 -13 _c
236 -13 173 19 130 83 _c
87 147 66 241 66 364 _c
66 486 87 580 130 645 _c
173 709 236 742 318 742 _c
_cl}_d
/one{636 0 110 0 544 729 _sc
124 83 _m
285 83 _l
285 639 _l
110 604 _l
110 694 _l
284 729 _l
383 729 _l
383 83 _l
544 83 _l
544 0 _l
124 0 _l
124 83 _l
_cl}_d
/two{{636 0 73 0 536 742 _sc
192 83 _m
536 83 _l
536 0 _l
73 0 _l
73 83 _l
110 121 161 173 226 239 _c
290 304 331 346 348 365 _c
380 400 402 430 414 455 _c
426 479 433 504 433 528 _c
433 566 419 598 392 622 _c
365 646 330 659 286 659 _c
255 659 222 653 188 643 _c
154 632 117 616 78 594 _c
78 694 _l
118 710 155 722 189 730 _c
223 738 255 742 284 742 _c
359 742 419 723 464 685 _c
509 647 532 597 532 534 _c
532 504 526 475 515 449 _c
504 422 484 390 454 354 _c
446 344 420 317 376 272 _c
332 227 271 164 192 83 _c
_cl}_e}_d
/five{{636 0 77 -13 549 729 _sc
108 729 _m
495 729 _l
495 646 _l
198 646 _l
198 467 _l
212 472 227 476 241 478 _c
255 480 270 482 284 482 _c
365 482 429 459 477 415 _c
525 370 549 310 549 234 _c
549 155 524 94 475 51 _c
426 8 357 -13 269 -13 _c
238 -13 207 -10 175 -6 _c
143 -1 111 6 77 17 _c
77 116 _l
106 100 136 88 168 80 _c
199 72 232 69 267 69 _c
323 69 368 83 401 113 _c
433 143 450 183 450 234 _c
450 284 433 324 401 354 _c
368 384 323 399 267 399 _c
241 399 214 396 188 390 _c
162 384 135 375 108 363 _c
108 729 _l
_cl}_e}_d
/A{684 0 8 0 676 729 _sc
342 632 _m
208 269 _l
476 269 _l
342 632 _l
286 729 _m
398 729 _l
676 0 _l
573 0 _l
507 187 _l
178 187 _l
112 0 _l
8 0 _l
286 729 _l
_cl}_d
/E{632 0 98 0 568 729 _sc
98 729 _m
559 729 _l
559 646 _l
197 646 _l
197 430 _l
544 430 _l
544 347 _l
197 347 _l
197 83 _l
568 83 _l
568 0 _l
98 0 _l
98 729 _l
_cl}_d
/a{{613 0 60 -13 522 560 _sc
343 275 _m
270 275 220 266 192 250 _c
164 233 150 205 150 165 _c
150 133 160 107 181 89 _c
202 70 231 61 267 61 _c
317 61 357 78 387 114 _c
417 149 432 196 432 255 _c
432 275 _l
343 275 _l
522 312 _m
522 0 _l
432 0 _l
432 83 _l
411 49 385 25 355 10 _c
325 -5 287 -13 243 -13 _c
187 -13 142 2 109 33 _c
76 64 60 106 60 159 _c
60 220 80 266 122 298 _c
163 329 224 345 306 345 _c
432 345 _l
432 354 _l
432 395 418 427 391 450 _c
364 472 326 484 277 484 _c
245 484 215 480 185 472 _c
155 464 127 453 100 439 _c
100 522 _l
}_e{132 534 164 544 195 550 _c
226 556 256 560 286 560 _c
365 560 424 539 463 498 _c
502 457 522 395 522 312 _c
_cl}_e}_d
/c{{550 0 55 -13 488 560 _sc
488 526 _m
488 442 _l
462 456 437 466 411 473 _c
385 480 360 484 334 484 _c
276 484 230 465 198 428 _c
166 391 150 339 150 273 _c
150 206 166 154 198 117 _c
230 80 276 62 334 62 _c
360 62 385 65 411 72 _c
437 79 462 90 488 104 _c
488 21 _l
462 9 436 0 410 -5 _c
383 -10 354 -13 324 -13 _c
242 -13 176 12 128 64 _c
79 115 55 185 55 273 _c
55 362 79 432 128 483 _c
177 534 244 560 330 560 _c
358 560 385 557 411 551 _c
437 545 463 537 488 526 _c
_cl}_e}_d
/e{{615 0 55 -13 562 560 _sc
562 296 _m
562 252 _l
149 252 _l
153 190 171 142 205 110 _c
238 78 284 62 344 62 _c
378 62 412 66 444 74 _c
476 82 509 95 541 113 _c
541 28 _l
509 14 476 3 442 -3 _c
408 -9 373 -13 339 -13 _c
251 -13 182 12 131 62 _c
80 112 55 181 55 268 _c
55 357 79 428 127 481 _c
175 533 241 560 323 560 _c
397 560 455 536 498 489 _c
540 441 562 377 562 296 _c
472 322 _m
471 371 457 410 431 440 _c
404 469 368 484 324 484 _c
274 484 234 469 204 441 _c
174 413 156 373 152 322 _c
472 322 _l
_cl}_e}_d
/h{634 0 91 0 549 760 _sc
549 330 _m
549 0 _l
459 0 _l
459 327 _l
459 379 448 417 428 443 _c
408 469 378 482 338 482 _c
289 482 251 466 223 435 _c
195 404 181 362 181 309 _c
181 0 _l
91 0 _l
91 760 _l
181 760 _l
181 462 _l
202 494 227 519 257 535 _c
286 551 320 560 358 560 _c
420 560 468 540 500 501 _c
532 462 549 405 549 330 _c
_cl}_d
/i{278 0 94 0 184 760 _sc
94 547 _m
184 547 _l
184 0 _l
94 0 _l
94 547 _l
94 760 _m
184 760 _l
184 646 _l
94 646 _l
94 760 _l
_cl}_d
/l{278 0 94 0 184 760 _sc
94 760 _m
184 760 _l
184 0 _l
94 0 _l
94 760 _l
_cl}_d
/m{{974 0 91 0 889 560 _sc
520 442 _m
542 482 569 511 600 531 _c
631 550 668 560 711 560 _c
767 560 811 540 842 500 _c
873 460 889 403 889 330 _c
889 0 _l
799 0 _l
799 327 _l
799 379 789 418 771 444 _c
752 469 724 482 686 482 _c
639 482 602 466 575 435 _c
548 404 535 362 535 309 _c
535 0 _l
445 0 _l
445 327 _l
445 379 435 418 417 444 _c
398 469 369 482 331 482 _c
285 482 248 466 221 435 _c
194 404 181 362 181 309 _c
181 0 _l
91 0 _l
91 547 _l
181 547 _l
181 462 _l
201 495 226 520 255 536 _c
283 552 317 560 357 560 _c
397 560 430 550 458 530 _c
486 510 506 480 520 442 _c
}_e{_cl}_e}_d
/n{634 0 91 0 549 560 _sc
549 330 _m
549 0 _l
459 0 _l
459 327 _l
459 379 448 417 428 443 _c
408 469 378 482 338 482 _c
289 482 251 466 223 435 _c
195 404 181 362 181 309 _c
181 0 _l
91 0 _l
91 547 _l
181 547 _l
181 462 _l
202 494 227 519 257 535 _c
286 551 320 560 358 560 _c
420 560 468 540 500 501 _c
532 462 549 405 549 330 _c
_cl}_d
/p{{635 0 91 -207 580 560 _sc
181 82 _m
181 -207 _l
91 -207 _l
91 547 _l
181 547 _l
181 464 _l
199 496 223 520 252 536 _c
281 552 316 560 356 560 _c
422 560 476 533 518 481 _c
559 428 580 359 580 273 _c
580 187 559 117 518 65 _c
476 13 422 -13 356 -13 _c
316 -13 281 -5 252 10 _c
223 25 199 49 181 82 _c
487 273 _m
487 339 473 390 446 428 _c
418 466 381 485 334 485 _c
286 485 249 466 222 428 _c
194 390 181 339 181 273 _c
181 207 194 155 222 117 _c
249 79 286 61 334 61 _c
381 61 418 79 446 117 _c
473 155 487 207 487 273 _c
_cl}_e}_d
/s{{521 0 54 -13 472 560 _sc
443 531 _m
443 446 _l
417 458 391 468 364 475 _c
336 481 308 485 279 485 _c
234 485 200 478 178 464 _c
156 450 145 430 145 403 _c
145 382 153 366 169 354 _c
185 342 217 330 265 320 _c
296 313 _l
360 299 405 279 432 255 _c
458 230 472 195 472 151 _c
472 100 452 60 412 31 _c
372 1 316 -13 246 -13 _c
216 -13 186 -10 154 -5 _c
122 0 89 8 54 20 _c
54 113 _l
87 95 120 82 152 74 _c
184 65 216 61 248 61 _c
290 61 323 68 346 82 _c
368 96 380 117 380 144 _c
380 168 371 187 355 200 _c
339 213 303 226 247 238 _c
216 245 _l
160 257 119 275 95 299 _c
70 323 58 356 58 399 _c
58 450 76 490 112 518 _c
148 546 200 560 268 560 _c
}_e{301 560 332 557 362 552 _c
391 547 418 540 443 531 _c
_cl}_e}_d
/t{392 0 27 0 368 702 _sc
183 702 _m
183 547 _l
368 547 _l
368 477 _l
183 477 _l
183 180 _l
183 135 189 106 201 94 _c
213 81 238 75 276 75 _c
368 75 _l
368 0 _l
276 0 _l
206 0 158 13 132 39 _c
106 65 93 112 93 180 _c
93 477 _l
27 477 _l
27 547 _l
93 547 _l
93 702 _l
183 702 _l
_cl}_d
/x{592 0 29 0 559 547 _sc
549 547 _m
351 281 _l
559 0 _l
453 0 _l
294 215 _l
135 0 _l
29 0 _l
241 286 _l
47 547 _l
153 547 _l
298 352 _l
443 547 _l
549 547 _l
_cl}_d
/y{592 0 30 -207 562 547 _sc
322 -50 _m
296 -114 271 -157 247 -177 _c
223 -197 191 -207 151 -207 _c
79 -207 _l
79 -132 _l
132 -132 _l
156 -132 175 -126 189 -114 _c
203 -102 218 -75 235 -31 _c
251 9 _l
30 547 _l
125 547 _l
296 119 _l
467 547 _l
562 547 _l
322 -50 _l
_cl}_d
/z{525 0 43 0 482 547 _sc
55 547 _m
482 547 _l
482 465 _l
144 72 _l
482 72 _l
482 0 _l
43 0 _l
43 82 _l
381 475 _l
55 475 _l
55 547 _l
_cl}_d
/minus{838 0 106 272 732 355 _sc
106 355 _m
732 355 _l
732 272 _l
106 272 _l
106 355 _l
_cl}_d
end readonly def

/BuildGlyph
 {exch begin
 CharStrings exch
 2 copy known not{pop /.notdef}if
 true 3 1 roll get exec
 end}_d

/BuildChar {
 1 index /Encoding get exch get
 1 index /BuildGlyph get exec
}_d

FontName currentdict end definefont pop
end
%%EndProlog
mpldict begin
-166.32 216 translate
944.64 360 0 0 clipbox
1.000 setlinewidth
1 setlinejoin
2 setlinecap
[] 0 setdash
1.000 setgray
gsave
0 0 m
944.64 0 l
944.64 360 l
0 360 l
0 0 l
gsave
fill
grestore
stroke
grestore
gsave
94.464 36 m
850.176 36 l
850.176 324 l
94.464 324 l
94.464 36 l
fill
grestore
1.000 0.000 0.000 setrgbcolor
gsave
755.7 288 94.46 36 clipbox
94.464 180 m
102.021 239.288 l
109.578 275.955 l
117.135 276 l
124.692 239.376 l
132.25 180.01 l
139.807 120.491 l
147.364 83.4705 l
154.921 83.0237 l
162.478 119.291 l
170.035 178.423 l
177.592 237.857 l
185.149 274.916 l
192.707 275.447 l
200.264 239.219 l
207.821 180.644 l
215.378 180.001 l
222.935 180 l
230.492 180 l
238.049 180 l
245.606 180 l
253.164 180 l
260.721 180 l
268.278 180 l
275.835 180 l
283.392 180 l
290.949 180 l
298.506 180 l
306.063 180 l
313.62 180 l
321.178 180 l
328.735 180 l
336.292 180 l
343.849 180 l
351.406 180 l
358.963 180 l
366.52 180 l
374.077 180 l
381.635 180 l
389.192 180 l
396.749 180 l
404.306 180 l
411.863 180 l
419.42 180 l
426.977 180 l
434.534 180 l
442.092 180 l
449.649 180 l
457.206 180 l
464.763 180 l
472.32 180 l
479.877 180 l
487.434 180 l
494.991 180 l
502.548 180 l
510.106 180 l
517.663 180 l
525.22 180 l
532.777 180 l
540.334 180 l
547.891 180 l
555.448 180 l
563.005 180 l
570.563 180 l
578.12 180 l
585.677 180 l
593.234 180 l
600.791 180 l
608.348 180 l
615.905 180 l
623.462 180 l
631.02 180 l
638.577 180 l
646.134 180 l
653.691 180 l
661.248 180 l
668.805 180 l
676.362 180 l
683.919 180 l
691.476 180 l
699.034 180 l
706.591 180 l
714.148 180 l
721.705 180 l
729.262 180 l
736.819 180 l
744.376 180 l
751.933 180 l
759.491 180 l
767.048 180 l
774.605 180 l
782.162 180 l
789.719 180 l
797.276 180 l
804.833 180 l
812.39 180 l
819.948 180 l
827.505 180 l
835.062 180 l
842.619 180 l
850.176 180 l
stroke
grestore
0.000 0.000 1.000 setrgbcolor
gsave
755.7 288 94.46 36 clipbox
94.464 180 m
94.4642 0 l
104.973 0 m
104.973 360 l
113.392 360 m
113.392 0 l
121.529 0 m
121.529 360 l
129.596 360 m
129.596 0 l
137.664 0 m
137.664 360 l
145.779 360 m
145.78 0 l
154.003 0 m
154.009 360 l
162.453 360 m
162.478 180 l
170.035 180 l
177.592 180 l
185.149 180 l
192.707 180 l
200.264 180 l
207.821 180 l
215.378 180 l
222.935 180 l
230.492 180 l
238.049 180 l
245.606 180 l
253.164 180 l
260.721 180 l
268.278 180 l
275.835 180 l
283.392 180 l
290.949 180 l
298.506 180 l
306.063 180 l
313.62 180 l
321.178 180 l
328.735 180 l
336.292 180 l
343.849 180 l
351.406 180 l
358.963 180 l
366.52 180 l
374.077 180 l
381.635 180 l
389.192 180 l
396.749 180 l
404.306 180 l
411.863 180 l
419.42 180 l
426.977 180 l
434.534 180 l
442.092 180 l
449.649 180 l
457.206 180 l
464.763 180 l
472.32 180 l
479.877 180 l
487.434 180 l
494.991 180 l
502.548 180 l
510.106 180 l
517.663 180 l
525.22 180 l
532.777 180 l
540.334 180 l
547.891 180 l
555.448 180 l
563.005 180 l
570.563 180 l
578.12 180 l
585.677 180 l
593.234 180 l
600.791 180 l
608.348 180 l
615.905 180 l
623.462 180 l
631.02 180 l
638.577 180 l
646.134 180 l
653.691 180 l
661.248 180 l
668.805 180 l
676.362 180 l
683.919 180 l
691.476 180 l
699.034 180 l
706.591 180 l
714.148 180 l
721.705 180 l
729.262 180 l
736.819 180 l
744.376 180 l
751.933 180 l
759.491 180 l
767.048 180 l
774.605 180 l
782.162 180 l
789.719 180 l
797.276 180 l
804.833 180 l
812.39 180 l
819.948 180 l
827.505 180 l
835.062 180 l
842.619 180 l
850.176 180 l
stroke
grestore
0.500 setlinewidth
0 setlinecap
[1 3] 0 setdash
0.000 setgray
gsave
755.7 288 94.46 36 clipbox
94.464 36 m
94.464 324 l
stroke
grestore
[] 0 setdash
gsave
/o {
gsave
newpath
translate
0 0 m
0 4 l
stroke
grestore
} bind def
94.464 36 o
grestore
gsave
/o {
gsave
newpath
translate
0 0 m
0 -4 l
stroke
grestore
} bind def
94.464 324 o
grestore
/BitstreamVeraSans-Roman findfont
12.000 scalefont
setfont
gsave
66.612437 22.921875 translate
0.000000 rotate
0.000000 0.171875 m /zero glyphshow
7.634766 0.171875 m /period glyphshow
11.449219 0.171875 m /zero glyphshow
19.083984 0.171875 m /zero glyphshow
26.718750 0.171875 m /zero glyphshow
34.353516 0.171875 m /zero glyphshow
41.988281 0.171875 m /zero glyphshow
49.623047 0.171875 m /zero glyphshow
grestore
[1 3] 0 setdash
gsave
755.7 288 94.46 36 clipbox
283.392 36 m
283.392 324 l
stroke
grestore
[] 0 setdash
gsave
/o {
gsave
newpath
translate
0 0 m
0 4 l
stroke
grestore
} bind def
283.392 36 o
grestore
gsave
/o {
gsave
newpath
translate
0 0 m
0 -4 l
stroke
grestore
} bind def
283.392 324 o
grestore
gsave
255.665437 22.921875 translate
0.000000 rotate
0.000000 0.171875 m /zero glyphshow
7.634766 0.171875 m /period glyphshow
11.449219 0.171875 m /zero glyphshow
19.083984 0.171875 m /zero glyphshow
26.718750 0.171875 m /zero glyphshow
34.353516 0.171875 m /zero glyphshow
41.988281 0.171875 m /zero glyphshow
49.623047 0.171875 m /five glyphshow
grestore
[1 3] 0 setdash
gsave
755.7 288 94.46 36 clipbox
472.32 36 m
472.32 324 l
stroke
grestore
[] 0 setdash
gsave
/o {
gsave
newpath
translate
0 0 m
0 4 l
stroke
grestore
} bind def
472.32 36 o
grestore
gsave
/o {
gsave
newpath
translate
0 0 m
0 -4 l
stroke
grestore
} bind def
472.32 324 o
grestore
gsave
444.468437 22.921875 translate
0.000000 rotate
0.000000 0.171875 m /zero glyphshow
7.634766 0.171875 m /period glyphshow
11.449219 0.171875 m /zero glyphshow
19.083984 0.171875 m /zero glyphshow
26.718750 0.171875 m /zero glyphshow
34.353516 0.171875 m /zero glyphshow
41.988281 0.171875 m /one glyphshow
49.623047 0.171875 m /zero glyphshow
grestore
[1 3] 0 setdash
gsave
755.7 288 94.46 36 clipbox
661.248 36 m
661.248 324 l
stroke
grestore
[] 0 setdash
gsave
/o {
gsave
newpath
translate
0 0 m
0 4 l
stroke
grestore
} bind def
661.248 36 o
grestore
gsave
/o {
gsave
newpath
translate
0 0 m
0 -4 l
stroke
grestore
} bind def
661.248 324 o
grestore
gsave
633.521437 22.921875 translate
0.000000 rotate
0.000000 0.171875 m /zero glyphshow
7.634766 0.171875 m /period glyphshow
11.449219 0.171875 m /zero glyphshow
19.083984 0.171875 m /zero glyphshow
26.718750 0.171875 m /zero glyphshow
34.353516 0.171875 m /zero glyphshow
41.988281 0.171875 m /one glyphshow
49.623047 0.171875 m /five glyphshow
grestore
[1 3] 0 setdash
gsave
755.7 288 94.46 36 clipbox
850.176 36 m
850.176 324 l
stroke
grestore
[] 0 setdash
gsave
/o {
gsave
newpath
translate
0 0 m
0 4 l
stroke
grestore
} bind def
850.176 36 o
grestore
gsave
/o {
gsave
newpath
translate
0 0 m
0 -4 l
stroke
grestore
} bind def
850.176 324 o
grestore
gsave
822.324437 22.921875 translate
0.000000 rotate
0.000000 0.171875 m /zero glyphshow
7.634766 0.171875 m /period glyphshow
11.449219 0.171875 m /zero glyphshow
19.083984 0.171875 m /zero glyphshow
26.718750 0.171875 m /zero glyphshow
34.353516 0.171875 m /zero glyphshow
41.988281 0.171875 m /two glyphshow
49.623047 0.171875 m /zero glyphshow
grestore
469.687 11.359 m
(z) show
[1 3] 0 setdash
gsave
755.7 288 94.46 36 clipbox
94.464 78.8928 m
850.176 78.8928 l
stroke
grestore
[] 0 setdash
gsave
/o {
gsave
newpath
translate
0 0 m
4 0 l
stroke
grestore
} bind def
94.464 78.8928 o
grestore
gsave
/o {
gsave
newpath
translate
0 0 m
-4 0 l
stroke
grestore
} bind def
850.176 78.8928 o
grestore
gsave
63.370250 74.353721 translate
0.000000 rotate
0.000000 0.171875 m /minus glyphshow
10.054688 0.171875 m /one glyphshow
17.689453 0.171875 m /period glyphshow
21.503906 0.171875 m /zero glyphshow
grestore
[1 3] 0 setdash
gsave
755.7 288 94.46 36 clipbox
94.464 129.446 m
850.176 129.446 l
stroke
grestore
[] 0 setdash
gsave
/o {
gsave
newpath
translate
0 0 m
4 0 l
stroke
grestore
} bind def
94.464 129.446 o
grestore
gsave
/o {
gsave
newpath
translate
0 0 m
-4 0 l
stroke
grestore
} bind def
850.176 129.446 o
grestore
gsave
63.620250 124.907329 translate
0.000000 rotate
0.000000 0.171875 m /minus glyphshow
10.054688 0.171875 m /zero glyphshow
17.689453 0.171875 m /period glyphshow
21.503906 0.171875 m /five glyphshow
grestore
[1 3] 0 setdash
gsave
755.7 288 94.46 36 clipbox
94.464 180 m
850.176 180 l
stroke
grestore
[] 0 setdash
gsave
/o {
gsave
newpath
translate
0 0 m
4 0 l
stroke
grestore
} bind def
94.464 180 o
grestore
gsave
/o {
gsave
newpath
translate
0 0 m
-4 0 l
stroke
grestore
} bind def
850.176 180 o
grestore
gsave
72.964000 175.460938 translate
0.000000 rotate
0.000000 0.171875 m /zero glyphshow
7.634766 0.171875 m /period glyphshow
11.449219 0.171875 m /zero glyphshow
grestore
[1 3] 0 setdash
gsave
755.7 288 94.46 36 clipbox
94.464 230.554 m
850.176 230.554 l
stroke
grestore
[] 0 setdash
gsave
/o {
gsave
newpath
translate
0 0 m
4 0 l
stroke
grestore
} bind def
94.464 230.554 o
grestore
gsave
/o {
gsave
newpath
translate
0 0 m
-4 0 l
stroke
grestore
} bind def
850.176 230.554 o
grestore
gsave
73.214000 226.014546 translate
0.000000 rotate
0.000000 0.171875 m /zero glyphshow
7.634766 0.171875 m /period glyphshow
11.449219 0.171875 m /five glyphshow
grestore
[1 3] 0 setdash
gsave
755.7 288 94.46 36 clipbox
94.464 281.107 m
850.176 281.107 l
stroke
grestore
[] 0 setdash
gsave
/o {
gsave
newpath
translate
0 0 m
4 0 l
stroke
grestore
} bind def
94.464 281.107 o
grestore
gsave
/o {
gsave
newpath
translate
0 0 m
-4 0 l
stroke
grestore
} bind def
850.176 281.107 o
grestore
gsave
73.479625 276.568154 translate
0.000000 rotate
0.000000 0.171875 m /one glyphshow
7.634766 0.171875 m /period glyphshow
11.449219 0.171875 m /zero glyphshow
grestore
58.37 173.445 m
gsave
90 rotate
(Ex) show
grestore
1.000 setlinewidth
2 setlinecap
gsave
94.464 324 m
850.176 324 l
stroke
grestore
gsave
850.176 36 m
850.176 324 l
stroke
grestore
gsave
94.464 36 m
850.176 36 l
stroke
grestore
gsave
94.464 36 m
94.464 324 l
stroke
grestore
gsave
321.129 329.173 m
623.511 329.173 l
623.511 354.24 l
321.129 354.24 l
321.129 329.173 l
cl
gsave
1.000 setgray
fill
grestore
stroke
grestore
1.000 0.000 0.000 setrgbcolor
gsave
331.209 342.879 m
351.369 342.879 l
stroke
grestore
0.000 setgray
/BitstreamVeraSans-Roman findfont
14.400 scalefont
setfont
367.209 334.933 m
0 2.906 rmoveto
(Analytical) show
0.000 0.000 1.000 setrgbcolor
gsave
469.485 342.879 m
489.645 342.879 l
stroke
grestore
0.000 setgray
505.485 334.933 m
0 2.906 rmoveto
(Explicit scheme) show

end
showpage
