%!PS-Adobe-3.0 EPSF-3.0
%%Title: /home/muha/src/python/course/second.eps
%%Creator: matplotlib version 0.99.0, http://matplotlib.sourceforge.net/
%%CreationDate: Mon Nov 23 22:16:49 2009
%%Orientation: portrait
%%BoundingBox: 18 184 594 607
%%EndComments
%%BeginProlog
/mpldict 8 dict def
mpldict begin
/m { moveto } bind def
/l { lineto } bind def
/r { rlineto } bind def
/c { curveto } bind def
/cl { closepath } bind def
/box {
m
1 index 0 r
0 exch r
neg 0 r
cl
} bind def
/clipbox {
box
clip
newpath
} bind def
%!PS-Adobe-3.0 Resource-Font
%%Title: Bitstream Vera Sans
%%Copyright: Copyright (c) 2003 by Bitstream, Inc. All Rights Reserved.
%%Creator: Converted from TrueType by PPR
25 dict begin
/_d{bind def}bind def
/_m{moveto}_d
/_l{lineto}_d
/_cl{closepath eofill}_d
/_c{curveto}_d
/_sc{7 -1 roll{setcachedevice}{pop pop pop pop pop pop}ifelse}_d
/_e{exec}_d
/FontName /BitstreamVeraSans-Roman def
/PaintType 0 def
/FontMatrix[.001 0 0 .001 0 0]def
/FontBBox[-182 -235 1287 928]def
/FontType 3 def
/Encoding StandardEncoding def
/FontInfo 10 dict dup begin
/FamilyName (Bitstream Vera Sans) def
/FullName (Bitstream Vera Sans) def
/Notice (Copyright (c) 2003 by Bitstream, Inc. All Rights Reserved. Bitstream Vera is a trademark of Bitstream, Inc.) def
/Weight (Roman) def
/Version (Release 1.10) def
/ItalicAngle 0.0 def
/isFixedPitch false def
/UnderlinePosition -213 def
/UnderlineThickness 143 def
end readonly def
/CharStrings 10 dict dup begin
/period{318 0 107 0 210 124 _sc
107 124 _m
210 124 _l
210 0 _l
107 0 _l
107 124 _l
_cl}_d
/zero{636 0 66 -13 570 742 _sc
318 664 _m
267 664 229 639 203 589 _c
177 539 165 464 165 364 _c
165 264 177 189 203 139 _c
229 89 267 64 318 64 _c
369 64 407 89 433 139 _c
458 189 471 264 471 364 _c
471 464 458 539 433 589 _c
407 639 369 664 318 664 _c
318 742 _m
399 742 461 709 505 645 _c
548 580 570 486 570 364 _c
570 241 548 147 505 83 _c
461 19 399 -13 318 -13 _c
236 -13 173 19 130 83 _c
87 147 66 241 66 364 _c
66 486 87 580 130 645 _c
173 709 236 742 318 742 _c
_cl}_d
/one{636 0 110 0 544 729 _sc
124 83 _m
285 83 _l
285 639 _l
110 604 _l
110 694 _l
284 729 _l
383 729 _l
383 83 _l
544 83 _l
544 0 _l
124 0 _l
124 83 _l
_cl}_d
/two{{636 0 73 0 536 742 _sc
192 83 _m
536 83 _l
536 0 _l
73 0 _l
73 83 _l
110 121 161 173 226 239 _c
290 304 331 346 348 365 _c
380 400 402 430 414 455 _c
426 479 433 504 433 528 _c
433 566 419 598 392 622 _c
365 646 330 659 286 659 _c
255 659 222 653 188 643 _c
154 632 117 616 78 594 _c
78 694 _l
118 710 155 722 189 730 _c
223 738 255 742 284 742 _c
359 742 419 723 464 685 _c
509 647 532 597 532 534 _c
532 504 526 475 515 449 _c
504 422 484 390 454 354 _c
446 344 420 317 376 272 _c
332 227 271 164 192 83 _c
_cl}_e}_d
/three{{636 0 76 -13 556 742 _sc
406 393 _m
453 383 490 362 516 330 _c
542 298 556 258 556 212 _c
556 140 531 84 482 45 _c
432 6 362 -13 271 -13 _c
240 -13 208 -10 176 -4 _c
144 1 110 10 76 22 _c
76 117 _l
103 101 133 89 166 81 _c
198 73 232 69 268 69 _c
330 69 377 81 409 105 _c
441 129 458 165 458 212 _c
458 254 443 288 413 312 _c
383 336 341 349 287 349 _c
202 349 _l
202 430 _l
291 430 _l
339 430 376 439 402 459 _c
428 478 441 506 441 543 _c
441 580 427 609 401 629 _c
374 649 336 659 287 659 _c
260 659 231 656 200 650 _c
169 644 135 635 98 623 _c
98 711 _l
135 721 170 729 203 734 _c
235 739 266 742 296 742 _c
}_e{370 742 429 725 473 691 _c
517 657 539 611 539 553 _c
539 513 527 479 504 451 _c
481 423 448 403 406 393 _c
_cl}_e}_d
/five{{636 0 77 -13 549 729 _sc
108 729 _m
495 729 _l
495 646 _l
198 646 _l
198 467 _l
212 472 227 476 241 478 _c
255 480 270 482 284 482 _c
365 482 429 459 477 415 _c
525 370 549 310 549 234 _c
549 155 524 94 475 51 _c
426 8 357 -13 269 -13 _c
238 -13 207 -10 175 -6 _c
143 -1 111 6 77 17 _c
77 116 _l
106 100 136 88 168 80 _c
199 72 232 69 267 69 _c
323 69 368 83 401 113 _c
433 143 450 183 450 234 _c
450 284 433 324 401 354 _c
368 384 323 399 267 399 _c
241 399 214 396 188 390 _c
162 384 135 375 108 363 _c
108 729 _l
_cl}_e}_d
/E{632 0 98 0 568 729 _sc
98 729 _m
559 729 _l
559 646 _l
197 646 _l
197 430 _l
544 430 _l
544 347 _l
197 347 _l
197 83 _l
568 83 _l
568 0 _l
98 0 _l
98 729 _l
_cl}_d
/x{592 0 29 0 559 547 _sc
549 547 _m
351 281 _l
559 0 _l
453 0 _l
294 215 _l
135 0 _l
29 0 _l
241 286 _l
47 547 _l
153 547 _l
298 352 _l
443 547 _l
549 547 _l
_cl}_d
/z{525 0 43 0 482 547 _sc
55 547 _m
482 547 _l
482 465 _l
144 72 _l
482 72 _l
482 0 _l
43 0 _l
43 82 _l
381 475 _l
55 475 _l
55 547 _l
_cl}_d
/minus{838 0 106 272 732 355 _sc
106 355 _m
732 355 _l
732 272 _l
106 272 _l
106 355 _l
_cl}_d
end readonly def

/BuildGlyph
 {exch begin
 CharStrings exch
 2 copy known not{pop /.notdef}if
 true 3 1 roll get exec
 end}_d

/BuildChar {
 1 index /Encoding get exch get
 1 index /BuildGlyph get exec
}_d

FontName currentdict end definefont pop
end
%%EndProlog
mpldict begin
18 184.5 translate
576 423 0 0 clipbox
1.000 setlinewidth
1 setlinejoin
2 setlinecap
[] 0 setdash
1.000 setgray
gsave
0 0 m
576 0 l
576 423 l
0 423 l
0 0 l
gsave
fill
grestore
stroke
grestore
gsave
72 42.3 m
518.4 42.3 l
518.4 380.7 l
72 380.7 l
72 42.3 l
fill
grestore
1.100 setlinewidth
0.000 setgray
gsave
446.4 338.4 72 42.3 clipbox
72 211.5 m
76.6872 246.01 l
78.9192 258.078 l
80.7048 264.497 l
81.8208 266.839 l
82.9368 267.82 l
84.0528 267.416 l
85.6152 264.551 l
86.9544 260.054 l
88.9632 250.155 l
91.4184 233.989 l
101.016 165.911 l
102.578 159.723 l
104.141 156.015 l
105.257 154.99 l
106.373 155.348 l
107.935 158.153 l
109.274 162.599 l
111.283 172.431 l
113.738 188.532 l
123.336 256.593 l
124.898 262.809 l
126.461 266.548 l
127.577 267.598 l
128.693 267.263 l
130.255 264.492 l
131.594 260.071 l
133.603 250.269 l
136.058 234.186 l
145.879 164.924 l
147.665 158.34 l
148.781 155.887 l
149.897 154.792 l
151.013 155.081 l
151.906 156.304 l
153.468 160.502 l
155.254 168.259 l
157.486 181.658 l
160.834 206.656 l
165.967 244.876 l
168.199 257.141 l
169.985 263.755 l
171.101 266.229 l
171.994 267.234 l
173.11 267.245 l
174.226 265.875 l
175.788 261.707 l
177.574 253.976 l
179.806 240.597 l
183.154 215.594 l
188.287 177.272 l
190.742 163.928 l
192.528 157.637 l
193.644 155.384 l
194.76 154.494 l
195.876 154.989 l
197.215 157.392 l
198.554 161.683 l
200.34 170.074 l
202.572 184.078 l
206.366 213.015 l
210.607 244.248 l
213.062 257.616 l
214.848 263.933 l
215.964 266.205 l
217.08 267.115 l
218.196 266.639 l
219.535 264.26 l
220.874 259.987 l
222.66 251.617 l
224.892 237.625 l
228.686 208.661 l
233.15 175.911 l
235.382 163.866 l
237.168 157.473 l
238.284 155.151 l
239.4 154.19 l
240.516 154.614 l
242.078 157.507 l
243.418 162.023 l
245.426 171.945 l
247.882 188.121 l
257.479 256.001 l
259.042 262.127 l
260.604 265.768 l
261.72 266.744 l
262.836 266.336 l
264.398 263.463 l
265.738 258.961 l
267.746 249.053 l
270.202 232.875 l
279.799 164.744 l
281.362 158.546 l
282.924 154.83 l
284.04 153.797 l
285.156 154.148 l
286.718 156.942 l
288.058 161.38 l
290.066 171.199 l
292.522 187.284 l
302.119 255.281 l
303.682 261.487 l
305.244 265.216 l
306.36 266.258 l
307.476 265.915 l
309.038 263.133 l
310.378 258.703 l
312.386 248.886 l
314.842 232.785 l
324.662 163.442 l
326.448 156.841 l
327.564 154.379 l
328.68 153.273 l
329.796 153.551 l
330.689 154.766 l
332.251 158.948 l
334.037 166.688 l
336.269 180.066 l
339.617 205.031 l
344.75 243.201 l
346.982 255.445 l
348.768 262.041 l
349.884 264.505 l
351 265.61 l
352.116 265.332 l
353.009 264.117 l
354.571 259.933 l
356.357 252.184 l
358.589 238.781 l
361.937 213.738 l
367.294 173.948 l
369.526 161.983 l
371.311 155.67 l
372.427 153.401 l
373.543 152.495 l
374.659 152.977 l
375.998 155.361 l
377.338 159.635 l
379.123 168.002 l
381.355 181.975 l
385.15 210.858 l
389.39 242.034 l
391.846 255.371 l
393.631 261.663 l
394.747 263.915 l
395.863 264.804 l
396.979 264.318 l
398.318 261.918 l
399.658 257.626 l
401.443 249.23 l
403.675 235.201 l
406.8 211.859 l
407.916 211.458 l
417.96 211.5 l
500.544 211.5 l
518.4 211.5 l
518.4 211.5 l
stroke
grestore
0.500 setlinewidth
0 setlinecap
[1 3] 0 setdash
gsave
446.4 338.4 72 42.3 clipbox
72 42.3 m
72 380.7 l
stroke
grestore
[] 0 setdash
gsave
/o {
gsave
newpath
translate
0 0 m
0 4 l
stroke
grestore
} bind def
72 42.3 o
grestore
gsave
/o {
gsave
newpath
translate
0 0 m
0 -4 l
stroke
grestore
} bind def
72 380.7 o
grestore
/BitstreamVeraSans-Roman findfont
12.000 scalefont
setfont
gsave
44.148438 29.221875 translate
0.000000 rotate
0.000000 0.171875 m /zero glyphshow
7.634766 0.171875 m /period glyphshow
11.449219 0.171875 m /zero glyphshow
19.083984 0.171875 m /zero glyphshow
26.718750 0.171875 m /zero glyphshow
34.353516 0.171875 m /zero glyphshow
41.988281 0.171875 m /zero glyphshow
49.623047 0.171875 m /zero glyphshow
grestore
[1 3] 0 setdash
gsave
446.4 338.4 72 42.3 clipbox
183.6 42.3 m
183.6 380.7 l
stroke
grestore
[] 0 setdash
gsave
/o {
gsave
newpath
translate
0 0 m
0 4 l
stroke
grestore
} bind def
183.6 42.3 o
grestore
gsave
/o {
gsave
newpath
translate
0 0 m
0 -4 l
stroke
grestore
} bind def
183.6 380.7 o
grestore
gsave
155.873437 29.221875 translate
0.000000 rotate
0.000000 0.171875 m /zero glyphshow
7.634766 0.171875 m /period glyphshow
11.449219 0.171875 m /zero glyphshow
19.083984 0.171875 m /zero glyphshow
26.718750 0.171875 m /zero glyphshow
34.353516 0.171875 m /zero glyphshow
41.988281 0.171875 m /zero glyphshow
49.623047 0.171875 m /five glyphshow
grestore
[1 3] 0 setdash
gsave
446.4 338.4 72 42.3 clipbox
295.2 42.3 m
295.2 380.7 l
stroke
grestore
[] 0 setdash
gsave
/o {
gsave
newpath
translate
0 0 m
0 4 l
stroke
grestore
} bind def
295.2 42.3 o
grestore
gsave
/o {
gsave
newpath
translate
0 0 m
0 -4 l
stroke
grestore
} bind def
295.2 380.7 o
grestore
gsave
267.348437 29.221875 translate
0.000000 rotate
0.000000 0.171875 m /zero glyphshow
7.634766 0.171875 m /period glyphshow
11.449219 0.171875 m /zero glyphshow
19.083984 0.171875 m /zero glyphshow
26.718750 0.171875 m /zero glyphshow
34.353516 0.171875 m /zero glyphshow
41.988281 0.171875 m /one glyphshow
49.623047 0.171875 m /zero glyphshow
grestore
[1 3] 0 setdash
gsave
446.4 338.4 72 42.3 clipbox
406.8 42.3 m
406.8 380.7 l
stroke
grestore
[] 0 setdash
gsave
/o {
gsave
newpath
translate
0 0 m
0 4 l
stroke
grestore
} bind def
406.8 42.3 o
grestore
gsave
/o {
gsave
newpath
translate
0 0 m
0 -4 l
stroke
grestore
} bind def
406.8 380.7 o
grestore
gsave
379.073437 29.221875 translate
0.000000 rotate
0.000000 0.171875 m /zero glyphshow
7.634766 0.171875 m /period glyphshow
11.449219 0.171875 m /zero glyphshow
19.083984 0.171875 m /zero glyphshow
26.718750 0.171875 m /zero glyphshow
34.353516 0.171875 m /zero glyphshow
41.988281 0.171875 m /one glyphshow
49.623047 0.171875 m /five glyphshow
grestore
[1 3] 0 setdash
gsave
446.4 338.4 72 42.3 clipbox
518.4 42.3 m
518.4 380.7 l
stroke
grestore
[] 0 setdash
gsave
/o {
gsave
newpath
translate
0 0 m
0 4 l
stroke
grestore
} bind def
518.4 42.3 o
grestore
gsave
/o {
gsave
newpath
translate
0 0 m
0 -4 l
stroke
grestore
} bind def
518.4 380.7 o
grestore
gsave
490.548437 29.221875 translate
0.000000 rotate
0.000000 0.171875 m /zero glyphshow
7.634766 0.171875 m /period glyphshow
11.449219 0.171875 m /zero glyphshow
19.083984 0.171875 m /zero glyphshow
26.718750 0.171875 m /zero glyphshow
34.353516 0.171875 m /zero glyphshow
41.988281 0.171875 m /two glyphshow
49.623047 0.171875 m /zero glyphshow
grestore
292.567 17.659 m
(z) show
[1 3] 0 setdash
gsave
446.4 338.4 72 42.3 clipbox
72 42.3 m
518.4 42.3 l
stroke
grestore
[] 0 setdash
gsave
/o {
gsave
newpath
translate
0 0 m
4 0 l
stroke
grestore
} bind def
72 42.3 o
grestore
gsave
/o {
gsave
newpath
translate
0 0 m
-4 0 l
stroke
grestore
} bind def
518.4 42.3 o
grestore
gsave
52.531250 37.760937 translate
0.000000 rotate
0.000000 0.171875 m /minus glyphshow
10.054688 0.171875 m /three glyphshow
grestore
[1 3] 0 setdash
gsave
446.4 338.4 72 42.3 clipbox
72 98.7 m
518.4 98.7 l
stroke
grestore
[] 0 setdash
gsave
/o {
gsave
newpath
translate
0 0 m
4 0 l
stroke
grestore
} bind def
72 98.7 o
grestore
gsave
/o {
gsave
newpath
translate
0 0 m
-4 0 l
stroke
grestore
} bind def
518.4 98.7 o
grestore
gsave
52.765625 94.246875 translate
0.000000 rotate
0.000000 0.000000 m /minus glyphshow
10.054688 0.000000 m /two glyphshow
grestore
[1 3] 0 setdash
gsave
446.4 338.4 72 42.3 clipbox
72 155.1 m
518.4 155.1 l
stroke
grestore
[] 0 setdash
gsave
/o {
gsave
newpath
translate
0 0 m
4 0 l
stroke
grestore
} bind def
72 155.1 o
grestore
gsave
/o {
gsave
newpath
translate
0 0 m
-4 0 l
stroke
grestore
} bind def
518.4 155.1 o
grestore
gsave
52.671875 150.725000 translate
0.000000 rotate
0.000000 0.000000 m /minus glyphshow
10.054688 0.000000 m /one glyphshow
grestore
[1 3] 0 setdash
gsave
446.4 338.4 72 42.3 clipbox
72 211.5 m
518.4 211.5 l
stroke
grestore
[] 0 setdash
gsave
/o {
gsave
newpath
translate
0 0 m
4 0 l
stroke
grestore
} bind def
72 211.5 o
grestore
gsave
/o {
gsave
newpath
translate
0 0 m
-4 0 l
stroke
grestore
} bind def
518.4 211.5 o
grestore
gsave
61.953125 206.960937 translate
0.000000 rotate
0.000000 0.171875 m /zero glyphshow
grestore
[1 3] 0 setdash
gsave
446.4 338.4 72 42.3 clipbox
72 267.9 m
518.4 267.9 l
stroke
grestore
[] 0 setdash
gsave
/o {
gsave
newpath
translate
0 0 m
4 0 l
stroke
grestore
} bind def
72 267.9 o
grestore
gsave
/o {
gsave
newpath
translate
0 0 m
-4 0 l
stroke
grestore
} bind def
518.4 267.9 o
grestore
gsave
62.781250 263.525000 translate
0.000000 rotate
0.000000 0.000000 m /one glyphshow
grestore
[1 3] 0 setdash
gsave
446.4 338.4 72 42.3 clipbox
72 324.3 m
518.4 324.3 l
stroke
grestore
[] 0 setdash
gsave
/o {
gsave
newpath
translate
0 0 m
4 0 l
stroke
grestore
} bind def
72 324.3 o
grestore
gsave
/o {
gsave
newpath
translate
0 0 m
-4 0 l
stroke
grestore
} bind def
518.4 324.3 o
grestore
gsave
62.437500 319.846875 translate
0.000000 rotate
0.000000 0.000000 m /two glyphshow
grestore
[1 3] 0 setdash
gsave
446.4 338.4 72 42.3 clipbox
72 380.7 m
518.4 380.7 l
stroke
grestore
[] 0 setdash
gsave
/o {
gsave
newpath
translate
0 0 m
4 0 l
stroke
grestore
} bind def
72 380.7 o
grestore
gsave
/o {
gsave
newpath
translate
0 0 m
-4 0 l
stroke
grestore
} bind def
518.4 380.7 o
grestore
gsave
62.250000 376.160937 translate
0.000000 rotate
0.000000 0.171875 m /three glyphshow
grestore
47.531 204.945 m
gsave
90 rotate
(Ex) show
grestore
1.000 setlinewidth
2 setlinecap
gsave
72 380.7 m
518.4 380.7 l
stroke
grestore
gsave
518.4 42.3 m
518.4 380.7 l
stroke
grestore
gsave
72 42.3 m
518.4 42.3 l
stroke
grestore
gsave
72 42.3 m
72 380.7 l
stroke
grestore

end
showpage
