G04 start of page 4 for group -1 layer_idx -1 *
G04 Title: element with pads on both sides, TODO:group_name *
G04 Creator: <version>
G04 CreationDate: <date>
G04 For:  *
G04 Format: Gerber/RS-274X *
G04 PCB-Dimensions: 50000 50000 *
G04 PCB-Coordinate-Origin: lower left *
%MOIN*%
%FSLAX25Y25*%
%LNTOPMASK*%
%ADD13C,0.0500*%
G54D13*X17500Y35000D02*X25000D01*
M02*
