%!PS-Adobe-3.0 EPSF-3.0
%%BoundingBox: 0 0 37.000000 37.000000
%%Pages: 1
save countdictstack mark newpath /showpage {} def /setpagedevice {pop} def
%%EndProlog
%%Page: 1 1
%%BeginDocument: comp1.eps

72 72 scale
1 dup neg scale
1 dup scale
0.00000 -0.50000 translate
/nclip { -0.01000 -0.01000 moveto -0.01000 0.51000 lineto 0.51000 0.51000 lineto 0.51000 -0.01000 lineto -0.01000 -0.01000 lineto eoclip newpath } def
/t { moveto lineto stroke } bind def
/tc { moveto lineto strokepath nclip } bind def
/r { /y2 exch def /x2 exch def /y1 exch def /x1 exch def
     x1 y1 moveto x1 y2 lineto x2 y2 lineto x2 y1 lineto closepath fill } bind def
/c { 0 360 arc fill } bind def
/cc { 0 360 arc nclip } bind def
/a { gsave setlinewidth translate scale 0 0 1 5 3 roll arc stroke grestore} bind def
% Layer bottomsilk group 12 drill 0 mask 0
% Layer bottom group 10 drill 0 mask 0
0.02000 setlinewidth
1 setlinecap
0.227451 0.372549 0.803922 setrgbcolor
0.02500 0.12500 0.47500 0.12500 t
0.627451 0.627451 0.627451 setrgbcolor
0.25000 0.07500 0.04331 c
0.00000 setlinewidth
1 1 1 setrgbcolor
0.25000 0.07500 0.01968 c
% Layer group5 group 5 drill 0 mask 0
0.00000 setlinewidth
0.627451 0.627451 0.627451 setrgbcolor
0.25000 0.07500 0.04331 c
0.00000 setlinewidth
1 1 1 setrgbcolor
0.25000 0.07500 0.01968 c
% Layer group7 group 7 drill 0 mask 0
0.00000 setlinewidth
0.627451 0.627451 0.627451 setrgbcolor
0.25000 0.07500 0.04331 c
0.00000 setlinewidth
1 1 1 setrgbcolor
0.25000 0.07500 0.01968 c
% Layer top group 3 drill 0 mask 0
0.02000 setlinewidth
0.545098 0.137255 0.137255 setrgbcolor
0.02500 0.15000 0.47500 0.15000 t
0.439216 0.439216 0.439216 setrgbcolor
0.25000 0.07500 0.04331 c
0.00000 setlinewidth
1 1 1 setrgbcolor
0.25000 0.07500 0.01968 c
% Layer topsilk group 1 drill 0 mask 0
gsave
0 0 0 setrgbcolor
0.17500 0.02500 moveto
0.17500 0.17500 lineto
0.02500 0.17500 lineto
0.02500 0.02500 lineto
fill
0.47500 0.02500 moveto
0.47500 0.47500 lineto
0.20000 0.47500 lineto
0.20000 0.02500 lineto
fill
1 1 1 setrgbcolor
0.45000 0.05000 moveto
0.45000 0.45000 lineto
0.22500 0.45000 lineto
0.22500 0.05000 lineto
fill
0.08000 setlinewidth
0.06000 0.25000 moveto 0.10000 0.12500 0.04000 -180 0 arc
0.10000 0.25000 0.04000 0 180 arc
nclip
0.02000 setlinewidth
90 180 -0.07500 0.07500 0.00000 0.00000 0.266667 a
0 0 0 setrgbcolor
0.10000 0.22500 0.10000 0.12500 t
grestore
gsave
% Layer plated-drill group -1 drill 1 mask 0
0.00000 setlinewidth
1 1 1 setrgbcolor
0.25000 0.07500 0.01968 c
grestore
showpage
%%EndDocument
%%Trailer
cleartomark countdictstack exch sub { end } repeat restore
%%EOF
