%!PS-Adobe-3.0 EPSF-3.0
%%BoundingBox: 0 0 37.000000 37.000000
%%Pages: 1
save countdictstack mark newpath /showpage {} def /setpagedevice {pop} def
%%EndProlog
%%Page: 1 1
%%BeginDocument: elem_pads_ds.eps

72 72 scale
1 dup neg scale
1 dup scale
0.00000 -0.50000 translate
/nclip { -0.01000 -0.01000 moveto -0.01000 0.51000 lineto 0.51000 0.51000 lineto 0.51000 -0.01000 lineto -0.01000 -0.01000 lineto eoclip newpath } def
/t { moveto lineto stroke } bind def
/tc { moveto lineto strokepath nclip } bind def
/r { /y2 exch def /x2 exch def /y1 exch def /x1 exch def
     x1 y1 moveto x1 y2 lineto x2 y2 lineto x2 y1 lineto closepath fill } bind def
/c { 0 360 arc fill } bind def
/cc { 0 360 arc nclip } bind def
/a { gsave setlinewidth translate scale 0 0 1 5 3 roll arc stroke grestore} bind def
% Layer bottom group 10 drill 0 mask 0
0.01000 setlinewidth
1 setlinecap
0.8 0.8 0.8 setrgbcolor
0.27500 0.17500 0.27500 0.25000 t
% Layer group5 group 5 drill 0 mask 0
% Layer group7 group 7 drill 0 mask 0
% Layer top group 3 drill 0 mask 0
0.301961 0.301961 0.301961 setrgbcolor
0.17500 0.15000 0.25000 0.15000 t
% Layer topsilk group 1 drill 0 mask 0
0 0 0 setrgbcolor
0.17500 0.15000 0.17500 0.25000 t
0.00700 setlinewidth
0.17500 0.09300 0.19000 0.09300 t
0.17500 0.11500 0.19500 0.11500 t
0.17500 0.07500 0.17500 0.11500 t
0.17500 0.07500 0.19500 0.07500 t
0.20700 0.08300 0.21500 0.07500 t
0.21500 0.07500 0.21500 0.11500 t
0.20700 0.11500 0.22200 0.11500 t
% Layer bottomsilk group 12 drill 0 mask 0
showpage
%%EndDocument
%%Trailer
cleartomark countdictstack exch sub { end } repeat restore
%%EOF
