G04 start of page 4 for group -1 layer_idx -1 *
G04 Title: smd elements on both sides, TODO:group_name *
G04 Creator: <version>
G04 CreationDate: <date>
G04 For:  *
G04 Format: Gerber/RS-274X *
G04 PCB-Dimensions: 50000 50000 *
G04 PCB-Coordinate-Origin: lower left *
%MOIN*%
%FSLAX25Y25*%
%LNTOPMASK*%
%ADD13R,0.0572X0.0572*%
G54D13*X16595Y38681D02*Y36319D01*
X28405Y38681D02*Y36319D01*
M02*
