G04 start of page 9 for group -4078 idx -4078 *
G04 Title: (unknown), bottomsilk *
G04 Creator: pcb 20140316 *
G04 CreationDate: Fri 26 Aug 2016 03:35:47 AM GMT UTC *
G04 For: user1 *
G04 Format: Gerber/RS-274X *
G04 PCB-Dimensions (mm): 31.75 54.61 *
G04 PCB-Coordinate-Origin: lower left *
%MOMM*%
%FSLAX43Y43*%
%LNBOTTOMSILK*%
%ADD74C,0.203*%
%ADD73C,0.254*%
%ADD72C,0.152*%
G54D72*X8636Y40386D02*X21336D01*
X8636Y50800D02*Y40386D01*
Y50800D02*X21336D01*
Y40386D01*
X14986Y45720D02*Y45466D01*
Y45720D02*X15113Y45593D01*
X14859D02*X15113D01*
X14859D02*X14986Y45466D01*
X15113Y45593D01*
X12446Y49530D02*X12065Y49149D01*
X12446Y50038D02*X12065Y49657D01*
X12446Y50038D02*Y49022D01*
X12065Y48641D01*
X12446Y49530D02*X12954D01*
X14986Y45466D02*G75*G03X15113Y45593I0J127D01*G01*
X14859D02*G75*G03X14986Y45466I127J0D01*G01*
Y45720D02*G75*G03X14859Y45593I0J-127D01*G01*
X15113D02*G75*G03X14986Y45720I-127J0D01*G01*
X14605Y41402D02*G75*G03X14986Y41021I381J0D01*G01*
G75*G03X15367Y41402I0J381D01*G01*
X17526Y48895D02*G75*G03X17907Y49276I0J381D01*G01*
X17145D02*G75*G03X17526Y48895I381J0D01*G01*
Y49657D02*G75*G03X17145Y49276I0J-381D01*G01*
X17907D02*G75*G03X17526Y49657I-381J0D01*G01*
X17145Y50038D02*G75*G03X17526Y49657I381J0D01*G01*
G54D73*X6883Y32715D02*X17399D01*
X6883Y39954D02*Y32715D01*
Y39954D02*X17399D01*
Y32715D01*
G54D74*X13627Y8825D02*X13827D01*
X13627Y10225D02*X13827D01*
G54D72*X8636Y14986D02*X21336D01*
X8636Y25400D02*Y14986D01*
Y25400D02*X21336D01*
Y14986D01*
X14986Y20320D02*Y20066D01*
Y20320D02*X15113Y20193D01*
X14859D02*X15113D01*
X14859D02*X14986Y20066D01*
X15113Y20193D01*
X12446Y24130D02*X12065Y23749D01*
X12446Y24638D02*X12065Y24257D01*
X12446Y24638D02*Y23622D01*
X12065Y23241D01*
X12446Y24130D02*X12954D01*
X14986Y20066D02*G75*G03X15113Y20193I0J127D01*G01*
X14859D02*G75*G03X14986Y20066I127J0D01*G01*
Y20320D02*G75*G03X14859Y20193I0J-127D01*G01*
X15113D02*G75*G03X14986Y20320I-127J0D01*G01*
X14605Y16002D02*G75*G03X14986Y15621I381J0D01*G01*
G75*G03X15367Y16002I0J381D01*G01*
X17526Y23495D02*G75*G03X17907Y23876I0J381D01*G01*
X17145D02*G75*G03X17526Y23495I381J0D01*G01*
Y24257D02*G75*G03X17145Y23876I0J-381D01*G01*
X17907D02*G75*G03X17526Y24257I-381J0D01*G01*
X17145Y24638D02*G75*G03X17526Y24257I381J0D01*G01*
X21717Y19685D02*X22733D01*
Y20066D02*X22606Y20193D01*
X21844D02*X22606D01*
X21717Y20066D02*X21844Y20193D01*
X21717Y19558D02*Y20066D01*
X22733Y19558D02*Y20066D01*
X21717Y20625D02*Y20879D01*
Y20752D02*X22733D01*
X22479Y20498D02*X22733Y20752D01*
X13054Y8471D02*X13435D01*
X12927Y8344D02*X13054Y8471D01*
X12927Y7582D02*Y8344D01*
Y7582D02*X13054Y7455D01*
X13435D01*
X13740Y7582D02*X13867Y7455D01*
X14248D01*
X14375Y7582D01*
Y7836D01*
X13740Y8471D02*X14375Y7836D01*
X13740Y8471D02*X14375D01*
X18110Y34925D02*X18999D01*
X18110D02*X17983Y35052D01*
Y35306D01*
X18110Y35433D01*
X18999D01*
X17983Y35865D02*Y36119D01*
Y35992D02*X18999D01*
X18745Y35738D02*X18999Y35992D01*
X18110Y36424D02*X17983Y36551D01*
X18110Y36424D02*X18872D01*
X18999Y36551D01*
Y36805D01*
X18872Y36932D01*
X18110D02*X18872D01*
X17983Y36805D02*X18110Y36932D01*
X17983Y36551D02*Y36805D01*
X18237Y36424D02*X18745Y36932D01*
X18110Y37236D02*X17983Y37363D01*
X18110Y37236D02*X18872D01*
X18999Y37363D01*
Y37617D01*
X18872Y37744D01*
X18110D02*X18872D01*
X17983Y37617D02*X18110Y37744D01*
X17983Y37363D02*Y37617D01*
X18237Y37236D02*X18745Y37744D01*
X21717Y43180D02*X22733D01*
X21717D02*Y43688D01*
X22225Y43993D02*Y44374D01*
X21717Y43993D02*Y44501D01*
Y43993D02*X22733D01*
Y44501D01*
X21717Y44933D02*X22733D01*
Y45314D02*X22606Y45441D01*
X21844D02*X22606D01*
X21717Y45314D02*X21844Y45441D01*
X21717Y44806D02*Y45314D01*
X22733Y44806D02*Y45314D01*
X21717Y45872D02*Y46126D01*
Y45999D02*X22733D01*
X22479Y45745D02*X22733Y45999D01*
X21844Y46431D02*X21717Y46558D01*
X21844Y46431D02*X22606D01*
X22733Y46558D01*
Y46812D01*
X22606Y46939D01*
X21844D02*X22606D01*
X21717Y46812D02*X21844Y46939D01*
X21717Y46558D02*Y46812D01*
X21971Y46431D02*X22479Y46939D01*
X21844Y47244D02*X21717Y47371D01*
X21844Y47244D02*X22606D01*
X22733Y47371D01*
Y47625D01*
X22606Y47752D01*
X21844D02*X22606D01*
X21717Y47625D02*X21844Y47752D01*
X21717Y47371D02*Y47625D01*
X21971Y47244D02*X22479Y47752D01*
M02*
