<?xml version="1.0" encoding="UTF-8" standalone="no"?>
<!DOCTYPE svg PUBLIC "-//W3C//DTD SVG 1.1//EN"
 "http://www.w3.org/Graphics/SVG/1.1/DTD/svg11.dtd">
<!-- Generated by graphviz version 2.38.0 (20140413.2041)
 -->
<!-- Title: plugin_deps Pages: 1 -->
<svg width="4545pt" height="4558pt"
 viewBox="0.00 0.00 4545.30 4558.13" xmlns="http://www.w3.org/2000/svg" xmlns:xlink="http://www.w3.org/1999/xlink">
<g id="graph0" class="graph" transform="scale(1 1) rotate(0) translate(4 4554.13)">
<title>plugin_deps</title>
<polygon fill="white" stroke="none" points="-4,4 -4,-4554.13 4541.3,-4554.13 4541.3,4 -4,4"/>
<!-- user -->
<g id="node1" class="node"><title>user</title>
<ellipse fill="none" stroke="black" cx="1266.01" cy="-1660.19" rx="27" ry="18"/>
<text text-anchor="middle" x="1266.01" y="-1656.49" font-family="Times,serif" font-size="14.00">user</text>
</g>
<!-- acompnet -->
<g id="node2" class="node"><title>acompnet</title>
<ellipse fill="lightgrey" stroke="black" cx="4000.65" cy="-3250.61" rx="45.4919" ry="18"/>
<text text-anchor="middle" x="4000.65" y="-3246.91" font-family="Times,serif" font-size="14.00">acompnet</text>
</g>
<!-- user&#45;&gt;acompnet -->
<g id="edge1" class="edge"><title>user&#45;&gt;acompnet</title>
<path fill="none" stroke="#a0a0a0" d="M1286.45,-1672.07C1519.26,-1807.47 3667.95,-3057.11 3966.33,-3230.65"/>
<polygon fill="#a0a0a0" stroke="#a0a0a0" points="3964.6,-3233.69 3975,-3235.69 3968.12,-3227.64 3964.6,-3233.69"/>
</g>
<!-- act_draw -->
<g id="node3" class="node"><title>act_draw</title>
<ellipse fill="lightgrey" stroke="black" cx="3909.71" cy="-3347.99" rx="42.7926" ry="18"/>
<text text-anchor="middle" x="3909.71" y="-3344.29" font-family="Times,serif" font-size="14.00">act_draw</text>
</g>
<!-- user&#45;&gt;act_draw -->
<g id="edge2" class="edge"><title>user&#45;&gt;act_draw</title>
<path fill="none" stroke="#a0a0a0" d="M1285.77,-1672.8C1511.07,-1816.64 3592.49,-3145.47 3877.44,-3327.39"/>
<polygon fill="#a0a0a0" stroke="#a0a0a0" points="3875.77,-3330.47 3886.08,-3332.91 3879.54,-3324.57 3875.77,-3330.47"/>
</g>
<!-- ar_cpcb -->
<g id="node4" class="node"><title>ar_cpcb</title>
<ellipse fill="lightgrey" stroke="black" cx="1882.88" cy="-2034.71" rx="38.1938" ry="18"/>
<text text-anchor="middle" x="1882.88" y="-2031.01" font-family="Times,serif" font-size="14.00">ar_cpcb</text>
</g>
<!-- user&#45;&gt;ar_cpcb -->
<g id="edge6" class="edge"><title>user&#45;&gt;ar_cpcb</title>
<path fill="none" stroke="#a0a0a0" d="M1286.19,-1672.44C1375.96,-1726.94 1739.59,-1947.71 1850.56,-2015.09"/>
<polygon fill="#a0a0a0" stroke="#a0a0a0" points="1848.95,-2018.2 1859.31,-2020.4 1852.58,-2012.22 1848.95,-2018.2"/>
</g>
<!-- asm -->
<g id="node8" class="node"><title>asm</title>
<ellipse fill="lightgrey" stroke="black" cx="3812.33" cy="-3438.93" rx="27" ry="18"/>
<text text-anchor="middle" x="3812.33" y="-3435.23" font-family="Times,serif" font-size="14.00">asm</text>
</g>
<!-- user&#45;&gt;asm -->
<g id="edge7" class="edge"><title>user&#45;&gt;asm</title>
<path fill="none" stroke="#a0a0a0" d="M1284.69,-1673.23C1500.84,-1824.23 3525.45,-3238.53 3784.99,-3419.83"/>
<polygon fill="#a0a0a0" stroke="#a0a0a0" points="3783.27,-3422.9 3793.47,-3425.76 3787.28,-3417.16 3783.27,-3422.9"/>
</g>
<!-- autocrop -->
<g id="node9" class="node"><title>autocrop</title>
<ellipse fill="lightgrey" stroke="black" cx="3708.97" cy="-3523.02" rx="41.6928" ry="18"/>
<text text-anchor="middle" x="3708.97" y="-3519.32" font-family="Times,serif" font-size="14.00">autocrop</text>
</g>
<!-- user&#45;&gt;autocrop -->
<g id="edge8" class="edge"><title>user&#45;&gt;autocrop</title>
<path fill="none" stroke="#a0a0a0" d="M1283.93,-1673.85C1490.55,-1831.41 3419.64,-3302.39 3679.96,-3500.9"/>
<polygon fill="#a0a0a0" stroke="#a0a0a0" points="3678.11,-3503.88 3688.18,-3507.16 3682.35,-3498.32 3678.11,-3503.88"/>
</g>
<!-- autoplace -->
<g id="node10" class="node"><title>autoplace</title>
<ellipse fill="lightgrey" stroke="black" cx="3600.12" cy="-3599.86" rx="44.393" ry="18"/>
<text text-anchor="middle" x="3600.12" y="-3596.16" font-family="Times,serif" font-size="14.00">autoplace</text>
</g>
<!-- user&#45;&gt;autoplace -->
<g id="edge9" class="edge"><title>user&#45;&gt;autoplace</title>
<path fill="none" stroke="#a0a0a0" d="M1283.13,-1674.41C1480.65,-1838.55 3325.59,-3371.72 3572.78,-3577.14"/>
<polygon fill="#a0a0a0" stroke="#a0a0a0" points="3570.66,-3579.92 3580.58,-3583.62 3575.13,-3574.54 3570.66,-3579.92"/>
</g>
<!-- autoroute -->
<g id="node11" class="node"><title>autoroute</title>
<ellipse fill="lightgrey" stroke="black" cx="4480.1" cy="-2034.81" rx="44.393" ry="18"/>
<text text-anchor="middle" x="4480.1" y="-2031.11" font-family="Times,serif" font-size="14.00">autoroute</text>
</g>
<!-- user&#45;&gt;autoroute -->
<g id="edge11" class="edge"><title>user&#45;&gt;autoroute</title>
<path fill="none" stroke="#a0a0a0" d="M1292.83,-1663.31C1577.21,-1696.46 4035.1,-1982.94 4427.4,-2028.67"/>
<polygon fill="#a0a0a0" stroke="#a0a0a0" points="4427.01,-2032.15 4437.35,-2029.83 4427.82,-2025.19 4427.01,-2032.15"/>
</g>
<!-- cam -->
<g id="node12" class="node"><title>cam</title>
<ellipse fill="#a0ffff" stroke="black" cx="3486.28" cy="-3669.09" rx="27" ry="18"/>
<text text-anchor="middle" x="3486.28" y="-3665.39" font-family="Times,serif" font-size="14.00">cam</text>
</g>
<!-- user&#45;&gt;cam -->
<g id="edge12" class="edge"><title>user&#45;&gt;cam</title>
<path fill="none" stroke="#a0a0a0" d="M1282.3,-1674.92C1470.77,-1845.45 3236.2,-3442.82 3462.45,-3647.53"/>
<polygon fill="#a0a0a0" stroke="#a0a0a0" points="3460.36,-3650.36 3470.13,-3654.47 3465.06,-3645.17 3460.36,-3650.36"/>
</g>
<!-- ddraft -->
<g id="node13" class="node"><title>ddraft</title>
<ellipse fill="#a0ffff" stroke="black" cx="3367.97" cy="-3730.39" rx="31.6951" ry="18"/>
<text text-anchor="middle" x="3367.97" y="-3726.69" font-family="Times,serif" font-size="14.00">ddraft</text>
</g>
<!-- user&#45;&gt;ddraft -->
<g id="edge13" class="edge"><title>user&#45;&gt;ddraft</title>
<path fill="none" stroke="#a0a0a0" d="M1281.43,-1675.37C1459.59,-1850.84 3126.06,-3492.13 3344.41,-3707.18"/>
<polygon fill="#a0a0a0" stroke="#a0a0a0" points="3342.26,-3709.97 3351.84,-3714.5 3347.17,-3704.98 3342.26,-3709.97"/>
</g>
<!-- diag -->
<g id="node14" class="node"><title>diag</title>
<ellipse fill="lightgrey" stroke="black" cx="3245.76" cy="-3783.47" rx="27" ry="18"/>
<text text-anchor="middle" x="3245.76" y="-3779.77" font-family="Times,serif" font-size="14.00">diag</text>
</g>
<!-- user&#45;&gt;diag -->
<g id="edge14" class="edge"><title>user&#45;&gt;diag</title>
<path fill="none" stroke="#a0a0a0" d="M1280.53,-1675.76C1448.59,-1856 3022.78,-3544.32 3224.52,-3760.68"/>
<polygon fill="#a0a0a0" stroke="#a0a0a0" points="3221.98,-3763.1 3231.36,-3768.03 3227.1,-3758.32 3221.98,-3763.1"/>
</g>
<!-- dialogs -->
<g id="node15" class="node"><title>dialogs</title>
<ellipse fill="lightgrey" stroke="black" cx="2991.91" cy="-3864.04" rx="36.2938" ry="18"/>
<text text-anchor="middle" x="2991.91" y="-3860.34" font-family="Times,serif" font-size="14.00">dialogs</text>
</g>
<!-- user&#45;&gt;dialogs -->
<g id="edge16" class="edge"><title>user&#45;&gt;dialogs</title>
<path fill="none" stroke="#a0a0a0" d="M1278.67,-1676.35C1424.88,-1863.05 2791.93,-3608.67 2972.3,-3838.99"/>
<polygon fill="#a0a0a0" stroke="#a0a0a0" points="2969.75,-3841.41 2978.67,-3847.12 2975.26,-3837.09 2969.75,-3841.41"/>
</g>
<!-- distalign -->
<g id="node17" class="node"><title>distalign</title>
<ellipse fill="lightgrey" stroke="black" cx="2729.46" cy="-3909.29" rx="40.8928" ry="18"/>
<text text-anchor="middle" x="2729.46" y="-3905.59" font-family="Times,serif" font-size="14.00">distalign</text>
</g>
<!-- user&#45;&gt;distalign -->
<g id="edge17" class="edge"><title>user&#45;&gt;distalign</title>
<path fill="none" stroke="#a0a0a0" d="M1276.95,-1677C1401.88,-1868.99 2557.72,-3645.34 2712.38,-3883.04"/>
<polygon fill="#a0a0a0" stroke="#a0a0a0" points="2709.65,-3885.26 2718.04,-3891.74 2715.52,-3881.44 2709.65,-3885.26"/>
</g>
<!-- distaligntext -->
<g id="node18" class="node"><title>distaligntext</title>
<ellipse fill="lightgrey" stroke="black" cx="2596.53" cy="-3918.38" rx="53.8905" ry="18"/>
<text text-anchor="middle" x="2596.53" y="-3914.68" font-family="Times,serif" font-size="14.00">distaligntext</text>
</g>
<!-- user&#45;&gt;distaligntext -->
<g id="edge18" class="edge"><title>user&#45;&gt;distaligntext</title>
<path fill="none" stroke="#a0a0a0" d="M1275.96,-1677.07C1389.48,-1869.74 2439.3,-3651.53 2580.78,-3891.66"/>
<polygon fill="#a0a0a0" stroke="#a0a0a0" points="2577.87,-3893.61 2585.96,-3900.45 2583.9,-3890.05 2577.87,-3893.61"/>
</g>
<!-- djopt -->
<g id="node19" class="node"><title>djopt</title>
<ellipse fill="lightgrey" stroke="black" cx="2463.29" cy="-3918.38" rx="28.6953" ry="18"/>
<text text-anchor="middle" x="2463.29" y="-3914.68" font-family="Times,serif" font-size="14.00">djopt</text>
</g>
<!-- user&#45;&gt;djopt -->
<g id="edge19" class="edge"><title>user&#45;&gt;djopt</title>
<path fill="none" stroke="#a0a0a0" d="M1275.13,-1677.39C1378.21,-1871.81 2322.96,-3653.71 2449.34,-3892.07"/>
<polygon fill="#a0a0a0" stroke="#a0a0a0" points="2446.34,-3893.89 2454.12,-3901.08 2452.53,-3890.61 2446.34,-3893.89"/>
</g>
<!-- draw_fab -->
<g id="node21" class="node"><title>draw_fab</title>
<ellipse fill="lightgrey" stroke="black" cx="2330.36" cy="-3909.29" rx="44.393" ry="18"/>
<text text-anchor="middle" x="2330.36" y="-3905.59" font-family="Times,serif" font-size="14.00">draw_fab</text>
</g>
<!-- user&#45;&gt;draw_fab -->
<g id="edge21" class="edge"><title>user&#45;&gt;draw_fab</title>
<path fill="none" stroke="#a0a0a0" d="M1274.27,-1677.64C1366.59,-1872.72 2204,-3642.28 2317.62,-3882.37"/>
<polygon fill="#a0a0a0" stroke="#a0a0a0" points="2314.48,-3883.92 2321.92,-3891.46 2320.81,-3880.93 2314.48,-3883.92"/>
</g>
<!-- report -->
<g id="node22" class="node"><title>report</title>
<ellipse fill="lightgrey" stroke="black" cx="2198.36" cy="-3891.15" rx="31.6951" ry="18"/>
<text text-anchor="middle" x="2198.36" y="-3887.45" font-family="Times,serif" font-size="14.00">report</text>
</g>
<!-- user&#45;&gt;report -->
<g id="edge130" class="edge"><title>user&#45;&gt;report</title>
<path fill="none" stroke="#a0a0a0" d="M1273.38,-1677.82C1354.89,-1872.86 2087.06,-3624.82 2187.06,-3864.12"/>
<polygon fill="#a0a0a0" stroke="#a0a0a0" points="2183.89,-3865.6 2190.98,-3873.48 2190.35,-3862.9 2183.89,-3865.6"/>
</g>
<!-- drc_orig -->
<g id="node23" class="node"><title>drc_orig</title>
<ellipse fill="lightgrey" stroke="black" cx="2067.9" cy="-3864.04" rx="40.0939" ry="18"/>
<text text-anchor="middle" x="2067.9" y="-3860.34" font-family="Times,serif" font-size="14.00">drc_orig</text>
</g>
<!-- user&#45;&gt;drc_orig -->
<g id="edge22" class="edge"><title>user&#45;&gt;drc_orig</title>
<path fill="none" stroke="#a0a0a0" d="M1272.47,-1677.93C1343.05,-1871.9 1970.35,-3595.93 2057.8,-3836.27"/>
<polygon fill="#a0a0a0" stroke="#a0a0a0" points="2054.63,-3837.79 2061.34,-3845.99 2061.21,-3835.4 2054.63,-3837.79"/>
</g>
<!-- expfeat -->
<g id="node24" class="node"><title>expfeat</title>
<ellipse fill="lightgrey" stroke="black" cx="1939.6" cy="-3828.09" rx="36.2938" ry="18"/>
<text text-anchor="middle" x="1939.6" y="-3824.39" font-family="Times,serif" font-size="14.00">expfeat</text>
</g>
<!-- user&#45;&gt;expfeat -->
<g id="edge23" class="edge"><title>user&#45;&gt;expfeat</title>
<path fill="none" stroke="#a0a0a0" d="M1271.53,-1677.96C1331.28,-1870.23 1857.2,-3562.86 1931.01,-3800.43"/>
<polygon fill="#a0a0a0" stroke="#a0a0a0" points="1927.69,-3801.54 1934,-3810.05 1934.38,-3799.47 1927.69,-3801.54"/>
</g>
<!-- export_bboard -->
<g id="node25" class="node"><title>export_bboard</title>
<ellipse fill="#a0ffff" stroke="black" cx="1814.06" cy="-3783.47" rx="61.99" ry="18"/>
<text text-anchor="middle" x="1814.06" y="-3779.77" font-family="Times,serif" font-size="14.00">export_bboard</text>
</g>
<!-- user&#45;&gt;export_bboard -->
<g id="edge24" class="edge"><title>user&#45;&gt;export_bboard</title>
<path fill="none" stroke="#a0a0a0" d="M1270.67,-1678.22C1319.99,-1869.31 1745.84,-3519.16 1806.8,-3755.36"/>
<polygon fill="#a0a0a0" stroke="#a0a0a0" points="1803.46,-3756.43 1809.35,-3765.24 1810.24,-3754.68 1803.46,-3756.43"/>
</g>
<!-- export_bom -->
<g id="node26" class="node"><title>export_bom</title>
<ellipse fill="#a0ffff" stroke="black" cx="1691.85" cy="-3730.39" rx="53.8905" ry="18"/>
<text text-anchor="middle" x="1691.85" y="-3726.69" font-family="Times,serif" font-size="14.00">export_bom</text>
</g>
<!-- user&#45;&gt;export_bom -->
<g id="edge25" class="edge"><title>user&#45;&gt;export_bom</title>
<path fill="none" stroke="#a0a0a0" d="M1269.69,-1678.08C1308.28,-1865.69 1638.22,-3469.69 1686.07,-3702.3"/>
<polygon fill="#a0a0a0" stroke="#a0a0a0" points="1682.69,-3703.24 1688.13,-3712.33 1689.55,-3701.83 1682.69,-3703.24"/>
</g>
<!-- export_dsn -->
<g id="node27" class="node"><title>export_dsn</title>
<ellipse fill="#a0ffff" stroke="black" cx="1573.54" cy="-3669.09" rx="50.0912" ry="18"/>
<text text-anchor="middle" x="1573.54" y="-3665.39" font-family="Times,serif" font-size="14.00">export_dsn</text>
</g>
<!-- user&#45;&gt;export_dsn -->
<g id="edge26" class="edge"><title>user&#45;&gt;export_dsn</title>
<path fill="none" stroke="#a0a0a0" d="M1268.76,-1678.17C1297.03,-1862.8 1534.17,-3411.85 1569.22,-3640.85"/>
<polygon fill="#a0a0a0" stroke="#a0a0a0" points="1565.81,-3641.67 1570.78,-3651.02 1572.73,-3640.61 1565.81,-3641.67"/>
</g>
<!-- export_dxf -->
<g id="node28" class="node"><title>export_dxf</title>
<ellipse fill="#a0ffff" stroke="black" cx="1459.7" cy="-3599.86" rx="49.2915" ry="18"/>
<text text-anchor="middle" x="1459.7" y="-3596.16" font-family="Times,serif" font-size="14.00">export_dxf</text>
</g>
<!-- user&#45;&gt;export_dxf -->
<g id="edge27" class="edge"><title>user&#45;&gt;export_dxf</title>
<path fill="none" stroke="#a0a0a0" d="M1267.81,-1678.15C1285.85,-1858.89 1434.48,-3347.34 1456.88,-3571.6"/>
<polygon fill="#a0a0a0" stroke="#a0a0a0" points="1453.4,-3571.99 1457.88,-3581.6 1460.37,-3571.3 1453.4,-3571.99"/>
</g>
<!-- export_fidocadj -->
<g id="node29" class="node"><title>export_fidocadj</title>
<ellipse fill="#a0ffff" stroke="black" cx="4471.01" cy="-2167.74" rx="66.0889" ry="18"/>
<text text-anchor="middle" x="4471.01" y="-2164.04" font-family="Times,serif" font-size="14.00">export_fidocadj</text>
</g>
<!-- user&#45;&gt;export_fidocadj -->
<g id="edge29" class="edge"><title>user&#45;&gt;export_fidocadj</title>
<path fill="none" stroke="#a0a0a0" d="M1292.28,-1664.35C1570.22,-1708.36 3968.65,-2088.19 4403.53,-2157.06"/>
<polygon fill="#a0a0a0" stroke="#a0a0a0" points="4403.01,-2160.52 4413.44,-2158.62 4404.11,-2153.6 4403.01,-2160.52"/>
</g>
<!-- export_gcode -->
<g id="node30" class="node"><title>export_gcode</title>
<ellipse fill="#a0ffff" stroke="black" cx="1350.85" cy="-3523.02" rx="58.4896" ry="18"/>
<text text-anchor="middle" x="1350.85" y="-3519.32" font-family="Times,serif" font-size="14.00">export_gcode</text>
</g>
<!-- user&#45;&gt;export_gcode -->
<g id="edge30" class="edge"><title>user&#45;&gt;export_gcode</title>
<path fill="none" stroke="#a0a0a0" d="M1266.84,-1678.32C1274.91,-1855.57 1339.64,-3276.85 1349.57,-3494.97"/>
<polygon fill="#a0a0a0" stroke="#a0a0a0" points="1346.07,-3495.15 1350.02,-3504.98 1353.07,-3494.83 1346.07,-3495.15"/>
</g>
<!-- export_gerber -->
<g id="node31" class="node"><title>export_gerber</title>
<ellipse fill="#a0ffff" stroke="black" cx="1247.49" cy="-3438.93" rx="59.5901" ry="18"/>
<text text-anchor="middle" x="1247.49" y="-3435.23" font-family="Times,serif" font-size="14.00">export_gerber</text>
</g>
<!-- user&#45;&gt;export_gerber -->
<g id="edge31" class="edge"><title>user&#45;&gt;export_gerber</title>
<path fill="none" stroke="#a0a0a0" d="M1265.82,-1678.37C1264.03,-1850.9 1250,-3197.62 1247.78,-3410.6"/>
<polygon fill="#a0a0a0" stroke="#a0a0a0" points="1244.28,-3410.64 1247.68,-3420.67 1251.28,-3410.71 1244.28,-3410.64"/>
</g>
<!-- export_ipcd356 -->
<g id="node32" class="node"><title>export_ipcd356</title>
<ellipse fill="#a0ffff" stroke="black" cx="4452.86" cy="-2299.74" rx="65.7887" ry="18"/>
<text text-anchor="middle" x="4452.86" y="-2296.04" font-family="Times,serif" font-size="14.00">export_ipcd356</text>
</g>
<!-- user&#45;&gt;export_ipcd356 -->
<g id="edge33" class="edge"><title>user&#45;&gt;export_ipcd356</title>
<path fill="none" stroke="#a0a0a0" d="M1292.13,-1665.43C1569.39,-1721.07 3968.72,-2202.58 4389.89,-2287.1"/>
<polygon fill="#a0a0a0" stroke="#a0a0a0" points="4389.26,-2290.55 4399.75,-2289.08 4390.64,-2283.68 4389.26,-2290.55"/>
</g>
<!-- export_lpr -->
<g id="node33" class="node"><title>export_lpr</title>
<ellipse fill="#a0ffff" stroke="black" cx="1150.11" cy="-3347.99" rx="47.3916" ry="18"/>
<text text-anchor="middle" x="1150.11" y="-3344.29" font-family="Times,serif" font-size="14.00">export_lpr</text>
</g>
<!-- user&#45;&gt;export_lpr -->
<g id="edge35" class="edge"><title>user&#45;&gt;export_lpr</title>
<path fill="none" stroke="#a0a0a0" d="M1264.77,-1678.28C1253.31,-1845.15 1166.15,-3114.45 1152.04,-3319.93"/>
<polygon fill="#a0a0a0" stroke="#a0a0a0" points="1148.55,-3319.71 1151.35,-3329.93 1155.53,-3320.19 1148.55,-3319.71"/>
</g>
<!-- export_ps -->
<g id="node34" class="node"><title>export_ps</title>
<ellipse fill="#a0ffff" stroke="black" cx="1059.17" cy="-3250.61" rx="45.4919" ry="18"/>
<text text-anchor="middle" x="1059.17" y="-3246.91" font-family="Times,serif" font-size="14.00">export_ps</text>
</g>
<!-- user&#45;&gt;export_ps -->
<g id="edge42" class="edge"><title>user&#45;&gt;export_ps</title>
<path fill="none" stroke="#a0a0a0" d="M1263.65,-1678.32C1242.7,-1839.42 1088.64,-3024.03 1062.83,-3222.45"/>
<polygon fill="#a0a0a0" stroke="#a0a0a0" points="1059.36,-3222.02 1061.54,-3232.39 1066.3,-3222.93 1059.36,-3222.02"/>
</g>
<!-- export_oldconn -->
<g id="node35" class="node"><title>export_oldconn</title>
<ellipse fill="#a0ffff" stroke="black" cx="975.082" cy="-3147.25" rx="65.7887" ry="18"/>
<text text-anchor="middle" x="975.082" y="-3143.55" font-family="Times,serif" font-size="14.00">export_oldconn</text>
</g>
<!-- user&#45;&gt;export_oldconn -->
<g id="edge36" class="edge"><title>user&#45;&gt;export_oldconn</title>
<path fill="none" stroke="#a0a0a0" d="M1262.49,-1678.19C1232.35,-1832.27 1017.93,-2928.23 980.613,-3118.98"/>
<polygon fill="#a0a0a0" stroke="#a0a0a0" points="977.174,-3118.33 978.689,-3128.82 984.044,-3119.67 977.174,-3118.33"/>
</g>
<!-- export_openems -->
<g id="node36" class="node"><title>export_openems</title>
<ellipse fill="#a0ffff" stroke="black" cx="898.244" cy="-3038.4" rx="69.5877" ry="18"/>
<text text-anchor="middle" x="898.244" y="-3034.7" font-family="Times,serif" font-size="14.00">export_openems</text>
</g>
<!-- user&#45;&gt;export_openems -->
<g id="edge38" class="edge"><title>user&#45;&gt;export_openems</title>
<path fill="none" stroke="#a0a0a0" d="M1261.23,-1678.12C1222.06,-1824.91 954.372,-2828.06 905.796,-3010.1"/>
<polygon fill="#a0a0a0" stroke="#a0a0a0" points="902.354,-3009.42 903.158,-3019.99 909.117,-3011.23 902.354,-3009.42"/>
</g>
<!-- export_openscad -->
<g id="node38" class="node"><title>export_openscad</title>
<ellipse fill="#a0ffff" stroke="black" cx="829.014" cy="-2924.56" rx="70.3881" ry="18"/>
<text text-anchor="middle" x="829.014" y="-2920.86" font-family="Times,serif" font-size="14.00">export_openscad</text>
</g>
<!-- user&#45;&gt;export_openscad -->
<g id="edge40" class="edge"><title>user&#45;&gt;export_openscad</title>
<path fill="none" stroke="#a0a0a0" d="M1259.83,-1678.06C1211.75,-1817.19 897.617,-2726.07 838.573,-2896.9"/>
<polygon fill="#a0a0a0" stroke="#a0a0a0" points="835.237,-2895.84 835.278,-2906.43 841.853,-2898.12 835.237,-2895.84"/>
</g>
<!-- export_png -->
<g id="node39" class="node"><title>export_png</title>
<ellipse fill="#a0ffff" stroke="black" cx="767.715" cy="-2806.25" rx="50.8918" ry="18"/>
<text text-anchor="middle" x="767.715" y="-2802.55" font-family="Times,serif" font-size="14.00">export_png</text>
</g>
<!-- user&#45;&gt;export_png -->
<g id="edge41" class="edge"><title>user&#45;&gt;export_png</title>
<path fill="none" stroke="#a0a0a0" d="M1258.38,-1677.73C1201.95,-1807.52 849.534,-2618.07 779.724,-2778.63"/>
<polygon fill="#a0a0a0" stroke="#a0a0a0" points="776.318,-2777.69 775.541,-2788.25 782.738,-2780.48 776.318,-2777.69"/>
</g>
<!-- export_stat -->
<g id="node40" class="node"><title>export_stat</title>
<ellipse fill="#a0ffff" stroke="black" cx="714.631" cy="-2684.04" rx="50.0912" ry="18"/>
<text text-anchor="middle" x="714.631" y="-2680.34" font-family="Times,serif" font-size="14.00">export_stat</text>
</g>
<!-- user&#45;&gt;export_stat -->
<g id="edge43" class="edge"><title>user&#45;&gt;export_stat</title>
<path fill="none" stroke="#a0a0a0" d="M1256.67,-1677.53C1191.8,-1798 808.541,-2509.66 729.058,-2657.25"/>
<polygon fill="#a0a0a0" stroke="#a0a0a0" points="725.929,-2655.68 724.269,-2666.15 732.092,-2659 725.929,-2655.68"/>
</g>
<!-- export_svg -->
<g id="node41" class="node"><title>export_svg</title>
<ellipse fill="#a0ffff" stroke="black" cx="670.012" cy="-2558.5" rx="50.0912" ry="18"/>
<text text-anchor="middle" x="670.012" y="-2554.8" font-family="Times,serif" font-size="14.00">export_svg</text>
</g>
<!-- user&#45;&gt;export_svg -->
<g id="edge44" class="edge"><title>user&#45;&gt;export_svg</title>
<path fill="none" stroke="#a0a0a0" d="M1254.9,-1676.94C1182.39,-1786.23 776.768,-2397.59 687.423,-2532.25"/>
<polygon fill="#a0a0a0" stroke="#a0a0a0" points="684.385,-2530.5 681.773,-2540.77 690.218,-2534.37 684.385,-2530.5"/>
</g>
<!-- export_test -->
<g id="node42" class="node"><title>export_test</title>
<ellipse fill="#a0ffff" stroke="black" cx="634.064" cy="-2430.2" rx="50.0912" ry="18"/>
<text text-anchor="middle" x="634.064" y="-2426.5" font-family="Times,serif" font-size="14.00">export_test</text>
</g>
<!-- user&#45;&gt;export_test -->
<g id="edge45" class="edge"><title>user&#45;&gt;export_test</title>
<path fill="none" stroke="#a0a0a0" d="M1252.81,-1676.27C1172.84,-1773.71 753.35,-2284.85 654.803,-2404.93"/>
<polygon fill="#a0a0a0" stroke="#a0a0a0" points="651.909,-2402.93 648.271,-2412.88 657.32,-2407.37 651.909,-2402.93"/>
</g>
<!-- export_xy -->
<g id="node43" class="node"><title>export_xy</title>
<ellipse fill="#a0ffff" stroke="black" cx="606.955" cy="-2299.74" rx="46.2923" ry="18"/>
<text text-anchor="middle" x="606.955" y="-2296.04" font-family="Times,serif" font-size="14.00">export_xy</text>
</g>
<!-- user&#45;&gt;export_xy -->
<g id="edge47" class="edge"><title>user&#45;&gt;export_xy</title>
<path fill="none" stroke="#a0a0a0" d="M1250.69,-1675.05C1164.43,-1758.76 739.369,-2171.25 631.751,-2275.68"/>
<polygon fill="#a0a0a0" stroke="#a0a0a0" points="629.017,-2273.45 624.278,-2282.93 633.892,-2278.48 629.017,-2273.45"/>
</g>
<!-- extedit -->
<g id="node44" class="node"><title>extedit</title>
<ellipse fill="lightgrey" stroke="black" cx="588.812" cy="-2167.74" rx="34.394" ry="18"/>
<text text-anchor="middle" x="588.812" y="-2164.04" font-family="Times,serif" font-size="14.00">extedit</text>
</g>
<!-- user&#45;&gt;extedit -->
<g id="edge49" class="edge"><title>user&#45;&gt;extedit</title>
<path fill="none" stroke="#a0a0a0" d="M1247.9,-1673.76C1154.83,-1743.52 730.383,-2061.64 616.824,-2146.75"/>
<polygon fill="#a0a0a0" stroke="#a0a0a0" points="614.496,-2144.12 608.593,-2152.92 618.694,-2149.72 614.496,-2144.12"/>
</g>
<!-- io_lihata -->
<g id="node45" class="node"><title>io_lihata</title>
<ellipse fill="#ffa0a0" stroke="black" cx="4425.76" cy="-2430.2" rx="41.6928" ry="18"/>
<text text-anchor="middle" x="4425.76" y="-2426.5" font-family="Times,serif" font-size="14.00">io_lihata</text>
</g>
<!-- user&#45;&gt;io_lihata -->
<g id="edge108" class="edge"><title>user&#45;&gt;io_lihata</title>
<path fill="none" stroke="#a0a0a0" d="M1291.45,-1666.39C1567.89,-1733.75 4011.82,-2329.32 4379.52,-2418.93"/>
<polygon fill="#a0a0a0" stroke="#a0a0a0" points="4378.76,-2422.34 4389.3,-2421.31 4380.41,-2415.54 4378.76,-2422.34"/>
</g>
<!-- fontmode -->
<g id="node46" class="node"><title>fontmode</title>
<ellipse fill="lightgrey" stroke="black" cx="579.719" cy="-2034.81" rx="44.6926" ry="18"/>
<text text-anchor="middle" x="579.719" y="-2031.11" font-family="Times,serif" font-size="14.00">fontmode</text>
</g>
<!-- user&#45;&gt;fontmode -->
<g id="edge50" class="edge"><title>user&#45;&gt;fontmode</title>
<path fill="none" stroke="#a0a0a0" d="M1245.1,-1671.6C1147.89,-1724.67 739.709,-1947.48 615.641,-2015.2"/>
<polygon fill="#a0a0a0" stroke="#a0a0a0" points="613.634,-2012.31 606.534,-2020.17 616.988,-2018.45 613.634,-2012.31"/>
</g>
<!-- fp_board -->
<g id="node47" class="node"><title>fp_board</title>
<ellipse fill="lightgrey" stroke="black" cx="579.719" cy="-1901.57" rx="42.4939" ry="18"/>
<text text-anchor="middle" x="579.719" y="-1897.87" font-family="Times,serif" font-size="14.00">fp_board</text>
</g>
<!-- user&#45;&gt;fp_board -->
<g id="edge51" class="edge"><title>user&#45;&gt;fp_board</title>
<path fill="none" stroke="#a0a0a0" d="M1241.99,-1668.64C1141.18,-1704.09 751.528,-1841.14 621.917,-1886.73"/>
<polygon fill="#a0a0a0" stroke="#a0a0a0" points="620.599,-1883.48 612.327,-1890.1 622.921,-1890.09 620.599,-1883.48"/>
</g>
<!-- fp_fs -->
<g id="node48" class="node"><title>fp_fs</title>
<ellipse fill="lightgrey" stroke="black" cx="588.812" cy="-1768.64" rx="28.6953" ry="18"/>
<text text-anchor="middle" x="588.812" y="-1764.94" font-family="Times,serif" font-size="14.00">fp_fs</text>
</g>
<!-- user&#45;&gt;fp_fs -->
<g id="edge52" class="edge"><title>user&#45;&gt;fp_fs</title>
<path fill="none" stroke="#a0a0a0" d="M1239.47,-1664.44C1134.68,-1681.22 749.534,-1742.9 626.714,-1762.57"/>
<polygon fill="#a0a0a0" stroke="#a0a0a0" points="625.977,-1759.14 616.656,-1764.18 627.084,-1766.05 625.977,-1759.14"/>
</g>
<!-- fp_wget -->
<g id="node49" class="node"><title>fp_wget</title>
<ellipse fill="lightgrey" stroke="black" cx="606.955" cy="-1636.64" rx="39.7935" ry="18"/>
<text text-anchor="middle" x="606.955" y="-1632.94" font-family="Times,serif" font-size="14.00">fp_wget</text>
</g>
<!-- user&#45;&gt;fp_wget -->
<g id="edge54" class="edge"><title>user&#45;&gt;fp_wget</title>
<path fill="none" stroke="#a0a0a0" d="M1238.95,-1659.22C1138.72,-1655.64 787.697,-1643.1 656.727,-1638.42"/>
<polygon fill="#a0a0a0" stroke="#a0a0a0" points="656.699,-1634.91 646.58,-1638.06 656.449,-1641.91 656.699,-1634.91"/>
</g>
<!-- hid_batch -->
<g id="node50" class="node"><title>hid_batch</title>
<ellipse fill="#a0a0ff" stroke="black" cx="634.064" cy="-1506.19" rx="45.4919" ry="18"/>
<text text-anchor="middle" x="634.064" y="-1502.49" font-family="Times,serif" font-size="14.00">hid_batch</text>
</g>
<!-- user&#45;&gt;hid_batch -->
<g id="edge55" class="edge"><title>user&#45;&gt;hid_batch</title>
<path fill="none" stroke="#a0a0a0" d="M1240.46,-1653.96C1145.13,-1630.73 809.308,-1548.89 682.78,-1518.06"/>
<polygon fill="#a0a0a0" stroke="#a0a0a0" points="683.514,-1514.63 672.969,-1515.67 681.856,-1521.43 683.514,-1514.63"/>
</g>
<!-- hid_gtk2_gdk -->
<g id="node51" class="node"><title>hid_gtk2_gdk</title>
<ellipse fill="#a0a0ff" stroke="black" cx="670.012" cy="-1377.89" rx="59.5901" ry="18"/>
<text text-anchor="middle" x="670.012" y="-1374.19" font-family="Times,serif" font-size="14.00">hid_gtk2_gdk</text>
</g>
<!-- user&#45;&gt;hid_gtk2_gdk -->
<g id="edge59" class="edge"><title>user&#45;&gt;hid_gtk2_gdk</title>
<path fill="none" stroke="#a0a0a0" d="M1243.74,-1649.64C1155.35,-1607.77 828.524,-1452.97 711.791,-1397.67"/>
<polygon fill="#a0a0a0" stroke="#a0a0a0" points="712.989,-1394.37 702.454,-1393.25 709.993,-1400.7 712.989,-1394.37"/>
</g>
<!-- hid_gtk2_gl -->
<g id="node54" class="node"><title>hid_gtk2_gl</title>
<ellipse fill="#a0a0ff" stroke="black" cx="714.631" cy="-1252.34" rx="53.0913" ry="18"/>
<text text-anchor="middle" x="714.631" y="-1248.64" font-family="Times,serif" font-size="14.00">hid_gtk2_gl</text>
</g>
<!-- user&#45;&gt;hid_gtk2_gl -->
<g id="edge64" class="edge"><title>user&#45;&gt;hid_gtk2_gl</title>
<path fill="none" stroke="#a0a0a0" d="M1247.67,-1646.62C1167.32,-1587.19 846.007,-1349.51 745.108,-1274.88"/>
<polygon fill="#a0a0a0" stroke="#a0a0a0" points="746.98,-1271.91 736.859,-1268.78 742.817,-1277.54 746.98,-1271.91"/>
</g>
<!-- hid_gtk3_cairo -->
<g id="node56" class="node"><title>hid_gtk3_cairo</title>
<ellipse fill="#a0a0ff" stroke="black" cx="767.715" cy="-1130.13" rx="63.8893" ry="18"/>
<text text-anchor="middle" x="767.715" y="-1126.43" font-family="Times,serif" font-size="14.00">hid_gtk3_cairo</text>
</g>
<!-- user&#45;&gt;hid_gtk3_cairo -->
<g id="edge68" class="edge"><title>user&#45;&gt;hid_gtk3_cairo</title>
<path fill="none" stroke="#a0a0a0" d="M1251.64,-1644.9C1181.86,-1570.67 878.32,-1247.78 791.182,-1155.09"/>
<polygon fill="#a0a0a0" stroke="#a0a0a0" points="793.525,-1152.47 784.125,-1147.58 788.425,-1157.27 793.525,-1152.47"/>
</g>
<!-- hid_gtk3_gl -->
<g id="node57" class="node"><title>hid_gtk3_gl</title>
<ellipse fill="#a0a0ff" stroke="black" cx="829.014" cy="-1011.82" rx="53.0913" ry="18"/>
<text text-anchor="middle" x="829.014" y="-1008.12" font-family="Times,serif" font-size="14.00">hid_gtk3_gl</text>
</g>
<!-- user&#45;&gt;hid_gtk3_gl -->
<g id="edge73" class="edge"><title>user&#45;&gt;hid_gtk3_gl</title>
<path fill="none" stroke="#a0a0a0" d="M1254.77,-1643.51C1195.52,-1555.6 919.424,-1145.96 846.641,-1037.98"/>
<polygon fill="#a0a0a0" stroke="#a0a0a0" points="849.485,-1035.93 840.994,-1029.6 843.68,-1039.85 849.485,-1035.93"/>
</g>
<!-- hid_lesstif -->
<g id="node58" class="node"><title>hid_lesstif</title>
<ellipse fill="#a0a0ff" stroke="black" cx="898.244" cy="-897.981" rx="47.3916" ry="18"/>
<text text-anchor="middle" x="898.244" y="-894.281" font-family="Times,serif" font-size="14.00">hid_lesstif</text>
</g>
<!-- user&#45;&gt;hid_lesstif -->
<g id="edge77" class="edge"><title>user&#45;&gt;hid_lesstif</title>
<path fill="none" stroke="#a0a0a0" d="M1257.64,-1642.84C1209.7,-1543.48 970.12,-1046.95 911.3,-925.04"/>
<polygon fill="#a0a0a0" stroke="#a0a0a0" points="914.425,-923.461 906.927,-915.976 908.12,-926.503 914.425,-923.461"/>
</g>
<!-- hid_remote -->
<g id="node60" class="node"><title>hid_remote</title>
<ellipse fill="#a0a0ff" stroke="black" cx="975.082" cy="-789.127" rx="51.1914" ry="18"/>
<text text-anchor="middle" x="975.082" y="-785.427" font-family="Times,serif" font-size="14.00">hid_remote</text>
</g>
<!-- user&#45;&gt;hid_remote -->
<g id="edge78" class="edge"><title>user&#45;&gt;hid_remote</title>
<path fill="none" stroke="#a0a0a0" d="M1260.07,-1642.39C1223.51,-1532.93 1029.21,-951.188 984.335,-816.831"/>
<polygon fill="#a0a0a0" stroke="#a0a0a0" points="987.625,-815.634 981.137,-807.258 980.985,-817.852 987.625,-815.634"/>
</g>
<!-- import_calay -->
<g id="node61" class="node"><title>import_calay</title>
<ellipse fill="#a0ffff" stroke="black" cx="1059.17" cy="-685.771" rx="57.6901" ry="18"/>
<text text-anchor="middle" x="1059.17" y="-682.071" font-family="Times,serif" font-size="14.00">import_calay</text>
</g>
<!-- user&#45;&gt;import_calay -->
<g id="edge79" class="edge"><title>user&#45;&gt;import_calay</title>
<path fill="none" stroke="#a0a0a0" d="M1262.16,-1642.02C1236.96,-1523.32 1095.88,-858.694 1065.1,-713.705"/>
<polygon fill="#a0a0a0" stroke="#a0a0a0" points="1068.5,-712.868 1063,-703.813 1061.65,-714.322 1068.5,-712.868"/>
</g>
<!-- import_dsn -->
<g id="node62" class="node"><title>import_dsn</title>
<ellipse fill="#a0ffff" stroke="black" cx="4389.81" cy="-2558.5" rx="51.1914" ry="18"/>
<text text-anchor="middle" x="4389.81" y="-2554.8" font-family="Times,serif" font-size="14.00">import_dsn</text>
</g>
<!-- user&#45;&gt;import_dsn -->
<g id="edge81" class="edge"><title>user&#45;&gt;import_dsn</title>
<path fill="none" stroke="#a0a0a0" d="M1291.16,-1667.42C1563.52,-1745.74 3964.09,-2436.07 4340.3,-2544.26"/>
<polygon fill="#a0a0a0" stroke="#a0a0a0" points="4339.5,-2547.67 4350.08,-2547.07 4341.44,-2540.94 4339.5,-2547.67"/>
</g>
<!-- import_edif -->
<g id="node63" class="node"><title>import_edif</title>
<ellipse fill="#a0ffff" stroke="black" cx="1150.11" cy="-588.393" rx="52.7911" ry="18"/>
<text text-anchor="middle" x="1150.11" y="-584.693" font-family="Times,serif" font-size="14.00">import_edif</text>
</g>
<!-- user&#45;&gt;import_edif -->
<g id="edge82" class="edge"><title>user&#45;&gt;import_edif</title>
<path fill="none" stroke="#a0a0a0" d="M1264.05,-1642.03C1250.43,-1516.04 1170,-772.324 1153.19,-616.87"/>
<polygon fill="#a0a0a0" stroke="#a0a0a0" points="1156.65,-616.276 1152.09,-606.71 1149.69,-617.028 1156.65,-616.276"/>
</g>
<!-- import_fpcb_nl -->
<g id="node64" class="node"><title>import_fpcb_nl</title>
<ellipse fill="#a0ffff" stroke="black" cx="1247.49" cy="-497.449" rx="65.7887" ry="18"/>
<text text-anchor="middle" x="1247.49" y="-493.749" font-family="Times,serif" font-size="14.00">import_fpcb_nl</text>
</g>
<!-- user&#45;&gt;import_fpcb_nl -->
<g id="edge83" class="edge"><title>user&#45;&gt;import_fpcb_nl</title>
<path fill="none" stroke="#a0a0a0" d="M1265.72,-1641.92C1263.6,-1508.9 1250.55,-689.622 1247.94,-525.903"/>
<polygon fill="#a0a0a0" stroke="#a0a0a0" points="1251.44,-525.616 1247.78,-515.673 1244.44,-525.727 1251.44,-525.616"/>
</g>
<!-- import_hpgl -->
<g id="node65" class="node"><title>import_hpgl</title>
<ellipse fill="#a0ffff" stroke="black" cx="1350.85" cy="-413.362" rx="54.6905" ry="18"/>
<text text-anchor="middle" x="1350.85" y="-409.662" font-family="Times,serif" font-size="14.00">import_hpgl</text>
</g>
<!-- user&#45;&gt;import_hpgl -->
<g id="edge84" class="edge"><title>user&#45;&gt;import_hpgl</title>
<path fill="none" stroke="#a0a0a0" d="M1267.24,-1642.08C1276.67,-1503.55 1337.31,-612.375 1348.92,-441.624"/>
<polygon fill="#a0a0a0" stroke="#a0a0a0" points="1352.42,-441.861 1349.6,-431.647 1345.43,-441.386 1352.42,-441.861"/>
</g>
<!-- import_ipcd356 -->
<g id="node66" class="node"><title>import_ipcd356</title>
<ellipse fill="#a0ffff" stroke="black" cx="4345.19" cy="-2684.04" rx="67.6881" ry="18"/>
<text text-anchor="middle" x="4345.19" y="-2680.34" font-family="Times,serif" font-size="14.00">import_ipcd356</text>
</g>
<!-- user&#45;&gt;import_ipcd356 -->
<g id="edge86" class="edge"><title>user&#45;&gt;import_ipcd356</title>
<path fill="none" stroke="#a0a0a0" d="M1290.35,-1668.28C1555.84,-1756.56 3911.39,-2539.8 4293.05,-2666.71"/>
<polygon fill="#a0a0a0" stroke="#a0a0a0" points="4292.14,-2670.09 4302.74,-2669.93 4294.35,-2663.45 4292.14,-2670.09"/>
</g>
<!-- import_ltspice -->
<g id="node67" class="node"><title>import_ltspice</title>
<ellipse fill="#a0ffff" stroke="black" cx="1459.7" cy="-336.525" rx="61.99" ry="18"/>
<text text-anchor="middle" x="1459.7" y="-332.825" font-family="Times,serif" font-size="14.00">import_ltspice</text>
</g>
<!-- user&#45;&gt;import_ltspice -->
<g id="edge87" class="edge"><title>user&#45;&gt;import_ltspice</title>
<path fill="none" stroke="#a0a0a0" d="M1268.68,-1641.98C1289.77,-1497.81 1429.68,-541.659 1455.58,-364.675"/>
<polygon fill="#a0a0a0" stroke="#a0a0a0" points="1459.07,-365 1457.06,-354.598 1452.14,-363.986 1459.07,-365"/>
</g>
<!-- import_mentor_sch -->
<g id="node68" class="node"><title>import_mentor_sch</title>
<ellipse fill="#a0ffff" stroke="black" cx="3170.89" cy="-1857.67" rx="80.6858" ry="18"/>
<text text-anchor="middle" x="3170.89" y="-1853.97" font-family="Times,serif" font-size="14.00">import_mentor_sch</text>
</g>
<!-- user&#45;&gt;import_mentor_sch -->
<g id="edge89" class="edge"><title>user&#45;&gt;import_mentor_sch</title>
<path fill="none" stroke="#a0a0a0" d="M1292.94,-1662.98C1493.05,-1683.73 2750.13,-1814.05 3087.6,-1849.04"/>
<polygon fill="#a0a0a0" stroke="#a0a0a0" points="3087.24,-1852.52 3097.55,-1850.07 3087.97,-1845.56 3087.24,-1852.52"/>
</g>
<!-- import_mucs -->
<g id="node69" class="node"><title>import_mucs</title>
<ellipse fill="#a0ffff" stroke="black" cx="4292.1" cy="-2806.25" rx="57.6901" ry="18"/>
<text text-anchor="middle" x="4292.1" y="-2802.55" font-family="Times,serif" font-size="14.00">import_mucs</text>
</g>
<!-- user&#45;&gt;import_mucs -->
<g id="edge91" class="edge"><title>user&#45;&gt;import_mucs</title>
<path fill="none" stroke="#a0a0a0" d="M1289.49,-1669.08C1549.4,-1767.51 3886.3,-2652.56 4245.78,-2788.71"/>
<polygon fill="#a0a0a0" stroke="#a0a0a0" points="4244.76,-2792.07 4255.35,-2792.33 4247.24,-2785.52 4244.76,-2792.07"/>
</g>
<!-- import_netlist -->
<g id="node70" class="node"><title>import_netlist</title>
<ellipse fill="#a0ffff" stroke="black" cx="1573.54" cy="-267.295" rx="60.3893" ry="18"/>
<text text-anchor="middle" x="1573.54" y="-263.595" font-family="Times,serif" font-size="14.00">import_netlist</text>
</g>
<!-- user&#45;&gt;import_netlist -->
<g id="edge92" class="edge"><title>user&#45;&gt;import_netlist</title>
<path fill="none" stroke="#a0a0a0" d="M1269.96,-1642.32C1302.54,-1494.73 1527.03,-477.946 1567.35,-295.347"/>
<polygon fill="#a0a0a0" stroke="#a0a0a0" points="1570.8,-295.961 1569.54,-285.441 1563.96,-294.451 1570.8,-295.961"/>
</g>
<!-- import_sch -->
<g id="node71" class="node"><title>import_sch</title>
<ellipse fill="#a0ffff" stroke="black" cx="1691.85" cy="-205.995" rx="50.8918" ry="18"/>
<text text-anchor="middle" x="1691.85" y="-202.295" font-family="Times,serif" font-size="14.00">import_sch</text>
</g>
<!-- user&#45;&gt;import_sch -->
<g id="edge93" class="edge"><title>user&#45;&gt;import_sch</title>
<path fill="none" stroke="#a0a0a0" d="M1271.24,-1642.33C1315.65,-1490.67 1629.19,-419.962 1683.76,-233.616"/>
<polygon fill="#a0a0a0" stroke="#a0a0a0" points="1687.12,-234.589 1686.57,-224.008 1680.4,-232.621 1687.12,-234.589"/>
</g>
<!-- import_tinycad -->
<g id="node72" class="node"><title>import_tinycad</title>
<ellipse fill="#a0ffff" stroke="black" cx="1814.06" cy="-152.912" rx="64.9885" ry="18"/>
<text text-anchor="middle" x="1814.06" y="-149.212" font-family="Times,serif" font-size="14.00">import_tinycad</text>
</g>
<!-- user&#45;&gt;import_tinycad -->
<g id="edge94" class="edge"><title>user&#45;&gt;import_tinycad</title>
<path fill="none" stroke="#a0a0a0" d="M1272.45,-1642.48C1328.59,-1488.08 1734.43,-371.906 1803.94,-180.735"/>
<polygon fill="#a0a0a0" stroke="#a0a0a0" points="1807.3,-181.729 1807.43,-171.134 1800.72,-179.336 1807.3,-181.729"/>
</g>
<!-- import_ttf -->
<g id="node73" class="node"><title>import_ttf</title>
<ellipse fill="#a0ffff" stroke="black" cx="1939.6" cy="-108.292" rx="46.5926" ry="18"/>
<text text-anchor="middle" x="1939.6" y="-104.592" font-family="Times,serif" font-size="14.00">import_ttf</text>
</g>
<!-- user&#45;&gt;import_ttf -->
<g id="edge95" class="edge"><title>user&#45;&gt;import_ttf</title>
<path fill="none" stroke="#a0a0a0" d="M1273.58,-1642.76C1341.38,-1486.55 1844.04,-328.453 1927.79,-135.508"/>
<polygon fill="#a0a0a0" stroke="#a0a0a0" points="1931.11,-136.656 1931.88,-126.089 1924.69,-133.869 1931.11,-136.656"/>
</g>
<!-- io_autotrax -->
<g id="node74" class="node"><title>io_autotrax</title>
<ellipse fill="#ffa0a0" stroke="black" cx="2067.9" cy="-72.3444" rx="50.8918" ry="18"/>
<text text-anchor="middle" x="2067.9" y="-68.6444" font-family="Times,serif" font-size="14.00">io_autotrax</text>
</g>
<!-- user&#45;&gt;io_autotrax -->
<g id="edge97" class="edge"><title>user&#45;&gt;io_autotrax</title>
<path fill="none" stroke="#a0a0a0" d="M1274.74,-1642.9C1354.53,-1484.91 1956.37,-293.202 2054.42,-99.047"/>
<polygon fill="#a0a0a0" stroke="#a0a0a0" points="2057.57,-100.581 2058.95,-90.0766 2051.32,-97.4251 2057.57,-100.581"/>
</g>
<!-- io_dsn -->
<g id="node75" class="node"><title>io_dsn</title>
<ellipse fill="#ffa0a0" stroke="black" cx="3176.94" cy="-1901.67" rx="34.394" ry="18"/>
<text text-anchor="middle" x="3176.94" y="-1897.97" font-family="Times,serif" font-size="14.00">io_dsn</text>
</g>
<!-- user&#45;&gt;io_dsn -->
<g id="edge99" class="edge"><title>user&#45;&gt;io_dsn</title>
<path fill="none" stroke="#a0a0a0" d="M1292.66,-1663.55C1501.26,-1689.92 2870.96,-1863.01 3133.48,-1896.18"/>
<polygon fill="#a0a0a0" stroke="#a0a0a0" points="3133.04,-1899.65 3143.4,-1897.44 3133.92,-1892.71 3133.04,-1899.65"/>
</g>
<!-- io_eagle -->
<g id="node76" class="node"><title>io_eagle</title>
<ellipse fill="#ffa0a0" stroke="black" cx="2198.36" cy="-45.2357" rx="40.0939" ry="18"/>
<text text-anchor="middle" x="2198.36" y="-41.5357" font-family="Times,serif" font-size="14.00">io_eagle</text>
</g>
<!-- user&#45;&gt;io_eagle -->
<g id="edge100" class="edge"><title>user&#45;&gt;io_eagle</title>
<path fill="none" stroke="#a0a0a0" d="M1275.85,-1643.14C1367.48,-1484.44 2070.58,-266.563 2183.17,-71.5406"/>
<polygon fill="#a0a0a0" stroke="#a0a0a0" points="2186.26,-73.2013 2188.22,-62.791 2180.19,-69.7014 2186.26,-73.2013"/>
</g>
<!-- io_hyp -->
<g id="node77" class="node"><title>io_hyp</title>
<ellipse fill="#ffa0a0" stroke="black" cx="4084.74" cy="-3147.25" rx="35.194" ry="18"/>
<text text-anchor="middle" x="4084.74" y="-3143.55" font-family="Times,serif" font-size="14.00">io_hyp</text>
</g>
<!-- user&#45;&gt;io_hyp -->
<g id="edge102" class="edge"><title>user&#45;&gt;io_hyp</title>
<path fill="none" stroke="#a0a0a0" d="M1287.48,-1671.51C1529.88,-1799.4 3749.16,-2970.21 4050.84,-3129.37"/>
<polygon fill="#a0a0a0" stroke="#a0a0a0" points="4049.51,-3132.62 4059.98,-3134.19 4052.77,-3126.43 4049.51,-3132.62"/>
</g>
<!-- io_kicad -->
<g id="node78" class="node"><title>io_kicad</title>
<ellipse fill="#ffa0a0" stroke="black" cx="3179.97" cy="-1945.98" rx="40.8928" ry="18"/>
<text text-anchor="middle" x="3179.97" y="-1942.28" font-family="Times,serif" font-size="14.00">io_kicad</text>
</g>
<!-- user&#45;&gt;io_kicad -->
<g id="edge104" class="edge"><title>user&#45;&gt;io_kicad</title>
<path fill="none" stroke="#a0a0a0" d="M1292.7,-1664.17C1500.18,-1695.15 2854.42,-1897.37 3130.78,-1938.64"/>
<polygon fill="#a0a0a0" stroke="#a0a0a0" points="3130.49,-1942.13 3140.9,-1940.15 3131.53,-1935.21 3130.49,-1942.13"/>
</g>
<!-- io_kicad_legacy -->
<g id="node79" class="node"><title>io_kicad_legacy</title>
<ellipse fill="#ffa0a0" stroke="black" cx="3830.04" cy="-1923.78" rx="68.4888" ry="18"/>
<text text-anchor="middle" x="3830.04" y="-1920.08" font-family="Times,serif" font-size="14.00">io_kicad_legacy</text>
</g>
<!-- user&#45;&gt;io_kicad_legacy -->
<g id="edge106" class="edge"><title>user&#45;&gt;io_kicad_legacy</title>
<path fill="none" stroke="#a0a0a0" d="M1293.07,-1662.97C1537.5,-1688.1 3364.41,-1875.91 3756.2,-1916.19"/>
<polygon fill="#a0a0a0" stroke="#a0a0a0" points="3755.97,-1919.68 3766.28,-1917.22 3756.69,-1912.72 3755.97,-1919.68"/>
</g>
<!-- io_mentor_cell -->
<g id="node80" class="node"><title>io_mentor_cell</title>
<ellipse fill="#ffa0a0" stroke="black" cx="2330.36" cy="-27.0927" rx="64.189" ry="18"/>
<text text-anchor="middle" x="2330.36" y="-23.3927" font-family="Times,serif" font-size="14.00">io_mentor_cell</text>
</g>
<!-- user&#45;&gt;io_mentor_cell -->
<g id="edge109" class="edge"><title>user&#45;&gt;io_mentor_cell</title>
<path fill="none" stroke="#a0a0a0" d="M1276.89,-1643.49C1380.07,-1485.19 2185,-250.129 2313.18,-53.4535"/>
<polygon fill="#a0a0a0" stroke="#a0a0a0" points="2316.24,-55.1702 2318.77,-44.8814 2310.37,-51.3481 2316.24,-55.1702"/>
</g>
<!-- io_pcb -->
<g id="node81" class="node"><title>io_pcb</title>
<ellipse fill="#ffa0a0" stroke="black" cx="4230.81" cy="-2924.56" rx="34.394" ry="18"/>
<text text-anchor="middle" x="4230.81" y="-2920.86" font-family="Times,serif" font-size="14.00">io_pcb</text>
</g>
<!-- user&#45;&gt;io_pcb -->
<g id="edge111" class="edge"><title>user&#45;&gt;io_pcb</title>
<path fill="none" stroke="#a0a0a0" d="M1289.02,-1670C1546.01,-1779.59 3875.65,-2773.1 4194.67,-2909.15"/>
<polygon fill="#a0a0a0" stroke="#a0a0a0" points="4193.36,-2912.39 4203.93,-2913.1 4196.11,-2905.95 4193.36,-2912.39"/>
</g>
<!-- io_tedax -->
<g id="node82" class="node"><title>io_tedax</title>
<ellipse fill="#ffa0a0" stroke="black" cx="4161.58" cy="-3038.4" rx="40.8928" ry="18"/>
<text text-anchor="middle" x="4161.58" y="-3034.7" font-family="Times,serif" font-size="14.00">io_tedax</text>
</g>
<!-- user&#45;&gt;io_tedax -->
<g id="edge114" class="edge"><title>user&#45;&gt;io_tedax</title>
<path fill="none" stroke="#a0a0a0" d="M1288.07,-1670.68C1536.43,-1788.9 3804.92,-2868.64 4124.28,-3020.65"/>
<polygon fill="#a0a0a0" stroke="#a0a0a0" points="4123.04,-3023.93 4133.57,-3025.07 4126.05,-3017.61 4123.04,-3023.93"/>
</g>
<!-- jostle -->
<g id="node83" class="node"><title>jostle</title>
<ellipse fill="lightgrey" stroke="black" cx="2463.29" cy="-18" rx="29.795" ry="18"/>
<text text-anchor="middle" x="2463.29" y="-14.3" font-family="Times,serif" font-size="14.00">jostle</text>
</g>
<!-- user&#45;&gt;jostle -->
<g id="edge115" class="edge"><title>user&#45;&gt;jostle</title>
<path fill="none" stroke="#a0a0a0" d="M1277.86,-1643.93C1392.61,-1486.54 2305.1,-234.976 2445.25,-42.743"/>
<polygon fill="#a0a0a0" stroke="#a0a0a0" points="2448.1,-44.7804 2451.16,-34.638 2442.44,-40.6565 2448.1,-44.7804"/>
</g>
<!-- loghid -->
<g id="node85" class="node"><title>loghid</title>
<ellipse fill="lightgrey" stroke="black" cx="2596.53" cy="-18" rx="33.2948" ry="18"/>
<text text-anchor="middle" x="2596.53" y="-14.3" font-family="Times,serif" font-size="14.00">loghid</text>
</g>
<!-- user&#45;&gt;loghid -->
<g id="edge119" class="edge"><title>user&#45;&gt;loghid</title>
<path fill="none" stroke="#a0a0a0" d="M1278.97,-1644.2C1405.62,-1487.88 2421.56,-233.951 2576.69,-42.4826"/>
<polygon fill="#a0a0a0" stroke="#a0a0a0" points="2579.46,-44.6281 2583.04,-34.6549 2574.02,-40.2214 2579.46,-44.6281"/>
</g>
<!-- millpath -->
<g id="node86" class="node"><title>millpath</title>
<ellipse fill="lightgrey" stroke="black" cx="2729.46" cy="-27.0927" rx="40.0939" ry="18"/>
<text text-anchor="middle" x="2729.46" y="-23.3927" font-family="Times,serif" font-size="14.00">millpath</text>
</g>
<!-- user&#45;&gt;millpath -->
<g id="edge121" class="edge"><title>user&#45;&gt;millpath</title>
<path fill="none" stroke="#a0a0a0" d="M1280.03,-1644.55C1418.3,-1490.24 2536.76,-242.126 2707.61,-51.4791"/>
<polygon fill="#a0a0a0" stroke="#a0a0a0" points="2710.31,-53.708 2714.38,-43.9248 2705.1,-49.0364 2710.31,-53.708"/>
</g>
<!-- mincut -->
<g id="node87" class="node"><title>mincut</title>
<ellipse fill="lightgrey" stroke="black" cx="2861.46" cy="-45.2357" rx="35.9954" ry="18"/>
<text text-anchor="middle" x="2861.46" y="-41.5357" font-family="Times,serif" font-size="14.00">mincut</text>
</g>
<!-- user&#45;&gt;mincut -->
<g id="edge122" class="edge"><title>user&#45;&gt;mincut</title>
<path fill="none" stroke="#a0a0a0" d="M1281.04,-1644.98C1430.82,-1493.37 2653.72,-255.515 2838.19,-68.7886"/>
<polygon fill="#a0a0a0" stroke="#a0a0a0" points="2840.95,-70.973 2845.49,-61.3993 2835.97,-66.0534 2840.95,-70.973"/>
</g>
<!-- oldactions -->
<g id="node88" class="node"><title>oldactions</title>
<ellipse fill="lightgrey" stroke="black" cx="2991.91" cy="-72.3444" rx="46.5926" ry="18"/>
<text text-anchor="middle" x="2991.91" y="-68.6444" font-family="Times,serif" font-size="14.00">oldactions</text>
</g>
<!-- user&#45;&gt;oldactions -->
<g id="edge123" class="edge"><title>user&#45;&gt;oldactions</title>
<path fill="none" stroke="#a0a0a0" d="M1282,-1645.48C1442.71,-1497.62 2765.45,-280.697 2966.37,-95.8425"/>
<polygon fill="#a0a0a0" stroke="#a0a0a0" points="2968.83,-98.3377 2973.82,-88.9913 2964.09,-93.1861 2968.83,-98.3377"/>
</g>
<!-- polycombine -->
<g id="node89" class="node"><title>polycombine</title>
<ellipse fill="lightgrey" stroke="black" cx="3120.21" cy="-108.292" rx="57.3905" ry="18"/>
<text text-anchor="middle" x="3120.21" y="-104.592" font-family="Times,serif" font-size="14.00">polycombine</text>
</g>
<!-- user&#45;&gt;polycombine -->
<g id="edge124" class="edge"><title>user&#45;&gt;polycombine</title>
<path fill="none" stroke="#a0a0a0" d="M1282.9,-1646.06C1454.06,-1502.8 2873.62,-314.68 3092.05,-131.866"/>
<polygon fill="#a0a0a0" stroke="#a0a0a0" points="3094.45,-134.419 3099.87,-125.317 3089.96,-129.051 3094.45,-134.419"/>
</g>
<!-- polystitch -->
<g id="node90" class="node"><title>polystitch</title>
<ellipse fill="lightgrey" stroke="black" cx="3245.76" cy="-152.912" rx="45.4919" ry="18"/>
<text text-anchor="middle" x="3245.76" y="-149.212" font-family="Times,serif" font-size="14.00">polystitch</text>
</g>
<!-- user&#45;&gt;polystitch -->
<g id="edge125" class="edge"><title>user&#45;&gt;polystitch</title>
<path fill="none" stroke="#a0a0a0" d="M1284.04,-1646.46C1466.99,-1507.18 2985.64,-350.953 3216.42,-175.255"/>
<polygon fill="#a0a0a0" stroke="#a0a0a0" points="3218.84,-177.81 3224.67,-168.968 3214.6,-172.24 3218.84,-177.81"/>
</g>
<!-- propedit -->
<g id="node91" class="node"><title>propedit</title>
<ellipse fill="lightgrey" stroke="black" cx="3367.97" cy="-205.995" rx="40.0939" ry="18"/>
<text text-anchor="middle" x="3367.97" y="-202.295" font-family="Times,serif" font-size="14.00">propedit</text>
</g>
<!-- user&#45;&gt;propedit -->
<g id="edge126" class="edge"><title>user&#45;&gt;propedit</title>
<path fill="none" stroke="#a0a0a0" d="M1284.83,-1647.17C1477.77,-1513.68 3094.8,-394.98 3337.53,-227.058"/>
<polygon fill="#a0a0a0" stroke="#a0a0a0" points="3339.66,-229.84 3345.89,-221.272 3335.68,-224.083 3339.66,-229.84"/>
</g>
<!-- puller -->
<g id="node92" class="node"><title>puller</title>
<ellipse fill="lightgrey" stroke="black" cx="3486.28" cy="-267.295" rx="31.3957" ry="18"/>
<text text-anchor="middle" x="3486.28" y="-263.595" font-family="Times,serif" font-size="14.00">puller</text>
</g>
<!-- user&#45;&gt;puller -->
<g id="edge127" class="edge"><title>user&#45;&gt;puller</title>
<path fill="none" stroke="#a0a0a0" d="M1285.88,-1647.72C1490.33,-1519.46 3208.44,-441.596 3456.48,-285.986"/>
<polygon fill="#a0a0a0" stroke="#a0a0a0" points="3458.39,-288.923 3465,-280.644 3454.67,-282.993 3458.39,-288.923"/>
</g>
<!-- query -->
<g id="node93" class="node"><title>query</title>
<ellipse fill="lightgrey" stroke="black" cx="3600.12" cy="-336.525" rx="30.5947" ry="18"/>
<text text-anchor="middle" x="3600.12" y="-332.825" font-family="Times,serif" font-size="14.00">query</text>
</g>
<!-- user&#45;&gt;query -->
<g id="edge128" class="edge"><title>user&#45;&gt;query</title>
<path fill="none" stroke="#a0a0a0" d="M1286.9,-1648.34C1501.94,-1526.39 3309.92,-501.098 3569.2,-354.057"/>
<polygon fill="#a0a0a0" stroke="#a0a0a0" points="3571.13,-356.989 3578.1,-349.012 3567.67,-350.9 3571.13,-356.989"/>
</g>
<!-- renumber -->
<g id="node94" class="node"><title>renumber</title>
<ellipse fill="lightgrey" stroke="black" cx="3708.97" cy="-413.362" rx="44.6926" ry="18"/>
<text text-anchor="middle" x="3708.97" y="-409.662" font-family="Times,serif" font-size="14.00">renumber</text>
</g>
<!-- user&#45;&gt;renumber -->
<g id="edge129" class="edge"><title>user&#45;&gt;renumber</title>
<path fill="none" stroke="#a0a0a0" d="M1287.5,-1649.22C1509.54,-1535.9 3383.11,-579.673 3671.71,-432.378"/>
<polygon fill="#a0a0a0" stroke="#a0a0a0" points="3673.61,-435.338 3680.93,-427.675 3670.43,-429.103 3673.61,-435.338"/>
</g>
<!-- rubberband_orig -->
<g id="node95" class="node"><title>rubberband_orig</title>
<ellipse fill="lightgrey" stroke="black" cx="3812.33" cy="-497.449" rx="69.5877" ry="18"/>
<text text-anchor="middle" x="3812.33" y="-493.749" font-family="Times,serif" font-size="14.00">rubberband_orig</text>
</g>
<!-- user&#45;&gt;rubberband_orig -->
<g id="edge131" class="edge"><title>user&#45;&gt;rubberband_orig</title>
<path fill="none" stroke="#a0a0a0" d="M1288.41,-1649.96C1518.62,-1544.84 3452.04,-661.97 3768.58,-517.429"/>
<polygon fill="#a0a0a0" stroke="#a0a0a0" points="3770.25,-520.514 3777.89,-513.176 3767.34,-514.146 3770.25,-520.514"/>
</g>
<!-- script -->
<g id="node96" class="node"><title>script</title>
<ellipse fill="lightgrey" stroke="black" cx="3909.71" cy="-588.393" rx="30.5947" ry="18"/>
<text text-anchor="middle" x="3909.71" y="-584.693" font-family="Times,serif" font-size="14.00">script</text>
</g>
<!-- user&#45;&gt;script -->
<g id="edge132" class="edge"><title>user&#45;&gt;script</title>
<path fill="none" stroke="#a0a0a0" d="M1289.27,-1650.76C1531.06,-1552.73 3582.61,-721.005 3875.07,-602.437"/>
<polygon fill="#a0a0a0" stroke="#a0a0a0" points="3876.39,-605.676 3884.35,-598.675 3873.76,-599.189 3876.39,-605.676"/>
</g>
<!-- serpentine -->
<g id="node97" class="node"><title>serpentine</title>
<ellipse fill="lightgrey" stroke="black" cx="4000.65" cy="-685.771" rx="46.5926" ry="18"/>
<text text-anchor="middle" x="4000.65" y="-682.071" font-family="Times,serif" font-size="14.00">serpentine</text>
</g>
<!-- user&#45;&gt;serpentine -->
<g id="edge133" class="edge"><title>user&#45;&gt;serpentine</title>
<path fill="none" stroke="#a0a0a0" d="M1290.07,-1651.62C1537.95,-1563.29 3624.66,-819.745 3956.31,-701.571"/>
<polygon fill="#a0a0a0" stroke="#a0a0a0" points="3957.8,-704.754 3966.05,-698.1 3955.45,-698.16 3957.8,-704.754"/>
</g>
<!-- shand_cmd -->
<g id="node98" class="node"><title>shand_cmd</title>
<ellipse fill="lightgrey" stroke="black" cx="4084.74" cy="-789.127" rx="51.1914" ry="18"/>
<text text-anchor="middle" x="4084.74" y="-785.427" font-family="Times,serif" font-size="14.00">shand_cmd</text>
</g>
<!-- user&#45;&gt;shand_cmd -->
<g id="edge134" class="edge"><title>user&#45;&gt;shand_cmd</title>
<path fill="none" stroke="#a0a0a0" d="M1290.81,-1652.52C1545.69,-1573.76 3686.81,-912.096 4036.53,-804.026"/>
<polygon fill="#a0a0a0" stroke="#a0a0a0" points="4037.59,-807.36 4046.11,-801.064 4035.52,-800.672 4037.59,-807.36"/>
</g>
<!-- shape -->
<g id="node99" class="node"><title>shape</title>
<ellipse fill="lightgrey" stroke="black" cx="4161.58" cy="-897.981" rx="30.5947" ry="18"/>
<text text-anchor="middle" x="4161.58" y="-894.281" font-family="Times,serif" font-size="14.00">shape</text>
</g>
<!-- user&#45;&gt;shape -->
<g id="edge135" class="edge"><title>user&#45;&gt;shape</title>
<path fill="none" stroke="#a0a0a0" d="M1291.49,-1653.48C1556.3,-1583.77 3803.19,-992.319 4123.61,-907.975"/>
<polygon fill="#a0a0a0" stroke="#a0a0a0" points="4124.58,-911.338 4133.36,-905.408 4122.8,-904.569 4124.58,-911.338"/>
</g>
<!-- sketch_route -->
<g id="node100" class="node"><title>sketch_route</title>
<ellipse fill="lightgrey" stroke="black" cx="4230.81" cy="-1011.82" rx="55.7903" ry="18"/>
<text text-anchor="middle" x="4230.81" y="-1008.12" font-family="Times,serif" font-size="14.00">sketch_route</text>
</g>
<!-- user&#45;&gt;sketch_route -->
<g id="edge136" class="edge"><title>user&#45;&gt;sketch_route</title>
<path fill="none" stroke="#a0a0a0" d="M1292.09,-1654.48C1558.9,-1596.14 3790.7,-1108.07 4174.67,-1024.1"/>
<polygon fill="#a0a0a0" stroke="#a0a0a0" points="4175.43,-1027.52 4184.45,-1021.96 4173.93,-1020.68 4175.43,-1027.52"/>
</g>
<!-- smartdisperse -->
<g id="node101" class="node"><title>smartdisperse</title>
<ellipse fill="lightgrey" stroke="black" cx="4292.1" cy="-1130.13" rx="59.5901" ry="18"/>
<text text-anchor="middle" x="4292.1" y="-1126.43" font-family="Times,serif" font-size="14.00">smartdisperse</text>
</g>
<!-- user&#45;&gt;smartdisperse -->
<g id="edge137" class="edge"><title>user&#45;&gt;smartdisperse</title>
<path fill="none" stroke="#a0a0a0" d="M1292.17,-1655.6C1561.36,-1608.45 3825.48,-1211.86 4230.29,-1140.96"/>
<polygon fill="#a0a0a0" stroke="#a0a0a0" points="4231.09,-1144.37 4240.34,-1139.2 4229.88,-1137.47 4231.09,-1144.37"/>
</g>
<!-- stroke -->
<g id="node102" class="node"><title>stroke</title>
<ellipse fill="lightgrey" stroke="black" cx="4345.19" cy="-1252.34" rx="32.4942" ry="18"/>
<text text-anchor="middle" x="4345.19" y="-1248.64" font-family="Times,serif" font-size="14.00">stroke</text>
</g>
<!-- user&#45;&gt;stroke -->
<g id="edge138" class="edge"><title>user&#45;&gt;stroke</title>
<path fill="none" stroke="#a0a0a0" d="M1292.63,-1656.66C1571.59,-1619.71 3956.1,-1303.87 4303.13,-1257.91"/>
<polygon fill="#a0a0a0" stroke="#a0a0a0" points="4303.8,-1261.35 4313.26,-1256.57 4302.88,-1254.41 4303.8,-1261.35"/>
</g>
<!-- teardrops -->
<g id="node103" class="node"><title>teardrops</title>
<ellipse fill="lightgrey" stroke="black" cx="4389.81" cy="-1377.89" rx="43.5923" ry="18"/>
<text text-anchor="middle" x="4389.81" y="-1374.19" font-family="Times,serif" font-size="14.00">teardrops</text>
</g>
<!-- user&#45;&gt;teardrops -->
<g id="edge139" class="edge"><title>user&#45;&gt;teardrops</title>
<path fill="none" stroke="#a0a0a0" d="M1293.02,-1657.75C1573.49,-1632.4 3951.98,-1417.45 4337.2,-1382.64"/>
<polygon fill="#a0a0a0" stroke="#a0a0a0" points="4337.59,-1386.12 4347.24,-1381.73 4336.96,-1379.15 4337.59,-1386.12"/>
</g>
<!-- vendordrill -->
<g id="node104" class="node"><title>vendordrill</title>
<ellipse fill="lightgrey" stroke="black" cx="4425.76" cy="-1506.19" rx="50.0912" ry="18"/>
<text text-anchor="middle" x="4425.76" y="-1502.49" font-family="Times,serif" font-size="14.00">vendordrill</text>
</g>
<!-- user&#45;&gt;vendordrill -->
<g id="edge140" class="edge"><title>user&#45;&gt;vendordrill</title>
<path fill="none" stroke="#a0a0a0" d="M1293.33,-1658.86C1575.45,-1645.11 3956.16,-1529.07 4365.85,-1509.11"/>
<polygon fill="#a0a0a0" stroke="#a0a0a0" points="4366.18,-1512.59 4376,-1508.61 4365.84,-1505.6 4366.18,-1512.59"/>
</g>
<!-- lib_gensexpr -->
<g id="node5" class="node"><title>lib_gensexpr</title>
<ellipse fill="#a0a0a0" stroke="black" cx="2529.91" cy="-1968.19" rx="55.7903" ry="18"/>
<text text-anchor="middle" x="2529.91" y="-1964.49" font-family="Times,serif" font-size="14.00">lib_gensexpr</text>
</g>
<!-- ar_cpcb&#45;&gt;lib_gensexpr -->
<g id="edge3" class="edge"><title>ar_cpcb&#45;&gt;lib_gensexpr</title>
<path fill="none" stroke="black" d="M1920.46,-2030.84C2027.18,-2019.87 2332.96,-1988.44 2466.37,-1974.72"/>
<polygon fill="black" stroke="black" points="2466.85,-1978.19 2476.44,-1973.69 2466.13,-1971.23 2466.85,-1978.19"/>
</g>
<!-- lib_compat_help -->
<g id="node6" class="node"><title>lib_compat_help</title>
<ellipse fill="#a0a0a0" stroke="black" cx="3769.84" cy="-2361.73" rx="70.3881" ry="18"/>
<text text-anchor="middle" x="3769.84" y="-2358.03" font-family="Times,serif" font-size="14.00">lib_compat_help</text>
</g>
<!-- ar_cpcb&#45;&gt;lib_compat_help -->
<g id="edge4" class="edge"><title>ar_cpcb&#45;&gt;lib_compat_help</title>
<path fill="none" stroke="black" d="M1918.89,-2040.95C2147.23,-2080.52 3393.98,-2296.59 3701.34,-2349.86"/>
<polygon fill="black" stroke="black" points="3700.99,-2353.35 3711.44,-2351.61 3702.19,-2346.45 3700.99,-2353.35"/>
</g>
<!-- lib_netmap -->
<g id="node7" class="node"><title>lib_netmap</title>
<ellipse fill="#a0a0a0" stroke="black" cx="3566.46" cy="-2754.23" rx="50.8918" ry="18"/>
<text text-anchor="middle" x="3566.46" y="-2750.53" font-family="Times,serif" font-size="14.00">lib_netmap</text>
</g>
<!-- ar_cpcb&#45;&gt;lib_netmap -->
<g id="edge5" class="edge"><title>ar_cpcb&#45;&gt;lib_netmap</title>
<path fill="none" stroke="black" d="M1911.39,-2046.89C2110.11,-2131.82 3287.08,-2634.83 3524.67,-2736.37"/>
<polygon fill="black" stroke="black" points="3523.43,-2739.65 3534.01,-2740.36 3526.19,-2733.21 3523.43,-2739.65"/>
</g>
<!-- autoroute&#45;&gt;lib_compat_help -->
<g id="edge10" class="edge"><title>autoroute&#45;&gt;lib_compat_help</title>
<path fill="none" stroke="black" d="M4450.49,-2048.44C4339.2,-2099.67 3945.64,-2280.81 3813.49,-2341.64"/>
<polygon fill="black" stroke="black" points="3811.69,-2338.61 3804.06,-2345.98 3814.61,-2344.97 3811.69,-2338.61"/>
</g>
<!-- draw_fontsel -->
<g id="node16" class="node"><title>draw_fontsel</title>
<ellipse fill="lightgrey" stroke="black" cx="3316.98" cy="-4448.05" rx="56.59" ry="18"/>
<text text-anchor="middle" x="3316.98" y="-4444.35" font-family="Times,serif" font-size="14.00">draw_fontsel</text>
</g>
<!-- dialogs&#45;&gt;draw_fontsel -->
<g id="edge15" class="edge"><title>dialogs&#45;&gt;draw_fontsel</title>
<path fill="none" stroke="black" d="M3001.64,-3881.52C3047.9,-3964.62 3245.68,-4319.95 3301.98,-4421.09"/>
<polygon fill="black" stroke="black" points="3299.05,-4423.04 3306.97,-4430.07 3305.17,-4419.63 3299.05,-4423.04"/>
</g>
<!-- draw_csect -->
<g id="node20" class="node"><title>draw_csect</title>
<ellipse fill="lightgrey" stroke="black" cx="50.0456" cy="-1181.12" rx="50.0912" ry="18"/>
<text text-anchor="middle" x="50.0456" y="-1177.42" font-family="Times,serif" font-size="14.00">draw_csect</text>
</g>
<!-- draw_fab&#45;&gt;report -->
<g id="edge20" class="edge"><title>draw_fab&#45;&gt;report</title>
<path fill="none" stroke="black" d="M2288.23,-3903.5C2272.78,-3901.37 2255.32,-3898.97 2239.92,-3896.86"/>
<polygon fill="black" stroke="black" points="2240.02,-3893.34 2229.64,-3895.44 2239.07,-3900.27 2240.02,-3893.34"/>
</g>
<!-- export_fidocadj&#45;&gt;lib_compat_help -->
<g id="edge28" class="edge"><title>export_fidocadj&#45;&gt;lib_compat_help</title>
<path fill="none" stroke="black" d="M4424.46,-2180.62C4300.62,-2214.88 3963.31,-2308.2 3827.56,-2345.76"/>
<polygon fill="black" stroke="black" points="3826.46,-2342.43 3817.76,-2348.47 3828.33,-2349.18 3826.46,-2342.43"/>
</g>
<!-- export_ipcd356&#45;&gt;lib_compat_help -->
<g id="edge32" class="edge"><title>export_ipcd356&#45;&gt;lib_compat_help</title>
<path fill="none" stroke="black" d="M4390.44,-2305.41C4265.03,-2316.79 3982.83,-2342.4 3846.48,-2354.77"/>
<polygon fill="black" stroke="black" points="3845.76,-2351.32 3836.12,-2355.71 3846.4,-2358.29 3845.76,-2351.32"/>
</g>
<!-- export_lpr&#45;&gt;export_ps -->
<g id="edge34" class="edge"><title>export_lpr&#45;&gt;export_ps</title>
<path fill="none" stroke="black" d="M1133.85,-3330.58C1119.41,-3315.11 1098.15,-3292.35 1082,-3275.06"/>
<polygon fill="black" stroke="black" points="1084.37,-3272.46 1074.98,-3267.54 1079.25,-3277.24 1084.37,-3272.46"/>
</g>
<!-- lib_polyhelp -->
<g id="node37" class="node"><title>lib_polyhelp</title>
<ellipse fill="#a0a0a0" stroke="black" cx="354.356" cy="-3395.14" rx="55.4913" ry="18"/>
<text text-anchor="middle" x="354.356" y="-3391.44" font-family="Times,serif" font-size="14.00">lib_polyhelp</text>
</g>
<!-- export_openems&#45;&gt;lib_polyhelp -->
<g id="edge37" class="edge"><title>export_openems&#45;&gt;lib_polyhelp</title>
<path fill="none" stroke="black" d="M872.377,-3055.37C783.03,-3113.97 487.434,-3307.85 387.616,-3373.32"/>
<polygon fill="black" stroke="black" points="385.567,-3370.48 379.125,-3378.89 389.406,-3376.33 385.567,-3370.48"/>
</g>
<!-- export_openscad&#45;&gt;lib_polyhelp -->
<g id="edge39" class="edge"><title>export_openscad&#45;&gt;lib_polyhelp</title>
<path fill="none" stroke="black" d="M811.273,-2942.14C738.647,-3014.15 463.867,-3286.57 379.287,-3370.42"/>
<polygon fill="black" stroke="black" points="376.571,-3368.18 371.933,-3377.71 381.499,-3373.15 376.571,-3368.18"/>
</g>
<!-- export_xy&#45;&gt;export_bom -->
<g id="edge46" class="edge"><title>export_xy&#45;&gt;export_bom</title>
<path fill="none" stroke="black" d="M620.087,-2317.06C732.78,-2465.67 1536.04,-3524.92 1672.25,-3704.54"/>
<polygon fill="black" stroke="black" points="1669.56,-3706.79 1678.39,-3712.65 1675.14,-3702.56 1669.56,-3706.79"/>
</g>
<!-- extedit&#45;&gt;io_lihata -->
<g id="edge48" class="edge"><title>extedit&#45;&gt;io_lihata</title>
<path fill="none" stroke="black" d="M623.155,-2170.09C976.481,-2194.26 3945.85,-2397.37 4374.32,-2426.68"/>
<polygon fill="black" stroke="black" points="4374.32,-2430.19 4384.54,-2427.38 4374.8,-2423.2 4374.32,-2430.19"/>
</g>
<!-- io_lihata&#45;&gt;lib_compat_help -->
<g id="edge107" class="edge"><title>io_lihata&#45;&gt;lib_compat_help</title>
<path fill="none" stroke="black" d="M4385.22,-2425.96C4277.79,-2414.75 3984.49,-2384.13 3845.2,-2369.59"/>
<polygon fill="black" stroke="black" points="3845.35,-2366.09 3835.04,-2368.53 3844.63,-2373.05 3845.35,-2366.09"/>
</g>
<!-- fp_wget&#45;&gt;fp_fs -->
<g id="edge53" class="edge"><title>fp_wget&#45;&gt;fp_fs</title>
<path fill="none" stroke="black" d="M604.47,-1654.72C601.434,-1676.81 596.261,-1714.45 592.697,-1740.38"/>
<polygon fill="black" stroke="black" points="589.219,-1739.97 591.325,-1750.36 596.154,-1740.93 589.219,-1739.97"/>
</g>
<!-- hid_gtk2_gdk&#45;&gt;draw_csect -->
<g id="edge58" class="edge"><title>hid_gtk2_gdk&#45;&gt;draw_csect</title>
<path fill="none" stroke="black" d="M628.854,-1364.82C518.222,-1329.71 214.883,-1233.43 97.3984,-1196.15"/>
<polygon fill="black" stroke="black" points="98.1991,-1192.73 87.6089,-1193.04 96.0815,-1199.4 98.1991,-1192.73"/>
</g>
<!-- lib_gtk_common -->
<g id="node52" class="node"><title>lib_gtk_common</title>
<ellipse fill="#a0a0a0" stroke="black" cx="3145.92" cy="-4495.99" rx="71.4873" ry="18"/>
<text text-anchor="middle" x="3145.92" y="-4492.29" font-family="Times,serif" font-size="14.00">lib_gtk_common</text>
</g>
<!-- hid_gtk2_gdk&#45;&gt;lib_gtk_common -->
<g id="edge56" class="edge"><title>hid_gtk2_gdk&#45;&gt;lib_gtk_common</title>
<path fill="none" stroke="black" d="M683.936,-1395.42C871.668,-1631.85 2898.22,-4184.04 3125.27,-4469.98"/>
<polygon fill="black" stroke="black" points="3122.78,-4472.48 3131.74,-4478.13 3128.26,-4468.12 3122.78,-4472.48"/>
</g>
<!-- lib_gtk_hid -->
<g id="node53" class="node"><title>lib_gtk_hid</title>
<ellipse fill="#a0a0a0" stroke="black" cx="2971.98" cy="-4532.13" rx="51.1914" ry="18"/>
<text text-anchor="middle" x="2971.98" y="-4528.43" font-family="Times,serif" font-size="14.00">lib_gtk_hid</text>
</g>
<!-- hid_gtk2_gdk&#45;&gt;lib_gtk_hid -->
<g id="edge57" class="edge"><title>hid_gtk2_gdk&#45;&gt;lib_gtk_hid</title>
<path fill="none" stroke="black" d="M682.957,-1395.62C857.59,-1634.91 2743.61,-4219.21 2953.1,-4506.27"/>
<polygon fill="black" stroke="black" points="2950.35,-4508.43 2959.07,-4514.44 2956,-4504.3 2950.35,-4508.43"/>
</g>
<!-- lib_gtk_common&#45;&gt;dialogs -->
<g id="edge116" class="edge"><title>lib_gtk_common&#45;&gt;dialogs</title>
<path fill="none" stroke="black" d="M3141.47,-4477.75C3119.78,-4388.74 3024.98,-3999.72 2998.69,-3891.86"/>
<polygon fill="black" stroke="black" points="3002.07,-3890.93 2996.3,-3882.04 2995.27,-3892.58 3002.07,-3890.93"/>
</g>
<!-- lib_gtk_hid&#45;&gt;dialogs -->
<g id="edge118" class="edge"><title>lib_gtk_hid&#45;&gt;dialogs</title>
<path fill="none" stroke="black" d="M2972.52,-4513.91C2975.28,-4421.62 2987.69,-4005.63 2991.07,-3892.51"/>
<polygon fill="black" stroke="black" points="2994.57,-3892.34 2991.37,-3882.24 2987.57,-3892.13 2994.57,-3892.34"/>
</g>
<!-- lib_hid_common -->
<g id="node59" class="node"><title>lib_hid_common</title>
<ellipse fill="#a0a0a0" stroke="black" cx="354.356" cy="-541.244" rx="71.4873" ry="18"/>
<text text-anchor="middle" x="354.356" y="-537.544" font-family="Times,serif" font-size="14.00">lib_hid_common</text>
</g>
<!-- lib_gtk_hid&#45;&gt;lib_hid_common -->
<g id="edge117" class="edge"><title>lib_gtk_hid&#45;&gt;lib_hid_common</title>
<path fill="none" stroke="black" d="M2960.31,-4514.34C2780.9,-4240.8 590.093,-900.654 371.843,-567.906"/>
<polygon fill="black" stroke="black" points="374.645,-565.797 366.234,-559.354 368.792,-569.636 374.645,-565.797"/>
</g>
<!-- hid_gtk2_gl&#45;&gt;draw_csect -->
<g id="edge63" class="edge"><title>hid_gtk2_gl&#45;&gt;draw_csect</title>
<path fill="none" stroke="black" d="M663.586,-1246.87C542.105,-1233.85 236.415,-1201.09 108.136,-1187.34"/>
<polygon fill="black" stroke="black" points="108.427,-1183.85 98.1114,-1186.27 107.682,-1190.81 108.427,-1183.85"/>
</g>
<!-- hid_gtk2_gl&#45;&gt;lib_gtk_common -->
<g id="edge60" class="edge"><title>hid_gtk2_gl&#45;&gt;lib_gtk_common</title>
<path fill="none" stroke="black" d="M727.712,-1269.79C908.518,-1511.01 2906.28,-4176.28 3126.28,-4469.79"/>
<polygon fill="black" stroke="black" points="3123.74,-4472.24 3132.54,-4478.14 3129.34,-4468.04 3123.74,-4472.24"/>
</g>
<!-- hid_gtk2_gl&#45;&gt;lib_gtk_hid -->
<g id="edge61" class="edge"><title>hid_gtk2_gl&#45;&gt;lib_gtk_hid</title>
<path fill="none" stroke="black" d="M726.776,-1269.98C894.733,-1514.01 2751.39,-4211.62 2954.06,-4506.09"/>
<polygon fill="black" stroke="black" points="2951.27,-4508.21 2959.82,-4514.47 2957.03,-4504.24 2951.27,-4508.21"/>
</g>
<!-- lib_hid_gl -->
<g id="node55" class="node"><title>lib_hid_gl</title>
<ellipse fill="#a0a0a0" stroke="black" cx="109.538" cy="-1013.72" rx="46.5926" ry="18"/>
<text text-anchor="middle" x="109.538" y="-1010.02" font-family="Times,serif" font-size="14.00">lib_hid_gl</text>
</g>
<!-- hid_gtk2_gl&#45;&gt;lib_hid_gl -->
<g id="edge62" class="edge"><title>hid_gtk2_gl&#45;&gt;lib_hid_gl</title>
<path fill="none" stroke="black" d="M679.926,-1238.65C575.611,-1197.52 265.114,-1075.07 151.655,-1030.33"/>
<polygon fill="black" stroke="black" points="152.833,-1027.03 142.246,-1026.62 150.265,-1033.54 152.833,-1027.03"/>
</g>
<!-- hid_gtk3_cairo&#45;&gt;draw_csect -->
<g id="edge67" class="edge"><title>hid_gtk3_cairo&#45;&gt;draw_csect</title>
<path fill="none" stroke="black" d="M705.905,-1134.52C569.382,-1144.22 243.606,-1167.36 109.392,-1176.9"/>
<polygon fill="black" stroke="black" points="109.026,-1173.42 99.2988,-1177.62 109.522,-1180.4 109.026,-1173.42"/>
</g>
<!-- hid_gtk3_cairo&#45;&gt;lib_gtk_common -->
<g id="edge65" class="edge"><title>hid_gtk3_cairo&#45;&gt;lib_gtk_common</title>
<path fill="none" stroke="black" d="M780.225,-1147.83C955.431,-1395.8 2915.29,-4169.57 3127.34,-4469.7"/>
<polygon fill="black" stroke="black" points="3124.74,-4472.08 3133.37,-4478.23 3130.46,-4468.04 3124.74,-4472.08"/>
</g>
<!-- hid_gtk3_cairo&#45;&gt;lib_gtk_hid -->
<g id="edge66" class="edge"><title>hid_gtk3_cairo&#45;&gt;lib_gtk_hid</title>
<path fill="none" stroke="black" d="M779.31,-1148.02C941.784,-1398.78 2760.07,-4205.08 2955.06,-4506.03"/>
<polygon fill="black" stroke="black" points="2952.22,-4508.08 2960.6,-4514.57 2958.1,-4504.27 2952.22,-4508.08"/>
</g>
<!-- hid_gtk3_gl&#45;&gt;draw_csect -->
<g id="edge72" class="edge"><title>hid_gtk3_gl&#45;&gt;draw_csect</title>
<path fill="none" stroke="black" d="M784.052,-1021.6C649.106,-1050.92 247.979,-1138.1 103.041,-1169.6"/>
<polygon fill="black" stroke="black" points="102.084,-1166.23 93.0552,-1171.77 103.57,-1173.07 102.084,-1166.23"/>
</g>
<!-- hid_gtk3_gl&#45;&gt;lib_gtk_common -->
<g id="edge69" class="edge"><title>hid_gtk3_gl&#45;&gt;lib_gtk_common</title>
<path fill="none" stroke="black" d="M840.928,-1029.74C1009.91,-1283.86 2922.96,-4160.7 3128.12,-4469.22"/>
<polygon fill="black" stroke="black" points="3125.49,-4471.59 3133.94,-4477.98 3131.32,-4467.71 3125.49,-4471.59"/>
</g>
<!-- hid_gtk3_gl&#45;&gt;lib_gtk_hid -->
<g id="edge70" class="edge"><title>hid_gtk3_gl&#45;&gt;lib_gtk_hid</title>
<path fill="none" stroke="black" d="M839.782,-1029.51C994.501,-1283.67 2767.37,-4196.01 2955.79,-4505.54"/>
<polygon fill="black" stroke="black" points="2952.94,-4507.59 2961.13,-4514.32 2958.92,-4503.95 2952.94,-4507.59"/>
</g>
<!-- hid_gtk3_gl&#45;&gt;lib_hid_gl -->
<g id="edge71" class="edge"><title>hid_gtk3_gl&#45;&gt;lib_hid_gl</title>
<path fill="none" stroke="black" d="M775.524,-1011.97C643.488,-1012.31 302.951,-1013.21 166.919,-1013.57"/>
<polygon fill="black" stroke="black" points="166.701,-1010.07 156.711,-1013.6 166.72,-1017.07 166.701,-1010.07"/>
</g>
<!-- hid_lesstif&#45;&gt;dialogs -->
<g id="edge76" class="edge"><title>hid_lesstif&#45;&gt;dialogs</title>
<path fill="none" stroke="black" d="M910.539,-915.399C1072.32,-1144.59 2779.43,-3563.02 2973.91,-3838.52"/>
<polygon fill="black" stroke="black" points="2971.08,-3840.58 2979.7,-3846.73 2976.79,-3836.55 2971.08,-3840.58"/>
</g>
<!-- hid_lesstif&#45;&gt;draw_csect -->
<g id="edge74" class="edge"><title>hid_lesstif&#45;&gt;draw_csect</title>
<path fill="none" stroke="black" d="M862.609,-909.876C727.696,-954.911 248.23,-1114.96 96.4651,-1165.62"/>
<polygon fill="black" stroke="black" points="95.3269,-1162.31 86.9497,-1168.8 97.5434,-1168.95 95.3269,-1162.31"/>
</g>
<!-- hid_lesstif&#45;&gt;lib_hid_common -->
<g id="edge75" class="edge"><title>hid_lesstif&#45;&gt;lib_hid_common</title>
<path fill="none" stroke="black" d="M874.172,-882.192C787.363,-825.254 490.181,-630.333 388.668,-563.75"/>
<polygon fill="black" stroke="black" points="390.303,-560.637 380.022,-558.079 386.464,-566.49 390.303,-560.637"/>
</g>
<!-- import_dsn&#45;&gt;lib_compat_help -->
<g id="edge80" class="edge"><title>import_dsn&#45;&gt;lib_compat_help</title>
<path fill="none" stroke="black" d="M4351.49,-2546.34C4245.21,-2512.6 3946.44,-2417.78 3823.61,-2378.79"/>
<polygon fill="black" stroke="black" points="3824.61,-2375.44 3814.02,-2375.75 3822.49,-2382.11 3824.61,-2375.44"/>
</g>
<!-- import_ipcd356&#45;&gt;lib_compat_help -->
<g id="edge85" class="edge"><title>import_ipcd356&#45;&gt;lib_compat_help</title>
<path fill="none" stroke="black" d="M4315.87,-2667.62C4219.96,-2613.89 3915.63,-2443.4 3808,-2383.11"/>
<polygon fill="black" stroke="black" points="3809.54,-2379.96 3799.11,-2378.12 3806.12,-2386.06 3809.54,-2379.96"/>
</g>
<!-- import_mentor_sch&#45;&gt;lib_gensexpr -->
<g id="edge88" class="edge"><title>import_mentor_sch&#45;&gt;lib_gensexpr</title>
<path fill="none" stroke="black" d="M3107.09,-1868.67C2982.94,-1890.08 2710.47,-1937.06 2589.64,-1957.89"/>
<polygon fill="black" stroke="black" points="2588.73,-1954.5 2579.47,-1959.65 2589.92,-1961.4 2588.73,-1954.5"/>
</g>
<!-- import_mucs&#45;&gt;lib_compat_help -->
<g id="edge90" class="edge"><title>import_mucs&#45;&gt;lib_compat_help</title>
<path fill="none" stroke="black" d="M4271.95,-2789.1C4191.26,-2720.42 3891.34,-2465.14 3797.85,-2385.57"/>
<polygon fill="black" stroke="black" points="3800.1,-2382.89 3790.22,-2379.07 3795.56,-2388.22 3800.1,-2382.89"/>
</g>
<!-- io_autotrax&#45;&gt;lib_polyhelp -->
<g id="edge96" class="edge"><title>io_autotrax&#45;&gt;lib_polyhelp</title>
<path fill="none" stroke="black" d="M2058.69,-90.2219C1931.25,-337.33 523.197,-3067.73 368.188,-3368.31"/>
<polygon fill="black" stroke="black" points="365.057,-3366.75 363.585,-3377.24 371.279,-3369.96 365.057,-3366.75"/>
</g>
<!-- io_dsn&#45;&gt;lib_gensexpr -->
<g id="edge98" class="edge"><title>io_dsn&#45;&gt;lib_gensexpr</title>
<path fill="none" stroke="black" d="M3143.07,-1905.16C3039.92,-1915.76 2728.57,-1947.77 2593.53,-1961.65"/>
<polygon fill="black" stroke="black" points="2592.93,-1958.19 2583.34,-1962.7 2593.65,-1965.16 2592.93,-1958.19"/>
</g>
<!-- io_hyp&#45;&gt;lib_netmap -->
<g id="edge101" class="edge"><title>io_hyp&#45;&gt;lib_netmap</title>
<path fill="none" stroke="black" d="M4065.05,-3132.33C3985.99,-3072.37 3691.23,-2848.85 3596.2,-2776.78"/>
<polygon fill="black" stroke="black" points="3598.23,-2773.93 3588.15,-2770.68 3594,-2779.51 3598.23,-2773.93"/>
</g>
<!-- io_kicad&#45;&gt;lib_gensexpr -->
<g id="edge103" class="edge"><title>io_kicad&#45;&gt;lib_gensexpr</title>
<path fill="none" stroke="black" d="M3138.82,-1947.39C3029.2,-1951.13 2729.43,-1961.37 2595.76,-1965.94"/>
<polygon fill="black" stroke="black" points="2595.53,-1962.45 2585.66,-1966.29 2595.77,-1969.44 2595.53,-1962.45"/>
</g>
<!-- io_kicad_legacy&#45;&gt;io_kicad -->
<g id="edge105" class="edge"><title>io_kicad_legacy&#45;&gt;io_kicad</title>
<path fill="none" stroke="black" d="M3762.31,-1926.09C3631.62,-1930.55 3347.33,-1940.27 3231.07,-1944.24"/>
<polygon fill="black" stroke="black" points="3230.89,-1940.74 3221.01,-1944.58 3231.13,-1947.74 3230.89,-1940.74"/>
</g>
<!-- io_pcb&#45;&gt;lib_compat_help -->
<g id="edge110" class="edge"><title>io_pcb&#45;&gt;lib_compat_help</title>
<path fill="none" stroke="black" d="M4217.01,-2907.71C4151.36,-2827.56 3870.5,-2484.63 3790.93,-2387.47"/>
<polygon fill="black" stroke="black" points="3793.54,-2385.14 3784.49,-2379.62 3788.12,-2389.57 3793.54,-2385.14"/>
</g>
<!-- io_tedax&#45;&gt;lib_compat_help -->
<g id="edge112" class="edge"><title>io_tedax&#45;&gt;lib_compat_help</title>
<path fill="none" stroke="black" d="M4151.3,-3020.65C4097.69,-2928.05 3850.14,-2500.43 3785.38,-2388.57"/>
<polygon fill="black" stroke="black" points="3788.23,-2386.51 3780.19,-2379.61 3782.17,-2390.01 3788.23,-2386.51"/>
</g>
<!-- io_tedax&#45;&gt;lib_netmap -->
<g id="edge113" class="edge"><title>io_tedax&#45;&gt;lib_netmap</title>
<path fill="none" stroke="black" d="M4133.67,-3025.08C4037.32,-2979.07 3718.4,-2826.78 3606.05,-2773.14"/>
<polygon fill="black" stroke="black" points="3607.3,-2769.85 3596.76,-2768.7 3604.28,-2776.17 3607.3,-2769.85"/>
</g>
<!-- lib_legacy_func -->
<g id="node84" class="node"><title>lib_legacy_func</title>
<ellipse fill="#a0a0a0" stroke="black" cx="4231.91" cy="-4182.19" rx="67.6881" ry="18"/>
<text text-anchor="middle" x="4231.91" y="-4178.49" font-family="Times,serif" font-size="14.00">lib_legacy_func</text>
</g>
<!-- millpath&#45;&gt;lib_polyhelp -->
<g id="edge120" class="edge"><title>millpath&#45;&gt;lib_polyhelp</title>
<path fill="none" stroke="black" d="M2717.25,-44.411C2544.11,-289.938 584.915,-3068.19 372.923,-3368.81"/>
<polygon fill="black" stroke="black" points="369.803,-3367.16 366.9,-3377.35 375.524,-3371.19 369.803,-3367.16"/>
</g>
</g>
</svg>
