G04 start of page 10 for group 12 layer_idx 7 *
G04 Title: thru-hole elements on both sides, bottom_silk *
G04 Creator: <version>
G04 CreationDate: <date>
G04 For: TEST *
G04 Format: Gerber/RS-274X *
G04 PCB-Dimensions: 50000 50000 *
G04 PCB-Coordinate-Origin: lower left *
%MOIN*%
%FSLAX25Y25*%
%LNBOTTOMSILK*%
%ADD31C,0.0070*%
%ADD30C,0.0100*%
G54D30*X5000Y10000D02*Y20000D01*
X45000D02*X5000D01*
X45000D02*Y10000D01*
X5000D02*X20000D01*
X30000D02*X45000D01*
X30000D02*G75*G03X20000Y10000I-5000J0D01*G01*
G54D31*X10000Y5000D02*Y8500D01*
X10500Y9000D01*
X11500D01*
X12000Y8500D01*
Y5000D02*Y8500D01*
X13200Y5500D02*X13700Y5000D01*
X15200D01*
X15700Y5500D01*
Y6500D01*
X13200Y9000D02*X15700Y6500D01*
X13200Y9000D02*X15700D01*
M02*
