G04 start of page 3 for group 5 layer_idx 4 *
G04 Title: thermals vs. multiple layer polygons, Intern *
G04 Creator: <version>
G04 CreationDate: <date>
G04 For: TEST *
G04 Format: Gerber/RS-274X *
G04 PCB-Dimensions: 50000 50000 *
G04 PCB-Coordinate-Origin: lower left *
%MOIN*%
%FSLAX25Y25*%
%LNGROUP5*%
%ADD15C,0.0315*%
%ADD14C,0.0787*%
G54D14*X10000Y40000D03*
X27500D03*
X10000Y22500D03*
X27500D03*
G54D15*M02*
