<?xml version="1.0" encoding="UTF-8" standalone="no"?>
<!DOCTYPE svg PUBLIC "-//W3C//DTD SVG 1.1//EN"
 "http://www.w3.org/Graphics/SVG/1.1/DTD/svg11.dtd">
<!-- Generated by graphviz version 2.38.0 (20140413.2041)
 -->
<!-- Title: li:submenu Pages: 1 -->
<svg width="1214pt" height="245pt"
 viewBox="0.00 0.00 1213.85 245.46" xmlns="http://www.w3.org/2000/svg" xmlns:xlink="http://www.w3.org/1999/xlink">
<g id="graph0" class="graph" transform="scale(1 1) rotate(0) translate(4 241.463)">
<title>li:submenu</title>
<polygon fill="white" stroke="none" points="-4,4 -4,-241.463 1209.85,-241.463 1209.85,4 -4,4"/>
<!-- /lht_tree_doc/comm/submenu -->
<g id="node1" class="node"><title>/lht_tree_doc/comm/submenu</title>
<g id="a_node1"><a xlink:href="tree.html#/lht_tree_doc/comm/submenu" xlink:title="ordered list of menu items for a submenu">
<ellipse fill="none" stroke="black" cx="224.234" cy="-209.886" rx="54.3945" ry="27.6545"/>
<text text-anchor="middle" x="224.234" y="-214.186" font-family="Times,serif" font-size="14.00">li:submenu</text>
</a>
</g>
</g>
<!-- /lht_tree_doc/comm/submenu/children/m -->
<g id="node2" class="node"><title>/lht_tree_doc/comm/submenu/children/m</title>
<g id="a_node2"><a xlink:href="tree.html#/lht_tree_doc/comm/submenu/children/m" xlink:title="mnemonic: single character that should be underlined and used as a hot key in the menu name">
<ellipse fill="none" stroke="black" cx="33.234" cy="-118.731" rx="33.4697" ry="26.7407"/>
<text text-anchor="middle" x="33.234" y="-122.531" font-family="Times,serif" font-size="14.00">m</text>
<text text-anchor="middle" x="33.234" y="-107.531" font-family="Times,serif" font-size="14.00">string</text>
</a>
</g>
</g>
<!-- /lht_tree_doc/comm/submenu&#45;&gt;/lht_tree_doc/comm/submenu/children/m -->
<g id="edge1" class="edge"><title>/lht_tree_doc/comm/submenu&#45;&gt;/lht_tree_doc/comm/submenu/children/m</title>
<path fill="none" stroke="black" d="M181.338,-192.772C151.358,-181.024 110.686,-164.105 76.234,-146.309 73.349,-144.818 70.3998,-143.204 67.465,-141.532"/>
<polygon fill="black" stroke="black" points="69.1748,-138.477 58.7834,-136.411 65.6185,-144.506 69.1748,-138.477"/>
</g>
<!-- /lht_tree_doc/comm/submenu/children/&#45; -->
<g id="node3" class="node"><title>/lht_tree_doc/comm/submenu/children/&#45;</title>
<g id="a_node3"><a xlink:href="tree.html#/lht_tree_doc/comm/submenu/children/-" xlink:title="horizontal separator">
<ellipse fill="none" stroke="black" cx="115.234" cy="-118.731" rx="30.3115" ry="26.7407"/>
<text text-anchor="middle" x="115.234" y="-122.531" font-family="Times,serif" font-size="14.00">&#45;</text>
<text text-anchor="middle" x="115.234" y="-107.531" font-family="Times,serif" font-size="14.00">none</text>
</a>
</g>
</g>
<!-- /lht_tree_doc/comm/submenu&#45;&gt;/lht_tree_doc/comm/submenu/children/&#45; -->
<g id="edge2" class="edge"><title>/lht_tree_doc/comm/submenu&#45;&gt;/lht_tree_doc/comm/submenu/children/&#45;</title>
<path fill="none" stroke="black" d="M196.447,-186.158C180.763,-173.33 161.158,-157.294 145.14,-144.192"/>
<polygon fill="black" stroke="black" points="147.086,-141.263 137.13,-137.641 142.655,-146.681 147.086,-141.263"/>
</g>
<!-- /lht_tree_doc/comm/submenu/children/@ANCHOR -->
<g id="node4" class="node"><title>/lht_tree_doc/comm/submenu/children/@ANCHOR</title>
<g id="a_node4"><a xlink:href="tree.html#/lht_tree_doc/comm/submenu/children/@ANCHOR" xlink:title="an anchor is an invisible placeholder where a dynamically generated set of menu items should be inserted runtime">
<ellipse fill="none" stroke="black" cx="224.234" cy="-118.731" rx="60.623" ry="26.7407"/>
<text text-anchor="middle" x="224.234" y="-122.531" font-family="Times,serif" font-size="14.00">@ANCHOR</text>
<text text-anchor="middle" x="224.234" y="-107.531" font-family="Times,serif" font-size="14.00">none</text>
</a>
</g>
</g>
<!-- /lht_tree_doc/comm/submenu&#45;&gt;/lht_tree_doc/comm/submenu/children/@ANCHOR -->
<g id="edge3" class="edge"><title>/lht_tree_doc/comm/submenu&#45;&gt;/lht_tree_doc/comm/submenu/children/@ANCHOR</title>
<path fill="none" stroke="black" d="M224.234,-182.137C224.234,-173.879 224.234,-164.644 224.234,-155.862"/>
<polygon fill="black" stroke="black" points="227.734,-155.848 224.234,-145.848 220.734,-155.848 227.734,-155.848"/>
</g>
<!-- /lht_tree_doc/comm/submenu/children/SUBSUBMENUNAME -->
<g id="node5" class="node"><title>/lht_tree_doc/comm/submenu/children/SUBSUBMENUNAME</title>
<g id="a_node5"><a xlink:href="tree.html#/lht_tree_doc/comm/submenu/children/SUBSUBMENUNAME" xlink:title="sub&#45;submenu item: opens a new level of submenu when clicked">
<ellipse fill="none" stroke="black" cx="421.234" cy="-118.731" rx="118.174" ry="27.6545"/>
<text text-anchor="middle" x="421.234" y="-123.031" font-family="Times,serif" font-size="14.00">ha:SUBSUBMENUNAME</text>
</a>
</g>
</g>
<!-- /lht_tree_doc/comm/submenu&#45;&gt;/lht_tree_doc/comm/submenu/children/SUBSUBMENUNAME -->
<g id="edge4" class="edge"><title>/lht_tree_doc/comm/submenu&#45;&gt;/lht_tree_doc/comm/submenu/children/SUBSUBMENUNAME</title>
<path fill="none" stroke="black" d="M264.1,-190.844C291.406,-178.486 328.165,-161.851 359.264,-147.777"/>
<polygon fill="black" stroke="black" points="361.049,-150.811 368.717,-143.499 358.163,-144.433 361.049,-150.811"/>
</g>
<!-- /lht_tree_doc/comm/submenu/children/LEAFSUBMENUNAME -->
<g id="node8" class="node"><title>/lht_tree_doc/comm/submenu/children/LEAFSUBMENUNAME</title>
<g id="a_node8"><a xlink:href="tree.html#/lht_tree_doc/comm/submenu/children/LEAFSUBMENUNAME" xlink:title="leaf submenu item: executes an action when clicked">
<ellipse fill="none" stroke="black" cx="764.234" cy="-118.731" rx="123.073" ry="27.6545"/>
<text text-anchor="middle" x="764.234" y="-123.031" font-family="Times,serif" font-size="14.00">ha:LEAFSUBMENUNAME</text>
</a>
</g>
</g>
<!-- /lht_tree_doc/comm/submenu&#45;&gt;/lht_tree_doc/comm/submenu/children/LEAFSUBMENUNAME -->
<g id="edge7" class="edge"><title>/lht_tree_doc/comm/submenu&#45;&gt;/lht_tree_doc/comm/submenu/children/LEAFSUBMENUNAME</title>
<path fill="none" stroke="black" d="M275.523,-200.418C362.755,-186.016 541.758,-156.462 657.219,-137.4"/>
<polygon fill="black" stroke="black" points="657.852,-140.843 667.148,-135.76 656.712,-133.936 657.852,-140.843"/>
</g>
<!-- dup51_/lht_tree_doc/comm/submenu/children/m -->
<g id="node6" class="node"><title>dup51_/lht_tree_doc/comm/submenu/children/m</title>
<g id="a_node6"><a xlink:href="tree.html#/lht_tree_doc/comm/submenu/children/m" xlink:title="mnemonic: single character that should be underlined and used as a hot key in the menu name">
<ellipse fill="none" stroke="black" cx="328.234" cy="-27.5772" rx="33.4697" ry="26.7407"/>
<text text-anchor="middle" x="328.234" y="-31.3772" font-family="Times,serif" font-size="14.00">m</text>
<text text-anchor="middle" x="328.234" y="-16.3772" font-family="Times,serif" font-size="14.00">string</text>
</a>
</g>
</g>
<!-- /lht_tree_doc/comm/submenu/children/SUBSUBMENUNAME&#45;&gt;dup51_/lht_tree_doc/comm/submenu/children/m -->
<g id="edge5" class="edge"><title>/lht_tree_doc/comm/submenu/children/SUBSUBMENUNAME&#45;&gt;dup51_/lht_tree_doc/comm/submenu/children/m</title>
<path fill="none" stroke="black" d="M393.834,-91.4645C382.143,-80.2567 368.502,-67.1799 356.697,-55.8627"/>
<polygon fill="black" stroke="black" points="358.884,-53.1109 349.243,-48.7172 354.039,-58.164 358.884,-53.1109"/>
</g>
<!-- dup52_/lht_tree_doc/comm/submenu/children/SUBSUBMENUNAME/children/submenu -->
<g id="node7" class="node"><title>dup52_/lht_tree_doc/comm/submenu/children/SUBSUBMENUNAME/children/submenu</title>
<g id="a_node7"><a xlink:href="submenu.svg" xlink:title="submenu &#45;&gt;\n\n\n">
<text text-anchor="middle" x="421.234" y="-39.8772" font-family="Times,serif" font-size="14.00">submenu &#45;&gt;</text>
</a>
</g>
</g>
<!-- /lht_tree_doc/comm/submenu/children/SUBSUBMENUNAME&#45;&gt;dup52_/lht_tree_doc/comm/submenu/children/SUBSUBMENUNAME/children/submenu -->
<g id="edge6" class="edge"><title>/lht_tree_doc/comm/submenu/children/SUBSUBMENUNAME&#45;&gt;dup52_/lht_tree_doc/comm/submenu/children/SUBSUBMENUNAME/children/submenu</title>
<path fill="none" stroke="black" d="M421.234,-90.9823C421.234,-82.96 421.234,-74.0155 421.234,-65.4608"/>
<polygon fill="black" stroke="black" points="424.734,-65.3075 421.234,-55.3075 417.734,-65.3076 424.734,-65.3075"/>
</g>
<!-- dup53_/lht_tree_doc/comm/submenu/children/m -->
<g id="node9" class="node"><title>dup53_/lht_tree_doc/comm/submenu/children/m</title>
<g id="a_node9"><a xlink:href="tree.html#/lht_tree_doc/comm/submenu/children/m" xlink:title="mnemonic: single character that should be underlined and used as a hot key in the menu name">
<ellipse fill="none" stroke="black" cx="514.234" cy="-27.5772" rx="33.4697" ry="26.7407"/>
<text text-anchor="middle" x="514.234" y="-31.3772" font-family="Times,serif" font-size="14.00">m</text>
<text text-anchor="middle" x="514.234" y="-16.3772" font-family="Times,serif" font-size="14.00">string</text>
</a>
</g>
</g>
<!-- /lht_tree_doc/comm/submenu/children/LEAFSUBMENUNAME&#45;&gt;dup53_/lht_tree_doc/comm/submenu/children/m -->
<g id="edge8" class="edge"><title>/lht_tree_doc/comm/submenu/children/LEAFSUBMENUNAME&#45;&gt;dup53_/lht_tree_doc/comm/submenu/children/m</title>
<path fill="none" stroke="black" d="M681.104,-98.2852C642.266,-87.8072 595.942,-73.2794 556.234,-55.1543 553.42,-53.87 550.571,-52.4243 547.752,-50.8876"/>
<polygon fill="black" stroke="black" points="549.331,-47.7571 538.927,-45.7556 545.812,-53.8083 549.331,-47.7571"/>
</g>
<!-- /lht_tree_doc/comm/submenu/children/LEAFSUBMENUNAME/children/a1 -->
<g id="node10" class="node"><title>/lht_tree_doc/comm/submenu/children/LEAFSUBMENUNAME/children/a1</title>
<g id="a_node10"><a xlink:href="tree.html#/lht_tree_doc/comm/submenu/children/LEAFSUBMENUNAME/children/a1" xlink:title="list of alternative hotkey sequences to activate the menu">
<ellipse fill="none" stroke="black" cx="592.234" cy="-27.5772" rx="27" ry="27.6545"/>
<text text-anchor="middle" x="592.234" y="-31.8772" font-family="Times,serif" font-size="14.00">li:a</text>
</a>
</g>
</g>
<!-- /lht_tree_doc/comm/submenu/children/LEAFSUBMENUNAME&#45;&gt;/lht_tree_doc/comm/submenu/children/LEAFSUBMENUNAME/children/a1 -->
<g id="edge9" class="edge"><title>/lht_tree_doc/comm/submenu/children/LEAFSUBMENUNAME&#45;&gt;/lht_tree_doc/comm/submenu/children/LEAFSUBMENUNAME/children/a1</title>
<path fill="none" stroke="black" d="M706.339,-94.2225C681.681,-83.4181 652.961,-69.762 628.234,-55.1543 626.069,-53.8751 623.875,-52.4943 621.695,-51.0582"/>
<polygon fill="black" stroke="black" points="623.657,-48.1596 613.444,-45.3424 619.671,-53.9139 623.657,-48.1596"/>
</g>
<!-- /lht_tree_doc/comm/submenu/children/LEAFSUBMENUNAME/children/a2 -->
<g id="node11" class="node"><title>/lht_tree_doc/comm/submenu/children/LEAFSUBMENUNAME/children/a2</title>
<g id="a_node11"><a xlink:href="tree.html#/lht_tree_doc/comm/submenu/children/LEAFSUBMENUNAME/children/a2" xlink:title="a single hotkey sequences to activate the menu">
<ellipse fill="none" stroke="black" cx="670.234" cy="-27.5772" rx="33.4697" ry="26.7407"/>
<text text-anchor="middle" x="670.234" y="-31.3772" font-family="Times,serif" font-size="14.00">a</text>
<text text-anchor="middle" x="670.234" y="-16.3772" font-family="Times,serif" font-size="14.00">string</text>
</a>
</g>
</g>
<!-- /lht_tree_doc/comm/submenu/children/LEAFSUBMENUNAME&#45;&gt;/lht_tree_doc/comm/submenu/children/LEAFSUBMENUNAME/children/a2 -->
<g id="edge10" class="edge"><title>/lht_tree_doc/comm/submenu/children/LEAFSUBMENUNAME&#45;&gt;/lht_tree_doc/comm/submenu/children/LEAFSUBMENUNAME/children/a2</title>
<path fill="none" stroke="black" d="M736.793,-91.7047C724.766,-80.2978 710.659,-66.9186 698.536,-55.4202"/>
<polygon fill="black" stroke="black" points="700.944,-52.8804 691.28,-48.5383 696.127,-57.9594 700.944,-52.8804"/>
</g>
<!-- /lht_tree_doc/comm/submenu/children/LEAFSUBMENUNAME/children/action1 -->
<g id="node12" class="node"><title>/lht_tree_doc/comm/submenu/children/LEAFSUBMENUNAME/children/action1</title>
<g id="a_node12"><a xlink:href="tree.html#/lht_tree_doc/comm/submenu/children/LEAFSUBMENUNAME/children/action1" xlink:title="list of actions to execute when the menu is activated">
<ellipse fill="none" stroke="black" cx="764.234" cy="-27.5772" rx="43.2674" ry="27.6545"/>
<text text-anchor="middle" x="764.234" y="-31.8772" font-family="Times,serif" font-size="14.00">li:action</text>
</a>
</g>
</g>
<!-- /lht_tree_doc/comm/submenu/children/LEAFSUBMENUNAME&#45;&gt;/lht_tree_doc/comm/submenu/children/LEAFSUBMENUNAME/children/action1 -->
<g id="edge11" class="edge"><title>/lht_tree_doc/comm/submenu/children/LEAFSUBMENUNAME&#45;&gt;/lht_tree_doc/comm/submenu/children/LEAFSUBMENUNAME/children/action1</title>
<path fill="none" stroke="black" d="M764.234,-90.9823C764.234,-82.96 764.234,-74.0155 764.234,-65.4608"/>
<polygon fill="black" stroke="black" points="767.734,-65.3075 764.234,-55.3075 760.734,-65.3076 767.734,-65.3075"/>
</g>
<!-- /lht_tree_doc/comm/submenu/children/LEAFSUBMENUNAME/children/action2 -->
<g id="node13" class="node"><title>/lht_tree_doc/comm/submenu/children/LEAFSUBMENUNAME/children/action2</title>
<g id="a_node13"><a xlink:href="tree.html#/lht_tree_doc/comm/submenu/children/LEAFSUBMENUNAME/children/action2" xlink:title="a single action to execute when the menu is activated">
<ellipse fill="none" stroke="black" cx="860.234" cy="-27.5772" rx="35.2113" ry="26.7407"/>
<text text-anchor="middle" x="860.234" y="-31.3772" font-family="Times,serif" font-size="14.00">action</text>
<text text-anchor="middle" x="860.234" y="-16.3772" font-family="Times,serif" font-size="14.00">string</text>
</a>
</g>
</g>
<!-- /lht_tree_doc/comm/submenu/children/LEAFSUBMENUNAME&#45;&gt;/lht_tree_doc/comm/submenu/children/LEAFSUBMENUNAME/children/action2 -->
<g id="edge12" class="edge"><title>/lht_tree_doc/comm/submenu/children/LEAFSUBMENUNAME&#45;&gt;/lht_tree_doc/comm/submenu/children/LEAFSUBMENUNAME/children/action2</title>
<path fill="none" stroke="black" d="M792.259,-91.7047C804.45,-80.383 818.734,-67.1181 831.052,-55.6779"/>
<polygon fill="black" stroke="black" points="833.487,-58.1939 838.432,-48.8242 828.723,-53.0646 833.487,-58.1939"/>
</g>
<!-- /lht_tree_doc/comm/submenu/children/LEAFSUBMENUNAME/children/tip -->
<g id="node14" class="node"><title>/lht_tree_doc/comm/submenu/children/LEAFSUBMENUNAME/children/tip</title>
<g id="a_node14"><a xlink:href="tree.html#/lht_tree_doc/comm/submenu/children/LEAFSUBMENUNAME/children/tip" xlink:title="tooltip text">
<ellipse fill="none" stroke="black" cx="947.234" cy="-27.5772" rx="33.4697" ry="26.7407"/>
<text text-anchor="middle" x="947.234" y="-31.3772" font-family="Times,serif" font-size="14.00">tip</text>
<text text-anchor="middle" x="947.234" y="-16.3772" font-family="Times,serif" font-size="14.00">string</text>
</a>
</g>
</g>
<!-- /lht_tree_doc/comm/submenu/children/LEAFSUBMENUNAME&#45;&gt;/lht_tree_doc/comm/submenu/children/LEAFSUBMENUNAME/children/tip -->
<g id="edge13" class="edge"><title>/lht_tree_doc/comm/submenu/children/LEAFSUBMENUNAME&#45;&gt;/lht_tree_doc/comm/submenu/children/LEAFSUBMENUNAME/children/tip</title>
<path fill="none" stroke="black" d="M821.255,-94.293C846.985,-83.197 877.529,-69.2945 904.234,-55.1543 907.104,-53.6348 910.042,-51.9994 912.969,-50.3132"/>
<polygon fill="black" stroke="black" points="914.825,-53.2818 921.638,-45.168 911.253,-47.2622 914.825,-53.2818"/>
</g>
<!-- /lht_tree_doc/comm/submenu/children/LEAFSUBMENUNAME/children/checked -->
<g id="node15" class="node"><title>/lht_tree_doc/comm/submenu/children/LEAFSUBMENUNAME/children/checked</title>
<g id="a_node15"><a xlink:href="tree.html#/lht_tree_doc/comm/submenu/children/LEAFSUBMENUNAME/children/checked" xlink:title="the menu item has a checkbox; value is the action to execute to determine whether the menu item&#39;s checkbox is checked or not">
<ellipse fill="none" stroke="black" cx="1041.23" cy="-27.5772" rx="43.2674" ry="26.7407"/>
<text text-anchor="middle" x="1041.23" y="-31.3772" font-family="Times,serif" font-size="14.00">checked</text>
<text text-anchor="middle" x="1041.23" y="-16.3772" font-family="Times,serif" font-size="14.00">string</text>
</a>
</g>
</g>
<!-- /lht_tree_doc/comm/submenu/children/LEAFSUBMENUNAME&#45;&gt;/lht_tree_doc/comm/submenu/children/LEAFSUBMENUNAME/children/checked -->
<g id="edge14" class="edge"><title>/lht_tree_doc/comm/submenu/children/LEAFSUBMENUNAME&#45;&gt;/lht_tree_doc/comm/submenu/children/LEAFSUBMENUNAME/children/checked</title>
<path fill="none" stroke="black" d="M848.621,-98.5494C891.416,-87.7502 943.811,-72.8703 989.234,-55.1543 992.902,-53.7239 996.653,-52.116 1000.38,-50.4173"/>
<polygon fill="black" stroke="black" points="1002,-53.5207 1009.52,-46.0575 998.989,-47.2023 1002,-53.5207"/>
</g>
<!-- /lht_tree_doc/comm/submenu/children/LEAFSUBMENUNAME/children/update_on -->
<g id="node16" class="node"><title>/lht_tree_doc/comm/submenu/children/LEAFSUBMENUNAME/children/update_on</title>
<g id="a_node16"><a xlink:href="tree.html#/lht_tree_doc/comm/submenu/children/LEAFSUBMENUNAME/children/update_on" xlink:title="path of a conf node that triggers re&#45;evaluation of the checkbox state">
<ellipse fill="none" stroke="black" cx="1154.23" cy="-27.5772" rx="51.7379" ry="26.7407"/>
<text text-anchor="middle" x="1154.23" y="-31.3772" font-family="Times,serif" font-size="14.00">update_on</text>
<text text-anchor="middle" x="1154.23" y="-16.3772" font-family="Times,serif" font-size="14.00">string</text>
</a>
</g>
</g>
<!-- /lht_tree_doc/comm/submenu/children/LEAFSUBMENUNAME&#45;&gt;/lht_tree_doc/comm/submenu/children/LEAFSUBMENUNAME/children/update_on -->
<g id="edge15" class="edge"><title>/lht_tree_doc/comm/submenu/children/LEAFSUBMENUNAME&#45;&gt;/lht_tree_doc/comm/submenu/children/LEAFSUBMENUNAME/children/update_on</title>
<path fill="none" stroke="black" d="M868.298,-104.015C933.754,-93.9033 1019.48,-77.9212 1093.23,-55.1543 1097.89,-53.7179 1102.66,-52.0338 1107.39,-50.2227"/>
<polygon fill="black" stroke="black" points="1109.01,-53.3432 1116.99,-46.3651 1106.4,-46.8486 1109.01,-53.3432"/>
</g>
</g>
</svg>
