<?xml version="1.0"?>
<svg xmlns="http://www.w3.org/2000/svg" xmlns:xlink="http://www.w3.org/1999/xlink" version="1.0" width="1625.6000" height="1625.6000" viewBox="-2.0000 -2.0000 17.7000 17.7000">
<g id="layer_9_outline">
<!--normal-->
 <rect x="0.0000" y="0.0000" width="12.7000" height="12.7000" stroke-width="0.2540" stroke="#00868b" stroke-linecap="round" fill="none"/>
</g>
<g id="layer_7_group7">
</g>
<g id="layer_5_group5">
</g>
<g id="layer_10_bottom">
</g>
<g id="layer_3_top">
<!--normal-->
 <polygon points="3.8100,3.8100 7.6200,3.8100 7.6200,4.5085 5.0800,4.5085 4.9903,4.5138 4.9029,4.5348 4.8197,4.5692 4.7430,4.6162 4.6746,4.6746 4.6162,4.7430 4.5692,4.8197 4.5348,4.9029 4.5138,4.9903 4.5067,5.0800 4.5138,5.1697 4.5348,5.2571 4.5692,5.3403 4.6162,5.4170 4.6746,5.4854 4.7430,5.5438 4.8197,5.5908 4.9029,5.6252 4.9903,5.6462 5.0800,5.6515 7.6200,5.6515 7.6200,8.2550 3.8100,8.2550 " stroke-width="0.075" stroke="#8b2323" fill="#8b2323"/>
 <line x1="5.0800" y1="5.0800" x2="8.8900" y2="5.0800" stroke-width="0.1270" stroke="#8b2323" stroke-linecap="round"/>
 <line x1="5.0800" y1="5.0800" x2="8.8900" y2="5.0800" stroke-width="0.3810" stroke="#8b2323" stroke-linecap="round"/>
</g>
<g id="layer_1_topsilk">
</g>
</svg>
