N005              R1                             1
N005              R2                             1
N005              C1                             2
N004              R1                             2
N004              V1                             1
0                 R2                             2
0                 R4                             2
0                 R5                             2
0                 V1                             2
0                 V2                             2
0                 C3                             2
0                 C4                             2
N001              R3                             1
N001              R6                             1
N001              V2                             1
N001              C3                             1
N002              R3                             2
N002              R4                             1
N002              C1                             1
N002              C2                             1
N002              Q1                             2
N006              R5                             1
N006              C4                             1
N006              Q1                             3
N003              R6                             2
N003              C2                             2
N003              C5                             2
N003              Q1                             1
NC_01             C5                             1
-1
