<?xml version="1.0"?>
<svg xmlns="http://www.w3.org/2000/svg" version="1.0" width="1625.6000" height="1625.6000" viewBox="-2.0000 -2.0000 17.7000 17.7000">
<g id="layer_9_outline">
<!--normal-->
 <rect x="0.0000" y="0.0000" width="12.7000" height="12.7000" stroke-width="0.2540" stroke="#00868b" stroke-linecap="round" fill="none"/>
</g>
<g id="layer_7_group7">
</g>
<g id="layer_5_group5">
</g>
<g id="layer_10_bottom">
</g>
<g id="layer_3_top">
</g>
<g id="layer_1_topsilk">
<!--normal-->
 <line x1="1.2700" y1="0.8890" x2="1.2700" y2="1.6510" stroke-width="0.1778" stroke="#000000" stroke-linecap="round"/>
 <line x1="1.2700" y1="0.8890" x2="1.4478" y2="0.6350" stroke-width="0.1778" stroke="#000000" stroke-linecap="round"/>
 <line x1="1.4478" y1="0.6350" x2="1.7272" y2="0.6350" stroke-width="0.1778" stroke="#000000" stroke-linecap="round"/>
 <line x1="1.7272" y1="0.6350" x2="1.9050" y2="0.8890" stroke-width="0.1778" stroke="#000000" stroke-linecap="round"/>
 <line x1="1.9050" y1="0.8890" x2="1.9050" y2="1.6510" stroke-width="0.1778" stroke="#000000" stroke-linecap="round"/>
 <line x1="1.2700" y1="1.1430" x2="1.9050" y2="1.1430" stroke-width="0.1778" stroke="#000000" stroke-linecap="round"/>
 <line x1="2.2098" y1="0.8382" x2="2.4130" y2="0.6350" stroke-width="0.1778" stroke="#000000" stroke-linecap="round"/>
 <line x1="2.4130" y1="0.6350" x2="2.4130" y2="1.6510" stroke-width="0.1778" stroke="#000000" stroke-linecap="round"/>
 <line x1="2.2098" y1="1.6510" x2="2.5908" y2="1.6510" stroke-width="0.1778" stroke="#000000" stroke-linecap="round"/>
 <line x1="1.2700" y1="5.1054" x2="1.2700" y2="5.1816" stroke-width="0.1778" stroke="#000000" stroke-linecap="round"/>
 <line x1="1.2700" y1="5.1054" x2="1.2878" y2="5.0800" stroke-width="0.1778" stroke="#000000" stroke-linecap="round"/>
 <line x1="1.2878" y1="5.0800" x2="1.3157" y2="5.0800" stroke-width="0.1778" stroke="#000000" stroke-linecap="round"/>
 <line x1="1.3157" y1="5.0800" x2="1.3335" y2="5.1054" stroke-width="0.1778" stroke="#000000" stroke-linecap="round"/>
 <line x1="1.3335" y1="5.1054" x2="1.3335" y2="5.1816" stroke-width="0.1778" stroke="#000000" stroke-linecap="round"/>
 <line x1="1.2700" y1="5.1308" x2="1.3335" y2="5.1308" stroke-width="0.1778" stroke="#000000" stroke-linecap="round"/>
 <line x1="1.3640" y1="5.0927" x2="1.3767" y2="5.0800" stroke-width="0.1778" stroke="#000000" stroke-linecap="round"/>
 <line x1="1.3767" y1="5.0800" x2="1.4148" y2="5.0800" stroke-width="0.1778" stroke="#000000" stroke-linecap="round"/>
 <line x1="1.4148" y1="5.0800" x2="1.4275" y2="5.0927" stroke-width="0.1778" stroke="#000000" stroke-linecap="round"/>
 <line x1="1.4275" y1="5.0927" x2="1.4275" y2="5.1181" stroke-width="0.1778" stroke="#000000" stroke-linecap="round"/>
 <line x1="1.3640" y1="5.1816" x2="1.4275" y2="5.1181" stroke-width="0.1778" stroke="#000000" stroke-linecap="round"/>
 <line x1="1.3640" y1="5.1816" x2="1.4275" y2="5.1816" stroke-width="0.1778" stroke="#000000" stroke-linecap="round"/>
 <line x1="1.2700" y1="8.4328" x2="1.2700" y2="10.8712" stroke-width="0.3251" stroke="#000000" stroke-linecap="round"/>
 <line x1="1.2700" y1="8.4328" x2="1.8390" y2="7.6200" stroke-width="0.3251" stroke="#000000" stroke-linecap="round"/>
 <line x1="1.8390" y1="7.6200" x2="2.7330" y2="7.6200" stroke-width="0.3251" stroke="#000000" stroke-linecap="round"/>
 <line x1="2.7330" y1="7.6200" x2="3.3020" y2="8.4328" stroke-width="0.3251" stroke="#000000" stroke-linecap="round"/>
 <line x1="3.3020" y1="8.4328" x2="3.3020" y2="10.8712" stroke-width="0.3251" stroke="#000000" stroke-linecap="round"/>
 <line x1="1.2700" y1="9.2456" x2="3.3020" y2="9.2456" stroke-width="0.3251" stroke="#000000" stroke-linecap="round"/>
 <line x1="4.2774" y1="8.0264" x2="4.6838" y2="7.6200" stroke-width="0.3251" stroke="#000000" stroke-linecap="round"/>
 <line x1="4.6838" y1="7.6200" x2="5.4966" y2="7.6200" stroke-width="0.3251" stroke="#000000" stroke-linecap="round"/>
 <line x1="5.4966" y1="7.6200" x2="5.9030" y2="8.0264" stroke-width="0.3251" stroke="#000000" stroke-linecap="round"/>
 <line x1="5.4966" y1="10.8712" x2="5.9030" y2="10.4648" stroke-width="0.3251" stroke="#000000" stroke-linecap="round"/>
 <line x1="4.6838" y1="10.8712" x2="5.4966" y2="10.8712" stroke-width="0.3251" stroke="#000000" stroke-linecap="round"/>
 <line x1="4.2774" y1="10.4648" x2="4.6838" y2="10.8712" stroke-width="0.3251" stroke="#000000" stroke-linecap="round"/>
 <line x1="4.6838" y1="9.0830" x2="5.4966" y2="9.0830" stroke-width="0.3251" stroke="#000000" stroke-linecap="round"/>
 <line x1="5.9030" y1="8.0264" x2="5.9030" y2="8.6766" stroke-width="0.3251" stroke="#000000" stroke-linecap="round"/>
 <line x1="5.9030" y1="9.4894" x2="5.9030" y2="10.4648" stroke-width="0.3251" stroke="#000000" stroke-linecap="round"/>
 <line x1="5.9030" y1="9.4894" x2="5.4966" y2="9.0830" stroke-width="0.3251" stroke="#000000" stroke-linecap="round"/>
 <line x1="5.9030" y1="8.6766" x2="5.4966" y2="9.0830" stroke-width="0.3251" stroke="#000000" stroke-linecap="round"/>
</g>
</svg>
