G04 start of page 4 for group 1 layer_idx 8 *
G04 Title: Rotated round cap and square pads, top_silk *
G04 Creator: <version>
G04 CreationDate: <date>
G04 For: TEST *
G04 Format: Gerber/RS-274X *
G04 PCB-Dimensions: 50000 50000 *
G04 PCB-Coordinate-Origin: lower left *
%MOIN*%
%FSLAX25Y25*%
%LNTOPSILK*%
%ADD18C,0.0070*%
%ADD17C,0.0050*%
G54D17*X2500Y25000D02*Y12500D01*
X7500D01*
Y25000D02*Y12500D01*
X2500Y25000D02*X7500D01*
X8964Y35000D02*X17803Y26161D01*
X21339Y29697D01*
X12500Y38536D02*X21339Y29697D01*
X8964Y35000D02*X12500Y38536D01*
X18964Y35000D02*X27803Y26161D01*
X31339Y29697D01*
X22500Y38536D02*X31339Y29697D01*
X18964Y35000D02*X22500Y38536D01*
X9240Y18631D02*X20812Y13904D01*
X22703Y18533D01*
X11131Y23260D02*X22703Y18533D01*
X9240Y18631D02*X11131Y23260D01*
X2500Y42500D02*X15000D01*
Y47500D01*
X2500D01*
Y42500D02*Y47500D01*
X7500Y40000D02*Y27500D01*
X2500Y40000D02*X7500D01*
X2500D02*Y27500D01*
X7500D01*
X17500Y42500D02*X30000D01*
Y47500D02*Y42500D01*
X17500Y47500D02*X30000D01*
X17500D02*Y42500D01*
X24240Y18631D02*X35812Y13904D01*
X37703Y18533D01*
X26131Y23260D02*X37703Y18533D01*
X24240Y18631D02*X26131Y23260D01*
G54D18*X8000Y28050D02*Y26750D01*
Y28050D02*X8325Y28375D01*
X8975D01*
X9300Y28050D02*X8975Y28375D01*
X9300Y28050D02*Y27075D01*
X8000D02*X10600D01*
X9300Y27595D02*X10600Y28375D01*
X8325Y29155D02*X8000Y29480D01*
Y30130D02*Y29480D01*
Y30130D02*X8325Y30455D01*
X10600Y30130D02*X10275Y30455D01*
X10600Y30130D02*Y29480D01*
X10275Y29155D02*X10600Y29480D01*
X9170Y30130D02*Y29480D01*
X8325Y30455D02*X8845D01*
X9495D02*X10275D01*
X9495D02*X9170Y30130D01*
X8845Y30455D02*X9170Y30130D01*
X7000Y11000D02*Y9000D01*
X6500Y8500D01*
X5500D02*X6500D01*
X5000Y9000D02*X5500Y8500D01*
X5000Y10500D02*Y9000D01*
X3000Y10500D02*X7000D01*
X5000Y9700D02*X3000Y8500D01*
X7000Y5800D02*X6500Y5300D01*
X7000Y6800D02*Y5800D01*
X6500Y7300D02*X7000Y6800D01*
X3500Y7300D02*X6500D01*
X3500D02*X3000Y6800D01*
X5200Y5800D02*X4700Y5300D01*
X5200Y7300D02*Y5800D01*
X3000Y6800D02*Y5800D01*
X3500Y5300D01*
X4700D01*
X19500Y13500D02*Y11500D01*
X19000Y11000D01*
X18000D02*X19000D01*
X17500Y11500D02*X18000Y11000D01*
X17500Y13000D02*Y11500D01*
X15500Y13000D02*X19500D01*
X17500Y12200D02*X15500Y11000D01*
Y9300D02*X19500Y7300D01*
Y9800D02*Y7300D01*
X1500Y48500D02*X2600D01*
X2875Y48225D01*
Y47675D01*
X2600Y47400D02*X2875Y47675D01*
X1775Y47400D02*X2600D01*
X1775Y48500D02*Y46300D01*
X2215Y47400D02*X2875Y46300D01*
X3535Y48060D02*X3975Y48500D01*
Y46300D01*
X3535D02*X4360D01*
X31250Y47500D02*X33250D01*
X33750Y47000D01*
Y46000D01*
X33250Y45500D02*X33750Y46000D01*
X31750Y45500D02*X33250D01*
X31750Y47500D02*Y43500D01*
X32550Y45500D02*X33750Y43500D01*
X34950Y47000D02*X35450Y47500D01*
X36950D01*
X37450Y47000D01*
Y46000D01*
X34950Y43500D02*X37450Y46000D01*
X34950Y43500D02*X37450D01*
X14000Y36700D02*Y35500D01*
Y36700D02*X14300Y37000D01*
X14900D01*
X15200Y36700D02*X14900Y37000D01*
X15200Y36700D02*Y35800D01*
X14000D02*X16400D01*
X15200Y36280D02*X16400Y37000D01*
X15500Y37720D02*X14000Y38920D01*
X15500Y39220D02*Y37720D01*
X14000Y38920D02*X16400D01*
X35500Y36500D02*Y34500D01*
X35000Y34000D01*
X34000D02*X35000D01*
X33500Y34500D02*X34000Y34000D01*
X33500Y36000D02*Y34500D01*
X31500Y36000D02*X35500D01*
X33500Y35200D02*X31500Y34000D01*
X35500Y32800D02*Y30800D01*
X33500Y32800D02*X35500D01*
X33500D02*X34000Y32300D01*
Y31300D01*
X33500Y30800D01*
X32000D02*X33500D01*
X31500Y31300D02*X32000Y30800D01*
X31500Y32300D02*Y31300D01*
X32000Y32800D02*X31500Y32300D01*
X33500Y12500D02*Y10500D01*
X33000Y10000D01*
X32000D02*X33000D01*
X31500Y10500D02*X32000Y10000D01*
X31500Y12000D02*Y10500D01*
X29500Y12000D02*X33500D01*
X31500Y11200D02*X29500Y10000D01*
X30000Y8800D02*X29500Y8300D01*
X30000Y8800D02*X30800D01*
X31500Y8100D01*
Y7500D01*
X30800Y6800D01*
X30000D02*X30800D01*
X29500Y7300D02*X30000Y6800D01*
X29500Y8300D02*Y7300D01*
X32200Y8800D02*X31500Y8100D01*
X32200Y8800D02*X33000D01*
X33500Y8300D01*
Y7300D01*
X33000Y6800D01*
X32200D02*X33000D01*
X31500Y7500D02*X32200Y6800D01*
M02*
