%!PS-Adobe-3.0 EPSF-3.0
%%BoundingBox: 0 0 37.000000 37.000000
%%Pages: 1
save countdictstack mark newpath /showpage {} def /setpagedevice {pop} def
%%EndProlog
%%Page: 1 1
%%BeginDocument: padstack.eps

72 72 scale
1 dup neg scale
1 dup scale
0.00000 -0.50000 translate
/nclip { -0.01000 -0.01000 moveto -0.01000 0.51000 lineto 0.51000 0.51000 lineto 0.51000 -0.01000 lineto -0.01000 -0.01000 lineto eoclip newpath } def
/t { moveto lineto stroke } bind def
/tc { moveto lineto strokepath nclip } bind def
/r { /y2 exch def /x2 exch def /y1 exch def /x1 exch def
     x1 y1 moveto x1 y2 lineto x2 y2 lineto x2 y1 lineto closepath fill } bind def
/c { 0 360 arc fill } bind def
/cc { 0 360 arc nclip } bind def
/a { gsave setlinewidth translate scale 0 0 1 5 3 roll arc stroke grestore} bind def
% Layer bottom group 10 drill 0 mask 0
0.01000 setlinewidth
1 setlinecap
0.8 0.8 0.8 setrgbcolor
0.15000 0.10000 0.02500 0.10000 t
0.37500 0.10000 0.04331 c
0.22500 0.32500 0.04831 c
0.00000 setlinewidth
1 1 1 setrgbcolor
0.07500 0.10000 0.01575 c
0.37500 0.10000 0.01968 c
0.22500 0.32500 0.01968 c
% Layer group5 group 5 drill 0 mask 0
0.00000 setlinewidth
0.8 0.8 0.8 setrgbcolor
0.07500 0.10000 0.03937 c
0.37500 0.10000 0.04331 c
0.07500 0.32500 0.04580 c
0.00000 setlinewidth
1 1 1 setrgbcolor
0.07500 0.10000 0.01575 c
0.37500 0.10000 0.01968 c
0.07500 0.32500 0.01968 c
% Layer group7 group 7 drill 0 mask 0
0.00000 setlinewidth
0.8 0.8 0.8 setrgbcolor
0.07500 0.10000 0.03937 c
0.37500 0.10000 0.04331 c
0.22500 0.32500 0.04831 c
0.00000 setlinewidth
1 1 1 setrgbcolor
0.07500 0.10000 0.01575 c
0.37500 0.10000 0.01968 c
0.22500 0.32500 0.01968 c
% Layer top group 3 drill 0 mask 0
0.00000 setlinewidth
0.498039 0.498039 0.498039 setrgbcolor
0.02500 0.05000 moveto
0.02500 0.15000 lineto
0.12500 0.12500 lineto
0.12500 0.05000 lineto
fill
0.37500 0.10000 0.04331 c
0.07500 0.32500 0.04580 c
0.00000 setlinewidth
1 1 1 setrgbcolor
0.07500 0.10000 0.01575 c
0.37500 0.10000 0.01968 c
0.07500 0.32500 0.01968 c
% Layer topsilk group 1 drill 0 mask 0
% Layer bottomsilk group 12 drill 0 mask 0
% Layer plated-drill group -1 drill 1 mask 0
0.07500 0.10000 0.01575 c
0.37500 0.10000 0.01968 c
showpage
%%EndDocument
%%Trailer
cleartomark countdictstack exch sub { end } repeat restore
%%EOF
