0	50	yes	yes	no	no	no	1	2	Linux
10	40	no	n/a	no	yes	n/a	20	2	Linux
0	5	n/a	no	no	no	no	20	4	Linux
5	20	no	no	no	yes	no	5	20	Linux
0	0	n/a	n/a	no	no	no	10	0	Linux
0	80	yes	yes	no	no	no	15	0	Linux
50	80	no	no	no	yes	n/a	30	100	OSX
20	75	no	no	no	yes	yes	15	3	Linux
0	8	yes	yes	yes	yes	no	2	1	Linux
0	2	yes	yes	no	no	no	8	4	Linux
