G04 start of page 2 for group 9 layer_idx 6 *
G04 Title: outline layer triangle, global outline *
G04 Creator: <version>
G04 CreationDate: <date>
G04 For: TEST *
G04 Format: Gerber/RS-274X *
G04 PCB-Dimensions: 50000 50000 *
G04 PCB-Coordinate-Origin: lower left *
%MOIN*%
%FSLAX25Y25*%
%LNOUTLINE*%
%ADD11C,0.0100*%
G54D11*X7500Y40000D02*Y10000D01*
X37500D01*
X7500Y40000D01*
M02*
