G04 start of page 4 for group 10 layer_idx 1 *
G04 Title: (unknown), bottom_copper *
G04 Creator: <version>
G04 CreationDate: <date>
G04 For: TEST *
G04 Format: Gerber/RS-274X *
G04 PCB-Dimensions: 50000 50000 *
G04 PCB-Coordinate-Origin: lower left *
%MOIN*%
%FSLAX25Y25*%
%LNBOTTOM*%
%ADD19C,0.0100*%
%ADD18C,0.0200*%
%ADD17C,0.0001*%
G54D17*G36*
X12000Y34000D02*X17000D01*
Y30000D01*
X12000D01*
Y34000D01*
G37*
G36*
X20000D02*X25000D01*
Y30000D01*
X20000D01*
Y34000D01*
G37*
G36*
X12500Y47000D02*X15500D01*
Y43000D01*
X12500D01*
Y47000D01*
G37*
G36*
X20500D02*X23500D01*
Y43000D01*
X20500D01*
Y47000D01*
G37*
G54D18*X14000Y38000D02*Y40000D01*
X22000Y38000D02*Y40000D01*
G54D17*G36*
X13500Y19000D02*X16500D01*
Y15000D01*
X13500D01*
Y19000D01*
G37*
G36*
X21500D02*X24500D01*
Y15000D01*
X21500D01*
Y19000D01*
G37*
G54D19*M02*
