G04 start of page 2 for group 3 layer_idx 0 *
G04 Title: pins with different shapes, top_copper *
G04 Creator: <version>
G04 CreationDate: <date>
G04 For: TEST *
G04 Format: Gerber/RS-274X *
G04 PCB-Dimensions: 50000 50000 *
G04 PCB-Coordinate-Origin: lower left *
%MOIN*%
%FSLAX25Y25*%
%LNTOP*%
%ADD13C,0.0394*%
%ADD12C,0.0800*%
%ADD11C,0.0001*%
G54D11*G36*
X3500Y41500D02*X11500D01*
Y33500D01*
X3500D01*
Y41500D01*
G37*
G54D12*X37500Y37500D03*
G54D11*G36*
X15500Y19157D02*X10814Y21500D01*
X5843D01*
X3500Y19157D01*
Y15843D01*
X5843Y13500D01*
X10814D01*
X15500Y15843D01*
Y19157D01*
G37*
G36*
X45500Y20814D02*X40814Y25500D01*
X34186D01*
X29500Y20814D01*
Y15843D01*
X34186Y13500D01*
X40814D01*
X45500Y15843D01*
Y20814D01*
G37*
G54D13*M02*
