<?xml version="1.0"?>
<svg xmlns="http://www.w3.org/2000/svg" xmlns:xlink="http://www.w3.org/1999/xlink" version="1.0" width="1625.6000" height="1625.6000" viewBox="-2.0000 -2.0000 17.7000 17.7000">
<g id="layer_7_group7">
</g>
<g id="layer_5_group5">
<!--normal-->
 <line x1="2.5400" y1="3.8100" x2="8.2550" y2="9.5250" stroke-width="0.2540" stroke="#548b54" stroke-linecap="round"/>
</g>
<g id="layer_10_bottom">
<!--normal-->
 <line x1="1.9050" y1="1.9050" x2="10.1600" y2="1.9050" stroke-width="0.2540" stroke="#3a5fcd" stroke-linecap="round"/>
</g>
<g id="layer_3_top">
<!--normal-->
 <line x1="1.2700" y1="1.9050" x2="1.2700" y2="8.8900" stroke-width="0.2540" stroke="#8b2323" stroke-linecap="round"/>
</g>
<g id="layer_1_topsilk">
</g>
<g id="layer_9_outline">
<!--normal-->
 <rect x="0.0000" y="0.0000" width="12.7000" height="12.7000" stroke-width="0.2540" stroke="#00868b" stroke-linecap="round" fill="none"/>
</g>
<g id="layer_9_outline">
</g>
</svg>
