<?xml version="1.0"?>
<svg xmlns="http://www.w3.org/2000/svg" xmlns:xlink="http://www.w3.org/1999/xlink" version="1.0" width="1625.6000" height="1625.6000" viewBox="-2.0000 -2.0000 17.7000 17.7000">
<g id="layer_9_outline">
<!--normal-->
 <rect x="0.0000" y="0.0000" width="12.7000" height="12.7000" stroke-width="0.2540" stroke="#00868b" stroke-linecap="round" fill="none"/>
</g>
<g id="layer_7_group7">
<!--normal-->
 <polygon points="1.5240,2.7940 3.5560,2.7940 3.5560,4.8260 1.5240,4.8260 " stroke-width="0.010" stroke="#cccccc" fill="#cccccc"/>
 <circle cx="10.1600" cy="3.8100" r="1.0160" stroke-width="0.0000" fill="#cccccc" stroke="none"/>
 <polygon points="1.5240,9.9060 3.5560,9.9060 3.5560,7.8740 1.5240,7.8740 " stroke-width="0.010" stroke="#cccccc" fill="#cccccc"/>
 <circle cx="10.1600" cy="8.8900" r="1.0160" stroke-width="0.0000" fill="#cccccc" stroke="none"/>
 <circle cx="2.5400" cy="3.8100" r="0.5000" stroke-width="0.0000" fill="#ffffff" stroke="none"/>
 <circle cx="10.1600" cy="3.8100" r="0.5000" stroke-width="0.0000" fill="#ffffff" stroke="none"/>
 <circle cx="2.5400" cy="8.8900" r="0.5000" stroke-width="0.0000" fill="#ffffff" stroke="none"/>
 <circle cx="10.1600" cy="8.8900" r="0.5000" stroke-width="0.0000" fill="#ffffff" stroke="none"/>
</g>
<g id="layer_5_group5">
<!--normal-->
 <polygon points="1.5240,2.7940 3.5560,2.7940 3.5560,4.8260 1.5240,4.8260 " stroke-width="0.010" stroke="#cccccc" fill="#cccccc"/>
 <circle cx="10.1600" cy="3.8100" r="1.0160" stroke-width="0.0000" fill="#cccccc" stroke="none"/>
 <polygon points="1.5240,9.9060 3.5560,9.9060 3.5560,7.8740 1.5240,7.8740 " stroke-width="0.010" stroke="#cccccc" fill="#cccccc"/>
 <circle cx="10.1600" cy="8.8900" r="1.0160" stroke-width="0.0000" fill="#cccccc" stroke="none"/>
 <circle cx="2.5400" cy="3.8100" r="0.5000" stroke-width="0.0000" fill="#ffffff" stroke="none"/>
 <circle cx="10.1600" cy="3.8100" r="0.5000" stroke-width="0.0000" fill="#ffffff" stroke="none"/>
 <circle cx="2.5400" cy="8.8900" r="0.5000" stroke-width="0.0000" fill="#ffffff" stroke="none"/>
 <circle cx="10.1600" cy="8.8900" r="0.5000" stroke-width="0.0000" fill="#ffffff" stroke="none"/>
</g>
<g id="layer_10_bottom">
<!--normal-->
 <polygon points="1.5240,2.7940 3.5560,2.7940 3.5560,4.8260 1.5240,4.8260 " stroke-width="0.010" stroke="#cccccc" fill="#cccccc"/>
 <circle cx="10.1600" cy="3.8100" r="1.0160" stroke-width="0.0000" fill="#cccccc" stroke="none"/>
 <polygon points="1.5240,9.9060 3.5560,9.9060 3.5560,7.8740 1.5240,7.8740 " stroke-width="0.010" stroke="#cccccc" fill="#cccccc"/>
 <circle cx="10.1600" cy="8.8900" r="1.0160" stroke-width="0.0000" fill="#cccccc" stroke="none"/>
 <circle cx="2.5400" cy="3.8100" r="0.5000" stroke-width="0.0000" fill="#ffffff" stroke="none"/>
 <circle cx="10.1600" cy="3.8100" r="0.5000" stroke-width="0.0000" fill="#ffffff" stroke="none"/>
 <circle cx="2.5400" cy="8.8900" r="0.5000" stroke-width="0.0000" fill="#ffffff" stroke="none"/>
 <circle cx="10.1600" cy="8.8900" r="0.5000" stroke-width="0.0000" fill="#ffffff" stroke="none"/>
</g>
<g id="layer_3_top">
<!--normal-->
 <polygon points="1.5240,2.7940 3.5560,2.7940 3.5560,4.8260 1.5240,4.8260 " stroke-width="0.010" stroke="#4d4d4d" fill="#4d4d4d"/>
 <circle cx="10.1600" cy="3.8100" r="1.0160" stroke-width="0.0000" fill="#4d4d4d" stroke="none"/>
 <polygon points="1.5240,9.9060 3.5560,9.9060 3.5560,7.8740 1.5240,7.8740 " stroke-width="0.010" stroke="#4d4d4d" fill="#4d4d4d"/>
 <circle cx="10.1600" cy="8.8900" r="1.0160" stroke-width="0.0000" fill="#4d4d4d" stroke="none"/>
 <circle cx="2.5400" cy="3.8100" r="0.5000" stroke-width="0.0000" fill="#ffffff" stroke="none"/>
 <circle cx="10.1600" cy="3.8100" r="0.5000" stroke-width="0.0000" fill="#ffffff" stroke="none"/>
 <circle cx="2.5400" cy="8.8900" r="0.5000" stroke-width="0.0000" fill="#ffffff" stroke="none"/>
 <circle cx="10.1600" cy="8.8900" r="0.5000" stroke-width="0.0000" fill="#ffffff" stroke="none"/>
</g>
<g id="layer_1_topsilk">
<!--normal-->
 <line x1="1.2700" y1="2.5400" x2="1.2700" y2="5.0800" stroke-width="0.2540" stroke="#000000" stroke-linecap="round"/>
 <line x1="11.4300" y1="5.0800" x2="1.2700" y2="5.0800" stroke-width="0.2540" stroke="#000000" stroke-linecap="round"/>
 <line x1="11.4300" y1="5.0800" x2="11.4300" y2="2.5400" stroke-width="0.2540" stroke="#000000" stroke-linecap="round"/>
 <line x1="1.2700" y1="2.5400" x2="5.0800" y2="2.5400" stroke-width="0.2540" stroke="#000000" stroke-linecap="round"/>
 <line x1="7.6200" y1="2.5400" x2="11.4300" y2="2.5400" stroke-width="0.2540" stroke="#000000" stroke-linecap="round"/>
 <path d="M 7.62000000 2.54000000 A 1.2700 1.2700 0 0 1 5.0800 2.5400" stroke-width="0.2540" stroke="#000000" stroke-linecap="round" fill="none"/>
 <line x1="2.5400" y1="1.2700" x2="2.5400" y2="2.1590" stroke-width="0.1778" stroke="#000000" stroke-linecap="round"/>
 <line x1="2.5400" y1="2.1590" x2="2.6670" y2="2.2860" stroke-width="0.1778" stroke="#000000" stroke-linecap="round"/>
 <line x1="2.6670" y1="2.2860" x2="2.9210" y2="2.2860" stroke-width="0.1778" stroke="#000000" stroke-linecap="round"/>
 <line x1="2.9210" y1="2.2860" x2="3.0480" y2="2.1590" stroke-width="0.1778" stroke="#000000" stroke-linecap="round"/>
 <line x1="3.0480" y1="1.2700" x2="3.0480" y2="2.1590" stroke-width="0.1778" stroke="#000000" stroke-linecap="round"/>
 <line x1="3.3528" y1="1.4732" x2="3.5560" y2="1.2700" stroke-width="0.1778" stroke="#000000" stroke-linecap="round"/>
 <line x1="3.5560" y1="1.2700" x2="3.5560" y2="2.2860" stroke-width="0.1778" stroke="#000000" stroke-linecap="round"/>
 <line x1="3.3528" y1="2.2860" x2="3.7338" y2="2.2860" stroke-width="0.1778" stroke="#000000" stroke-linecap="round"/>
</g>
<g id="layer_-1_plated-drill">
<!--normal-->
 <circle cx="2.5400" cy="3.8100" r="0.5000" stroke-width="0.0000" fill="#ffffff" stroke="none"/>
 <circle cx="10.1600" cy="3.8100" r="0.5000" stroke-width="0.0000" fill="#ffffff" stroke="none"/>
 <circle cx="2.5400" cy="8.8900" r="0.5000" stroke-width="0.0000" fill="#ffffff" stroke="none"/>
 <circle cx="10.1600" cy="8.8900" r="0.5000" stroke-width="0.0000" fill="#ffffff" stroke="none"/>
</g>
</svg>
