<?xml version="1.0"?>
<svg xmlns="http://www.w3.org/2000/svg" version="1.0" width="1625.6000" height="1625.6000" viewBox="-2.0000 -2.0000 17.7000 17.7000">
<g id="layer_9_outline">
<!--normal-->
 <rect x="0.0000" y="0.0000" width="12.7000" height="12.7000" stroke-width="0.2540" stroke="#00868b" stroke-linecap="round" fill="none"/>
</g>
<g id="layer_7_group7">
</g>
<g id="layer_5_group5">
</g>
<g id="layer_10_bottom">
</g>
<g id="layer_3_top">
</g>
<g id="layer_1_topsilk">
<!--normal-->
 <line x1="5.7150" y1="4.6990" x2="5.7150" y2="5.4610" stroke-width="0.1778" stroke="#000000" stroke-linecap="round"/>
 <line x1="5.7150" y1="4.6990" x2="5.8928" y2="4.4450" stroke-width="0.1778" stroke="#000000" stroke-linecap="round"/>
 <line x1="5.8928" y1="4.4450" x2="6.1722" y2="4.4450" stroke-width="0.1778" stroke="#000000" stroke-linecap="round"/>
 <line x1="6.1722" y1="4.4450" x2="6.3500" y2="4.6990" stroke-width="0.1778" stroke="#000000" stroke-linecap="round"/>
 <line x1="6.3500" y1="4.6990" x2="6.3500" y2="5.4610" stroke-width="0.1778" stroke="#000000" stroke-linecap="round"/>
 <line x1="5.7150" y1="4.9530" x2="6.3500" y2="4.9530" stroke-width="0.1778" stroke="#000000" stroke-linecap="round"/>
 <line x1="6.6548" y1="4.6482" x2="6.8580" y2="4.4450" stroke-width="0.1778" stroke="#000000" stroke-linecap="round"/>
 <line x1="6.8580" y1="4.4450" x2="6.8580" y2="5.4610" stroke-width="0.1778" stroke="#000000" stroke-linecap="round"/>
 <line x1="6.6548" y1="5.4610" x2="7.0358" y2="5.4610" stroke-width="0.1778" stroke="#000000" stroke-linecap="round"/>
</g>
</svg>
