<?xml version="1.0"?>
<svg xmlns="http://www.w3.org/2000/svg" xmlns:xlink="http://www.w3.org/1999/xlink" version="1.0" width="1625.6000" height="1625.6000" viewBox="-2.0000 -2.0000 17.7000 17.7000">
<g id="layer_7_group7">
</g>
<g id="layer_5_group5">
</g>
<g id="layer_10_bottom">
</g>
<g id="layer_3_top">
<!--normal-->
 <line x1="1.2700" y1="1.2700" x2="3.1750" y2="1.2700" stroke-width="0.2540" stroke="#4d4d4d" stroke-linecap="round"/>
 <line x1="1.2700" y1="3.1750" x2="1.2700" y2="5.0800" stroke-width="0.2540" stroke="#4d4d4d" stroke-linecap="round"/>
 <polygon points="4.9530,1.1430 4.9530,1.3970 7.1120,1.3970 7.1120,1.1430 " stroke-width="0.010" stroke="#4d4d4d" fill="#4d4d4d"/>
 <polygon points="1.3970,6.8580 1.1430,6.8580 1.1430,9.0170 1.3970,9.0170 " stroke-width="0.010" stroke="#4d4d4d" fill="#4d4d4d"/>
 <line x1="3.1750" y1="3.8100" x2="4.5220" y2="5.1570" stroke-width="0.2540" stroke="#4d4d4d" stroke-linecap="round"/>
 <polygon points="5.7150,3.6304 5.5354,3.8100 7.0620,5.3366 7.2416,5.1570 " stroke-width="0.010" stroke="#4d4d4d" fill="#4d4d4d"/>
 <line x1="3.1750" y1="7.6200" x2="4.9385" y2="8.3403" stroke-width="0.2540" stroke="#4d4d4d" stroke-linecap="round"/>
 <polygon points="6.9155,7.4544 6.8194,7.6895 8.8181,8.5059 8.9141,8.2708 " stroke-width="0.010" stroke="#4d4d4d" fill="#4d4d4d"/>
</g>
<g id="layer_1_topsilk">
<!--normal-->
 <line x1="0.6350" y1="1.9050" x2="3.8100" y2="1.9050" stroke-width="0.1270" stroke="#000000" stroke-linecap="round"/>
 <line x1="3.8100" y1="1.9050" x2="3.8100" y2="0.6350" stroke-width="0.1270" stroke="#000000" stroke-linecap="round"/>
 <line x1="3.8100" y1="0.6350" x2="0.6350" y2="0.6350" stroke-width="0.1270" stroke="#000000" stroke-linecap="round"/>
 <line x1="0.6350" y1="1.9050" x2="0.6350" y2="0.6350" stroke-width="0.1270" stroke="#000000" stroke-linecap="round"/>
 <line x1="0.6350" y1="2.5400" x2="1.9050" y2="2.5400" stroke-width="0.1270" stroke="#000000" stroke-linecap="round"/>
 <line x1="1.9050" y1="2.5400" x2="1.9050" y2="5.7150" stroke-width="0.1270" stroke="#000000" stroke-linecap="round"/>
 <line x1="0.6350" y1="2.5400" x2="0.6350" y2="5.7150" stroke-width="0.1270" stroke="#000000" stroke-linecap="round"/>
 <line x1="0.6350" y1="5.7150" x2="1.9050" y2="5.7150" stroke-width="0.1270" stroke="#000000" stroke-linecap="round"/>
 <line x1="0.6350" y1="6.3500" x2="0.6350" y2="9.5250" stroke-width="0.1270" stroke="#000000" stroke-linecap="round"/>
 <line x1="0.6350" y1="9.5250" x2="1.9050" y2="9.5250" stroke-width="0.1270" stroke="#000000" stroke-linecap="round"/>
 <line x1="1.9050" y1="6.3500" x2="1.9050" y2="9.5250" stroke-width="0.1270" stroke="#000000" stroke-linecap="round"/>
 <line x1="0.6350" y1="6.3500" x2="1.9050" y2="6.3500" stroke-width="0.1270" stroke="#000000" stroke-linecap="round"/>
 <line x1="4.4450" y1="1.9050" x2="7.6200" y2="1.9050" stroke-width="0.1270" stroke="#000000" stroke-linecap="round"/>
 <line x1="7.6200" y1="0.6350" x2="7.6200" y2="1.9050" stroke-width="0.1270" stroke="#000000" stroke-linecap="round"/>
 <line x1="4.4450" y1="0.6350" x2="7.6200" y2="0.6350" stroke-width="0.1270" stroke="#000000" stroke-linecap="round"/>
 <line x1="4.4450" y1="0.6350" x2="4.4450" y2="1.9050" stroke-width="0.1270" stroke="#000000" stroke-linecap="round"/>
 <line x1="2.2769" y1="3.8100" x2="3.1750" y2="2.9119" stroke-width="0.1270" stroke="#000000" stroke-linecap="round"/>
 <line x1="2.2769" y1="3.8100" x2="4.5220" y2="6.0551" stroke-width="0.1270" stroke="#000000" stroke-linecap="round"/>
 <line x1="3.1750" y1="2.9119" x2="5.4201" y2="5.1570" stroke-width="0.1270" stroke="#000000" stroke-linecap="round"/>
 <line x1="4.5220" y1="6.0551" x2="5.4201" y2="5.1570" stroke-width="0.1270" stroke="#000000" stroke-linecap="round"/>
 <line x1="4.8169" y1="3.8100" x2="7.0620" y2="6.0551" stroke-width="0.1270" stroke="#000000" stroke-linecap="round"/>
 <line x1="7.0620" y1="6.0551" x2="7.9601" y2="5.1570" stroke-width="0.1270" stroke="#000000" stroke-linecap="round"/>
 <line x1="5.7150" y1="2.9119" x2="7.9601" y2="5.1570" stroke-width="0.1270" stroke="#000000" stroke-linecap="round"/>
 <line x1="4.8169" y1="3.8100" x2="5.7150" y2="2.9119" stroke-width="0.1270" stroke="#000000" stroke-linecap="round"/>
 <line x1="2.3470" y1="7.9677" x2="5.2862" y2="9.1684" stroke-width="0.1270" stroke="#000000" stroke-linecap="round"/>
 <line x1="5.2862" y1="9.1684" x2="5.7666" y2="7.9926" stroke-width="0.1270" stroke="#000000" stroke-linecap="round"/>
 <line x1="6.1570" y1="7.9677" x2="9.0962" y2="9.1684" stroke-width="0.1270" stroke="#000000" stroke-linecap="round"/>
 <line x1="9.0962" y1="9.1684" x2="9.5766" y2="7.9926" stroke-width="0.1270" stroke="#000000" stroke-linecap="round"/>
 <line x1="2.8273" y1="6.7920" x2="5.7666" y2="7.9926" stroke-width="0.1270" stroke="#000000" stroke-linecap="round"/>
 <line x1="6.6373" y1="6.7920" x2="9.5766" y2="7.9926" stroke-width="0.1270" stroke="#000000" stroke-linecap="round"/>
 <line x1="6.1570" y1="7.9677" x2="6.6373" y2="6.7920" stroke-width="0.1270" stroke="#000000" stroke-linecap="round"/>
 <line x1="2.3470" y1="7.9677" x2="2.8273" y2="6.7920" stroke-width="0.1270" stroke="#000000" stroke-linecap="round"/>
 <line x1="0.3810" y1="0.3810" x2="0.6604" y2="0.3810" stroke-width="0.1778" stroke="#000000" stroke-linecap="round"/>
 <line x1="0.6604" y1="0.3810" x2="0.7302" y2="0.4508" stroke-width="0.1778" stroke="#000000" stroke-linecap="round"/>
 <line x1="0.7302" y1="0.4508" x2="0.7302" y2="0.5906" stroke-width="0.1778" stroke="#000000" stroke-linecap="round"/>
 <line x1="0.6604" y1="0.6604" x2="0.7302" y2="0.5906" stroke-width="0.1778" stroke="#000000" stroke-linecap="round"/>
 <line x1="0.4508" y1="0.6604" x2="0.6604" y2="0.6604" stroke-width="0.1778" stroke="#000000" stroke-linecap="round"/>
 <line x1="0.4508" y1="0.3810" x2="0.4508" y2="0.9398" stroke-width="0.1778" stroke="#000000" stroke-linecap="round"/>
 <line x1="0.5626" y1="0.6604" x2="0.7302" y2="0.9398" stroke-width="0.1778" stroke="#000000" stroke-linecap="round"/>
 <line x1="0.8979" y1="0.4928" x2="1.0097" y2="0.3810" stroke-width="0.1778" stroke="#000000" stroke-linecap="round"/>
 <line x1="1.0097" y1="0.3810" x2="1.0097" y2="0.9398" stroke-width="0.1778" stroke="#000000" stroke-linecap="round"/>
 <line x1="0.8979" y1="0.9398" x2="1.1074" y2="0.9398" stroke-width="0.1778" stroke="#000000" stroke-linecap="round"/>
 <line x1="7.9375" y1="0.6350" x2="8.4455" y2="0.6350" stroke-width="0.1778" stroke="#000000" stroke-linecap="round"/>
 <line x1="8.4455" y1="0.6350" x2="8.5725" y2="0.7620" stroke-width="0.1778" stroke="#000000" stroke-linecap="round"/>
 <line x1="8.5725" y1="0.7620" x2="8.5725" y2="1.0160" stroke-width="0.1778" stroke="#000000" stroke-linecap="round"/>
 <line x1="8.4455" y1="1.1430" x2="8.5725" y2="1.0160" stroke-width="0.1778" stroke="#000000" stroke-linecap="round"/>
 <line x1="8.0645" y1="1.1430" x2="8.4455" y2="1.1430" stroke-width="0.1778" stroke="#000000" stroke-linecap="round"/>
 <line x1="8.0645" y1="0.6350" x2="8.0645" y2="1.6510" stroke-width="0.1778" stroke="#000000" stroke-linecap="round"/>
 <line x1="8.2677" y1="1.1430" x2="8.5725" y2="1.6510" stroke-width="0.1778" stroke="#000000" stroke-linecap="round"/>
 <line x1="8.8773" y1="0.7620" x2="9.0043" y2="0.6350" stroke-width="0.1778" stroke="#000000" stroke-linecap="round"/>
 <line x1="9.0043" y1="0.6350" x2="9.3853" y2="0.6350" stroke-width="0.1778" stroke="#000000" stroke-linecap="round"/>
 <line x1="9.3853" y1="0.6350" x2="9.5123" y2="0.7620" stroke-width="0.1778" stroke="#000000" stroke-linecap="round"/>
 <line x1="9.5123" y1="0.7620" x2="9.5123" y2="1.0160" stroke-width="0.1778" stroke="#000000" stroke-linecap="round"/>
 <line x1="8.8773" y1="1.6510" x2="9.5123" y2="1.0160" stroke-width="0.1778" stroke="#000000" stroke-linecap="round"/>
 <line x1="8.8773" y1="1.6510" x2="9.5123" y2="1.6510" stroke-width="0.1778" stroke="#000000" stroke-linecap="round"/>
 <line x1="3.5560" y1="3.6830" x2="3.5560" y2="3.3782" stroke-width="0.1778" stroke="#000000" stroke-linecap="round"/>
 <line x1="3.5560" y1="3.3782" x2="3.6322" y2="3.3020" stroke-width="0.1778" stroke="#000000" stroke-linecap="round"/>
 <line x1="3.6322" y1="3.3020" x2="3.7846" y2="3.3020" stroke-width="0.1778" stroke="#000000" stroke-linecap="round"/>
 <line x1="3.8608" y1="3.3782" x2="3.7846" y2="3.3020" stroke-width="0.1778" stroke="#000000" stroke-linecap="round"/>
 <line x1="3.8608" y1="3.6068" x2="3.8608" y2="3.3782" stroke-width="0.1778" stroke="#000000" stroke-linecap="round"/>
 <line x1="3.5560" y1="3.6068" x2="4.1656" y2="3.6068" stroke-width="0.1778" stroke="#000000" stroke-linecap="round"/>
 <line x1="3.8608" y1="3.4849" x2="4.1656" y2="3.3020" stroke-width="0.1778" stroke="#000000" stroke-linecap="round"/>
 <line x1="3.9370" y1="3.1191" x2="3.5560" y2="2.8143" stroke-width="0.1778" stroke="#000000" stroke-linecap="round"/>
 <line x1="3.9370" y1="3.1191" x2="3.9370" y2="2.7381" stroke-width="0.1778" stroke="#000000" stroke-linecap="round"/>
 <line x1="3.5560" y1="2.8143" x2="4.1656" y2="2.8143" stroke-width="0.1778" stroke="#000000" stroke-linecap="round"/>
 <line x1="9.0170" y1="3.4290" x2="9.0170" y2="3.9370" stroke-width="0.1778" stroke="#000000" stroke-linecap="round"/>
 <line x1="9.0170" y1="3.9370" x2="8.8900" y2="4.0640" stroke-width="0.1778" stroke="#000000" stroke-linecap="round"/>
 <line x1="8.8900" y1="4.0640" x2="8.6360" y2="4.0640" stroke-width="0.1778" stroke="#000000" stroke-linecap="round"/>
 <line x1="8.5090" y1="3.9370" x2="8.6360" y2="4.0640" stroke-width="0.1778" stroke="#000000" stroke-linecap="round"/>
 <line x1="8.5090" y1="3.5560" x2="8.5090" y2="3.9370" stroke-width="0.1778" stroke="#000000" stroke-linecap="round"/>
 <line x1="9.0170" y1="3.5560" x2="8.0010" y2="3.5560" stroke-width="0.1778" stroke="#000000" stroke-linecap="round"/>
 <line x1="8.5090" y1="3.7592" x2="8.0010" y2="4.0640" stroke-width="0.1778" stroke="#000000" stroke-linecap="round"/>
 <line x1="9.0170" y1="4.3688" x2="9.0170" y2="4.8768" stroke-width="0.1778" stroke="#000000" stroke-linecap="round"/>
 <line x1="9.0170" y1="4.3688" x2="8.5090" y2="4.3688" stroke-width="0.1778" stroke="#000000" stroke-linecap="round"/>
 <line x1="8.5090" y1="4.3688" x2="8.6360" y2="4.4958" stroke-width="0.1778" stroke="#000000" stroke-linecap="round"/>
 <line x1="8.6360" y1="4.4958" x2="8.6360" y2="4.7498" stroke-width="0.1778" stroke="#000000" stroke-linecap="round"/>
 <line x1="8.6360" y1="4.7498" x2="8.5090" y2="4.8768" stroke-width="0.1778" stroke="#000000" stroke-linecap="round"/>
 <line x1="8.5090" y1="4.8768" x2="8.1280" y2="4.8768" stroke-width="0.1778" stroke="#000000" stroke-linecap="round"/>
 <line x1="8.0010" y1="4.7498" x2="8.1280" y2="4.8768" stroke-width="0.1778" stroke="#000000" stroke-linecap="round"/>
 <line x1="8.0010" y1="4.4958" x2="8.0010" y2="4.7498" stroke-width="0.1778" stroke="#000000" stroke-linecap="round"/>
 <line x1="8.1280" y1="4.3688" x2="8.0010" y2="4.4958" stroke-width="0.1778" stroke="#000000" stroke-linecap="round"/>
 <line x1="2.0320" y1="5.9055" x2="2.0320" y2="5.5753" stroke-width="0.1778" stroke="#000000" stroke-linecap="round"/>
 <line x1="2.0320" y1="5.5753" x2="2.1145" y2="5.4928" stroke-width="0.1778" stroke="#000000" stroke-linecap="round"/>
 <line x1="2.1145" y1="5.4928" x2="2.2797" y2="5.4928" stroke-width="0.1778" stroke="#000000" stroke-linecap="round"/>
 <line x1="2.3622" y1="5.5753" x2="2.2797" y2="5.4928" stroke-width="0.1778" stroke="#000000" stroke-linecap="round"/>
 <line x1="2.3622" y1="5.8229" x2="2.3622" y2="5.5753" stroke-width="0.1778" stroke="#000000" stroke-linecap="round"/>
 <line x1="2.0320" y1="5.8229" x2="2.6924" y2="5.8229" stroke-width="0.1778" stroke="#000000" stroke-linecap="round"/>
 <line x1="2.3622" y1="5.6909" x2="2.6924" y2="5.4928" stroke-width="0.1778" stroke="#000000" stroke-linecap="round"/>
 <line x1="2.1145" y1="5.2946" x2="2.0320" y2="5.2121" stroke-width="0.1778" stroke="#000000" stroke-linecap="round"/>
 <line x1="2.0320" y1="5.2121" x2="2.0320" y2="5.0470" stroke-width="0.1778" stroke="#000000" stroke-linecap="round"/>
 <line x1="2.0320" y1="5.0470" x2="2.1145" y2="4.9644" stroke-width="0.1778" stroke="#000000" stroke-linecap="round"/>
 <line x1="2.6924" y1="5.0470" x2="2.6098" y2="4.9644" stroke-width="0.1778" stroke="#000000" stroke-linecap="round"/>
 <line x1="2.6924" y1="5.2121" x2="2.6924" y2="5.0470" stroke-width="0.1778" stroke="#000000" stroke-linecap="round"/>
 <line x1="2.6098" y1="5.2946" x2="2.6924" y2="5.2121" stroke-width="0.1778" stroke="#000000" stroke-linecap="round"/>
 <line x1="2.3292" y1="5.2121" x2="2.3292" y2="5.0470" stroke-width="0.1778" stroke="#000000" stroke-linecap="round"/>
 <line x1="2.1145" y1="4.9644" x2="2.2466" y2="4.9644" stroke-width="0.1778" stroke="#000000" stroke-linecap="round"/>
 <line x1="2.4117" y1="4.9644" x2="2.6098" y2="4.9644" stroke-width="0.1778" stroke="#000000" stroke-linecap="round"/>
 <line x1="2.4117" y1="4.9644" x2="2.3292" y2="5.0470" stroke-width="0.1778" stroke="#000000" stroke-linecap="round"/>
 <line x1="2.2466" y1="4.9644" x2="2.3292" y2="5.0470" stroke-width="0.1778" stroke="#000000" stroke-linecap="round"/>
 <line x1="1.7780" y1="9.9060" x2="1.7780" y2="10.4140" stroke-width="0.1778" stroke="#000000" stroke-linecap="round"/>
 <line x1="1.7780" y1="10.4140" x2="1.6510" y2="10.5410" stroke-width="0.1778" stroke="#000000" stroke-linecap="round"/>
 <line x1="1.6510" y1="10.5410" x2="1.3970" y2="10.5410" stroke-width="0.1778" stroke="#000000" stroke-linecap="round"/>
 <line x1="1.2700" y1="10.4140" x2="1.3970" y2="10.5410" stroke-width="0.1778" stroke="#000000" stroke-linecap="round"/>
 <line x1="1.2700" y1="10.0330" x2="1.2700" y2="10.4140" stroke-width="0.1778" stroke="#000000" stroke-linecap="round"/>
 <line x1="1.7780" y1="10.0330" x2="0.7620" y2="10.0330" stroke-width="0.1778" stroke="#000000" stroke-linecap="round"/>
 <line x1="1.2700" y1="10.2362" x2="0.7620" y2="10.5410" stroke-width="0.1778" stroke="#000000" stroke-linecap="round"/>
 <line x1="1.7780" y1="11.2268" x2="1.6510" y2="11.3538" stroke-width="0.1778" stroke="#000000" stroke-linecap="round"/>
 <line x1="1.7780" y1="10.9728" x2="1.7780" y2="11.2268" stroke-width="0.1778" stroke="#000000" stroke-linecap="round"/>
 <line x1="1.6510" y1="10.8458" x2="1.7780" y2="10.9728" stroke-width="0.1778" stroke="#000000" stroke-linecap="round"/>
 <line x1="1.6510" y1="10.8458" x2="0.8890" y2="10.8458" stroke-width="0.1778" stroke="#000000" stroke-linecap="round"/>
 <line x1="0.8890" y1="10.8458" x2="0.7620" y2="10.9728" stroke-width="0.1778" stroke="#000000" stroke-linecap="round"/>
 <line x1="1.3208" y1="11.2268" x2="1.1938" y2="11.3538" stroke-width="0.1778" stroke="#000000" stroke-linecap="round"/>
 <line x1="1.3208" y1="10.8458" x2="1.3208" y2="11.2268" stroke-width="0.1778" stroke="#000000" stroke-linecap="round"/>
 <line x1="0.7620" y1="10.9728" x2="0.7620" y2="11.2268" stroke-width="0.1778" stroke="#000000" stroke-linecap="round"/>
 <line x1="0.7620" y1="11.2268" x2="0.8890" y2="11.3538" stroke-width="0.1778" stroke="#000000" stroke-linecap="round"/>
 <line x1="1.1938" y1="11.3538" x2="0.8890" y2="11.3538" stroke-width="0.1778" stroke="#000000" stroke-linecap="round"/>
 <line x1="4.9530" y1="9.2710" x2="4.9530" y2="9.7790" stroke-width="0.1778" stroke="#000000" stroke-linecap="round"/>
 <line x1="4.9530" y1="9.7790" x2="4.8260" y2="9.9060" stroke-width="0.1778" stroke="#000000" stroke-linecap="round"/>
 <line x1="4.8260" y1="9.9060" x2="4.5720" y2="9.9060" stroke-width="0.1778" stroke="#000000" stroke-linecap="round"/>
 <line x1="4.4450" y1="9.7790" x2="4.5720" y2="9.9060" stroke-width="0.1778" stroke="#000000" stroke-linecap="round"/>
 <line x1="4.4450" y1="9.3980" x2="4.4450" y2="9.7790" stroke-width="0.1778" stroke="#000000" stroke-linecap="round"/>
 <line x1="4.9530" y1="9.3980" x2="3.9370" y2="9.3980" stroke-width="0.1778" stroke="#000000" stroke-linecap="round"/>
 <line x1="4.4450" y1="9.6012" x2="3.9370" y2="9.9060" stroke-width="0.1778" stroke="#000000" stroke-linecap="round"/>
 <line x1="3.9370" y1="10.3378" x2="4.9530" y2="10.8458" stroke-width="0.1778" stroke="#000000" stroke-linecap="round"/>
 <line x1="4.9530" y1="10.2108" x2="4.9530" y2="10.8458" stroke-width="0.1778" stroke="#000000" stroke-linecap="round"/>
 <line x1="8.5090" y1="9.5250" x2="8.5090" y2="10.0330" stroke-width="0.1778" stroke="#000000" stroke-linecap="round"/>
 <line x1="8.5090" y1="10.0330" x2="8.3820" y2="10.1600" stroke-width="0.1778" stroke="#000000" stroke-linecap="round"/>
 <line x1="8.3820" y1="10.1600" x2="8.1280" y2="10.1600" stroke-width="0.1778" stroke="#000000" stroke-linecap="round"/>
 <line x1="8.0010" y1="10.0330" x2="8.1280" y2="10.1600" stroke-width="0.1778" stroke="#000000" stroke-linecap="round"/>
 <line x1="8.0010" y1="9.6520" x2="8.0010" y2="10.0330" stroke-width="0.1778" stroke="#000000" stroke-linecap="round"/>
 <line x1="8.5090" y1="9.6520" x2="7.4930" y2="9.6520" stroke-width="0.1778" stroke="#000000" stroke-linecap="round"/>
 <line x1="8.0010" y1="9.8552" x2="7.4930" y2="10.1600" stroke-width="0.1778" stroke="#000000" stroke-linecap="round"/>
 <line x1="7.6200" y1="10.4648" x2="7.4930" y2="10.5918" stroke-width="0.1778" stroke="#000000" stroke-linecap="round"/>
 <line x1="7.8232" y1="10.4648" x2="7.6200" y2="10.4648" stroke-width="0.1778" stroke="#000000" stroke-linecap="round"/>
 <line x1="7.8232" y1="10.4648" x2="8.0010" y2="10.6426" stroke-width="0.1778" stroke="#000000" stroke-linecap="round"/>
 <line x1="8.0010" y1="10.6426" x2="8.0010" y2="10.7950" stroke-width="0.1778" stroke="#000000" stroke-linecap="round"/>
 <line x1="8.0010" y1="10.7950" x2="7.8232" y2="10.9728" stroke-width="0.1778" stroke="#000000" stroke-linecap="round"/>
 <line x1="7.8232" y1="10.9728" x2="7.6200" y2="10.9728" stroke-width="0.1778" stroke="#000000" stroke-linecap="round"/>
 <line x1="7.4930" y1="10.8458" x2="7.6200" y2="10.9728" stroke-width="0.1778" stroke="#000000" stroke-linecap="round"/>
 <line x1="7.4930" y1="10.5918" x2="7.4930" y2="10.8458" stroke-width="0.1778" stroke="#000000" stroke-linecap="round"/>
 <line x1="8.1788" y1="10.4648" x2="8.0010" y2="10.6426" stroke-width="0.1778" stroke="#000000" stroke-linecap="round"/>
 <line x1="8.3820" y1="10.4648" x2="8.1788" y2="10.4648" stroke-width="0.1778" stroke="#000000" stroke-linecap="round"/>
 <line x1="8.3820" y1="10.4648" x2="8.5090" y2="10.5918" stroke-width="0.1778" stroke="#000000" stroke-linecap="round"/>
 <line x1="8.5090" y1="10.5918" x2="8.5090" y2="10.8458" stroke-width="0.1778" stroke="#000000" stroke-linecap="round"/>
 <line x1="8.5090" y1="10.8458" x2="8.3820" y2="10.9728" stroke-width="0.1778" stroke="#000000" stroke-linecap="round"/>
 <line x1="8.3820" y1="10.9728" x2="8.1788" y2="10.9728" stroke-width="0.1778" stroke="#000000" stroke-linecap="round"/>
 <line x1="8.0010" y1="10.7950" x2="8.1788" y2="10.9728" stroke-width="0.1778" stroke="#000000" stroke-linecap="round"/>
</g>
<g id="layer_9_outline">
<!--normal-->
 <rect x="0.0000" y="0.0000" width="12.7000" height="12.7000" stroke-width="0.2540" stroke="#00868b" stroke-linecap="round" fill="none"/>
</g>
<g id="layer_9_outline">
</g>
</svg>
