%!PS-Adobe-3.0 EPSF-3.0
%%BoundingBox: 0 0 37.000000 37.000000
%%Pages: 1
save countdictstack mark newpath /showpage {} def /setpagedevice {pop} def
%%EndProlog
%%Page: 1 1
%%BeginDocument: line_f_clear.eps

72 72 scale
1 dup neg scale
1 dup scale
0.00000 -0.50000 translate
/nclip { -0.01000 -0.01000 moveto -0.01000 0.51000 lineto 0.51000 0.51000 lineto 0.51000 -0.01000 lineto -0.01000 -0.01000 lineto eoclip newpath } def
/t { moveto lineto stroke } bind def
/tc { moveto lineto strokepath nclip } bind def
/r { /y2 exch def /x2 exch def /y1 exch def /x1 exch def
     x1 y1 moveto x1 y2 lineto x2 y2 lineto x2 y1 lineto closepath fill } bind def
/c { 0 360 arc fill } bind def
/cc { 0 360 arc nclip } bind def
/a { gsave setlinewidth translate scale 0 0 1 5 3 roll arc stroke grestore} bind def
% Layer bottom group 10 drill 0 mask 0
% Layer group5 group 5 drill 0 mask 0
% Layer group7 group 7 drill 0 mask 0
% Layer top group 3 drill 0 mask 0
0.00000 setlinewidth
1 setlinecap
0.545098 0.137255 0.137255 setrgbcolor
0.26250 0.02500 moveto
0.47500 0.02500 lineto
0.47500 0.47500 lineto
0.26250 0.47500 lineto
0.26250 0.42033 lineto
0.26457 0.41984 lineto
0.27140 0.41701 lineto
0.27771 0.41314 lineto
0.28334 0.40834 lineto
0.28814 0.40271 lineto
0.29201 0.39640 lineto
0.29484 0.38957 lineto
0.29656 0.38238 lineto
0.29700 0.37500 lineto
0.29700 0.26950 lineto
0.40000 0.26950 lineto
0.40306 0.26932 lineto
0.40604 0.26860 lineto
0.40888 0.26743 lineto
0.41150 0.26582 lineto
0.41383 0.26383 lineto
0.41582 0.26150 lineto
0.41743 0.25888 lineto
0.41860 0.25604 lineto
0.41932 0.25306 lineto
0.41956 0.25000 lineto
0.41932 0.24694 lineto
0.41860 0.24396 lineto
0.41743 0.24112 lineto
0.41582 0.23850 lineto
0.41383 0.23617 lineto
0.41150 0.23418 lineto
0.40888 0.23257 lineto
0.40604 0.23140 lineto
0.40306 0.23068 lineto
0.40000 0.23050 lineto
0.29700 0.23050 lineto
0.29700 0.12500 lineto
0.29656 0.11762 lineto
0.29484 0.11043 lineto
0.29201 0.10360 lineto
0.28814 0.09729 lineto
0.28334 0.09166 lineto
0.27771 0.08686 lineto
0.27140 0.08299 lineto
0.26457 0.08016 lineto
0.26250 0.07967 lineto
fill
0.02500 0.02500 moveto
0.26250 0.02500 lineto
0.26250 0.07967 lineto
0.25738 0.07844 lineto
0.25000 0.07786 lineto
0.24262 0.07844 lineto
0.23543 0.08016 lineto
0.22860 0.08299 lineto
0.22229 0.08686 lineto
0.21666 0.09166 lineto
0.21186 0.09729 lineto
0.20799 0.10360 lineto
0.20516 0.11043 lineto
0.20344 0.11762 lineto
0.20300 0.12500 lineto
0.20300 0.23050 lineto
0.12500 0.23050 lineto
0.12194 0.23068 lineto
0.11896 0.23140 lineto
0.11612 0.23257 lineto
0.11350 0.23418 lineto
0.11117 0.23617 lineto
0.10918 0.23850 lineto
0.10757 0.24112 lineto
0.10640 0.24396 lineto
0.10568 0.24694 lineto
0.10544 0.25000 lineto
0.10568 0.25306 lineto
0.10640 0.25604 lineto
0.10757 0.25888 lineto
0.10918 0.26150 lineto
0.11117 0.26383 lineto
0.11350 0.26582 lineto
0.11612 0.26743 lineto
0.11896 0.26860 lineto
0.12194 0.26932 lineto
0.12500 0.26950 lineto
0.20300 0.26950 lineto
0.20300 0.37500 lineto
0.20344 0.38238 lineto
0.20516 0.38957 lineto
0.20799 0.39640 lineto
0.21186 0.40271 lineto
0.21666 0.40834 lineto
0.22229 0.41314 lineto
0.22860 0.41701 lineto
0.23543 0.41984 lineto
0.24262 0.42156 lineto
0.25000 0.42214 lineto
0.25738 0.42156 lineto
0.26250 0.42033 lineto
0.26250 0.47500 lineto
0.02500 0.47500 lineto
fill
0.01500 setlinewidth
0.12500 0.25000 0.40000 0.25000 t
0.01000 setlinewidth
0.25000 0.12500 0.25000 0.37500 t
0.02000 setlinewidth
0.25000 0.25000 0.40000 0.20000 t
0.00500 setlinewidth
0.25000 0.25000 0.15000 0.15000 t
% Layer topsilk group 1 drill 0 mask 0
% Layer bottomsilk group 12 drill 0 mask 0
showpage
%%EndDocument
%%Trailer
cleartomark countdictstack exch sub { end } repeat restore
%%EOF
