G04 start of page 2 for group 0 layer_idx 8 *
G04 Title: text rotations, TODO:group_name *
G04 Creator: <version>
G04 CreationDate: <date>
G04 For:  *
G04 Format: Gerber/RS-274X *
G04 PCB-Dimensions: 50000 50000 *
G04 PCB-Coordinate-Origin: lower left *
%MOIN*%
%FSLAX25Y25*%
%LNTOPSILK*%
%ADD11C,0.0070*%
G54D11*X22500Y34000D02*Y31000D01*
Y34000D02*X23200Y35000D01*
X24300D01*
X25000Y34000D01*
Y31000D01*
X22500Y33000D02*X25000D01*
X26200Y34200D02*X27000Y35000D01*
Y31000D01*
X26200D02*X27700D01*
X16000Y22500D02*X19000D01*
X16000D02*X15000Y23200D01*
Y24300D02*Y23200D01*
Y24300D02*X16000Y25000D01*
X19000D01*
X17000D02*Y22500D01*
X15500Y26200D02*X15000Y26700D01*
Y28200D02*Y26700D01*
Y28200D02*X15500Y28700D01*
X16500D01*
X19000Y26200D02*X16500Y28700D01*
X19000D02*Y26200D01*
X27500Y19000D02*Y16000D01*
X26800Y15000D01*
X25700D02*X26800D01*
X25700D02*X25000Y16000D01*
Y19000D02*Y16000D01*
Y17000D02*X27500D01*
X23800Y15500D02*X23300Y15000D01*
X22300D02*X23300D01*
X22300D02*X21800Y15500D01*
X22300Y19000D02*X21800Y18500D01*
X22300Y19000D02*X23300D01*
X23800Y18500D02*X23300Y19000D01*
X22300Y16800D02*X23300D01*
X21800Y16300D02*Y15500D01*
Y18500D02*Y17300D01*
X22300Y16800D01*
X21800Y16300D02*X22300Y16800D01*
X31000Y27500D02*X34000D01*
X35000Y26800D01*
Y25700D01*
X34000Y25000D01*
X31000D02*X34000D01*
X33000Y27500D02*Y25000D01*
X32500Y23800D02*X35000Y21800D01*
X32500Y23800D02*Y21300D01*
X31000Y21800D02*X35000D01*
M02*
