<?xml version="1.0"?>
<svg xmlns="http://www.w3.org/2000/svg" xmlns:xlink="http://www.w3.org/1999/xlink" version="1.0" width="1625.6000" height="1625.6000" viewBox="-2.0000 -2.0000 17.7000 17.7000">
<g id="layer_7_group7">
<!--normal-->
 <polygon points="0.8890,2.1590 2.9210,2.1590 2.9210,4.1910 0.8890,4.1910 " stroke-width="0.010" stroke="#999999" fill="#999999"/>
 <circle cx="9.5250" cy="3.1750" r="1.0160" stroke-width="0.0000" fill="#999999" stroke="none"/>
 <polygon points="3.9370,7.8342 2.7467,7.2390 1.4842,7.2390 0.8890,7.8342 0.8890,8.6758 1.4842,9.2710 2.7467,9.2710 3.9370,8.6758 " stroke-width="0.010" stroke="#999999" fill="#999999"/>
 <polygon points="11.5570,7.4133 10.3667,6.2230 8.6833,6.2230 7.4930,7.4133 7.4930,8.6758 8.6833,9.2710 10.3667,9.2710 11.5570,8.6758 " stroke-width="0.010" stroke="#999999" fill="#999999"/>
 <circle cx="1.9050" cy="3.1750" r="0.5000" stroke-width="0.0000" fill="#ffffff" stroke="none"/>
 <circle cx="9.5250" cy="3.1750" r="0.5000" stroke-width="0.0000" fill="#ffffff" stroke="none"/>
 <circle cx="1.9050" cy="8.2550" r="0.5000" stroke-width="0.0000" fill="#ffffff" stroke="none"/>
 <circle cx="9.5250" cy="8.2550" r="0.5000" stroke-width="0.0000" fill="#ffffff" stroke="none"/>
</g>
<g id="layer_5_group5">
<!--normal-->
 <polygon points="0.8890,2.1590 2.9210,2.1590 2.9210,4.1910 0.8890,4.1910 " stroke-width="0.010" stroke="#999999" fill="#999999"/>
 <circle cx="9.5250" cy="3.1750" r="1.0160" stroke-width="0.0000" fill="#999999" stroke="none"/>
 <polygon points="3.9370,7.8342 2.7467,7.2390 1.4842,7.2390 0.8890,7.8342 0.8890,8.6758 1.4842,9.2710 2.7467,9.2710 3.9370,8.6758 " stroke-width="0.010" stroke="#999999" fill="#999999"/>
 <polygon points="11.5570,7.4133 10.3667,6.2230 8.6833,6.2230 7.4930,7.4133 7.4930,8.6758 8.6833,9.2710 10.3667,9.2710 11.5570,8.6758 " stroke-width="0.010" stroke="#999999" fill="#999999"/>
 <circle cx="1.9050" cy="3.1750" r="0.5000" stroke-width="0.0000" fill="#ffffff" stroke="none"/>
 <circle cx="9.5250" cy="3.1750" r="0.5000" stroke-width="0.0000" fill="#ffffff" stroke="none"/>
 <circle cx="1.9050" cy="8.2550" r="0.5000" stroke-width="0.0000" fill="#ffffff" stroke="none"/>
 <circle cx="9.5250" cy="8.2550" r="0.5000" stroke-width="0.0000" fill="#ffffff" stroke="none"/>
</g>
<g id="layer_10_bottom">
<!--normal-->
 <polygon points="0.8890,2.1590 2.9210,2.1590 2.9210,4.1910 0.8890,4.1910 " stroke-width="0.010" stroke="#999999" fill="#999999"/>
 <circle cx="9.5250" cy="3.1750" r="1.0160" stroke-width="0.0000" fill="#999999" stroke="none"/>
 <polygon points="3.9370,7.8342 2.7467,7.2390 1.4842,7.2390 0.8890,7.8342 0.8890,8.6758 1.4842,9.2710 2.7467,9.2710 3.9370,8.6758 " stroke-width="0.010" stroke="#999999" fill="#999999"/>
 <polygon points="11.5570,7.4133 10.3667,6.2230 8.6833,6.2230 7.4930,7.4133 7.4930,8.6758 8.6833,9.2710 10.3667,9.2710 11.5570,8.6758 " stroke-width="0.010" stroke="#999999" fill="#999999"/>
 <circle cx="1.9050" cy="3.1750" r="0.5000" stroke-width="0.0000" fill="#ffffff" stroke="none"/>
 <circle cx="9.5250" cy="3.1750" r="0.5000" stroke-width="0.0000" fill="#ffffff" stroke="none"/>
 <circle cx="1.9050" cy="8.2550" r="0.5000" stroke-width="0.0000" fill="#ffffff" stroke="none"/>
 <circle cx="9.5250" cy="8.2550" r="0.5000" stroke-width="0.0000" fill="#ffffff" stroke="none"/>
</g>
<g id="layer_3_top">
<!--normal-->
 <polygon points="0.8890,2.1590 2.9210,2.1590 2.9210,4.1910 0.8890,4.1910 " stroke-width="0.010" stroke="#4d4d4d" fill="#4d4d4d"/>
 <circle cx="9.5250" cy="3.1750" r="1.0160" stroke-width="0.0000" fill="#4d4d4d" stroke="none"/>
 <polygon points="3.9370,7.8342 2.7467,7.2390 1.4842,7.2390 0.8890,7.8342 0.8890,8.6758 1.4842,9.2710 2.7467,9.2710 3.9370,8.6758 " stroke-width="0.010" stroke="#4d4d4d" fill="#4d4d4d"/>
 <polygon points="11.5570,7.4133 10.3667,6.2230 8.6833,6.2230 7.4930,7.4133 7.4930,8.6758 8.6833,9.2710 10.3667,9.2710 11.5570,8.6758 " stroke-width="0.010" stroke="#4d4d4d" fill="#4d4d4d"/>
 <circle cx="1.9050" cy="3.1750" r="0.5000" stroke-width="0.0000" fill="#ffffff" stroke="none"/>
 <circle cx="9.5250" cy="3.1750" r="0.5000" stroke-width="0.0000" fill="#ffffff" stroke="none"/>
 <circle cx="1.9050" cy="8.2550" r="0.5000" stroke-width="0.0000" fill="#ffffff" stroke="none"/>
 <circle cx="9.5250" cy="8.2550" r="0.5000" stroke-width="0.0000" fill="#ffffff" stroke="none"/>
</g>
<g id="layer_1_topsilk">
<!--normal-->
 <line x1="0.6350" y1="1.9050" x2="0.6350" y2="4.4450" stroke-width="0.2540" stroke="#000000" stroke-linecap="round"/>
 <line x1="10.7950" y1="4.4450" x2="0.6350" y2="4.4450" stroke-width="0.2540" stroke="#000000" stroke-linecap="round"/>
 <line x1="0.6350" y1="1.9050" x2="4.4450" y2="1.9050" stroke-width="0.2540" stroke="#000000" stroke-linecap="round"/>
 <line x1="0.6350" y1="6.9850" x2="0.6350" y2="9.5250" stroke-width="0.2540" stroke="#000000" stroke-linecap="round"/>
 <line x1="6.9850" y1="6.9850" x2="10.7950" y2="6.9850" stroke-width="0.2540" stroke="#000000" stroke-linecap="round"/>
 <line x1="10.7950" y1="9.5250" x2="0.6350" y2="9.5250" stroke-width="0.2540" stroke="#000000" stroke-linecap="round"/>
 <line x1="10.7950" y1="9.5250" x2="10.7950" y2="6.9850" stroke-width="0.2540" stroke="#000000" stroke-linecap="round"/>
 <line x1="0.6350" y1="6.9850" x2="4.4450" y2="6.9850" stroke-width="0.2540" stroke="#000000" stroke-linecap="round"/>
 <line x1="10.7950" y1="4.4450" x2="10.7950" y2="1.9050" stroke-width="0.2540" stroke="#000000" stroke-linecap="round"/>
 <line x1="6.9850" y1="1.9050" x2="10.7950" y2="1.9050" stroke-width="0.2540" stroke="#000000" stroke-linecap="round"/>
 <path d="M 6.98500000 1.90500000 A 1.2700 1.2700 0 0 1 4.4450 1.9050" stroke-width="0.2540" stroke="#000000" stroke-linecap="round" fill="none"/>
 <path d="M 6.98500000 6.98500000 A 1.2700 1.2700 0 0 1 4.4450 6.9850" stroke-width="0.2540" stroke="#000000" stroke-linecap="round" fill="none"/>
 <line x1="1.9050" y1="0.6350" x2="1.9050" y2="1.5240" stroke-width="0.1778" stroke="#000000" stroke-linecap="round"/>
 <line x1="1.9050" y1="1.5240" x2="2.0320" y2="1.6510" stroke-width="0.1778" stroke="#000000" stroke-linecap="round"/>
 <line x1="2.0320" y1="1.6510" x2="2.2860" y2="1.6510" stroke-width="0.1778" stroke="#000000" stroke-linecap="round"/>
 <line x1="2.2860" y1="1.6510" x2="2.4130" y2="1.5240" stroke-width="0.1778" stroke="#000000" stroke-linecap="round"/>
 <line x1="2.4130" y1="0.6350" x2="2.4130" y2="1.5240" stroke-width="0.1778" stroke="#000000" stroke-linecap="round"/>
 <line x1="2.7178" y1="0.8382" x2="2.9210" y2="0.6350" stroke-width="0.1778" stroke="#000000" stroke-linecap="round"/>
 <line x1="2.9210" y1="0.6350" x2="2.9210" y2="1.6510" stroke-width="0.1778" stroke="#000000" stroke-linecap="round"/>
 <line x1="2.7178" y1="1.6510" x2="3.0988" y2="1.6510" stroke-width="0.1778" stroke="#000000" stroke-linecap="round"/>
 <line x1="1.9050" y1="5.7150" x2="1.9050" y2="6.6040" stroke-width="0.1778" stroke="#000000" stroke-linecap="round"/>
 <line x1="1.9050" y1="6.6040" x2="2.0320" y2="6.7310" stroke-width="0.1778" stroke="#000000" stroke-linecap="round"/>
 <line x1="2.0320" y1="6.7310" x2="2.2860" y2="6.7310" stroke-width="0.1778" stroke="#000000" stroke-linecap="round"/>
 <line x1="2.2860" y1="6.7310" x2="2.4130" y2="6.6040" stroke-width="0.1778" stroke="#000000" stroke-linecap="round"/>
 <line x1="2.4130" y1="5.7150" x2="2.4130" y2="6.6040" stroke-width="0.1778" stroke="#000000" stroke-linecap="round"/>
 <line x1="2.7178" y1="5.8420" x2="2.8448" y2="5.7150" stroke-width="0.1778" stroke="#000000" stroke-linecap="round"/>
 <line x1="2.8448" y1="5.7150" x2="3.2258" y2="5.7150" stroke-width="0.1778" stroke="#000000" stroke-linecap="round"/>
 <line x1="3.2258" y1="5.7150" x2="3.3528" y2="5.8420" stroke-width="0.1778" stroke="#000000" stroke-linecap="round"/>
 <line x1="3.3528" y1="5.8420" x2="3.3528" y2="6.0960" stroke-width="0.1778" stroke="#000000" stroke-linecap="round"/>
 <line x1="2.7178" y1="6.7310" x2="3.3528" y2="6.0960" stroke-width="0.1778" stroke="#000000" stroke-linecap="round"/>
 <line x1="2.7178" y1="6.7310" x2="3.3528" y2="6.7310" stroke-width="0.1778" stroke="#000000" stroke-linecap="round"/>
</g>
<g id="layer_-1_plated-drill">
<!--normal-->
 <circle cx="1.9050" cy="3.1750" r="0.5000" stroke-width="0.0000" fill="#ffffff" stroke="none"/>
 <circle cx="9.5250" cy="3.1750" r="0.5000" stroke-width="0.0000" fill="#ffffff" stroke="none"/>
 <circle cx="1.9050" cy="8.2550" r="0.5000" stroke-width="0.0000" fill="#ffffff" stroke="none"/>
 <circle cx="9.5250" cy="8.2550" r="0.5000" stroke-width="0.0000" fill="#ffffff" stroke="none"/>
</g>
<g id="layer_9_outline">
<!--normal-->
 <rect x="0.0000" y="0.0000" width="12.7000" height="12.7000" stroke-width="0.2540" stroke="#00868b" stroke-linecap="round" fill="none"/>
</g>
<g id="layer_9_outline">
</g>
</svg>
