%!PS-Adobe-3.0 EPSF-3.0
%%BoundingBox: 0 0 37.000000 37.000000
%%Pages: 1
save countdictstack mark newpath /showpage {} def /setpagedevice {pop} def
%%EndProlog
%%Page: 1 1
%%BeginDocument: elem_pads.eps

72 72 scale
1 dup neg scale
1 dup scale
0.00000 -0.50000 translate
/nclip { -0.01000 -0.01000 moveto -0.01000 0.51000 lineto 0.51000 0.51000 lineto 0.51000 -0.01000 lineto -0.01000 -0.01000 lineto eoclip newpath } def
/t { moveto lineto stroke } bind def
/tc { moveto lineto strokepath nclip } bind def
/r { /y2 exch def /x2 exch def /y1 exch def /x1 exch def
     x1 y1 moveto x1 y2 lineto x2 y2 lineto x2 y1 lineto closepath fill } bind def
/c { 0 360 arc fill } bind def
/cc { 0 360 arc nclip } bind def
/a { gsave setlinewidth translate scale 0 0 1 5 3 roll arc stroke grestore} bind def
% Layer bottom group 10 drill 0 mask 0
% Layer group5 group 5 drill 0 mask 0
% Layer group7 group 7 drill 0 mask 0
% Layer top group 3 drill 0 mask 0
0.01500 setlinewidth
2 setlinecap
0.301961 0.301961 0.301961 setrgbcolor
0.22400 0.36500 0.22400 0.38500 t
0.27500 0.36500 0.27500 0.38500 t
0.27500 0.29500 0.27500 0.31500 t
0.25000 0.29500 0.25000 0.31500 t
0.22400 0.29500 0.22400 0.31500 t
0.05118 setlinewidth
0.19095 0.08819 0.19095 0.11181 t
0.30905 0.08819 0.30905 0.11181 t
% Layer topsilk group 1 drill 0 mask 0
0.00800 setlinewidth
1 setlinecap
0 0 0 setrgbcolor
0.22638 0.06260 0.27362 0.06260 t
0.22638 0.13740 0.27362 0.13740 t
0.01000 setlinewidth
0.21000 0.28100 0.21000 0.40000 t
0.21000 0.40000 0.29000 0.40000 t
0.29000 0.40000 0.29000 0.28100 t
0.29000 0.28100 0.21000 0.28100 t
0.00700 setlinewidth
0.21850 0.14350 0.23850 0.14350 t
0.23850 0.14350 0.24350 0.14850 t
0.24350 0.14850 0.24350 0.15850 t
0.23850 0.16350 0.24350 0.15850 t
0.22350 0.16350 0.23850 0.16350 t
0.22350 0.14350 0.22350 0.18350 t
0.23150 0.16350 0.24350 0.18350 t
0.25550 0.15150 0.26350 0.14350 t
0.26350 0.14350 0.26350 0.18350 t
0.25550 0.18350 0.27050 0.18350 t
0.22500 0.41500 0.22500 0.45000 t
0.22500 0.45000 0.23000 0.45500 t
0.23000 0.45500 0.24000 0.45500 t
0.24000 0.45500 0.24500 0.45000 t
0.24500 0.41500 0.24500 0.45000 t
0.25700 0.42300 0.26500 0.41500 t
0.26500 0.41500 0.26500 0.45500 t
0.25700 0.45500 0.27200 0.45500 t
% Layer bottomsilk group 12 drill 0 mask 0
showpage
%%EndDocument
%%Trailer
cleartomark countdictstack exch sub { end } repeat restore
%%EOF
