* EESchema Netlist Version 1.1 (Spice format) creation date: Sat 18 Feb 2017 23:45:09 ACDT

* To exclude a component from the Spice Netlist add [Spice_Netlist_Enabled] user FIELD set to: N
* To reorder the component spice node sequence add [Spice_Node_Sequence] user FIELD and define sequence: 2,1,0

*Sheet Name:/
R1  N-000008 N-000009 R		
R5  N-000003 N-000001 R		
R2  ? N-000009 R2		
R3  N-000009 N-000002 R		
R4  N-000004 N-000002 R		
C2  N-000001 N-000009 C		
C3  N-000001 ? C		
C4  N-000004 N-000002 CP1		
Q1  N-000004 N-000009 N-000001 NPN		
C1  N-000008 ? CP1		
C5  N-000003 N-000002 CP1		

.end
