G04 start of page 2 for group 0 layer_idx 0 *
G04 Title: (unknown), TODO:group_name *
G04 Creator: <version>
G04 CreationDate: <date>
G04 For:  *
G04 Format: Gerber/RS-274X *
G04 PCB-Dimensions: 50000 50000 *
G04 PCB-Coordinate-Origin: lower left *
%MOIN*%
%FSLAX25Y25*%
%LNTOP*%
%ADD12C,0.0100*%
%ADD11C,0.0001*%
G54D11*G36*
X3937Y46063D02*X47244D01*
Y22441D01*
X26122D01*
Y38189D01*
X26099Y38581D01*
X26007Y38964D01*
X25856Y39327D01*
X25651Y39663D01*
X25395Y39962D01*
X25096Y40218D01*
X24760Y40423D01*
X24397Y40574D01*
X24014Y40666D01*
X23622Y40697D01*
X23230Y40666D01*
X22847Y40574D01*
X22484Y40423D01*
X22148Y40218D01*
X21849Y39962D01*
X21593Y39663D01*
X21388Y39327D01*
X21237Y38964D01*
X21145Y38581D01*
X21122Y38189D01*
Y22441D01*
X3937D01*
Y46063D01*
G37*
G54D12*X23622Y10630D02*Y38189D01*
M02*
