G04 start of page 7 for group 1 layer_idx 8 *
G04 Title: smd elements on both sides, top_silk *
G04 Creator: <version>
G04 CreationDate: <date>
G04 For: TEST *
G04 Format: Gerber/RS-274X *
G04 PCB-Dimensions: 50000 50000 *
G04 PCB-Coordinate-Origin: lower left *
%MOIN*%
%FSLAX25Y25*%
%LNTOPSILK*%
%ADD18C,0.0070*%
%ADD17C,0.0080*%
G54D17*X20138Y41240D02*X24862D01*
X20138Y33760D02*X24862D01*
G54D18*X34350Y40650D02*X36350D01*
X36850Y40150D01*
Y39150D01*
X36350Y38650D02*X36850Y39150D01*
X34850Y38650D02*X36350D01*
X34850Y40650D02*Y36650D01*
X35650Y38650D02*X36850Y36650D01*
X38050Y39850D02*X38850Y40650D01*
Y36650D01*
X38050D02*X39550D01*
M02*
