%!PS-Adobe-3.0
%%Title: FlareLED.ps
%%Creator: XCircuit v3.8 rev78
%%CreationDate: Fri Feb 10 04:51:09 2017
%%Pages: 1
%%BoundingBox: 0 0 612 792
%%DocumentNeededResources: font Helvetica Helvetica-Bold Times-Roman Symbol 
%%EndComments
%%BeginProlog
%
%  PostScript prolog for output from xcircuit
%  Version: 3.8
%
%  Electrical circuit (and otherwise general) drawing program
%
%  Written by Tim Edwards 8/5/93--11/1/10  (tim.edwards@multigig.com)
%  The Johns Hopkins University (1993-2004)
%  MultiGiG, Inc. (2004-2012)
%
%%BeginResource: procset XCIRCproc 3.8 0
%
% supporting definitions --- these are the primary xcircuit types.

/XCIRCsave save def
/topmat matrix currentmatrix def

/fontslant { /slant exch def [1 0 slant 1 0 0] 
    exch findfont exch makefont dup length dict /ndict exch def
    { 1 index /FID ne { ndict 3 1 roll put } { pop pop } ifelse } forall
    ndict definefont pop} def
/ul { dup type /stringtype eq showflag 1 eq and { gsave 
   currentpoint topmat setmatrix 0 0 moveto 2 index stringwidth pop (_)
   false charpath flattenpath pathbbox grestore exch pop 1 index
   sub setlinewidth exch pop currentpoint 3 -1 roll add moveto 0
   rlineto stroke moveto } if } def
/ol { dup type /stringtype eq showflag 1 eq and { gsave gsave
   currentpoint topmat setmatrix 2 index stringwidth pop 3 index
   true charpath flattenpath pathbbox grestore exch pop
   exch pop topmat setmatrix (_) true charpath pathbbox grestore
   exch pop 1 index sub setlinewidth exch pop currentpoint
   exch 4 1 roll exch sub add moveto pop 0 rlineto stroke
   moveto } if } def
/stW { gsave currentpoint newpath moveto true charpath flattenpath
	pathbbox pop exch pop sub grestore } def
/Ts {mark Tabs aload pop counttomark 1 add array astore /Tabs exch def Tabs
	0 currentpoint pop put} def
/Tbn {mark Tabs aload pop counttomark dup 2 add 1 roll cleartomark 1 sub} def
/Tb { 0 1 Tbn {Tabs exch get dup currentpoint pop lt
	{currentpoint exch pop moveto exit} {pop} ifelse } for } def
/Tf { Tbn -1 0 {Tabs exch get dup currentpoint pop gt
	{currentpoint exch pop moveto exit} {pop} ifelse } for } def
/qS { (aa) stW (a a) stW sub 4 div 0 Kn } def
/hS { qS qS } def
/pspc 0 def
/cf0 { scalefont setfont } bind def
/Kn { dup kY add /kY exch def rmoveto } bind def
/ss { /fscale fscale 0.67 mul def currentfont 0.67 cf0 0 fscale0 fscale mul
	0.33 mul neg Kn} def
/Ss { /fscale fscale 0.67 mul def currentfont 0.67 cf0 0 fscale0 fscale mul
	0.67 mul Kn } def
/ns { 0 kY neg Kn /kY 0 def /fscale 1.0 def xfont0 1.0 cf0 } def
/MR { /twidth exch def } def
/CR { ns 0 /Bline Bline fscale0 neg add def Bline moveto } def
/cf { dup type /realtype ne {1.0} if exch findfont exch kY 0 eq
	{ 40 mul dup /fscale0 exch def cf0 /xfont0 currentfont def}
	{fscale0 mul fscale mul cf0} ifelse } def
/ctmk { counttomark dup 2 add -1 roll pop } bind def
/label { gsave translate 0 0 moveto dup scale neg
	/rotval exch def /twidth 100000 def /just exch def just 384 and
	0 gt {/mshow {pop} def} {/mshow {show} def} ifelse just 16 and 0
	gt {gsave rotval rotate 0 1 dtransform gsave pagemat setmatrix
	idtransform exch grestore 1 0 dtransform gsave pagemat setmatrix
	idtransform exch grestore dup abs 1e-9 lt {pop mul 0 gt} {3 1 roll
	pop pop 0 lt} ifelse grestore {-1 /rotval rotval neg def /just just
	dup 3 and 1 ne {3 xor} if def} {1} ifelse exch -1e-9 lt {-1 /rotval
	rotval neg def /just just dup 12 and 4 ne {12 xor} if def} {1}
	ifelse scale } if /showflag 0 def /fspc pspc def /Bline 0 def /Tabs
	0 array def /fscale 1.0 def /kY 0 def gsave dup 1 add copy dup
	1 0 dtransform exch atan rotate {exch dup type /stringtype eq {gsave
        dup gsave newpath 0 0 moveto true charpath flattenpath pathbbox pop
	exch pop exch pop grestore currentpoint pop add twidth
	ge {grestore CR exch 1 add dup 2 add {CR} exch 1 roll exch} {grestore}
	ifelse true charpath flattenpath} {dup type /arraytype eq {exec} {12
	string cvs true charpath flattenpath} ifelse} ifelse} repeat exch pop
	pathbbox grestore 3 -1 roll pop 3 1 roll just 1 and 0 gt {just 2 and
	0 gt {exch pop neg fspc sub} {exch sub 0.5 mul neg} ifelse} {pop neg
	fspc add} ifelse exch Bline exch just 4 and 0 gt {just 8 and 0 gt
	{exch pop neg fspc sub} {add 0.5 mul neg} ifelse} {pop neg fspc add}
	ifelse rotval rotate Kn currentpoint translate /showflag 1 def /Bline
	0 def /Tabs 0 array def /fscale 1.0 def /kY 0 def {dup type
	/stringtype eq {mshow} {dup type /arraytype eq {exec} {12 string cvs
	mshow} ifelse} ifelse} repeat grestore endclip} def
/pinlabel { 4 index 32 and 0 ne hlevel 0 eq or { /pspc 10 def label
	/pspc 0 def } { pop pop pop pop pop {pop} repeat } ifelse } def
/pinglobal { pinlabel } def
/infolabel { pinlabel } def
/graphic { gsave 4 index cvx exec /DataSource get resetfile translate 0 0
	moveto neg rotate dup scale cvx exec image grestore endclip} def

/scb { setrgbcolor } bind def  /sce { defColor aload pop scb } bind def
/cRedef {/defColor currentcolor 3 array astore def} def
/begingate {dup type /dicttype ne {1 dict} if begin	% default params
	dup type /dicttype ne {1 dict} if begin		% instanced params
	/hlevel hlevel 1 add def /defColor currentcolor sce 3 array astore
	def gsave sce translate 0 0 moveto neg rotate dup type /nametype
	eq not { dup abs currentlinewidth exch div setlinewidth } { pop }
	ifelse dup abs scale clipped 1 and 1 eq {/clipped clipped 1 add def}
	if} bind def
/endgate { /hlevel hlevel 1 sub def grestore defColor aload pop cRedef
	scb end end endclip} bind def

/hlevel 0 def
/endclip {clipped 1 and 1 eq {grestore /clipped clipped 1 sub def} if} def
/tmpa [1 0 0 1 0 0] def
/gar {8 8 true tmpa {<c0 c0 00 00 0c 0c 00 00>} imagemask} bind
{8 8 true tmpa {<30 70 60 02 03 07 06 20>} imagemask} bind
{8 8 true tmpa {<0c 1e 1e 0c c0 e1 e1 c0>} imagemask} bind
{8 8 true tmpa {<0f 0f 0f 0f f0 f0 f0 f0>} imagemask} bind
{8 8 true tmpa {<3f f3 e1 e1 f3 3f 1e 1e>} imagemask} bind
{8 8 true tmpa {<df cf 8f 9f fd fc f8 f9>} imagemask} bind
{8 8 true tmpa {<ff 3f 3f ff ff f3 f3 ff>} imagemask} bind 7 array astore def
/ppaint { gsave clip tmpa dup setmatrix pathbbox neg exch neg 4 2 roll
  neg 4 -1 roll 2 copy gt {exch} if 8 div ceiling 8 mul 4 2 roll neg 2 copy
  gt {exch} if 8 div ceiling 8 mul 3 -1 roll -8 5 -1 roll
  { 3 index exch 5 exch put dup -8 3 index { 3 index
  exch 4 exch put 3 index exec } for } for pop pop pop pop grestore } bind def
/setstyles {
  currentlinewidth mul setlinewidth /style exch def style 2048 and 0 gt
  clipped 1 and 0 eq and {clip newpath /clipped clipped 1 add def} {
  style 1 and 0 gt not {closepath} if
  style 1024 and 0 gt {2 setlinecap 0 setlinejoin} if
  style 2 and 0 gt {currentlinewidth 4 mul dup 2 array astore 0 setdash} if
  style 4 and 0 gt {0.5 currentlinewidth 4 mul 2 array astore 0 setdash} if
  gsave style 16 and 0 gt { style 224 and -5 bitshift style 256 and 0 gt {
  7 exch sub 8 div dup 1 exch sub currentrgbcolor 3 array astore
  {3 copy mul add 4 1 roll pop} forall pop pop setrgbcolor eofill}
  {dup 7 lt {gar exch get ppaint} {pop eofill} ifelse} ifelse}
  {style 256 and 0 gt {1 setgray eofill} if} ifelse grestore style 8 and 0 gt 
  style 512 eq or {newpath} {stroke} ifelse grestore endclip} ifelse} def     

/addtoy {exch dup dup 2 mul 3 add 1 roll -1 1 { 4 1 roll dup 4 1 roll add
	4 -1 roll 2 mul 1 add index 2 mul 2 add 2 roll} for pop} def
/addtoy1 {1 exch addtoy pop} def
/addtoy3 {3 exch addtoy pop} def
/addtoy4 {4 exch addtoy pop} def
/addtox {exch dup dup 2 mul 3 add 1 roll -1 1 { 4 1 roll dup 4 1 roll 3 -1 roll
	add exch 4 -1 roll 2 mul 1 add index 2 mul 2 add 2 roll} for pop} def
/addtox1 {1 exch addtox pop} def
/addtox3 {3 exch addtox pop} def
/addtox4 {4 exch addtox pop} def
/polygon { gsave /num exch def moveto num 1 sub {lineto} repeat setstyles } def
/xcarc   { gsave newpath arc setstyles } def
/elb { matrix currentmatrix 7 -1 roll 7 -1 roll translate 5 1 roll 4 -1 roll
	3 index div 1 scale } def
/ele { 0 4 1 roll 0 4 1 roll } bind def
/ellipse { gsave elb newpath ele arc setmatrix setstyles } def
/pellip  { elb ele arc setmatrix } def
/nellip  { elb ele arcn setmatrix } def
/spline  { gsave moveto curveto setstyles } def
/polyc   { {lineto} repeat } bind def
/beginpath { gsave moveto } bind def
/endpath { setstyles } bind def
/bop	 { 1 setlinecap 2 setlinejoin 6 setmiterlimit 0 0 0 scb cRedef
	/clipped 0 def} def
/psinsertion {/PSobj save def /showpage {} def /setpagedevice {pop} def bop
	rotate translate dup scale} def
/end_insert {PSobj restore} def
/setpagemat {/pagemat matrix currentmatrix def} def
/inchscale  {setpagemat 0.375 mul dup scale} def
/cmscale    {setpagemat 0.35433071 mul dup scale} def

%%EndResource
%%EndProlog

% XCircuit output starts here.

%%BeginSetup

/::PIC16C54 {
<</@v1 (?) >> begingate
0 1.000 0 0 0 736 480 736 480 0 4 polygon
(PIC16C54A) {/Helvetica-Bold cf} 2 21 0 1.000 240 320 label
(Vdd) {/Helvetica cf} 2 23 0 1.000 464 368 label
(RA2) {/Helvetica cf} 2 20 0 1.000 16 688 label
(RA3) {/Helvetica cf} 2 20 0 1.000 16 624 label
(RTCC) {/Helvetica cf} 2 20 0 1.000 16 560 label
(MCLR) {ol} {/Helvetica cf} 3 20 0 1.000 16 496 label
(Vss) {/Helvetica cf} 2 20 0 1.000 16 368 label
(RB0) {/Helvetica cf} 2 20 0 1.000 16 240 label
(RB1) {/Helvetica cf} 2 20 0 1.000 16 176 label
(RB2) {/Helvetica cf} 2 20 0 1.000 16 112 label
(RB3) {/Helvetica cf} 2 20 0 1.000 16 48 label
(RB4) {/Helvetica cf} 2 23 0 1.000 464 48 label
(RB5) {/Helvetica cf} 2 23 0 1.000 464 112 label
(RB6) {/Helvetica cf} 2 23 0 1.000 464 176 label
(RB7) {/Helvetica cf} 2 23 0 1.000 464 240 label
(OSC2/CLKOUT) {/Helvetica cf} 2 23 0 1.000 464 496 label
(OSC1/CLKIN) {/Helvetica cf} 2 23 0 1.000 464 560 label
(RA0) {/Helvetica cf} 2 23 0 1.000 464 624 label
(RA1) {/Helvetica cf} 2 23 0 1.000 464 688 label
0.180 0.545 0.341 scb
mark @v1 (pcb:U) {/Helvetica cf} ctmk 21 0 1.000 224 256 infolabel
1.000 0.000 0.000 scb
(1) {/Helvetica cf} 2 23 0 1.000 0 688 pinlabel
(2) {/Helvetica cf} 2 23 0 1.000 0 624 pinlabel
(3) {/Helvetica cf} 2 23 0 1.000 0 560 pinlabel
(4) {/Helvetica cf} 2 23 0 1.000 0 496 pinlabel
(5) {/Helvetica cf} 2 23 0 1.000 0 368 pinlabel
(6) {/Helvetica cf} 2 23 0 1.000 0 240 pinlabel
(7) {/Helvetica cf} 2 23 0 1.000 0 176 pinlabel
(8) {/Helvetica cf} 2 23 0 1.000 0 112 pinlabel
(9) {/Helvetica cf} 2 23 0 1.000 0 48 pinlabel
(10) {/Helvetica cf} 2 20 0 1.000 480 48 pinlabel
(11) {/Helvetica cf} 2 20 0 1.000 480 112 pinlabel
(12) {/Helvetica cf} 2 20 0 1.000 480 176 pinlabel
(13) {/Helvetica cf} 2 20 0 1.000 480 240 pinlabel
(14) {/Helvetica cf} 2 20 0 1.000 480 368 pinlabel
(15) {/Helvetica cf} 2 20 0 1.000 480 496 pinlabel
(16) {/Helvetica cf} 2 20 0 1.000 480 560 pinlabel
(17) {/Helvetica cf} 2 20 0 1.000 480 624 pinlabel
(18) {/Helvetica cf} 2 20 0 1.000 480 688 pinlabel
endgate
} def

/::LTC490 {
<</@footprint (dip\(8\)) /@v1 (?) >> begingate
0 1.000 0 0 0 384 416 384 416 0 4 polygon
(RS422) {/Helvetica cf} 2 21 0 1.000 192 176 label
(Transciever) {/Helvetica cf} 2 21 0 1.000 208 128 label
(LTC490) {/Helvetica-Bold cf} 2 21 0 1.000 192 256 label
(Vcc) {/Helvetica cf} 2 20 0 1.000 16 336 label
(R) {/Helvetica cf} 2 20 0 1.000 16 240 label
(D) {/Helvetica cf} 2 20 0 1.000 16 144 label
(GND) {/Helvetica cf} 2 20 0 1.000 16 48 label
(Y) {/Helvetica cf} 2 23 0 1.000 400 48 label
(Z) {/Helvetica cf} 2 23 0 1.000 400 144 label
(B) {/Helvetica cf} 2 23 0 1.000 400 240 label
(A) {/Helvetica cf} 2 23 0 1.000 400 336 label
0.180 0.545 0.341 scb
mark @v1 (pcb:U) {/Helvetica cf} ctmk 21 0 1.000 208 80 infolabel
1.000 0.000 0.000 scb
(1) {/Helvetica cf} 2 23 0 1.000 0 336 pinlabel
(2) {/Helvetica cf} 2 23 0 1.000 0 240 pinlabel
(3) {/Helvetica cf} 2 23 0 1.000 0 144 pinlabel
(4) {/Helvetica cf} 2 23 0 1.000 0 48 pinlabel
(5) {/Helvetica cf} 2 20 0 1.000 416 48 pinlabel
(6) {/Helvetica cf} 2 20 0 1.000 416 144 pinlabel
(7) {/Helvetica cf} 2 20 0 1.000 416 240 pinlabel
(8) {/Helvetica cf} 2 20 0 1.000 416 336 pinlabel
endgate
} def

/::terminal_block {
<</@v1 (?) >> begingate
0 1.000 -160 -80 -160 48 160 48 160 -80 4 polygon
(ED100/3DS) {/Helvetica cf} 2 21 0 1.000 0 80 label
1 1.000 0 -16 32 0.000 360.000 xcarc
1 1.000 96 -16 32 0.000 360.000 xcarc
1 1.000 -96 -16 32 0.000 360.000 xcarc
0.180 0.545 0.341 scb
mark @v1 (pcb:J) {/Helvetica cf} ctmk 21 0 1.000 0 -112 infolabel
1.000 0.000 0.000 scb
(1) {/Helvetica cf} 2 25 0 1.000 -96 -16 pinlabel
(2) {/Helvetica cf} 2 25 0 1.000 0 -16 pinlabel
(3) {/Helvetica cf} 2 25 0 1.000 96 -16 pinlabel
endgate
} def

/::LTC1152 {
<</@v1 (?) >> begingate
0 1.000 -192 -192 -192 192 192 192 192 -192 4 polygon
(LTC1152) {/Helvetica-Bold cf} 2 25 0 1.000 0 48 label
(Op-amp) {/Helvetica cf} 2 29 0 1.000 0 0 label
(SHDN) {/Helvetica cf} 2 20 0 1.000 -176 144 label
(IN) {/Helvetica cf} (-) {/Symbol cf} 4 20 0 1.000 -176 48 label
(IN) {/Helvetica cf} (+) {/Symbol cf} 4 20 0 1.000 -176 -48 label
(-) {/Symbol cf} (V) {/Helvetica cf} 4 20 0 1.000 -176 -144 label
(COMP) {/Helvetica cf} 2 23 0 1.000 176 -144 label
(OUT) {/Helvetica cf} 2 23 0 1.000 176 -48 label
(+) {/Symbol cf} (V) {/Helvetica cf} 4 23 0 1.000 176 48 label
(CP) {/Helvetica cf} 2 23 0 1.000 176 144 label
0.180 0.545 0.341 scb
mark @v1 (pcb:U) {/Helvetica cf} ctmk 21 0 1.000 0 -80 infolabel
1.000 0.000 0.000 scb
(1) {/Helvetica cf} 2 23 0 1.000 -192 144 pinlabel
(2) {/Helvetica cf} 2 23 0 1.000 -192 48 pinlabel
(3) {/Helvetica cf} 2 23 0 1.000 -192 -48 pinlabel
(5) {/Helvetica cf} 2 20 0 1.000 192 -144 pinlabel
(4) {/Helvetica cf} 2 23 0 1.000 -192 -144 pinlabel
(6) {/Helvetica cf} 2 20 0 1.000 192 -48 pinlabel
(7) {/Helvetica cf} 2 20 0 1.000 192 48 pinlabel
(8) {/Helvetica cf} 2 20 0 1.000 192 144 pinlabel
endgate
} def

/::DSUB9 {
<</@footprint (db9f) /@v1 (?) >> begingate
1 1.000 -128 96 16 0.000 360.000 xcarc
1 1.000 -32 32 16 0.000 360.000 xcarc
1 1.000 0 96 16 0.000 360.000 xcarc
1 1.000 64 96 16 0.000 360.000 xcarc
1 1.000 128 96 16 15.000 375.000 xcarc
1 1.000 96 32 16 0.000 360.000 xcarc
1 1.000 32 32 16 0.000 360.000 xcarc
1 1.000 -64 96 16 0.000 360.000 xcarc
1 1.000 -96 32 16 0.000 360.000 xcarc
0.180 0.545 0.341 scb
mark @v1 (pcb:J) {/Helvetica cf} ctmk 21 0 1.000 16 -48 infolabel
sce
128 128 beginpath
145 127 160 113 160 96 curveto
159 91 158 86 156 81 curveto
124 17 1 polyc
119 
6 108 0 96 0 curveto
-96 0 1 polyc
-108 0 -119 6 -124 17 curveto
-156 81 1 polyc
-164 97 -158 
116 -142 124 curveto
-137 126 -132 128 -128 128 curveto
128 128 1 polyc
1 1.000 endpath
(AMP 745781-4) {/Helvetica cf} 2 25 0 1.000 0 160 label
1.000 0.000 0.000 scb
(1) {/Helvetica cf} 2 25 0 1.000 -128 96 pinlabel
(3) {/Helvetica cf} 2 25 0 1.000 0 96 pinlabel
(2) {/Helvetica cf} 2 25 0 1.000 -64 96 pinlabel
(4) {/Helvetica cf} 2 25 0 1.000 64 96 pinlabel
(5) {/Helvetica cf} 2 25 0 1.000 128 96 pinlabel
(6) {/Helvetica cf} 2 29 0 1.000 -96 32 pinlabel
(7) {/Helvetica cf} 2 29 0 1.000 -32 32 pinlabel
(8) {/Helvetica cf} 2 29 0 1.000 32 32 pinlabel
(9) {/Helvetica cf} 2 29 0 1.000 96 32 pinlabel
endgate
} def

/::Crystal {
<</@v1 (?) >> begingate
0 1.000 -144 -144 -144 144 144 144 144 -144 4 polygon
(CTX169) {/Helvetica-Bold cf} 2 25 0 1.000 0 16 label
(MHz) {hS} (20) {/Helvetica cf} 4 21 0 1.000 0 -32 label
(N/C) {/Helvetica cf} 2 20 0 1.000 -128 96 label
(GND) {/Helvetica cf} 2 20 0 1.000 -128 -96 label
(OUT) {/Helvetica cf} 2 23 0 1.000 128 -96 label
(Vdd) {/Helvetica cf} 2 23 0 1.000 128 96 label
0.180 0.545 0.341 scb
mark @v1 (pcb:X) {/Helvetica cf} ctmk 21 0 1.000 0 -176 infolabel
1.000 0.000 0.000 scb
(1) {/Helvetica cf} 2 23 0 1.000 -144 96 pinlabel
(2) {/Helvetica cf} 2 23 0 1.000 -144 -96 pinlabel
(3) {/Helvetica cf} 2 20 0 1.000 144 -96 pinlabel
(4) {/Helvetica cf} 2 20 0 1.000 144 96 pinlabel
endgate
} def

/::ADC12138 {
<</@v1 (?) >> begingate
0 1.000 -240 -464 -240 464 240 464 240 -464 4 polygon
(CH0) {/Helvetica cf} 2 20 0 1.000 -224 416 label
(CH1) {/Helvetica cf} 2 20 0 1.000 -224 352 label
(CH2) {/Helvetica cf} 2 20 0 1.000 -224 288 label
(CH3) {/Helvetica cf} 2 20 0 1.000 -224 224 label
(CH4) {/Helvetica cf} 2 20 0 1.000 -224 160 label
(CH5) {/Helvetica cf} 2 20 0 1.000 -224 96 label
(CH6) {/Helvetica cf} 2 20 0 1.000 -224 32 label
(CH7) {/Helvetica cf} 2 20 0 1.000 -224 -32 label
(COM) {/Helvetica cf} 2 20 0 1.000 -224 -96 label
(MuxOut1) {/Helvetica cf} 2 20 0 1.000 -224 -160 label
(A/Din2) {/Helvetica cf} 2 20 0 1.000 -224 -352 label
(DGND) {/Helvetica cf} 2 20 0 1.000 -224 -416 label
(+) {/Symbol cf} (VA) {/Helvetica cf} 4 23 0 1.000 224 -416 label
(-) {/Symbol cf} (Vref) {/Helvetica cf} 4 23 0 1.000 224 -352 label
(+) {/Symbol cf} (Vref) {/Helvetica cf} 4 23 0 1.000 224 -288 label
(AGND) {/Helvetica cf} 2 23 0 1.000 224 -224 label
(PD) {/Helvetica cf} 2 23 0 1.000 224 -160 label
(EOC) {/Helvetica cf} 2 23 0 1.000 224 -96 label
(CONV) {ol} {/Helvetica cf} 3 23 0 1.000 224 -32 label
(CS) {ol} {/Helvetica cf} 3 23 0 1.000 224 32 label
(DO) {/Helvetica cf} 2 23 0 1.000 224 96 label
(DI) {/Helvetica cf} 2 23 0 1.000 224 160 label
(SCLK) {/Helvetica cf} 2 23 0 1.000 224 224 label
(A/Din1) {/Helvetica cf} 2 20 0 1.000 -224 -224 label
(MuxOut2) {/Helvetica cf} 2 20 0 1.000 -224 -288 label
(CCLK) {/Helvetica cf} 2 23 0 1.000 224 288 label
(DOR) {ol} {/Helvetica cf} 3 23 0 1.000 224 352 label
(+) {/Symbol cf} (VD) {/Helvetica cf} 4 23 0 1.000 224 416 label
(ADC12138) {/Helvetica-Bold cf} 2 21 0 1.000 0 64 label
0.180 0.545 0.341 scb
mark @v1 (pcb:U) {/Helvetica cf} ctmk 21 0 1.000 0 0 infolabel
1.000 0.000 0.000 scb
(1) {/Helvetica cf} 2 23 0 1.000 -240 416 pinlabel
(2) {/Helvetica cf} 2 23 0 1.000 -240 352 pinlabel
(3) {/Helvetica cf} 2 23 0 1.000 -240 288 pinlabel
(4) {/Helvetica cf} 2 23 0 1.000 -240 224 pinlabel
(5) {/Helvetica cf} 2 23 0 1.000 -240 160 pinlabel
(6) {/Helvetica cf} 2 23 0 1.000 -240 96 pinlabel
(7) {/Helvetica cf} 2 23 0 1.000 -240 32 pinlabel
(8) {/Helvetica cf} 2 23 0 1.000 -240 -32 pinlabel
(9) {/Helvetica cf} 2 23 0 1.000 -240 -96 pinlabel
(10) {/Helvetica cf} 2 23 0 1.000 -240 -160 pinlabel
(11) {/Helvetica cf} 2 23 0 1.000 -240 -224 pinlabel
(12) {/Helvetica cf} 2 23 0 1.000 -240 -288 pinlabel
(13) {/Helvetica cf} 2 23 0 1.000 -240 -352 pinlabel
(14) {/Helvetica cf} 2 23 0 1.000 -240 -416 pinlabel
(15) {/Helvetica cf} 2 20 0 1.000 240 -416 pinlabel
(16) {/Helvetica cf} 2 20 0 1.000 240 -352 pinlabel
(17) {/Helvetica cf} 2 20 0 1.000 240 -288 pinlabel
(18) {/Helvetica cf} 2 20 0 1.000 240 -224 pinlabel
(19) {/Helvetica cf} 2 20 0 1.000 240 -160 pinlabel
(20) {/Helvetica cf} 2 20 0 1.000 240 -96 pinlabel
(21) {/Helvetica cf} 2 20 0 1.000 240 -32 pinlabel
(22) {/Helvetica cf} 2 20 0 1.000 240 32 pinlabel
(23) {/Helvetica cf} 2 20 0 1.000 240 96 pinlabel
(24) {/Helvetica cf} 2 20 0 1.000 240 160 pinlabel
(25) {/Helvetica cf} 2 20 0 1.000 240 224 pinlabel
(26) {/Helvetica cf} 2 20 0 1.000 240 288 pinlabel
(27) {/Helvetica cf} 2 20 0 1.000 240 352 pinlabel
(28) {/Helvetica cf} 2 20 0 1.000 240 416 pinlabel
endgate
} def

/::TK11950 {
<</@v1 (?) >> begingate
0 1.000 -336 -112 -336 112 336 112 336 -112 4 polygon
(NOISE BYPASS) {/Helvetica cf} 2 20 0 1.000 -320 64 label
(CONTROL) {/Helvetica cf} 2 20 0 1.000 -320 0 label
(RESET OUT) {/Helvetica cf} 2 20 0 1.000 -320 -64 label
(VO) {/Helvetica cf} 2 23 0 1.000 320 -64 label
(GND) {/Helvetica cf} 2 23 0 1.000 320 0 label
(VIN) {/Helvetica cf} 2 23 0 1.000 320 64 label
(TK11950) {/Helvetica-Bold cf} 2 21 0 1.000 64 16 label
(V) {hS} (5.0) {/Helvetica cf} 4 29 0 1.000 64 -32 label
0.180 0.545 0.341 scb
mark @v1 (pcb:U) {/Helvetica cf} ctmk 21 0 1.000 0 -144 infolabel
1.000 0.000 0.000 scb
(1) {/Helvetica cf} 2 23 0 1.000 -336 64 pinlabel
(2) {/Helvetica cf} 2 23 0 1.000 -336 0 pinlabel
(3) {/Helvetica cf} 2 23 0 1.000 -336 -64 pinlabel
(4) {/Helvetica cf} 2 20 0 1.000 336 -64 pinlabel
(5) {/Helvetica cf} 2 20 0 1.000 336 0 pinlabel
(6) {/Helvetica cf} 2 20 0 1.000 336 64 pinlabel
endgate
} def

/analoglib3::Capacitor {
<</p_yps1 16 /p_xps1 48 /p_yps -16 /p_xps 48 /@class (C) /@value (1.0) /@units 
(p) /@index (?) /p_jst 20 /p_rot 0 >> begingate
1 1.000 0 -64 0 -6 2 polygon
1 1.000 0 64 0 6 2 polygon
1 1.000 -32 6 32 6 2 polygon
1.000 0.000 0.000 scb
(1) {/Times-Roman cf} 2 9 0 1.000 0 64 pinlabel
(2) {/Times-Roman cf} 2 13 0 1.000 0 -64 pinlabel
0.180 0.545 0.341 scb
mark @units @value ( %p1 %p2 ) @index @class (spice:) {/Times-Roman cf} ctmk 4 
0 1.000 -208 -160 infolabel
(sim:e %p1 %p2) {/Times-Roman cf} 2 4 0 1.000 -208 -208 infolabel
0.647 0.165 0.165 scb
mark (F) @units {hS} @value {/Times-Roman cf} ctmk p_jst p_rot 0.700 p_xps 
p_yps label
0.180 0.545 0.341 scb
mark @index @class (pcb:) {/Times-Roman cf} ctmk 20 0 1.000 -208 -256 infolabel
0.000 0.000 1.000 scb
mark @index @class {/Times-Roman cf} ctmk 20 p_rot 0.700 p_xps1 p_yps1 label
sce
1 1.000 -32 -6 32 -6 2 polygon
endgate
} def

/::LM13700 {
<</@v1 (?) >> begingate
0 1.000 -256 -256 -256 288 224 288 224 -256 4 polygon
(BufIn1) {/Helvetica cf} 2 20 0 1.000 -240 -144 label
(BufOut1) {/Helvetica cf} 2 20 0 1.000 -240 -208 label
(BufIn2) {/Helvetica cf} 2 23 0 1.000 208 -144 label
(+) {/Symbol cf} (V) {/Helvetica cf} 4 23 0 1.000 208 -80 label
(Out2) {/Helvetica cf} 2 23 0 1.000 208 -16 label
1.000 0.000 0.000 scb
(7) {/Helvetica cf} 2 23 0 1.000 -256 -144 pinlabel
(8) {/Helvetica cf} 2 23 0 1.000 -256 -208 pinlabel
(10) {/Helvetica cf} 2 20 0 1.000 224 -144 pinlabel
(11) {/Helvetica cf} 2 20 0 1.000 224 -80 pinlabel
(12) {/Helvetica cf} 2 20 0 1.000 224 -16 pinlabel
sce
(LM13700) {/Helvetica-Bold cf} 2 21 0 1.000 -16 16 label
(Iabc1) {/Helvetica cf} 2 20 0 1.000 -240 240 label
(Dbias1) {/Helvetica cf} 2 20 0 1.000 -240 176 label
(1) {/Helvetica cf} (+) {/Symbol cf} (In) {/Helvetica cf} 6 20 0 1.000 -240 112 
label
(Out1) {/Helvetica cf} 2 20 0 1.000 -240 -16 label
1.000 0.000 0.000 scb
(1) {/Helvetica cf} 2 23 0 1.000 -256 240 pinlabel
(2) {/Helvetica cf} 2 23 0 1.000 -256 176 pinlabel
(3) {/Helvetica cf} 2 23 0 1.000 -256 112 pinlabel
(4) {/Helvetica cf} 2 23 0 1.000 -256 48 pinlabel
(5) {/Helvetica cf} 2 23 0 1.000 -256 -16 pinlabel
(14) {/Helvetica cf} 2 20 0 1.000 224 112 pinlabel
(15) {/Helvetica cf} 2 20 0 1.000 224 176 pinlabel
(16) {/Helvetica cf} 2 20 0 1.000 224 240 pinlabel
sce
(-) {/Symbol cf} (V) {/Helvetica cf} 4 20 0 1.000 -240 -80 label
1.000 0.000 0.000 scb
(6) {/Helvetica cf} 2 23 0 1.000 -256 -80 pinlabel
(13) {/Helvetica cf} 2 20 0 1.000 224 48 pinlabel
sce
(BufOut2) {/Helvetica cf} 2 23 0 1.000 208 -208 label
1.000 0.000 0.000 scb
(9) {/Helvetica cf} 2 20 0 1.000 224 -208 pinlabel
sce
(1) {/Helvetica cf} (-) {/Symbol cf} (In) {/Helvetica cf} 6 20 0 1.000 -240 48 
label
(Iabc2) {/Helvetica cf} 2 23 0 1.000 208 240 label
(Dbias2) {/Helvetica cf} 2 23 0 1.000 208 176 label
(2) {/Helvetica cf} (+) {/Symbol cf} (In) {/Helvetica cf} 6 23 0 1.000 208 112 
label
(2) {/Helvetica cf} (-) {/Symbol cf} (In) {/Helvetica cf} 6 23 0 1.000 208 48 
label
0.180 0.545 0.341 scb
mark @v1 (pcb:U) {/Helvetica cf} ctmk 21 0 1.000 -16 -304 infolabel
endgate
} def

/analoglib3::Resistor {
<</@class (R) /@value (1.0) /@units (k) /@index (?) /p_jst 20 /p_rot 0 /p_xps 
32 /p_yps -16 /p_xps1 32 /p_yps1 16 >> begingate
1 1.000 0 64 0 36 2 polygon
1 1.000 0 -64 0 -36 2 polygon
1 1.000 0 -36 14 -30 -14 -18 14 -6 -14 6 14 18 -14 30 0 36 8 polygon
1.000 0.000 0.000 scb
(1) {/Times-Roman cf} 2 9 0 1.000 0 64 pinlabel
(2) {/Times-Roman cf} 2 13 0 1.000 0 -64 pinlabel
0.180 0.545 0.341 scb
mark @units @value ( %p1 %p2 ) @index @class (spice:) {/Times-Roman cf} ctmk 4 
0 1.000 -208 -160 infolabel
mark @index @class (pcb:) {/Times-Roman cf} ctmk 20 0 1.000 -208 -256 infolabel
(sim:r %p1 %p2) {/Times-Roman cf} 2 4 0 1.000 -208 -208 infolabel
0.647 0.165 0.165 scb
mark (W) {/Symbol cf} @units {hS} @value {/Times-Roman cf} ctmk p_jst p_rot 
0.700 p_xps p_yps label
0.000 0.000 1.000 scb
mark @index @class {/Times-Roman cf} ctmk p_jst p_rot 0.700 p_xps1 p_yps1 label
endgate
} def

/analog::gnd {
% trivial
begingate
1 1.000 0 0 0 -32 2 polygon
1 1.000 -32 -32 32 -32 2 polygon
1 1.000 -18 -46 18 -46 2 polygon
1 1.000 -4 -60 4 -60 2 polygon
0.933 0.604 0.000 scb
(GND) {/Times-Roman cf} 2 1 0 1.000 0 0 pinglobal
endgate
} def

/generic::dot {
% trivial
begingate
248 1.000 0 0 6 0.000 360.000 xcarc
1.000 0.000 0.000 scb
(x) {/Times-Roman cf} 2 29 0 1.000 0 0 pinlabel
endgate
} def

/analog::vdd {
% trivial
begingate
1 1.000 0 0 0 32 2 polygon
1 1.000 -32 32 32 32 2 polygon
(Vdd) {/Times-Roman cf} 2 17 0 0.900 0 38 label
0.933 0.604 0.000 scb
(Vdd) {/Times-Roman cf} 2 13 0 1.000 0 0 pinglobal
endgate
} def


%%EndSetup

%%Page: FlareLED 1
%%PageOrientation: Portrait
%%PageBoundingBox: 0 0 612 792
/pgsave save def bop
1.0000 inchscale
2.6000 setlinewidth 1671 848 translate

1.000 0 -1024 800 <</@v1 (5) >> ::PIC16C54
1.000 180 -1712 1536 <</@v1 (6) >> ::LTC490
1.000 0 -976 -1008 <</@v1 (2) >> ::terminal_block
1.000 0 112 96 <</@v1 (7) >> ::LTC1152
1.000 0 -2256 448 <</@v1 (3) >> ::DSUB9
1.000 180 -112 1344 <</@v1 (1) >> ::Crystal
1.000 0 -784 240 <</@v1 (2) >> ::ADC12138
-1.000 180 -1744 816 <</@v1 (4) >> ::TK11950
1 1.000 -256 1440 -384 1440 -384 1360 -544 1360 4 polygon
-1.000 0 384 320 analoglib3::Capacitor
1.000 0 -768 -544 <</@v1 (1) >> ::LM13700
1.000 0 -592 -1008 <</@v1 (1) >> ::terminal_block
1.000 0 -368 576 analoglib3::Resistor
1.000 0 -1568 1136 analoglib3::Resistor
1.000 0 -1360 608 analoglib3::Resistor
-1.000 0 -2384 1216 analoglib3::Resistor
1.000 0 -1280 752 analoglib3::Resistor
1.000 0 -304 144 analoglib3::Resistor
1.000 0 96 1376 analoglib3::Capacitor
-1.000 0 -176 -128 analoglib3::Capacitor
1.000 0 400 -16 analoglib3::Capacitor
1.000 0 -1968 608 analoglib3::Capacitor
1.000 0 -1184 -432 analoglib3::Capacitor
1 1.000 -1024 -304 -1184 -304 -1184 -368 3 polygon
1 1.000 -1184 -496 -1184 -624 -1024 -624 3 polygon
1 1.000 -2352 480 -2352 -624 -1184 -624 3 polygon
1.000 0 -2352 -624 analog::gnd
1 1.000 -1024 -688 -2160 -688 -2160 480 3 polygon
1 1.000 -2384 1152 -2384 544 2 polygon
1 1.000 -2128 1392 -2192 1392 -2192 544 3 polygon
1 1.000 -2128 1488 -2256 1488 -2256 544 3 polygon
1 1.000 -1408 816 -1280 816 -1280 1488 -1712 1488 4 polygon
1 1.000 -1712 1200 -1344 1200 2 polygon
1 1.000 -1344 1200 -1344 880 -1408 880 3 polygon
1 1.000 -1360 672 -1360 752 -1408 752 3 polygon
1 1.000 -1280 816 -1280 816 2 polygon
1 1.000 -1360 672 -1280 672 -1280 688 3 polygon
-1.000 180 16 912 <</@v1 (3) >> ::TK11950
1 1.000 -544 -112 -336 -112 2 polygon
1.000 0 -336 -112 generic::dot
1 1.000 -80 48 -304 48 -304 80 3 polygon
1 1.000 -80 240 -304 240 -304 208 3 polygon
1 1.000 304 144 448 144 448 384 -304 384 -304 240 5 polygon
1.000 0 -304 240 generic::dot
1 1.000 -2128 1296 -2384 1296 -2384 1280 3 polygon
1 1.000 -2128 1200 -2224 1200 -2224 1152 -2384 1152 4 polygon
1 1.000 -2320 544 -2320 1296 2 polygon
1.000 0 -2320 1296 generic::dot
1.000 0 -2384 1152 generic::dot
1 1.000 -2128 544 -2128 1040 -1280 1040 3 polygon
1.000 0 -1280 1040 generic::dot
1.000 0 -1280 816 generic::dot
1.000 0 -1360 672 generic::dot
1 1.000 -544 1168 -320 1168 -320 1264 -256 1264 4 polygon
1 1.000 -1024 1168 -1120 1168 -1120 1584 96 1584 96 1440 32 1440 6 polygon
1 1.000 -336 1168 96 1168 96 1312 3 polygon
1.000 0 -320 1168 generic::dot
1 1.000 -544 528 -448 528 -448 1296 -544 1296 4 polygon
1 1.000 -544 464 -464 464 -464 784 -1072 784 -1072 1040 -1024 1040 6 polygon
1 1.000 -544 400 -480 400 -480 768 -1088 768 -1088 976 -1024 976 6 polygon
1 1.000 -544 336 -496 336 -496 752 -1104 752 -1104 912 -1024 912 6 polygon
1 1.000 -544 272 -512 272 -512 736 -1120 736 -1120 848 -1024 848 6 polygon
1 1.000 -544 208 -432 208 -432 912 -544 912 4 polygon
1 1.000 -544 144 -416 144 -416 848 -544 848 4 polygon
1 1.000 -544 1424 -480 1424 -480 1568 -1664 1568 -1664 1392 -1712 1392 6 
polygon
1 1.000 -1712 1296 -1648 1296 -1648 1552 -512 1552 -512 1488 -544 1488 6 
polygon
1 1.000 -1024 -112 -1056 -112 -1056 -48 -1024 -48 4 polygon
1 1.000 -1024 16 -1056 16 -1056 80 -1024 80 4 polygon
1 1.000 -1024 -176 -1088 -176 2 polygon
1.000 0 -1232 -240 analog::gnd
1.000 0 -1968 512 analog::gnd
1 1.000 -1968 544 -2128 544 2 polygon
1.000 0 -320 1264 analog::vdd
1 1.000 304 -48 352 -48 352 -80 400 -80 4 polygon
1.000 0 -176 -208 generic::dot
1 1.000 -80 -48 -176 -48 -176 -64 3 polygon
1.000 0 400 48 generic::dot
1 1.000 304 240 384 240 384 256 3 polygon
1.000 0 384 384 generic::dot
1 1.000 -1024 -752 -1280 -752 -1280 -368 -1024 -368 4 polygon
1 1.000 -1280 -752 -1280 -848 -480 -848 -480 -368 -560 -368 5 polygon
1.000 0 -1280 -752 generic::dot
1 1.000 -1280 -368 -1280 192 -1152 192 -1152 592 -1024 592 5 polygon
1.000 0 -1280 -368 generic::dot
(Flare Genesis) {/Helvetica cf} 2 16 0 1.500 208 -416 label
(LED Interface) {/Helvetica cf} 2 16 0 1.500 208 -512 label
1 1.000 -1024 -432 -1056 -432 -1056 -832 -976 -832 -976 -1024 5 polygon
1 1.000 -1024 -496 -1072 -496 -1072 -1024 3 polygon
1 1.000 -688 -1024 -688 -864 -448 -864 -448 -496 -544 -496 5 polygon
1 1.000 -592 -1024 -592 -880 -432 -880 -432 -432 -544 -432 5 polygon
1 1.000 -496 -1024 -496 -1136 -1344 -1136 -1344 224 -1184 224 -1184 400 -1024 
400 7 polygon
1 1.000 -544 -560 -384 -560 -384 -1168 -1392 -1168 -1392 256 -1216 256 -1216 
656 -1024 656 8 polygon
1 1.000 -544 -176 -400 -176 -400 -48 -544 -48 4 polygon
1 1.000 -304 224 -400 224 -400 -48 -496 -48 4 polygon
1.000 0 -400 -48 generic::dot
1.000 0 -304 224 generic::dot
1 1.000 -544 16 -448 16 -448 80 -544 80 4 polygon
1 1.000 -128 0 -128 144 -80 144 3 polygon
1 1.000 -128 0 -336 0 -336 -208 448 -208 448 48 304 48 6 polygon
1 1.000 -176 -192 -176 -208 2 polygon
1 1.000 -112 -48 -112 -128 2 polygon
1.000 0 -112 -48 generic::dot
1.000 0 -112 -128 analog::gnd
1 1.000 -2080 816 -2128 816 2 polygon
1.000 0 -2128 816 generic::dot
1 1.000 -2080 880 -2112 880 -2112 1008 -1216 1008 -1216 1296 -1024 1296 6 
polygon
1 1.000 -1568 1072 -1568 1008 2 polygon
1.000 0 -1568 1200 generic::dot
1.000 0 -1568 1008 generic::dot
1 1.000 -2080 752 -2096 752 -2096 672 -1968 672 4 polygon
1 1.000 -1968 512 -1968 544 2 polygon
1.000 0 -1968 544 generic::dot
1 1.000 -1360 544 -1360 400 -2160 400 3 polygon
1.000 0 -2160 400 generic::dot
1 1.000 -544 -624 -368 -624 2 polygon
1 1.000 -512 -624 -512 -816 -1184 -816 -1184 -688 4 polygon
1.000 0 -1184 -688 generic::dot
1.000 0 -512 -624 generic::dot
1 1.000 -368 512 -368 -624 2 polygon
1 1.000 448 384 448 848 352 848 3 polygon
1.000 0 448 384 generic::dot
1 1.000 352 912 448 912 448 1088 -368 1088 -368 912 -320 912 6 polygon
1 1.000 -368 640 -368 736 400 736 400 976 352 976 5 polygon
1 1.000 -1024 144 -1088 144 -1088 336 -1024 336 4 polygon
1 1.000 -1024 272 -1088 272 2 polygon
1 1.000 -1024 208 -1088 208 2 polygon
1.000 0 -1088 208 generic::dot
1.000 0 -1088 272 generic::dot
1 1.000 -1088 144 -1088 -240 2 polygon
1.000 0 -1088 -176 generic::dot
1.000 0 -1088 144 generic::dot
1 1.000 -448 16 -448 -240 -1232 -240 3 polygon
1.000 0 -1088 -240 generic::dot
1.000 0 -448 16 generic::dot
(is not complete!) {CR} (this schematic) {/Helvetica cf} 4 16 0 1.000 176 -928 
label
0 1.000 -96 -1024 -96 -352 768 -352 768 -1024 4 polygon
1 1.000 -96 -448 768 -448 2 polygon
1 1.000 -96 -544 768 -544 2 polygon
(1.0) {/Helvetica cf} 2 16 0 1.500 208 -608 label
1 1.000 -96 -640 768 -640 2 polygon
(Project:) {/Helvetica cf} 2 16 0 1.500 -64 -416 label
(Name:) {/Helvetica cf} 2 16 0 1.500 -64 -512 label
(Revision:) {/Helvetica cf} 2 16 0 1.500 -64 -608 label
(Design:) {/Helvetica cf} 2 16 0 1.500 -64 -704 label
(Date:) {/Helvetica cf} 2 16 0 1.500 -64 -800 label
(Notes:) {/Helvetica cf} 2 16 0 1.500 -64 -896 label
1 1.000 -96 -736 768 -736 2 polygon
1 1.000 -96 -832 768 -832 2 polygon
(Harry Eaton) {/Helvetica cf} 2 16 0 1.500 224 -704 label
0 1.000 -112 -1040 -112 -336 784 -336 784 -1040 4 polygon
1.000 0 -2352 -624 generic::dot
pgsave restore showpage

%%Trailer
XCIRCsave restore
%%EOF
