<?xml version="1.0"?>
<svg xmlns="http://www.w3.org/2000/svg" xmlns:xlink="http://www.w3.org/1999/xlink" version="1.0" width="1625.6000" height="1625.6000" viewBox="-2.0000 -2.0000 17.7000 17.7000">
<g id="layer_9_outline">
<!--normal-->
 <rect x="0.0000" y="0.0000" width="12.7000" height="12.7000" stroke-width="0.2540" stroke="#00868b" stroke-linecap="round" fill="none"/>
</g>
<g id="layer_7_group7">
</g>
<g id="layer_5_group5">
</g>
<g id="layer_10_bottom">
<!--normal-->
 <line x1="4.2151" y1="8.5900" x2="4.2151" y2="9.1900" stroke-width="1.3000" stroke="#cccccc" stroke-linecap="square"/>
 <line x1="7.2149" y1="8.5900" x2="7.2149" y2="9.1900" stroke-width="1.3000" stroke="#cccccc" stroke-linecap="square"/>
</g>
<g id="layer_3_top">
<!--normal-->
 <line x1="4.2151" y1="2.8750" x2="4.2151" y2="3.4750" stroke-width="1.3000" stroke="#4d4d4d" stroke-linecap="square"/>
 <line x1="7.2149" y1="2.8750" x2="7.2149" y2="3.4750" stroke-width="1.3000" stroke="#4d4d4d" stroke-linecap="square"/>
</g>
<g id="layer_1_topsilk">
<!--normal-->
 <line x1="5.1151" y1="2.2250" x2="6.3149" y2="2.2250" stroke-width="0.2032" stroke="#000000" stroke-linecap="round"/>
 <line x1="5.1151" y1="4.1250" x2="6.3149" y2="4.1250" stroke-width="0.2032" stroke="#000000" stroke-linecap="round"/>
 <line x1="8.7249" y1="2.3749" x2="9.2329" y2="2.3749" stroke-width="0.1778" stroke="#000000" stroke-linecap="round"/>
 <line x1="9.2329" y1="2.3749" x2="9.3599" y2="2.5019" stroke-width="0.1778" stroke="#000000" stroke-linecap="round"/>
 <line x1="9.3599" y1="2.5019" x2="9.3599" y2="2.7559" stroke-width="0.1778" stroke="#000000" stroke-linecap="round"/>
 <line x1="9.2329" y1="2.8829" x2="9.3599" y2="2.7559" stroke-width="0.1778" stroke="#000000" stroke-linecap="round"/>
 <line x1="8.8519" y1="2.8829" x2="9.2329" y2="2.8829" stroke-width="0.1778" stroke="#000000" stroke-linecap="round"/>
 <line x1="8.8519" y1="2.3749" x2="8.8519" y2="3.3909" stroke-width="0.1778" stroke="#000000" stroke-linecap="round"/>
 <line x1="9.0551" y1="2.8829" x2="9.3599" y2="3.3909" stroke-width="0.1778" stroke="#000000" stroke-linecap="round"/>
 <line x1="9.6647" y1="2.5781" x2="9.8679" y2="2.3749" stroke-width="0.1778" stroke="#000000" stroke-linecap="round"/>
 <line x1="9.8679" y1="2.3749" x2="9.8679" y2="3.3909" stroke-width="0.1778" stroke="#000000" stroke-linecap="round"/>
 <line x1="9.6647" y1="3.3909" x2="10.0457" y2="3.3909" stroke-width="0.1778" stroke="#000000" stroke-linecap="round"/>
</g>
</svg>
