G04 start of page 4 for group 7 layer_idx 5 *
G04 Title: (unknown), Intern *
G04 Creator: <version>
G04 CreationDate: <date>
G04 For: TEST *
G04 Format: Gerber/RS-274X *
G04 PCB-Dimensions: 50000 50000 *
G04 PCB-Coordinate-Origin: lower left *
%MOIN*%
%FSLAX25Y25*%
%LNGROUP7*%
%ADD17C,0.0394*%
%ADD16C,0.0866*%
G54D16*X25000Y42500D03*
G54D17*M02*
