G04 start of page 4 for group 2 layer_idx 9 *
G04 Title: smd elements on both sides, top_mask *
G04 Creator: <version>
G04 CreationDate: <date>
G04 For: TEST *
G04 Format: Gerber/RS-274X *
G04 PCB-Dimensions: 50000 50000 *
G04 PCB-Coordinate-Origin: lower left *
%MOIN*%
%FSLAX25Y25*%
%LNTOPMASK*%
%ADD13C,0.0001*%
G54D13*G36*
X19454Y41540D02*X13736D01*
Y33460D01*
X19454D01*
Y41540D01*
G37*
G36*
X31264D02*X25546D01*
Y33460D01*
X31264D01*
Y41540D01*
G37*
M02*
