G04 start of page 3 for group 2 layer_idx 9 *
G04 Title: Rotated round cap and square pads, top_mask *
G04 Creator: <version>
G04 CreationDate: <date>
G04 For: TEST *
G04 Format: Gerber/RS-274X *
G04 PCB-Dimensions: 50000 50000 *
G04 PCB-Coordinate-Origin: lower left *
%MOIN*%
%FSLAX25Y25*%
%LNTOPMASK*%
%ADD14C,0.0001*%
%ADD13C,0.0500*%
G54D13*X5000Y45000D02*X12500D01*
X5000Y37500D02*Y30000D01*
G54D14*G36*
X17500Y47500D02*Y42500D01*
X30000D01*
Y47500D01*
X17500D01*
G37*
G54D13*X12500Y20000D02*X19443Y17164D01*
G54D14*G36*
X7500Y25000D02*X2500D01*
Y12500D01*
X7500D01*
Y25000D01*
G37*
G54D13*X12500Y35000D02*X17803Y29697D01*
G54D14*G36*
X22500Y38536D02*X18964Y35000D01*
X27803Y26161D01*
X31339Y29697D01*
X22500Y38536D01*
G37*
G36*
X26131Y23260D02*X24240Y18631D01*
X35812Y13904D01*
X37703Y18533D01*
X26131Y23260D01*
G37*
M02*
