G04 start of page 2 for group 3 layer_idx 0 *
G04 Title: Normal lines at different size and angle, top_copper *
G04 Creator: <version>
G04 CreationDate: <date>
G04 For: TEST *
G04 Format: Gerber/RS-274X *
G04 PCB-Dimensions: 50000 50000 *
G04 PCB-Coordinate-Origin: lower left *
%MOIN*%
%FSLAX25Y25*%
%LNTOP*%
%ADD14C,0.0050*%
%ADD13C,0.0200*%
%ADD12C,0.0100*%
%ADD11C,0.0150*%
G54D11*X12500Y25000D02*X40000D01*
G54D12*X25000Y37500D02*Y12500D01*
G54D13*Y25000D02*X40000Y30000D01*
G54D14*X25000Y25000D02*X15000Y35000D01*
M02*
