%!PS-Adobe-3.0 EPSF-3.0
%%BoundingBox: 0 0 37.000000 37.000000
%%Pages: 1
save countdictstack mark newpath /showpage {} def /setpagedevice {pop} def
%%EndProlog
%%Page: 1 1
%%BeginDocument: poly_hole.eps

72 72 scale
1 dup neg scale
1 dup scale
0.00000 -0.50000 translate
/nclip { -0.01000 -0.01000 moveto -0.01000 0.51000 lineto 0.51000 0.51000 lineto 0.51000 -0.01000 lineto -0.01000 -0.01000 lineto eoclip newpath } def
/t { moveto lineto stroke } bind def
/tc { moveto lineto strokepath nclip } bind def
/r { /y2 exch def /x2 exch def /y1 exch def /x1 exch def
     x1 y1 moveto x1 y2 lineto x2 y2 lineto x2 y1 lineto closepath fill } bind def
/c { 0 360 arc fill } bind def
/cc { 0 360 arc nclip } bind def
/a { gsave setlinewidth translate scale 0 0 1 5 3 roll arc stroke grestore} bind def
% Layer bottom group 10 drill 0 mask 0
% Layer group5 group 5 drill 0 mask 0
% Layer group7 group 7 drill 0 mask 0
% Layer top group 3 drill 0 mask 0
0.00000 setlinewidth
2 setlinecap
0.545098 0.137255 0.137255 setrgbcolor
0.06250 0.02500 moveto
0.12500 0.02500 lineto
0.06250 0.08750 lineto
0.06250 0.06250 lineto
0.07500 0.05000 lineto
0.06250 0.05000 lineto
fill
0.02500 0.02500 moveto
0.06250 0.02500 lineto
0.06250 0.05000 lineto
0.05000 0.05000 lineto
0.05000 0.07500 lineto
0.06250 0.06250 lineto
0.06250 0.08750 lineto
0.02500 0.12500 lineto
fill
0.10000 0.07500 moveto
0.15000 0.02500 lineto
0.15000 0.15000 lineto
0.10000 0.15000 lineto
0.10000 0.12500 lineto
0.12500 0.12500 lineto
0.12500 0.10000 lineto
0.10000 0.10000 lineto
fill
0.02500 0.15000 moveto
0.10000 0.07500 lineto
0.10000 0.10000 lineto
0.07500 0.12500 lineto
0.10000 0.12500 lineto
0.10000 0.15000 lineto
fill
0.30000 0.02500 moveto
0.42500 0.15000 lineto
0.30000 0.15000 lineto
0.30000 0.12500 lineto
0.32500 0.12500 lineto
0.32500 0.07500 lineto
0.30000 0.07500 lineto
fill
0.17500 0.15000 moveto
0.30000 0.02500 lineto
0.30000 0.07500 lineto
0.27500 0.07500 lineto
0.27500 0.12500 lineto
0.30000 0.12500 lineto
0.30000 0.15000 lineto
fill
0.16250 0.18750 moveto
0.30000 0.20000 lineto
0.16250 0.28250 lineto
0.16250 0.25000 lineto
0.17500 0.25000 lineto
0.17500 0.22500 lineto
0.16250 0.22500 lineto
fill
0.10000 0.18182 moveto
0.16250 0.18750 lineto
0.16250 0.22500 lineto
0.15000 0.22500 lineto
0.15000 0.25000 lineto
0.16250 0.25000 lineto
0.16250 0.28250 lineto
0.10000 0.32000 lineto
0.10000 0.30000 lineto
0.12500 0.27500 lineto
0.12500 0.25000 lineto
0.10000 0.22500 lineto
fill
0.02500 0.17500 moveto
0.10000 0.18182 lineto
0.10000 0.22500 lineto
0.07500 0.22500 lineto
0.07500 0.27500 lineto
0.10000 0.30000 lineto
0.10000 0.32000 lineto
0.05000 0.35000 lineto
fill
% Layer topsilk group 1 drill 0 mask 0
% Layer bottomsilk group 12 drill 0 mask 0
showpage
%%EndDocument
%%Trailer
cleartomark countdictstack exch sub { end } repeat restore
%%EOF
