v 20130925 2
C 40000 40000 0 0 0 title-B.sym
B 40800 47000 3000 400 3 0 0 0 -1 -1 3 1 -1 100 -1 -1
L 44000 47000 40600 47000 3 0 0 0 -1 -1
B 40300 44000 4000 6500 3 0 0 0 -1 -1 0 -1 -1 -1 -1 -1
L 44000 47400 40600 47400 3 0 0 0 -1 -1
L 44000 47900 40600 47900 3 0 0 0 -1 -1
L 44000 48400 40600 48400 3 0 0 0 -1 -1
L 44000 48900 40600 48900 3 0 0 0 -1 -1
L 44000 49400 40600 49400 3 0 0 0 -1 -1
L 44000 46000 40600 46000 3 0 0 0 -1 -1
L 44000 46500 40600 46500 3 0 0 0 -1 -1
L 44000 45000 40600 45000 3 0 0 0 -1 -1
L 44000 45500 40600 45500 3 0 0 0 -1 -1
L 44000 44500 40600 44500 3 0 0 0 -1 -1
L 44000 49900 40600 49900 3 0 0 0 -1 -1
T 42400 47200 9 10 1 0 0 4 1
Substrate
B 44900 47100 3000 400 3 0 0 0 -1 -1 3 1 -1 100 -1 -1
L 48100 47100 44700 47100 3 0 0 0 -1 -1
B 44400 44000 4000 6500 3 0 0 0 -1 -1 0 -1 -1 -1 -1 -1
L 48100 47500 44700 47500 3 0 0 0 -1 -1
L 48100 47900 44700 47900 3 0 0 0 -1 -1
L 48100 48400 44700 48400 3 0 0 0 -1 -1
L 48100 48900 44700 48900 3 0 0 0 -1 -1
L 48100 49400 44700 49400 3 0 0 0 -1 -1
L 48100 46100 44700 46100 3 0 0 0 -1 -1
L 48100 46600 44700 46600 3 0 0 0 -1 -1
L 48100 45100 44700 45100 3 0 0 0 -1 -1
L 48100 45600 44700 45600 3 0 0 0 -1 -1
L 48100 44600 44700 44600 3 0 0 0 -1 -1
L 48100 49900 44700 49900 3 0 0 0 -1 -1
T 46500 47300 9 10 1 0 0 4 1
Substrate
L 48100 47300 44700 47300 3 0 0 0 -1 -1
B 49000 47200 3000 400 3 0 0 0 -1 -1 3 1 -1 100 -1 -1
B 48500 44000 4000 6500 3 0 0 0 -1 -1 0 -1 -1 -1 -1 -1
L 52200 47500 48800 47500 3 0 0 0 -1 -1
L 52200 48100 48800 48100 3 0 0 0 -1 -1
L 52200 48500 48800 48500 3 0 0 0 -1 -1
L 52200 49000 48800 49000 3 0 0 0 -1 -1
L 52200 46300 48800 46300 3 0 0 0 -1 -1
L 52200 45300 48800 45300 3 0 0 0 -1 -1
L 52200 45800 48800 45800 3 0 0 0 -1 -1
L 52200 44800 48800 44800 3 0 0 0 -1 -1
L 52200 49500 48800 49500 3 0 0 0 -1 -1
L 52200 47400 48800 47400 3 0 0 0 -1 -1
T 50600 47400 9 10 1 0 0 4 1
Substrate
L 52200 47300 48800 47300 3 0 0 0 -1 -1
L 52200 47200 48800 47200 3 0 0 0 -1 -1
L 52200 47600 48800 47600 3 0 0 0 -1 -1
L 52200 47800 48800 47800 3 0 0 0 -1 -1
L 52200 47000 48800 47000 3 0 0 0 -1 -1
L 52200 46700 48800 46700 3 0 0 0 -1 -1
L 52200 50000 48800 50000 3 0 0 0 -1 -1
L 52200 44300 48800 44300 3 0 0 0 -1 -1
B 53100 47200 3000 400 3 0 0 0 -1 -1 3 1 -1 100 -1 -1
B 52600 47000 4000 3500 3 0 0 0 -1 -1 0 -1 -1 -1 -1 -1
L 56300 47500 52900 47500 3 0 0 0 -1 -1
L 56300 48100 52900 48100 3 0 0 0 -1 -1
L 56300 48500 52900 48500 3 0 0 0 -1 -1
L 56300 49000 52900 49000 3 0 0 0 -1 -1
L 56300 49500 52900 49500 3 0 0 0 -1 -1
L 56300 47400 52900 47400 3 0 0 0 -1 -1
L 56300 47300 52900 47300 3 0 0 0 -1 -1
L 56300 47200 52900 47200 3 0 0 0 -1 -1
L 56300 47600 52900 47600 3 0 0 0 -1 -1
L 56300 47800 52900 47800 3 0 0 0 -1 -1
L 56300 50000 52900 50000 3 0 0 0 -1 -1
T 54700 47400 9 10 1 0 0 4 1
Substrate
T 53900 40100 14 9 1 0 0 0 1
Evan Foss
T 50000 40700 14 9 1 0 0 0 1
Mesh Examples
T 40300 50600 9 10 1 0 0 0 1
Uniform mesh of board thickness
T 44400 50600 9 10 1 0 0 0 2
Uniform mesh of board thickness with added 
line in substrate.
T 48500 50600 9 10 1 0 0 0 2
Non-uniform mesh with substate internal lines
<defaults should stear the user to this>
T 52600 50600 9 10 1 0 0 0 2
Non-uniform mesh with substate internal lines 
and the board at the bottom of the mesh
