G04 start of page 2 for group 3 layer_idx 0 *
G04 Title: odd coordinates to check rounding errors, top_copper *
G04 Creator: <version>
G04 CreationDate: <date>
G04 For: TEST *
G04 Format: Gerber/RS-274X *
G04 PCB-Dimensions: 50000 50000 *
G04 PCB-Coordinate-Origin: lower left *
%MOIN*%
%FSLAX25Y25*%
%LNTOP*%
%ADD11C,0.0394*%
G54D11*X23622Y25984D02*X24055Y25941D01*
X24059Y25941D02*X24059Y25941D01*
M02*
