G04 start of page 5 for group -1 layer_idx 268435462 *
G04 Title: (unknown), <virtual group> *
G04 Creator: <version>
G04 CreationDate: <date>
G04 For: TEST *
G04 Format: Gerber/RS-274X *
G04 PCB-Dimensions: 50000 50000 *
G04 PCB-Coordinate-Origin: lower left *
%MOIN*%
%FSLAX25Y25*%
%LNPLATED_DRILL*%
%ADD20C,0.0100*%
M30
