G04 start of page 5 for group -1 layer_idx 16777221 *
G04 Title: thermals on the last 2 layers - catch off-by-one bugs due to the 0-base index of thermals, <virtual group> *
G04 Creator: <version>
G04 CreationDate: <date>
G04 For:  *
G04 Format: Gerber/RS-274X *
G04 PCB-Dimensions: 50000 50000 *
G04 PCB-Coordinate-Origin: lower left *
%MOIN*%
%FSLAX25Y25*%
%LNFAB*%
%ADD21C,0.0100*%
%ADD20C,0.0075*%
%ADD19C,0.0060*%
%ADD18C,0.0080*%
G54D18*X10000Y40000D02*Y38400D01*
Y40000D02*X11387Y40800D01*
X10000Y40000D02*X8613Y40800D01*
X15000Y106250D02*Y104650D01*
Y106250D02*X16387Y107050D01*
X15000Y106250D02*X13613Y107050D01*
G54D19*X135000Y108500D02*X136500Y105500D01*
X138000Y108500D01*
X136500Y105500D02*Y102500D01*
X139800Y105800D02*X142050D01*
X139800Y102500D02*X142800D01*
X139800Y108500D02*Y102500D01*
Y108500D02*X142800D01*
X147600D02*X148350Y107750D01*
X145350Y108500D02*X147600D01*
X144600Y107750D02*X145350Y108500D01*
X144600Y107750D02*Y106250D01*
X145350Y105500D01*
X147600D01*
X148350Y104750D01*
Y103250D01*
X147600Y102500D02*X148350Y103250D01*
X145350Y102500D02*X147600D01*
X144600Y103250D02*X145350Y102500D01*
X98000Y107300D02*X99200Y108500D01*
Y102500D01*
X98000D02*X100250D01*
X45000Y103250D02*X45750Y102500D01*
X45000Y107750D02*Y103250D01*
Y107750D02*X45750Y108500D01*
X47250D01*
X48000Y107750D01*
Y103250D01*
X47250Y102500D02*X48000Y103250D01*
X45750Y102500D02*X47250D01*
X45000Y104000D02*X48000Y107000D01*
X49800Y102500D02*X50550D01*
X52350Y103250D02*X53100Y102500D01*
X52350Y107750D02*Y103250D01*
Y107750D02*X53100Y108500D01*
X54600D01*
X55350Y107750D01*
Y103250D01*
X54600Y102500D02*X55350Y103250D01*
X53100Y102500D02*X54600D01*
X52350Y104000D02*X55350Y107000D01*
X57150Y107750D02*X57900Y108500D01*
X59400D01*
X60150Y107750D01*
X59400Y102500D02*X60150Y103250D01*
X57900Y102500D02*X59400D01*
X57150Y103250D02*X57900Y102500D01*
Y105800D02*X59400D01*
X60150Y107750D02*Y106550D01*
Y105050D02*Y103250D01*
Y105050D02*X59400Y105800D01*
X60150Y106550D02*X59400Y105800D01*
X61950Y107750D02*X62700Y108500D01*
X64950D01*
X65700Y107750D01*
Y106250D01*
X61950Y102500D02*X65700Y106250D01*
X61950Y102500D02*X65700D01*
X3000Y123500D02*X3750Y122750D01*
X750Y123500D02*X3000D01*
X0Y122750D02*X750Y123500D01*
X0Y122750D02*Y121250D01*
X750Y120500D01*
X3000D01*
X3750Y119750D01*
Y118250D01*
X3000Y117500D02*X3750Y118250D01*
X750Y117500D02*X3000D01*
X0Y118250D02*X750Y117500D01*
X5550Y120500D02*Y118250D01*
X6300Y117500D01*
X8550Y120500D02*Y116000D01*
X7800Y115250D02*X8550Y116000D01*
X6300Y115250D02*X7800D01*
X5550Y116000D02*X6300Y115250D01*
Y117500D02*X7800D01*
X8550Y118250D01*
X11100Y119750D02*Y117500D01*
Y119750D02*X11850Y120500D01*
X12600D01*
X13350Y119750D01*
Y117500D01*
Y119750D02*X14100Y120500D01*
X14850D01*
X15600Y119750D01*
Y117500D01*
X10350Y120500D02*X11100Y119750D01*
X17400Y123500D02*Y117500D01*
Y118250D02*X18150Y117500D01*
X19650D01*
X20400Y118250D01*
Y119750D02*Y118250D01*
X19650Y120500D02*X20400Y119750D01*
X18150Y120500D02*X19650D01*
X17400Y119750D02*X18150Y120500D01*
X22200Y119750D02*Y118250D01*
Y119750D02*X22950Y120500D01*
X24450D01*
X25200Y119750D01*
Y118250D01*
X24450Y117500D02*X25200Y118250D01*
X22950Y117500D02*X24450D01*
X22200Y118250D02*X22950Y117500D01*
X27000Y123500D02*Y118250D01*
X27750Y117500D01*
X0Y114250D02*X29250D01*
X41750Y123500D02*Y117500D01*
X43700Y123500D02*X44750Y122450D01*
Y118550D01*
X43700Y117500D02*X44750Y118550D01*
X41000Y117500D02*X43700D01*
X41000Y123500D02*X43700D01*
G54D20*X46550Y122000D02*Y121850D01*
G54D19*Y119750D02*Y117500D01*
X50300Y120500D02*X51050Y119750D01*
X48800Y120500D02*X50300D01*
X48050Y119750D02*X48800Y120500D01*
X48050Y119750D02*Y118250D01*
X48800Y117500D01*
X51050Y120500D02*Y118250D01*
X51800Y117500D01*
X48800D02*X50300D01*
X51050Y118250D01*
X54350Y119750D02*Y117500D01*
Y119750D02*X55100Y120500D01*
X55850D01*
X56600Y119750D01*
Y117500D01*
Y119750D02*X57350Y120500D01*
X58100D01*
X58850Y119750D01*
Y117500D01*
X53600Y120500D02*X54350Y119750D01*
X60650Y117500D02*X61400D01*
X65900Y118250D02*X66650Y117500D01*
X65900Y122750D02*X66650Y123500D01*
X65900Y122750D02*Y118250D01*
X68450Y123500D02*X69950D01*
X69200D02*Y117500D01*
X68450D02*X69950D01*
X72500Y119750D02*Y117500D01*
Y119750D02*X73250Y120500D01*
X74000D01*
X74750Y119750D01*
Y117500D01*
X71750Y120500D02*X72500Y119750D01*
X77300Y120500D02*X79550D01*
X76550Y119750D02*X77300Y120500D01*
X76550Y119750D02*Y118250D01*
X77300Y117500D01*
X79550D01*
X81350Y123500D02*Y117500D01*
Y119750D02*X82100Y120500D01*
X83600D01*
X84350Y119750D01*
Y117500D01*
X86150Y123500D02*X86900Y122750D01*
Y118250D01*
X86150Y117500D02*X86900Y118250D01*
X41000Y114250D02*X88700D01*
X96050Y117500D02*X98000D01*
X95000Y118550D02*X96050Y117500D01*
X95000Y122450D02*Y118550D01*
Y122450D02*X96050Y123500D01*
X98000D01*
X99800Y119750D02*Y118250D01*
Y119750D02*X100550Y120500D01*
X102050D01*
X102800Y119750D01*
Y118250D01*
X102050Y117500D02*X102800Y118250D01*
X100550Y117500D02*X102050D01*
X99800Y118250D02*X100550Y117500D01*
X104600Y120500D02*Y118250D01*
X105350Y117500D01*
X106850D01*
X107600Y118250D01*
Y120500D02*Y118250D01*
X110150Y119750D02*Y117500D01*
Y119750D02*X110900Y120500D01*
X111650D01*
X112400Y119750D01*
Y117500D01*
X109400Y120500D02*X110150Y119750D01*
X114950Y123500D02*Y118250D01*
X115700Y117500D01*
X114200Y121250D02*X115700D01*
X95000Y114250D02*X117200D01*
X130750Y123500D02*Y117500D01*
X130000Y123500D02*X133000D01*
X133750Y122750D01*
Y121250D01*
X133000Y120500D02*X133750Y121250D01*
X130750Y120500D02*X133000D01*
X135550Y123500D02*Y118250D01*
X136300Y117500D01*
X140050Y120500D02*X140800Y119750D01*
X138550Y120500D02*X140050D01*
X137800Y119750D02*X138550Y120500D01*
X137800Y119750D02*Y118250D01*
X138550Y117500D01*
X140800Y120500D02*Y118250D01*
X141550Y117500D01*
X138550D02*X140050D01*
X140800Y118250D01*
X144100Y123500D02*Y118250D01*
X144850Y117500D01*
X143350Y121250D02*X144850D01*
X147100Y117500D02*X149350D01*
X146350Y118250D02*X147100Y117500D01*
X146350Y119750D02*Y118250D01*
Y119750D02*X147100Y120500D01*
X148600D01*
X149350Y119750D01*
X146350Y119000D02*X149350D01*
Y119750D02*Y119000D01*
X154150Y123500D02*Y117500D01*
X153400D02*X154150Y118250D01*
X151900Y117500D02*X153400D01*
X151150Y118250D02*X151900Y117500D01*
X151150Y119750D02*Y118250D01*
Y119750D02*X151900Y120500D01*
X153400D01*
X154150Y119750D01*
X157450Y120500D02*Y119750D01*
Y118250D02*Y117500D01*
X155950Y122750D02*Y122000D01*
Y122750D02*X156700Y123500D01*
X158200D01*
X158950Y122750D01*
Y122000D01*
X157450Y120500D02*X158950Y122000D01*
X130000Y114250D02*X160750D01*
X0Y138500D02*X3000D01*
X1500D02*Y132500D01*
X4800Y138500D02*Y132500D01*
Y134750D02*X5550Y135500D01*
X7050D01*
X7800Y134750D01*
Y132500D01*
X10350D02*X12600D01*
X9600Y133250D02*X10350Y132500D01*
X9600Y134750D02*Y133250D01*
Y134750D02*X10350Y135500D01*
X11850D01*
X12600Y134750D01*
X9600Y134000D02*X12600D01*
Y134750D02*Y134000D01*
X15150Y134750D02*Y132500D01*
Y134750D02*X15900Y135500D01*
X17400D01*
X14400D02*X15150Y134750D01*
X19950Y132500D02*X22200D01*
X19200Y133250D02*X19950Y132500D01*
X19200Y134750D02*Y133250D01*
Y134750D02*X19950Y135500D01*
X21450D01*
X22200Y134750D01*
X19200Y134000D02*X22200D01*
Y134750D02*Y134000D01*
X28950Y135500D02*X29700Y134750D01*
X27450Y135500D02*X28950D01*
X26700Y134750D02*X27450Y135500D01*
X26700Y134750D02*Y133250D01*
X27450Y132500D01*
X29700Y135500D02*Y133250D01*
X30450Y132500D01*
X27450D02*X28950D01*
X29700Y133250D01*
X33000Y134750D02*Y132500D01*
Y134750D02*X33750Y135500D01*
X35250D01*
X32250D02*X33000Y134750D01*
X37800Y132500D02*X40050D01*
X37050Y133250D02*X37800Y132500D01*
X37050Y134750D02*Y133250D01*
Y134750D02*X37800Y135500D01*
X39300D01*
X40050Y134750D01*
X37050Y134000D02*X40050D01*
Y134750D02*Y134000D01*
X44550Y137300D02*X45750Y138500D01*
Y132500D01*
X44550D02*X46800D01*
X54300Y138500D02*Y132500D01*
X53550D02*X54300Y133250D01*
X52050Y132500D02*X53550D01*
X51300Y133250D02*X52050Y132500D01*
X51300Y134750D02*Y133250D01*
Y134750D02*X52050Y135500D01*
X53550D01*
X54300Y134750D01*
G54D20*X56100Y137000D02*Y136850D01*
G54D19*Y134750D02*Y132500D01*
X58350Y137750D02*Y132500D01*
Y137750D02*X59100Y138500D01*
X59850D01*
X57600Y135500D02*X59100D01*
X62100Y137750D02*Y132500D01*
Y137750D02*X62850Y138500D01*
X63600D01*
X61350Y135500D02*X62850D01*
X65850Y132500D02*X68100D01*
X65100Y133250D02*X65850Y132500D01*
X65100Y134750D02*Y133250D01*
Y134750D02*X65850Y135500D01*
X67350D01*
X68100Y134750D01*
X65100Y134000D02*X68100D01*
Y134750D02*Y134000D01*
X70650Y134750D02*Y132500D01*
Y134750D02*X71400Y135500D01*
X72900D01*
X69900D02*X70650Y134750D01*
X75450Y132500D02*X77700D01*
X74700Y133250D02*X75450Y132500D01*
X74700Y134750D02*Y133250D01*
Y134750D02*X75450Y135500D01*
X76950D01*
X77700Y134750D01*
X74700Y134000D02*X77700D01*
Y134750D02*Y134000D01*
X80250Y134750D02*Y132500D01*
Y134750D02*X81000Y135500D01*
X81750D01*
X82500Y134750D01*
Y132500D01*
X79500Y135500D02*X80250Y134750D01*
X85050Y138500D02*Y133250D01*
X85800Y132500D01*
X84300Y136250D02*X85800D01*
X93000Y138500D02*Y132500D01*
X92250D02*X93000Y133250D01*
X90750Y132500D02*X92250D01*
X90000Y133250D02*X90750Y132500D01*
X90000Y134750D02*Y133250D01*
Y134750D02*X90750Y135500D01*
X92250D01*
X93000Y134750D01*
X95550D02*Y132500D01*
Y134750D02*X96300Y135500D01*
X97800D01*
X94800D02*X95550Y134750D01*
G54D20*X99600Y137000D02*Y136850D01*
G54D19*Y134750D02*Y132500D01*
X101100Y138500D02*Y133250D01*
X101850Y132500D01*
X103350Y138500D02*Y133250D01*
X104100Y132500D01*
X109050D02*X111300D01*
X112050Y133250D01*
X111300Y134000D02*X112050Y133250D01*
X109050Y134000D02*X111300D01*
X108300Y134750D02*X109050Y134000D01*
X108300Y134750D02*X109050Y135500D01*
X111300D01*
X112050Y134750D01*
X108300Y133250D02*X109050Y132500D01*
G54D20*X113850Y137000D02*Y136850D01*
G54D19*Y134750D02*Y132500D01*
X115350Y135500D02*X118350D01*
X115350Y132500D02*X118350Y135500D01*
X115350Y132500D02*X118350D01*
X120900D02*X123150D01*
X120150Y133250D02*X120900Y132500D01*
X120150Y134750D02*Y133250D01*
Y134750D02*X120900Y135500D01*
X122400D01*
X123150Y134750D01*
X120150Y134000D02*X123150D01*
Y134750D02*Y134000D01*
X125700Y132500D02*X127950D01*
X128700Y133250D01*
X127950Y134000D02*X128700Y133250D01*
X125700Y134000D02*X127950D01*
X124950Y134750D02*X125700Y134000D01*
X124950Y134750D02*X125700Y135500D01*
X127950D01*
X128700Y134750D01*
X124950Y133250D02*X125700Y132500D01*
X133200Y135500D02*Y133250D01*
X133950Y132500D01*
X135450D01*
X136200Y133250D01*
Y135500D02*Y133250D01*
X138750Y132500D02*X141000D01*
X141750Y133250D01*
X141000Y134000D02*X141750Y133250D01*
X138750Y134000D02*X141000D01*
X138000Y134750D02*X138750Y134000D01*
X138000Y134750D02*X138750Y135500D01*
X141000D01*
X141750Y134750D01*
X138000Y133250D02*X138750Y132500D01*
X144300D02*X146550D01*
X143550Y133250D02*X144300Y132500D01*
X143550Y134750D02*Y133250D01*
Y134750D02*X144300Y135500D01*
X145800D01*
X146550Y134750D01*
X143550Y134000D02*X146550D01*
Y134750D02*Y134000D01*
X151350Y138500D02*Y132500D01*
X150600D02*X151350Y133250D01*
X149100Y132500D02*X150600D01*
X148350Y133250D02*X149100Y132500D01*
X148350Y134750D02*Y133250D01*
Y134750D02*X149100Y135500D01*
X150600D01*
X151350Y134750D01*
G54D20*X155850Y137000D02*Y136850D01*
G54D19*Y134750D02*Y132500D01*
X158100Y134750D02*Y132500D01*
Y134750D02*X158850Y135500D01*
X159600D01*
X160350Y134750D01*
Y132500D01*
X157350Y135500D02*X158100Y134750D01*
X165600Y138500D02*Y133250D01*
X166350Y132500D01*
X164850Y136250D02*X166350D01*
X167850Y138500D02*Y132500D01*
Y134750D02*X168600Y135500D01*
X170100D01*
X170850Y134750D01*
Y132500D01*
G54D20*X172650Y137000D02*Y136850D01*
G54D19*Y134750D02*Y132500D01*
X174900D02*X177150D01*
X177900Y133250D01*
X177150Y134000D02*X177900Y133250D01*
X174900Y134000D02*X177150D01*
X174150Y134750D02*X174900Y134000D01*
X174150Y134750D02*X174900Y135500D01*
X177150D01*
X177900Y134750D01*
X174150Y133250D02*X174900Y132500D01*
X182400Y138500D02*Y133250D01*
X183150Y132500D01*
X186900Y135500D02*X187650Y134750D01*
X185400Y135500D02*X186900D01*
X184650Y134750D02*X185400Y135500D01*
X184650Y134750D02*Y133250D01*
X185400Y132500D01*
X187650Y135500D02*Y133250D01*
X188400Y132500D01*
X185400D02*X186900D01*
X187650Y133250D01*
X190200Y135500D02*Y133250D01*
X190950Y132500D01*
X193200Y135500D02*Y131000D01*
X192450Y130250D02*X193200Y131000D01*
X190950Y130250D02*X192450D01*
X190200Y131000D02*X190950Y130250D01*
Y132500D02*X192450D01*
X193200Y133250D01*
X195000Y134750D02*Y133250D01*
Y134750D02*X195750Y135500D01*
X197250D01*
X198000Y134750D01*
Y133250D01*
X197250Y132500D02*X198000Y133250D01*
X195750Y132500D02*X197250D01*
X195000Y133250D02*X195750Y132500D01*
X199800Y135500D02*Y133250D01*
X200550Y132500D01*
X202050D01*
X202800Y133250D01*
Y135500D02*Y133250D01*
X205350Y138500D02*Y133250D01*
X206100Y132500D01*
X204600Y136250D02*X206100D01*
X207600Y131000D02*X209100Y132500D01*
X213600Y137300D02*X214800Y138500D01*
Y132500D01*
X213600D02*X215850D01*
X220350Y138500D02*Y132500D01*
Y134750D02*X221100Y135500D01*
X222600D01*
X223350Y134750D01*
Y132500D01*
X225150Y134750D02*Y133250D01*
Y134750D02*X225900Y135500D01*
X227400D01*
X228150Y134750D01*
Y133250D01*
X227400Y132500D02*X228150Y133250D01*
X225900Y132500D02*X227400D01*
X225150Y133250D02*X225900Y132500D01*
X229950Y138500D02*Y133250D01*
X230700Y132500D01*
X232950D02*X235200D01*
X232200Y133250D02*X232950Y132500D01*
X232200Y134750D02*Y133250D01*
Y134750D02*X232950Y135500D01*
X234450D01*
X235200Y134750D01*
X232200Y134000D02*X235200D01*
Y134750D02*Y134000D01*
X237750Y132500D02*X240000D01*
X240750Y133250D01*
X240000Y134000D02*X240750Y133250D01*
X237750Y134000D02*X240000D01*
X237000Y134750D02*X237750Y134000D01*
X237000Y134750D02*X237750Y135500D01*
X240000D01*
X240750Y134750D01*
X237000Y133250D02*X237750Y132500D01*
X246000Y138500D02*Y133250D01*
X246750Y132500D01*
X245250Y136250D02*X246750D01*
X248250Y134750D02*Y133250D01*
Y134750D02*X249000Y135500D01*
X250500D01*
X251250Y134750D01*
Y133250D01*
X250500Y132500D02*X251250Y133250D01*
X249000Y132500D02*X250500D01*
X248250Y133250D02*X249000Y132500D01*
X253800Y138500D02*Y133250D01*
X254550Y132500D01*
X253050Y136250D02*X254550D01*
X258300Y135500D02*X259050Y134750D01*
X256800Y135500D02*X258300D01*
X256050Y134750D02*X256800Y135500D01*
X256050Y134750D02*Y133250D01*
X256800Y132500D01*
X259050Y135500D02*Y133250D01*
X259800Y132500D01*
X256800D02*X258300D01*
X259050Y133250D01*
X261600Y138500D02*Y133250D01*
X262350Y132500D01*
G54D21*X0Y50000D02*X50000D01*
X0D02*Y0D01*
X50000Y50000D02*Y0D01*
X0D02*X50000D01*
G54D19*X200000Y63500D02*Y57500D01*
Y63500D02*X202250Y60500D01*
X204500Y63500D01*
Y57500D01*
X208550Y60500D02*X209300Y59750D01*
X207050Y60500D02*X208550D01*
X206300Y59750D02*X207050Y60500D01*
X206300Y59750D02*Y58250D01*
X207050Y57500D01*
X209300Y60500D02*Y58250D01*
X210050Y57500D01*
X207050D02*X208550D01*
X209300Y58250D01*
X211850Y60500D02*X214850Y57500D01*
X211850D02*X214850Y60500D01*
G54D20*X216650Y62000D02*Y61850D01*
G54D19*Y59750D02*Y57500D01*
X218900Y59750D02*Y57500D01*
Y59750D02*X219650Y60500D01*
X220400D01*
X221150Y59750D01*
Y57500D01*
Y59750D02*X221900Y60500D01*
X222650D01*
X223400Y59750D01*
Y57500D01*
X218150Y60500D02*X218900Y59750D01*
X225200Y60500D02*Y58250D01*
X225950Y57500D01*
X227450D01*
X228200Y58250D01*
Y60500D02*Y58250D01*
X230750Y59750D02*Y57500D01*
Y59750D02*X231500Y60500D01*
X232250D01*
X233000Y59750D01*
Y57500D01*
Y59750D02*X233750Y60500D01*
X234500D01*
X235250Y59750D01*
Y57500D01*
X230000Y60500D02*X230750Y59750D01*
X240500Y63500D02*Y57500D01*
X242450Y63500D02*X243500Y62450D01*
Y58550D01*
X242450Y57500D02*X243500Y58550D01*
X239750Y57500D02*X242450D01*
X239750Y63500D02*X242450D01*
G54D20*X245300Y62000D02*Y61850D01*
G54D19*Y59750D02*Y57500D01*
X247550Y59750D02*Y57500D01*
Y59750D02*X248300Y60500D01*
X249050D01*
X249800Y59750D01*
Y57500D01*
Y59750D02*X250550Y60500D01*
X251300D01*
X252050Y59750D01*
Y57500D01*
X246800Y60500D02*X247550Y59750D01*
X254600Y57500D02*X256850D01*
X253850Y58250D02*X254600Y57500D01*
X253850Y59750D02*Y58250D01*
Y59750D02*X254600Y60500D01*
X256100D01*
X256850Y59750D01*
X253850Y59000D02*X256850D01*
Y59750D02*Y59000D01*
X259400Y59750D02*Y57500D01*
Y59750D02*X260150Y60500D01*
X260900D01*
X261650Y59750D01*
Y57500D01*
X258650Y60500D02*X259400Y59750D01*
X264200Y57500D02*X266450D01*
X267200Y58250D01*
X266450Y59000D02*X267200Y58250D01*
X264200Y59000D02*X266450D01*
X263450Y59750D02*X264200Y59000D01*
X263450Y59750D02*X264200Y60500D01*
X266450D01*
X267200Y59750D01*
X263450Y58250D02*X264200Y57500D01*
G54D20*X269000Y62000D02*Y61850D01*
G54D19*Y59750D02*Y57500D01*
X270500Y59750D02*Y58250D01*
Y59750D02*X271250Y60500D01*
X272750D01*
X273500Y59750D01*
Y58250D01*
X272750Y57500D02*X273500Y58250D01*
X271250Y57500D02*X272750D01*
X270500Y58250D02*X271250Y57500D01*
X276050Y59750D02*Y57500D01*
Y59750D02*X276800Y60500D01*
X277550D01*
X278300Y59750D01*
Y57500D01*
X275300Y60500D02*X276050Y59750D01*
X280850Y57500D02*X283100D01*
X283850Y58250D01*
X283100Y59000D02*X283850Y58250D01*
X280850Y59000D02*X283100D01*
X280100Y59750D02*X280850Y59000D01*
X280100Y59750D02*X280850Y60500D01*
X283100D01*
X283850Y59750D01*
X280100Y58250D02*X280850Y57500D01*
X285650Y61250D02*X286400D01*
X285650Y59750D02*X286400D01*
X290900Y63500D02*X293900D01*
X290900D02*Y60500D01*
X291650Y61250D01*
X293150D01*
X293900Y60500D01*
Y58250D01*
X293150Y57500D02*X293900Y58250D01*
X291650Y57500D02*X293150D01*
X290900Y58250D02*X291650Y57500D01*
X295700Y58250D02*X296450Y57500D01*
X295700Y62750D02*Y58250D01*
Y62750D02*X296450Y63500D01*
X297950D01*
X298700Y62750D01*
Y58250D01*
X297950Y57500D02*X298700Y58250D01*
X296450Y57500D02*X297950D01*
X295700Y59000D02*X298700Y62000D01*
X300500Y58250D02*X301250Y57500D01*
X300500Y62750D02*Y58250D01*
Y62750D02*X301250Y63500D01*
X302750D01*
X303500Y62750D01*
Y58250D01*
X302750Y57500D02*X303500Y58250D01*
X301250Y57500D02*X302750D01*
X300500Y59000D02*X303500Y62000D01*
X305300Y57500D02*X306050D01*
X307850Y58250D02*X308600Y57500D01*
X307850Y62750D02*Y58250D01*
Y62750D02*X308600Y63500D01*
X310100D01*
X310850Y62750D01*
Y58250D01*
X310100Y57500D02*X310850Y58250D01*
X308600Y57500D02*X310100D01*
X307850Y59000D02*X310850Y62000D01*
X312650Y58250D02*X313400Y57500D01*
X312650Y62750D02*Y58250D01*
Y62750D02*X313400Y63500D01*
X314900D01*
X315650Y62750D01*
Y58250D01*
X314900Y57500D02*X315650Y58250D01*
X313400Y57500D02*X314900D01*
X312650Y59000D02*X315650Y62000D01*
X317450Y58250D02*X318200Y57500D01*
X317450Y62750D02*Y58250D01*
Y62750D02*X318200Y63500D01*
X319700D01*
X320450Y62750D01*
Y58250D01*
X319700Y57500D02*X320450Y58250D01*
X318200Y57500D02*X319700D01*
X317450Y59000D02*X320450Y62000D01*
X322250Y58250D02*X323000Y57500D01*
X322250Y62750D02*Y58250D01*
Y62750D02*X323000Y63500D01*
X324500D01*
X325250Y62750D01*
Y58250D01*
X324500Y57500D02*X325250Y58250D01*
X323000Y57500D02*X324500D01*
X322250Y59000D02*X325250Y62000D01*
X327050Y58250D02*X327800Y57500D01*
X327050Y62750D02*Y58250D01*
Y62750D02*X327800Y63500D01*
X329300D01*
X330050Y62750D01*
Y58250D01*
X329300Y57500D02*X330050Y58250D01*
X327800Y57500D02*X329300D01*
X327050Y59000D02*X330050Y62000D01*
X331850Y58250D02*X332600Y57500D01*
X331850Y62750D02*Y58250D01*
Y62750D02*X332600Y63500D01*
X334100D01*
X334850Y62750D01*
Y58250D01*
X334100Y57500D02*X334850Y58250D01*
X332600Y57500D02*X334100D01*
X331850Y59000D02*X334850Y62000D01*
X340100Y59750D02*Y57500D01*
Y59750D02*X340850Y60500D01*
X341600D01*
X342350Y59750D01*
Y57500D01*
Y59750D02*X343100Y60500D01*
X343850D01*
X344600Y59750D01*
Y57500D01*
X339350Y60500D02*X340100Y59750D01*
G54D20*X346400Y62000D02*Y61850D01*
G54D19*Y59750D02*Y57500D01*
X347900Y63500D02*Y58250D01*
X348650Y57500D01*
X350900D02*X353150D01*
X353900Y58250D01*
X353150Y59000D02*X353900Y58250D01*
X350900Y59000D02*X353150D01*
X350150Y59750D02*X350900Y59000D01*
X350150Y59750D02*X350900Y60500D01*
X353150D01*
X353900Y59750D01*
X350150Y58250D02*X350900Y57500D01*
X358400Y60500D02*Y58250D01*
X359150Y57500D01*
X359900D01*
X360650Y58250D01*
Y60500D02*Y58250D01*
X361400Y57500D01*
X362150D01*
X362900Y58250D01*
Y60500D02*Y58250D01*
G54D20*X364700Y62000D02*Y61850D01*
G54D19*Y59750D02*Y57500D01*
X369200Y63500D02*Y57500D01*
X368450D02*X369200Y58250D01*
X366950Y57500D02*X368450D01*
X366200Y58250D02*X366950Y57500D01*
X366200Y59750D02*Y58250D01*
Y59750D02*X366950Y60500D01*
X368450D01*
X369200Y59750D01*
X371750Y57500D02*X374000D01*
X371000Y58250D02*X371750Y57500D01*
X371000Y59750D02*Y58250D01*
Y59750D02*X371750Y60500D01*
X373250D01*
X374000Y59750D01*
X371000Y59000D02*X374000D01*
Y59750D02*Y59000D01*
X375800Y56000D02*X377300Y57500D01*
X381800Y63500D02*X384800D01*
X381800D02*Y60500D01*
X382550Y61250D01*
X384050D01*
X384800Y60500D01*
Y58250D01*
X384050Y57500D02*X384800Y58250D01*
X382550Y57500D02*X384050D01*
X381800Y58250D02*X382550Y57500D01*
X386600Y58250D02*X387350Y57500D01*
X386600Y62750D02*Y58250D01*
Y62750D02*X387350Y63500D01*
X388850D01*
X389600Y62750D01*
Y58250D01*
X388850Y57500D02*X389600Y58250D01*
X387350Y57500D02*X388850D01*
X386600Y59000D02*X389600Y62000D01*
X391400Y58250D02*X392150Y57500D01*
X391400Y62750D02*Y58250D01*
Y62750D02*X392150Y63500D01*
X393650D01*
X394400Y62750D01*
Y58250D01*
X393650Y57500D02*X394400Y58250D01*
X392150Y57500D02*X393650D01*
X391400Y59000D02*X394400Y62000D01*
X396200Y57500D02*X396950D01*
X398750Y58250D02*X399500Y57500D01*
X398750Y62750D02*Y58250D01*
Y62750D02*X399500Y63500D01*
X401000D01*
X401750Y62750D01*
Y58250D01*
X401000Y57500D02*X401750Y58250D01*
X399500Y57500D02*X401000D01*
X398750Y59000D02*X401750Y62000D01*
X403550Y58250D02*X404300Y57500D01*
X403550Y62750D02*Y58250D01*
Y62750D02*X404300Y63500D01*
X405800D01*
X406550Y62750D01*
Y58250D01*
X405800Y57500D02*X406550Y58250D01*
X404300Y57500D02*X405800D01*
X403550Y59000D02*X406550Y62000D01*
X408350Y58250D02*X409100Y57500D01*
X408350Y62750D02*Y58250D01*
Y62750D02*X409100Y63500D01*
X410600D01*
X411350Y62750D01*
Y58250D01*
X410600Y57500D02*X411350Y58250D01*
X409100Y57500D02*X410600D01*
X408350Y59000D02*X411350Y62000D01*
X413150Y58250D02*X413900Y57500D01*
X413150Y62750D02*Y58250D01*
Y62750D02*X413900Y63500D01*
X415400D01*
X416150Y62750D01*
Y58250D01*
X415400Y57500D02*X416150Y58250D01*
X413900Y57500D02*X415400D01*
X413150Y59000D02*X416150Y62000D01*
X417950Y58250D02*X418700Y57500D01*
X417950Y62750D02*Y58250D01*
Y62750D02*X418700Y63500D01*
X420200D01*
X420950Y62750D01*
Y58250D01*
X420200Y57500D02*X420950Y58250D01*
X418700Y57500D02*X420200D01*
X417950Y59000D02*X420950Y62000D01*
X422750Y58250D02*X423500Y57500D01*
X422750Y62750D02*Y58250D01*
Y62750D02*X423500Y63500D01*
X425000D01*
X425750Y62750D01*
Y58250D01*
X425000Y57500D02*X425750Y58250D01*
X423500Y57500D02*X425000D01*
X422750Y59000D02*X425750Y62000D01*
X431000Y59750D02*Y57500D01*
Y59750D02*X431750Y60500D01*
X432500D01*
X433250Y59750D01*
Y57500D01*
Y59750D02*X434000Y60500D01*
X434750D01*
X435500Y59750D01*
Y57500D01*
X430250Y60500D02*X431000Y59750D01*
G54D20*X437300Y62000D02*Y61850D01*
G54D19*Y59750D02*Y57500D01*
X438800Y63500D02*Y58250D01*
X439550Y57500D01*
X441800D02*X444050D01*
X444800Y58250D01*
X444050Y59000D02*X444800Y58250D01*
X441800Y59000D02*X444050D01*
X441050Y59750D02*X441800Y59000D01*
X441050Y59750D02*X441800Y60500D01*
X444050D01*
X444800Y59750D01*
X441050Y58250D02*X441800Y57500D01*
X449300Y63500D02*Y57500D01*
Y59750D02*X450050Y60500D01*
X451550D01*
X452300Y59750D01*
Y57500D01*
G54D20*X454100Y62000D02*Y61850D01*
G54D19*Y59750D02*Y57500D01*
X457850Y60500D02*X458600Y59750D01*
X456350Y60500D02*X457850D01*
X455600Y59750D02*X456350Y60500D01*
X455600Y59750D02*Y58250D01*
X456350Y57500D01*
X457850D01*
X458600Y58250D01*
X455600Y56000D02*X456350Y55250D01*
X457850D01*
X458600Y56000D01*
Y60500D02*Y56000D01*
X460400Y63500D02*Y57500D01*
Y59750D02*X461150Y60500D01*
X462650D01*
X463400Y59750D01*
Y57500D01*
X0Y-9500D02*X3000D01*
X3750Y-8750D01*
Y-6950D02*Y-8750D01*
X3000Y-6200D02*X3750Y-6950D01*
X750Y-6200D02*X3000D01*
X750Y-3500D02*Y-9500D01*
X0Y-3500D02*X3000D01*
X3750Y-4250D01*
Y-5450D01*
X3000Y-6200D02*X3750Y-5450D01*
X5550Y-7250D02*Y-8750D01*
Y-7250D02*X6300Y-6500D01*
X7800D01*
X8550Y-7250D01*
Y-8750D01*
X7800Y-9500D02*X8550Y-8750D01*
X6300Y-9500D02*X7800D01*
X5550Y-8750D02*X6300Y-9500D01*
X12600Y-6500D02*X13350Y-7250D01*
X11100Y-6500D02*X12600D01*
X10350Y-7250D02*X11100Y-6500D01*
X10350Y-7250D02*Y-8750D01*
X11100Y-9500D01*
X13350Y-6500D02*Y-8750D01*
X14100Y-9500D01*
X11100D02*X12600D01*
X13350Y-8750D01*
X16650Y-7250D02*Y-9500D01*
Y-7250D02*X17400Y-6500D01*
X18900D01*
X15900D02*X16650Y-7250D01*
X23700Y-3500D02*Y-9500D01*
X22950D02*X23700Y-8750D01*
X21450Y-9500D02*X22950D01*
X20700Y-8750D02*X21450Y-9500D01*
X20700Y-7250D02*Y-8750D01*
Y-7250D02*X21450Y-6500D01*
X22950D01*
X23700Y-7250D01*
X28200D02*Y-8750D01*
Y-7250D02*X28950Y-6500D01*
X30450D01*
X31200Y-7250D01*
Y-8750D01*
X30450Y-9500D02*X31200Y-8750D01*
X28950Y-9500D02*X30450D01*
X28200Y-8750D02*X28950Y-9500D01*
X33000Y-6500D02*Y-8750D01*
X33750Y-9500D01*
X35250D01*
X36000Y-8750D01*
Y-6500D02*Y-8750D01*
X38550Y-3500D02*Y-8750D01*
X39300Y-9500D01*
X37800Y-5750D02*X39300D01*
X40800Y-3500D02*Y-8750D01*
X41550Y-9500D01*
G54D20*X43050Y-5000D02*Y-5150D01*
G54D19*Y-7250D02*Y-9500D01*
X45300Y-7250D02*Y-9500D01*
Y-7250D02*X46050Y-6500D01*
X46800D01*
X47550Y-7250D01*
Y-9500D01*
X44550Y-6500D02*X45300Y-7250D01*
X50100Y-9500D02*X52350D01*
X49350Y-8750D02*X50100Y-9500D01*
X49350Y-7250D02*Y-8750D01*
Y-7250D02*X50100Y-6500D01*
X51600D01*
X52350Y-7250D01*
X49350Y-8000D02*X52350D01*
Y-7250D02*Y-8000D01*
G54D20*X56850Y-5000D02*Y-5150D01*
G54D19*Y-7250D02*Y-9500D01*
X59100D02*X61350D01*
X62100Y-8750D01*
X61350Y-8000D02*X62100Y-8750D01*
X59100Y-8000D02*X61350D01*
X58350Y-7250D02*X59100Y-8000D01*
X58350Y-7250D02*X59100Y-6500D01*
X61350D01*
X62100Y-7250D01*
X58350Y-8750D02*X59100Y-9500D01*
X67350Y-3500D02*Y-8750D01*
X68100Y-9500D01*
X66600Y-5750D02*X68100D01*
X69600Y-3500D02*Y-9500D01*
Y-7250D02*X70350Y-6500D01*
X71850D01*
X72600Y-7250D01*
Y-9500D01*
X75150D02*X77400D01*
X74400Y-8750D02*X75150Y-9500D01*
X74400Y-7250D02*Y-8750D01*
Y-7250D02*X75150Y-6500D01*
X76650D01*
X77400Y-7250D01*
X74400Y-8000D02*X77400D01*
Y-7250D02*Y-8000D01*
X82650Y-6500D02*X84900D01*
X81900Y-7250D02*X82650Y-6500D01*
X81900Y-7250D02*Y-8750D01*
X82650Y-9500D01*
X84900D01*
X87450D02*X89700D01*
X86700Y-8750D02*X87450Y-9500D01*
X86700Y-7250D02*Y-8750D01*
Y-7250D02*X87450Y-6500D01*
X88950D01*
X89700Y-7250D01*
X86700Y-8000D02*X89700D01*
Y-7250D02*Y-8000D01*
X92250Y-7250D02*Y-9500D01*
Y-7250D02*X93000Y-6500D01*
X93750D01*
X94500Y-7250D01*
Y-9500D01*
X91500Y-6500D02*X92250Y-7250D01*
X97050Y-3500D02*Y-8750D01*
X97800Y-9500D01*
X96300Y-5750D02*X97800D01*
X100050Y-9500D02*X102300D01*
X99300Y-8750D02*X100050Y-9500D01*
X99300Y-7250D02*Y-8750D01*
Y-7250D02*X100050Y-6500D01*
X101550D01*
X102300Y-7250D01*
X99300Y-8000D02*X102300D01*
Y-7250D02*Y-8000D01*
X104850Y-7250D02*Y-9500D01*
Y-7250D02*X105600Y-6500D01*
X107100D01*
X104100D02*X104850Y-7250D01*
X108900Y-3500D02*Y-8750D01*
X109650Y-9500D01*
G54D20*X111150Y-5000D02*Y-5150D01*
G54D19*Y-7250D02*Y-9500D01*
X113400Y-7250D02*Y-9500D01*
Y-7250D02*X114150Y-6500D01*
X114900D01*
X115650Y-7250D01*
Y-9500D01*
X112650Y-6500D02*X113400Y-7250D01*
X118200Y-9500D02*X120450D01*
X117450Y-8750D02*X118200Y-9500D01*
X117450Y-7250D02*Y-8750D01*
Y-7250D02*X118200Y-6500D01*
X119700D01*
X120450Y-7250D01*
X117450Y-8000D02*X120450D01*
Y-7250D02*Y-8000D01*
X124950Y-7250D02*Y-8750D01*
Y-7250D02*X125700Y-6500D01*
X127200D01*
X127950Y-7250D01*
Y-8750D01*
X127200Y-9500D02*X127950Y-8750D01*
X125700Y-9500D02*X127200D01*
X124950Y-8750D02*X125700Y-9500D01*
X130500Y-4250D02*Y-9500D01*
Y-4250D02*X131250Y-3500D01*
X132000D01*
X129750Y-6500D02*X131250D01*
X136950Y-3500D02*Y-8750D01*
X137700Y-9500D01*
X136200Y-5750D02*X137700D01*
X139200Y-3500D02*Y-9500D01*
Y-7250D02*X139950Y-6500D01*
X141450D01*
X142200Y-7250D01*
Y-9500D01*
G54D20*X144000Y-5000D02*Y-5150D01*
G54D19*Y-7250D02*Y-9500D01*
X146250D02*X148500D01*
X149250Y-8750D01*
X148500Y-8000D02*X149250Y-8750D01*
X146250Y-8000D02*X148500D01*
X145500Y-7250D02*X146250Y-8000D01*
X145500Y-7250D02*X146250Y-6500D01*
X148500D01*
X149250Y-7250D01*
X145500Y-8750D02*X146250Y-9500D01*
X153750Y-8750D02*X154500Y-9500D01*
X153750Y-7550D02*Y-8750D01*
Y-7550D02*X154800Y-6500D01*
X155700D01*
X156750Y-7550D01*
Y-8750D01*
X156000Y-9500D02*X156750Y-8750D01*
X154500Y-9500D02*X156000D01*
X153750Y-5450D02*X154800Y-6500D01*
X153750Y-4250D02*Y-5450D01*
Y-4250D02*X154500Y-3500D01*
X156000D01*
X156750Y-4250D01*
Y-5450D01*
X155700Y-6500D02*X156750Y-5450D01*
X158550Y-9500D02*X159300D01*
X161100Y-8750D02*X161850Y-9500D01*
X161100Y-4250D02*Y-8750D01*
Y-4250D02*X161850Y-3500D01*
X163350D01*
X164100Y-4250D01*
Y-8750D01*
X163350Y-9500D02*X164100Y-8750D01*
X161850Y-9500D02*X163350D01*
X161100Y-8000D02*X164100Y-5000D01*
X165900Y-8750D02*X166650Y-9500D01*
X165900Y-4250D02*Y-8750D01*
Y-4250D02*X166650Y-3500D01*
X168150D01*
X168900Y-4250D01*
Y-8750D01*
X168150Y-9500D02*X168900Y-8750D01*
X166650Y-9500D02*X168150D01*
X165900Y-8000D02*X168900Y-5000D01*
X170700Y-8750D02*X171450Y-9500D01*
X170700Y-4250D02*Y-8750D01*
Y-4250D02*X171450Y-3500D01*
X172950D01*
X173700Y-4250D01*
Y-8750D01*
X172950Y-9500D02*X173700Y-8750D01*
X171450Y-9500D02*X172950D01*
X170700Y-8000D02*X173700Y-5000D01*
X175500Y-8750D02*X176250Y-9500D01*
X175500Y-4250D02*Y-8750D01*
Y-4250D02*X176250Y-3500D01*
X177750D01*
X178500Y-4250D01*
Y-8750D01*
X177750Y-9500D02*X178500Y-8750D01*
X176250Y-9500D02*X177750D01*
X175500Y-8000D02*X178500Y-5000D01*
X180300Y-8750D02*X181050Y-9500D01*
X180300Y-4250D02*Y-8750D01*
Y-4250D02*X181050Y-3500D01*
X182550D01*
X183300Y-4250D01*
Y-8750D01*
X182550Y-9500D02*X183300Y-8750D01*
X181050Y-9500D02*X182550D01*
X180300Y-8000D02*X183300Y-5000D01*
X185100Y-8750D02*X185850Y-9500D01*
X185100Y-4250D02*Y-8750D01*
Y-4250D02*X185850Y-3500D01*
X187350D01*
X188100Y-4250D01*
Y-8750D01*
X187350Y-9500D02*X188100Y-8750D01*
X185850Y-9500D02*X187350D01*
X185100Y-8000D02*X188100Y-5000D01*
X193350Y-7250D02*Y-9500D01*
Y-7250D02*X194100Y-6500D01*
X194850D01*
X195600Y-7250D01*
Y-9500D01*
Y-7250D02*X196350Y-6500D01*
X197100D01*
X197850Y-7250D01*
Y-9500D01*
X192600Y-6500D02*X193350Y-7250D01*
G54D20*X199650Y-5000D02*Y-5150D01*
G54D19*Y-7250D02*Y-9500D01*
X201150Y-3500D02*Y-8750D01*
X201900Y-9500D01*
X206850Y-7250D02*Y-9500D01*
Y-7250D02*X207600Y-6500D01*
X209100D01*
X206100D02*X206850Y-7250D01*
X211650Y-9500D02*X213900D01*
X210900Y-8750D02*X211650Y-9500D01*
X210900Y-7250D02*Y-8750D01*
Y-7250D02*X211650Y-6500D01*
X213150D01*
X213900Y-7250D01*
X210900Y-8000D02*X213900D01*
Y-7250D02*Y-8000D01*
X216450Y-6500D02*X218700D01*
X215700Y-7250D02*X216450Y-6500D01*
X215700Y-7250D02*Y-8750D01*
X216450Y-9500D01*
X218700D01*
X221250Y-3500D02*Y-8750D01*
X222000Y-9500D01*
X220500Y-5750D02*X222000D01*
X225750Y-6500D02*X226500Y-7250D01*
X224250Y-6500D02*X225750D01*
X223500Y-7250D02*X224250Y-6500D01*
X223500Y-7250D02*Y-8750D01*
X224250Y-9500D01*
X226500Y-6500D02*Y-8750D01*
X227250Y-9500D01*
X224250D02*X225750D01*
X226500Y-8750D01*
X229800Y-7250D02*Y-9500D01*
Y-7250D02*X230550Y-6500D01*
X231300D01*
X232050Y-7250D01*
Y-9500D01*
X229050Y-6500D02*X229800Y-7250D01*
X236100Y-6500D02*X236850Y-7250D01*
X234600Y-6500D02*X236100D01*
X233850Y-7250D02*X234600Y-6500D01*
X233850Y-7250D02*Y-8750D01*
X234600Y-9500D01*
X236100D01*
X236850Y-8750D01*
X233850Y-11000D02*X234600Y-11750D01*
X236100D01*
X236850Y-11000D01*
Y-6500D02*Y-11000D01*
X238650Y-3500D02*Y-8750D01*
X239400Y-9500D01*
X241650D02*X243900D01*
X240900Y-8750D02*X241650Y-9500D01*
X240900Y-7250D02*Y-8750D01*
Y-7250D02*X241650Y-6500D01*
X243150D01*
X243900Y-7250D01*
X240900Y-8000D02*X243900D01*
Y-7250D02*Y-8000D01*
X248400Y-6500D02*X251400D01*
X255900Y-8750D02*X256650Y-9500D01*
X255900Y-4250D02*Y-8750D01*
Y-4250D02*X256650Y-3500D01*
X258150D01*
X258900Y-4250D01*
Y-8750D01*
X258150Y-9500D02*X258900Y-8750D01*
X256650Y-9500D02*X258150D01*
X255900Y-8000D02*X258900Y-5000D01*
X260700Y-11000D02*X262200Y-9500D01*
X264000Y-8750D02*X264750Y-9500D01*
X264000Y-4250D02*Y-8750D01*
Y-4250D02*X264750Y-3500D01*
X266250D01*
X267000Y-4250D01*
Y-8750D01*
X266250Y-9500D02*X267000Y-8750D01*
X264750Y-9500D02*X266250D01*
X264000Y-8000D02*X267000Y-5000D01*
X272250Y-3500D02*Y-8750D01*
X273000Y-9500D01*
X271500Y-5750D02*X273000D01*
X274500Y-7250D02*Y-8750D01*
Y-7250D02*X275250Y-6500D01*
X276750D01*
X277500Y-7250D01*
Y-8750D01*
X276750Y-9500D02*X277500Y-8750D01*
X275250Y-9500D02*X276750D01*
X274500Y-8750D02*X275250Y-9500D01*
X282000Y-3500D02*X285000D01*
X282000D02*Y-6500D01*
X282750Y-5750D01*
X284250D01*
X285000Y-6500D01*
Y-8750D01*
X284250Y-9500D02*X285000Y-8750D01*
X282750Y-9500D02*X284250D01*
X282000Y-8750D02*X282750Y-9500D01*
X286800Y-8750D02*X287550Y-9500D01*
X286800Y-4250D02*Y-8750D01*
Y-4250D02*X287550Y-3500D01*
X289050D01*
X289800Y-4250D01*
Y-8750D01*
X289050Y-9500D02*X289800Y-8750D01*
X287550Y-9500D02*X289050D01*
X286800Y-8000D02*X289800Y-5000D01*
X291600Y-8750D02*X292350Y-9500D01*
X291600Y-4250D02*Y-8750D01*
Y-4250D02*X292350Y-3500D01*
X293850D01*
X294600Y-4250D01*
Y-8750D01*
X293850Y-9500D02*X294600Y-8750D01*
X292350Y-9500D02*X293850D01*
X291600Y-8000D02*X294600Y-5000D01*
X296400Y-9500D02*X297150D01*
X298950Y-8750D02*X299700Y-9500D01*
X298950Y-4250D02*Y-8750D01*
Y-4250D02*X299700Y-3500D01*
X301200D01*
X301950Y-4250D01*
Y-8750D01*
X301200Y-9500D02*X301950Y-8750D01*
X299700Y-9500D02*X301200D01*
X298950Y-8000D02*X301950Y-5000D01*
X303750Y-8750D02*X304500Y-9500D01*
X303750Y-4250D02*Y-8750D01*
Y-4250D02*X304500Y-3500D01*
X306000D01*
X306750Y-4250D01*
Y-8750D01*
X306000Y-9500D02*X306750Y-8750D01*
X304500Y-9500D02*X306000D01*
X303750Y-8000D02*X306750Y-5000D01*
X308550Y-8750D02*X309300Y-9500D01*
X308550Y-4250D02*Y-8750D01*
Y-4250D02*X309300Y-3500D01*
X310800D01*
X311550Y-4250D01*
Y-8750D01*
X310800Y-9500D02*X311550Y-8750D01*
X309300Y-9500D02*X310800D01*
X308550Y-8000D02*X311550Y-5000D01*
X313350Y-8750D02*X314100Y-9500D01*
X313350Y-4250D02*Y-8750D01*
Y-4250D02*X314100Y-3500D01*
X315600D01*
X316350Y-4250D01*
Y-8750D01*
X315600Y-9500D02*X316350Y-8750D01*
X314100Y-9500D02*X315600D01*
X313350Y-8000D02*X316350Y-5000D01*
X318150Y-8750D02*X318900Y-9500D01*
X318150Y-4250D02*Y-8750D01*
Y-4250D02*X318900Y-3500D01*
X320400D01*
X321150Y-4250D01*
Y-8750D01*
X320400Y-9500D02*X321150Y-8750D01*
X318900Y-9500D02*X320400D01*
X318150Y-8000D02*X321150Y-5000D01*
X322950Y-8750D02*X323700Y-9500D01*
X322950Y-4250D02*Y-8750D01*
Y-4250D02*X323700Y-3500D01*
X325200D01*
X325950Y-4250D01*
Y-8750D01*
X325200Y-9500D02*X325950Y-8750D01*
X323700Y-9500D02*X325200D01*
X322950Y-8000D02*X325950Y-5000D01*
X327750Y-11000D02*X329250Y-9500D01*
X331050Y-3500D02*X334050D01*
X331050D02*Y-6500D01*
X331800Y-5750D01*
X333300D01*
X334050Y-6500D01*
Y-8750D01*
X333300Y-9500D02*X334050Y-8750D01*
X331800Y-9500D02*X333300D01*
X331050Y-8750D02*X331800Y-9500D01*
X335850Y-8750D02*X336600Y-9500D01*
X335850Y-4250D02*Y-8750D01*
Y-4250D02*X336600Y-3500D01*
X338100D01*
X338850Y-4250D01*
Y-8750D01*
X338100Y-9500D02*X338850Y-8750D01*
X336600Y-9500D02*X338100D01*
X335850Y-8000D02*X338850Y-5000D01*
X340650Y-8750D02*X341400Y-9500D01*
X340650Y-4250D02*Y-8750D01*
Y-4250D02*X341400Y-3500D01*
X342900D01*
X343650Y-4250D01*
Y-8750D01*
X342900Y-9500D02*X343650Y-8750D01*
X341400Y-9500D02*X342900D01*
X340650Y-8000D02*X343650Y-5000D01*
X345450Y-9500D02*X346200D01*
X348000Y-8750D02*X348750Y-9500D01*
X348000Y-4250D02*Y-8750D01*
Y-4250D02*X348750Y-3500D01*
X350250D01*
X351000Y-4250D01*
Y-8750D01*
X350250Y-9500D02*X351000Y-8750D01*
X348750Y-9500D02*X350250D01*
X348000Y-8000D02*X351000Y-5000D01*
X352800Y-8750D02*X353550Y-9500D01*
X352800Y-4250D02*Y-8750D01*
Y-4250D02*X353550Y-3500D01*
X355050D01*
X355800Y-4250D01*
Y-8750D01*
X355050Y-9500D02*X355800Y-8750D01*
X353550Y-9500D02*X355050D01*
X352800Y-8000D02*X355800Y-5000D01*
X357600Y-8750D02*X358350Y-9500D01*
X357600Y-4250D02*Y-8750D01*
Y-4250D02*X358350Y-3500D01*
X359850D01*
X360600Y-4250D01*
Y-8750D01*
X359850Y-9500D02*X360600Y-8750D01*
X358350Y-9500D02*X359850D01*
X357600Y-8000D02*X360600Y-5000D01*
X362400Y-8750D02*X363150Y-9500D01*
X362400Y-4250D02*Y-8750D01*
Y-4250D02*X363150Y-3500D01*
X364650D01*
X365400Y-4250D01*
Y-8750D01*
X364650Y-9500D02*X365400Y-8750D01*
X363150Y-9500D02*X364650D01*
X362400Y-8000D02*X365400Y-5000D01*
X367200Y-8750D02*X367950Y-9500D01*
X367200Y-4250D02*Y-8750D01*
Y-4250D02*X367950Y-3500D01*
X369450D01*
X370200Y-4250D01*
Y-8750D01*
X369450Y-9500D02*X370200Y-8750D01*
X367950Y-9500D02*X369450D01*
X367200Y-8000D02*X370200Y-5000D01*
X372000Y-8750D02*X372750Y-9500D01*
X372000Y-4250D02*Y-8750D01*
Y-4250D02*X372750Y-3500D01*
X374250D01*
X375000Y-4250D01*
Y-8750D01*
X374250Y-9500D02*X375000Y-8750D01*
X372750Y-9500D02*X374250D01*
X372000Y-8000D02*X375000Y-5000D01*
X380250Y-7250D02*Y-9500D01*
Y-7250D02*X381000Y-6500D01*
X381750D01*
X382500Y-7250D01*
Y-9500D01*
Y-7250D02*X383250Y-6500D01*
X384000D01*
X384750Y-7250D01*
Y-9500D01*
X379500Y-6500D02*X380250Y-7250D01*
G54D20*X386550Y-5000D02*Y-5150D01*
G54D19*Y-7250D02*Y-9500D01*
X388050Y-3500D02*Y-8750D01*
X388800Y-9500D01*
X391050D02*X393300D01*
X394050Y-8750D01*
X393300Y-8000D02*X394050Y-8750D01*
X391050Y-8000D02*X393300D01*
X390300Y-7250D02*X391050Y-8000D01*
X390300Y-7250D02*X391050Y-6500D01*
X393300D01*
X394050Y-7250D01*
X390300Y-8750D02*X391050Y-9500D01*
X200750Y78500D02*Y72500D01*
X202700Y78500D02*X203750Y77450D01*
Y73550D01*
X202700Y72500D02*X203750Y73550D01*
X200000Y72500D02*X202700D01*
X200000Y78500D02*X202700D01*
X207800Y75500D02*X208550Y74750D01*
X206300Y75500D02*X207800D01*
X205550Y74750D02*X206300Y75500D01*
X205550Y74750D02*Y73250D01*
X206300Y72500D01*
X208550Y75500D02*Y73250D01*
X209300Y72500D01*
X206300D02*X207800D01*
X208550Y73250D01*
X211850Y78500D02*Y73250D01*
X212600Y72500D01*
X211100Y76250D02*X212600D01*
X214850Y72500D02*X217100D01*
X214100Y73250D02*X214850Y72500D01*
X214100Y74750D02*Y73250D01*
Y74750D02*X214850Y75500D01*
X216350D01*
X217100Y74750D01*
X214100Y74000D02*X217100D01*
Y74750D02*Y74000D01*
X218900Y76250D02*X219650D01*
X218900Y74750D02*X219650D01*
X224150Y75500D02*X225650Y77000D01*
X224150Y75500D02*X225650Y74000D01*
X230450Y78500D02*Y72500D01*
X229700D02*X230450Y73250D01*
X228200Y72500D02*X229700D01*
X227450Y73250D02*X228200Y72500D01*
X227450Y74750D02*Y73250D01*
Y74750D02*X228200Y75500D01*
X229700D01*
X230450Y74750D01*
X234500Y75500D02*X235250Y74750D01*
X233000Y75500D02*X234500D01*
X232250Y74750D02*X233000Y75500D01*
X232250Y74750D02*Y73250D01*
X233000Y72500D01*
X235250Y75500D02*Y73250D01*
X236000Y72500D01*
X233000D02*X234500D01*
X235250Y73250D01*
X238550Y78500D02*Y73250D01*
X239300Y72500D01*
X237800Y76250D02*X239300D01*
X241550Y72500D02*X243800D01*
X240800Y73250D02*X241550Y72500D01*
X240800Y74750D02*Y73250D01*
Y74750D02*X241550Y75500D01*
X243050D01*
X243800Y74750D01*
X240800Y74000D02*X243800D01*
Y74750D02*Y74000D01*
X245600Y77000D02*X247100Y75500D01*
X245600Y74000D02*X247100Y75500D01*
X200000Y92000D02*Y87500D01*
Y92000D02*X201050Y93500D01*
X202700D01*
X203750Y92000D01*
Y87500D01*
X200000Y90500D02*X203750D01*
X205550D02*Y88250D01*
X206300Y87500D01*
X207800D01*
X208550Y88250D01*
Y90500D02*Y88250D01*
X211100Y93500D02*Y88250D01*
X211850Y87500D01*
X210350Y91250D02*X211850D01*
X213350Y93500D02*Y87500D01*
Y89750D02*X214100Y90500D01*
X215600D01*
X216350Y89750D01*
Y87500D01*
X218150Y89750D02*Y88250D01*
Y89750D02*X218900Y90500D01*
X220400D01*
X221150Y89750D01*
Y88250D01*
X220400Y87500D02*X221150Y88250D01*
X218900Y87500D02*X220400D01*
X218150Y88250D02*X218900Y87500D01*
X223700Y89750D02*Y87500D01*
Y89750D02*X224450Y90500D01*
X225950D01*
X222950D02*X223700Y89750D01*
X227750Y91250D02*X228500D01*
X227750Y89750D02*X228500D01*
X200000Y108500D02*X203000D01*
X201500D02*Y102500D01*
G54D20*X204800Y107000D02*Y106850D01*
G54D19*Y104750D02*Y102500D01*
X207050Y108500D02*Y103250D01*
X207800Y102500D01*
X206300Y106250D02*X207800D01*
X209300Y108500D02*Y103250D01*
X210050Y102500D01*
X212300D02*X214550D01*
X211550Y103250D02*X212300Y102500D01*
X211550Y104750D02*Y103250D01*
Y104750D02*X212300Y105500D01*
X213800D01*
X214550Y104750D01*
X211550Y104000D02*X214550D01*
Y104750D02*Y104000D01*
X216350Y106250D02*X217100D01*
X216350Y104750D02*X217100D01*
X222350Y108500D02*Y103250D01*
X223100Y102500D01*
X221600Y106250D02*X223100D01*
X224600Y108500D02*Y102500D01*
Y104750D02*X225350Y105500D01*
X226850D01*
X227600Y104750D01*
Y102500D01*
X230150D02*X232400D01*
X229400Y103250D02*X230150Y102500D01*
X229400Y104750D02*Y103250D01*
Y104750D02*X230150Y105500D01*
X231650D01*
X232400Y104750D01*
X229400Y104000D02*X232400D01*
Y104750D02*Y104000D01*
X234950Y104750D02*Y102500D01*
Y104750D02*X235700Y105500D01*
X237200D01*
X234200D02*X234950Y104750D01*
X239750D02*Y102500D01*
Y104750D02*X240500Y105500D01*
X241250D01*
X242000Y104750D01*
Y102500D01*
Y104750D02*X242750Y105500D01*
X243500D01*
X244250Y104750D01*
Y102500D01*
X239000Y105500D02*X239750Y104750D01*
X248300Y105500D02*X249050Y104750D01*
X246800Y105500D02*X248300D01*
X246050Y104750D02*X246800Y105500D01*
X246050Y104750D02*Y103250D01*
X246800Y102500D01*
X249050Y105500D02*Y103250D01*
X249800Y102500D01*
X246800D02*X248300D01*
X249050Y103250D01*
X251600Y108500D02*Y103250D01*
X252350Y102500D01*
X254600D02*X256850D01*
X257600Y103250D01*
X256850Y104000D02*X257600Y103250D01*
X254600Y104000D02*X256850D01*
X253850Y104750D02*X254600Y104000D01*
X253850Y104750D02*X254600Y105500D01*
X256850D01*
X257600Y104750D01*
X253850Y103250D02*X254600Y102500D01*
X262100Y104750D02*Y103250D01*
Y104750D02*X262850Y105500D01*
X264350D01*
X265100Y104750D01*
Y103250D01*
X264350Y102500D02*X265100Y103250D01*
X262850Y102500D02*X264350D01*
X262100Y103250D02*X262850Y102500D01*
X267650Y104750D02*Y102500D01*
Y104750D02*X268400Y105500D01*
X269150D01*
X269900Y104750D01*
Y102500D01*
X266900Y105500D02*X267650Y104750D01*
X275150Y108500D02*Y103250D01*
X275900Y102500D01*
X274400Y106250D02*X275900D01*
X277400Y108500D02*Y102500D01*
Y104750D02*X278150Y105500D01*
X279650D01*
X280400Y104750D01*
Y102500D01*
X282950D02*X285200D01*
X282200Y103250D02*X282950Y102500D01*
X282200Y104750D02*Y103250D01*
Y104750D02*X282950Y105500D01*
X284450D01*
X285200Y104750D01*
X282200Y104000D02*X285200D01*
Y104750D02*Y104000D01*
X289700Y108500D02*Y103250D01*
X290450Y102500D01*
X294200Y105500D02*X294950Y104750D01*
X292700Y105500D02*X294200D01*
X291950Y104750D02*X292700Y105500D01*
X291950Y104750D02*Y103250D01*
X292700Y102500D01*
X294950Y105500D02*Y103250D01*
X295700Y102500D01*
X292700D02*X294200D01*
X294950Y103250D01*
X298250Y102500D02*X300500D01*
X301250Y103250D01*
X300500Y104000D02*X301250Y103250D01*
X298250Y104000D02*X300500D01*
X297500Y104750D02*X298250Y104000D01*
X297500Y104750D02*X298250Y105500D01*
X300500D01*
X301250Y104750D01*
X297500Y103250D02*X298250Y102500D01*
X303800Y108500D02*Y103250D01*
X304550Y102500D01*
X303050Y106250D02*X304550D01*
X308750Y107750D02*X309500Y108500D01*
X311750D01*
X312500Y107750D01*
Y106250D01*
X308750Y102500D02*X312500Y106250D01*
X308750Y102500D02*X312500D01*
X317000Y108500D02*Y103250D01*
X317750Y102500D01*
X321500Y105500D02*X322250Y104750D01*
X320000Y105500D02*X321500D01*
X319250Y104750D02*X320000Y105500D01*
X319250Y104750D02*Y103250D01*
X320000Y102500D01*
X322250Y105500D02*Y103250D01*
X323000Y102500D01*
X320000D02*X321500D01*
X322250Y103250D01*
X324800Y105500D02*Y103250D01*
X325550Y102500D01*
X327800Y105500D02*Y101000D01*
X327050Y100250D02*X327800Y101000D01*
X325550Y100250D02*X327050D01*
X324800Y101000D02*X325550Y100250D01*
Y102500D02*X327050D01*
X327800Y103250D01*
X330350Y102500D02*X332600D01*
X329600Y103250D02*X330350Y102500D01*
X329600Y104750D02*Y103250D01*
Y104750D02*X330350Y105500D01*
X331850D01*
X332600Y104750D01*
X329600Y104000D02*X332600D01*
Y104750D02*Y104000D01*
X335150Y104750D02*Y102500D01*
Y104750D02*X335900Y105500D01*
X337400D01*
X334400D02*X335150Y104750D01*
X339950Y102500D02*X342200D01*
X342950Y103250D01*
X342200Y104000D02*X342950Y103250D01*
X339950Y104000D02*X342200D01*
X339200Y104750D02*X339950Y104000D01*
X339200Y104750D02*X339950Y105500D01*
X342200D01*
X342950Y104750D01*
X339200Y103250D02*X339950Y102500D01*
X347450Y105500D02*X350450D01*
X355700D02*X357950D01*
X354950Y104750D02*X355700Y105500D01*
X354950Y104750D02*Y103250D01*
X355700Y102500D01*
X357950D01*
X362000Y105500D02*X362750Y104750D01*
X360500Y105500D02*X362000D01*
X359750Y104750D02*X360500Y105500D01*
X359750Y104750D02*Y103250D01*
X360500Y102500D01*
X362750Y105500D02*Y103250D01*
X363500Y102500D01*
X360500D02*X362000D01*
X362750Y103250D01*
X366050Y108500D02*Y103250D01*
X366800Y102500D01*
X365300Y106250D02*X366800D01*
X369050Y105500D02*X371300D01*
X368300Y104750D02*X369050Y105500D01*
X368300Y104750D02*Y103250D01*
X369050Y102500D01*
X371300D01*
X373100Y108500D02*Y102500D01*
Y104750D02*X373850Y105500D01*
X375350D01*
X376100Y104750D01*
Y102500D01*
X380600Y104750D02*Y103250D01*
Y104750D02*X381350Y105500D01*
X382850D01*
X383600Y104750D01*
Y103250D01*
X382850Y102500D02*X383600Y103250D01*
X381350Y102500D02*X382850D01*
X380600Y103250D02*X381350Y102500D01*
X386150Y107750D02*Y102500D01*
Y107750D02*X386900Y108500D01*
X387650D01*
X385400Y105500D02*X386900D01*
X389900Y107750D02*Y102500D01*
Y107750D02*X390650Y108500D01*
X391400D01*
X389150Y105500D02*X390650D01*
X392900D02*X395900D01*
X397700Y108500D02*Y102500D01*
Y103250D02*X398450Y102500D01*
X399950D01*
X400700Y103250D01*
Y104750D02*Y103250D01*
X399950Y105500D02*X400700Y104750D01*
X398450Y105500D02*X399950D01*
X397700Y104750D02*X398450Y105500D01*
X402500D02*Y103250D01*
X403250Y102500D01*
X405500Y105500D02*Y101000D01*
X404750Y100250D02*X405500Y101000D01*
X403250Y100250D02*X404750D01*
X402500Y101000D02*X403250Y100250D01*
Y102500D02*X404750D01*
X405500Y103250D01*
X407300Y105500D02*X410300D01*
X412100Y104750D02*Y103250D01*
Y104750D02*X412850Y105500D01*
X414350D01*
X415100Y104750D01*
Y103250D01*
X414350Y102500D02*X415100Y103250D01*
X412850Y102500D02*X414350D01*
X412100Y103250D02*X412850Y102500D01*
X417650Y104750D02*Y102500D01*
Y104750D02*X418400Y105500D01*
X419150D01*
X419900Y104750D01*
Y102500D01*
X416900Y105500D02*X417650Y104750D01*
X422450Y102500D02*X424700D01*
X421700Y103250D02*X422450Y102500D01*
X421700Y104750D02*Y103250D01*
Y104750D02*X422450Y105500D01*
X423950D01*
X424700Y104750D01*
X421700Y104000D02*X424700D01*
Y104750D02*Y104000D01*
X429200Y108500D02*Y102500D01*
Y103250D02*X429950Y102500D01*
X431450D01*
X432200Y103250D01*
Y104750D02*Y103250D01*
X431450Y105500D02*X432200Y104750D01*
X429950Y105500D02*X431450D01*
X429200Y104750D02*X429950Y105500D01*
X434000D02*Y103250D01*
X434750Y102500D01*
X436250D01*
X437000Y103250D01*
Y105500D02*Y103250D01*
X441050Y105500D02*X441800Y104750D01*
X439550Y105500D02*X441050D01*
X438800Y104750D02*X439550Y105500D01*
X438800Y104750D02*Y103250D01*
X439550Y102500D01*
X441050D01*
X441800Y103250D01*
X438800Y101000D02*X439550Y100250D01*
X441050D01*
X441800Y101000D01*
Y105500D02*Y101000D01*
X444350Y102500D02*X446600D01*
X447350Y103250D01*
X446600Y104000D02*X447350Y103250D01*
X444350Y104000D02*X446600D01*
X443600Y104750D02*X444350Y104000D01*
X443600Y104750D02*X444350Y105500D01*
X446600D01*
X447350Y104750D01*
X443600Y103250D02*X444350Y102500D01*
X454850Y108500D02*Y102500D01*
X454100D02*X454850Y103250D01*
X452600Y102500D02*X454100D01*
X451850Y103250D02*X452600Y102500D01*
X451850Y104750D02*Y103250D01*
Y104750D02*X452600Y105500D01*
X454100D01*
X454850Y104750D01*
X456650Y105500D02*Y103250D01*
X457400Y102500D01*
X458900D01*
X459650Y103250D01*
Y105500D02*Y103250D01*
X462200Y102500D02*X464450D01*
X461450Y103250D02*X462200Y102500D01*
X461450Y104750D02*Y103250D01*
Y104750D02*X462200Y105500D01*
X463700D01*
X464450Y104750D01*
X461450Y104000D02*X464450D01*
Y104750D02*Y104000D01*
X469700Y108500D02*Y103250D01*
X470450Y102500D01*
X468950Y106250D02*X470450D01*
X471950Y104750D02*Y103250D01*
Y104750D02*X472700Y105500D01*
X474200D01*
X474950Y104750D01*
Y103250D01*
X474200Y102500D02*X474950Y103250D01*
X472700Y102500D02*X474200D01*
X471950Y103250D02*X472700Y102500D01*
X480200Y108500D02*Y103250D01*
X480950Y102500D01*
X479450Y106250D02*X480950D01*
X482450Y108500D02*Y102500D01*
Y104750D02*X483200Y105500D01*
X484700D01*
X485450Y104750D01*
Y102500D01*
X488000D02*X490250D01*
X487250Y103250D02*X488000Y102500D01*
X487250Y104750D02*Y103250D01*
Y104750D02*X488000Y105500D01*
X489500D01*
X490250Y104750D01*
X487250Y104000D02*X490250D01*
Y104750D02*Y104000D01*
X494750Y103250D02*X495500Y102500D01*
X494750Y107750D02*Y103250D01*
Y107750D02*X495500Y108500D01*
X497000D01*
X497750Y107750D01*
Y103250D01*
X497000Y102500D02*X497750Y103250D01*
X495500Y102500D02*X497000D01*
X494750Y104000D02*X497750Y107000D01*
X499550Y105500D02*X502550D01*
X504350Y108500D02*Y102500D01*
Y103250D02*X505100Y102500D01*
X506600D01*
X507350Y103250D01*
Y104750D02*Y103250D01*
X506600Y105500D02*X507350Y104750D01*
X505100Y105500D02*X506600D01*
X504350Y104750D02*X505100Y105500D01*
X511400D02*X512150Y104750D01*
X509900Y105500D02*X511400D01*
X509150Y104750D02*X509900Y105500D01*
X509150Y104750D02*Y103250D01*
X509900Y102500D01*
X512150Y105500D02*Y103250D01*
X512900Y102500D01*
X509900D02*X511400D01*
X512150Y103250D01*
X515450Y102500D02*X517700D01*
X518450Y103250D01*
X517700Y104000D02*X518450Y103250D01*
X515450Y104000D02*X517700D01*
X514700Y104750D02*X515450Y104000D01*
X514700Y104750D02*X515450Y105500D01*
X517700D01*
X518450Y104750D01*
X514700Y103250D02*X515450Y102500D01*
X521000D02*X523250D01*
X520250Y103250D02*X521000Y102500D01*
X520250Y104750D02*Y103250D01*
Y104750D02*X521000Y105500D01*
X522500D01*
X523250Y104750D01*
X520250Y104000D02*X523250D01*
Y104750D02*Y104000D01*
G54D20*X527750Y107000D02*Y106850D01*
G54D19*Y104750D02*Y102500D01*
X530000Y104750D02*Y102500D01*
Y104750D02*X530750Y105500D01*
X531500D01*
X532250Y104750D01*
Y102500D01*
X529250Y105500D02*X530000Y104750D01*
X537050Y108500D02*Y102500D01*
X536300D02*X537050Y103250D01*
X534800Y102500D02*X536300D01*
X534050Y103250D02*X534800Y102500D01*
X534050Y104750D02*Y103250D01*
Y104750D02*X534800Y105500D01*
X536300D01*
X537050Y104750D01*
X539600Y102500D02*X541850D01*
X538850Y103250D02*X539600Y102500D01*
X538850Y104750D02*Y103250D01*
Y104750D02*X539600Y105500D01*
X541100D01*
X541850Y104750D01*
X538850Y104000D02*X541850D01*
Y104750D02*Y104000D01*
X543650Y105500D02*X546650Y102500D01*
X543650D02*X546650Y105500D01*
X551150Y104750D02*Y103250D01*
Y104750D02*X551900Y105500D01*
X553400D01*
X554150Y104750D01*
Y103250D01*
X553400Y102500D02*X554150Y103250D01*
X551900Y102500D02*X553400D01*
X551150Y103250D02*X551900Y102500D01*
X556700Y107750D02*Y102500D01*
Y107750D02*X557450Y108500D01*
X558200D01*
X555950Y105500D02*X557450D01*
X563150Y108500D02*Y103250D01*
X563900Y102500D01*
X562400Y106250D02*X563900D01*
X565400Y108500D02*Y102500D01*
Y104750D02*X566150Y105500D01*
X567650D01*
X568400Y104750D01*
Y102500D01*
X570950D02*X573200D01*
X570200Y103250D02*X570950Y102500D01*
X570200Y104750D02*Y103250D01*
Y104750D02*X570950Y105500D01*
X572450D01*
X573200Y104750D01*
X570200Y104000D02*X573200D01*
Y104750D02*Y104000D01*
X575750Y104750D02*Y102500D01*
Y104750D02*X576500Y105500D01*
X578000D01*
X575000D02*X575750Y104750D01*
X580550D02*Y102500D01*
Y104750D02*X581300Y105500D01*
X582050D01*
X582800Y104750D01*
Y102500D01*
Y104750D02*X583550Y105500D01*
X584300D01*
X585050Y104750D01*
Y102500D01*
X579800Y105500D02*X580550Y104750D01*
X589100Y105500D02*X589850Y104750D01*
X587600Y105500D02*X589100D01*
X586850Y104750D02*X587600Y105500D01*
X586850Y104750D02*Y103250D01*
X587600Y102500D01*
X589850Y105500D02*Y103250D01*
X590600Y102500D01*
X587600D02*X589100D01*
X589850Y103250D01*
X592400Y108500D02*Y103250D01*
X593150Y102500D01*
X595400D02*X597650D01*
X598400Y103250D01*
X597650Y104000D02*X598400Y103250D01*
X595400Y104000D02*X597650D01*
X594650Y104750D02*X595400Y104000D01*
X594650Y104750D02*X595400Y105500D01*
X597650D01*
X598400Y104750D01*
X594650Y103250D02*X595400Y102500D01*
X602900Y105500D02*X605900D01*
X610400Y108500D02*Y102500D01*
Y108500D02*X613400D01*
X610400Y105800D02*X612650D01*
X617450Y105500D02*X618200Y104750D01*
X615950Y105500D02*X617450D01*
X615200Y104750D02*X615950Y105500D01*
X615200Y104750D02*Y103250D01*
X615950Y102500D01*
X618200Y105500D02*Y103250D01*
X618950Y102500D01*
X615950D02*X617450D01*
X618200Y103250D01*
X620750Y108500D02*Y102500D01*
Y103250D02*X621500Y102500D01*
X623000D01*
X623750Y103250D01*
Y104750D02*Y103250D01*
X623000Y105500D02*X623750Y104750D01*
X621500Y105500D02*X623000D01*
X620750Y104750D02*X621500Y105500D01*
X626300Y104750D02*Y102500D01*
Y104750D02*X627050Y105500D01*
X628550D01*
X625550D02*X626300Y104750D01*
G54D20*X630350Y107000D02*Y106850D01*
G54D19*Y104750D02*Y102500D01*
X632600Y105500D02*X634850D01*
X631850Y104750D02*X632600Y105500D01*
X631850Y104750D02*Y103250D01*
X632600Y102500D01*
X634850D01*
X638901Y105500D02*X639651Y104750D01*
X637401Y105500D02*X638901D01*
X636651Y104750D02*X637401Y105500D01*
X636651Y104750D02*Y103250D01*
X637401Y102500D01*
X639651Y105500D02*Y103250D01*
X640401Y102500D01*
X637401D02*X638901D01*
X639651Y103250D01*
X642951Y108500D02*Y103250D01*
X643701Y102500D01*
X642201Y106250D02*X643701D01*
G54D20*X645201Y107000D02*Y106850D01*
G54D19*Y104750D02*Y102500D01*
X646701Y104750D02*Y103250D01*
Y104750D02*X647451Y105500D01*
X648951D01*
X649701Y104750D01*
Y103250D01*
X648951Y102500D02*X649701Y103250D01*
X647451Y102500D02*X648951D01*
X646701Y103250D02*X647451Y102500D01*
X652251Y104750D02*Y102500D01*
Y104750D02*X653001Y105500D01*
X653751D01*
X654501Y104750D01*
Y102500D01*
X651501Y105500D02*X652251Y104750D01*
X659751Y108500D02*Y102500D01*
X661701Y108500D02*X662751Y107450D01*
Y103550D01*
X661701Y102500D02*X662751Y103550D01*
X659001Y102500D02*X661701D01*
X659001Y108500D02*X661701D01*
X665301Y104750D02*Y102500D01*
Y104750D02*X666051Y105500D01*
X667551D01*
X664551D02*X665301Y104750D01*
X671601Y105500D02*X672351Y104750D01*
X670101Y105500D02*X671601D01*
X669351Y104750D02*X670101Y105500D01*
X669351Y104750D02*Y103250D01*
X670101Y102500D01*
X672351Y105500D02*Y103250D01*
X673101Y102500D01*
X670101D02*X671601D01*
X672351Y103250D01*
X674901Y105500D02*Y103250D01*
X675651Y102500D01*
X676401D01*
X677151Y103250D01*
Y105500D02*Y103250D01*
X677901Y102500D01*
X678651D01*
X679401Y103250D01*
Y105500D02*Y103250D01*
G54D20*X681201Y107000D02*Y106850D01*
G54D19*Y104750D02*Y102500D01*
X683451Y104750D02*Y102500D01*
Y104750D02*X684201Y105500D01*
X684951D01*
X685701Y104750D01*
Y102500D01*
X682701Y105500D02*X683451Y104750D01*
X689751Y105500D02*X690501Y104750D01*
X688251Y105500D02*X689751D01*
X687501Y104750D02*X688251Y105500D01*
X687501Y104750D02*Y103250D01*
X688251Y102500D01*
X689751D01*
X690501Y103250D01*
X687501Y101000D02*X688251Y100250D01*
X689751D01*
X690501Y101000D01*
Y105500D02*Y101000D01*
M02*
