<?xml version="1.0"?>
<svg xmlns="http://www.w3.org/2000/svg" xmlns:xlink="http://www.w3.org/1999/xlink" version="1.0" width="1625.6000" height="1625.6000" viewBox="-2.0000 -2.0000 17.7000 17.7000">
<g id="layer_9_outline">
<!--normal-->
 <rect x="0.0000" y="0.0000" width="12.7000" height="12.7000" stroke-width="0.2540" stroke="#00868b" stroke-linecap="round" fill="none"/>
</g>
<g id="layer_7_group7">
<!--normal-->
 <polygon points="1.9050,1.9050 3.5128,1.9050 3.5119,1.9059 3.4879,1.9381 3.4692,1.9737 3.4563,2.0117 3.4495,2.0513 3.4490,2.0914 3.4548,2.1312 3.4675,2.1692 3.4996,2.2586 3.5220,2.3510 3.5355,2.4451 3.5400,2.5400 3.5355,2.6349 3.5220,2.7290 3.4996,2.8214 3.4686,2.9112 3.4559,2.9491 3.4502,2.9886 3.4507,3.0286 3.4574,3.0680 3.4702,3.1059 3.4888,3.1413 3.5127,3.1733 3.5414,3.2012 3.5740,3.2243 3.6098,3.2421 3.6480,3.2539 3.6876,3.2597 3.7275,3.2592 3.7670,3.2525 3.8048,3.2396 3.8402,3.2210 3.8723,3.1971 3.9002,3.1685 3.9233,3.1359 3.9403,3.0998 3.9887,2.9648 4.0225,2.8253 4.0429,2.6833 4.0497,2.5400 4.0429,2.3967 4.0225,2.2547 3.9887,2.1152 3.9418,1.9796 3.9243,1.9435 3.9011,1.9107 3.8954,1.9050 4.4450,1.9050 4.4450,4.4450 1.9050,4.4450 1.9050,3.8939 1.9115,3.9002 1.9441,3.9233 1.9802,3.9403 2.1152,3.9887 2.2547,4.0225 2.3967,4.0429 2.5400,4.0497 2.6833,4.0429 2.8253,4.0225 2.9648,3.9887 3.1004,3.9418 3.1365,3.9243 3.1693,3.9011 3.1980,3.8730 3.2220,3.8408 3.2407,3.8053 3.2536,3.7672 3.2603,3.7276 3.2608,3.6875 3.2550,3.6478 3.2431,3.6094 3.2253,3.5734 3.2021,3.5406 3.1741,3.5119 3.1419,3.4879 3.1063,3.4692 3.0683,3.4563 3.0287,3.4495 2.9886,3.4490 2.9488,3.4548 2.9108,3.4675 2.8214,3.4996 2.7290,3.5220 2.6349,3.5355 2.5400,3.5400 2.4451,3.5355 2.3510,3.5220 2.2586,3.4996 2.1688,3.4686 2.1309,3.4559 2.0914,3.4502 2.0514,3.4507 2.0120,3.4574 1.9741,3.4702 1.9387,3.4888 1.9067,3.5127 1.9050,3.5144 " stroke-width="0.010" stroke="#8b7355" fill="#8b7355"/>
 <circle cx="2.5400" cy="2.5400" r="1.0000" stroke-width="0.0000" fill="#cccccc" stroke="none"/>
 <circle cx="2.5400" cy="2.5400" r="0.4001" stroke-width="0.0000" fill="#ffffff" stroke="none"/>
</g>
<g id="layer_5_group5">
<!--normal-->
 <polygon points="0.6350,0.6350 3.1750,0.6350 3.1750,1.1708 3.0074,1.1014 2.7766,1.0460 2.5400,1.0274 2.3034,1.0460 2.0726,1.1014 1.8533,1.1922 1.6661,1.3069 2.0355,1.6763 2.0846,1.6462 2.2300,1.5860 2.3831,1.5493 2.5400,1.5369 2.6969,1.5493 2.8500,1.5860 2.9954,1.6462 3.0445,1.6763 3.1750,1.5458 3.1750,3.1750 1.5458,3.1750 1.6763,3.0445 1.6462,2.9954 1.5860,2.8500 1.5493,2.6969 1.5369,2.5400 1.5493,2.3831 1.5860,2.2300 1.6462,2.0846 1.6763,2.0355 1.3069,1.6661 1.1922,1.8533 1.1014,2.0726 1.0460,2.3034 1.0274,2.5400 1.0460,2.7766 1.1014,3.0074 1.1708,3.1750 0.6350,3.1750 " stroke-width="0.010" stroke="#548b54" fill="#548b54"/>
 <circle cx="2.5400" cy="2.5400" r="1.0000" stroke-width="0.0000" fill="#cccccc" stroke="none"/>
 <circle cx="2.5400" cy="2.5400" r="0.4001" stroke-width="0.0000" fill="#ffffff" stroke="none"/>
</g>
<g id="layer_10_bottom">
<!--normal-->
 <circle cx="2.5400" cy="2.5400" r="1.0000" stroke-width="0.0000" fill="#cccccc" stroke="none"/>
 <circle cx="2.5400" cy="2.5400" r="0.4001" stroke-width="0.0000" fill="#ffffff" stroke="none"/>
</g>
<g id="layer_3_top">
<!--normal-->
 <circle cx="2.5400" cy="2.5400" r="1.0000" stroke-width="0.0000" fill="#7f7f7f" stroke="none"/>
 <circle cx="2.5400" cy="2.5400" r="0.4001" stroke-width="0.0000" fill="#ffffff" stroke="none"/>
</g>
<g id="layer_1_topsilk">
</g>
<g id="layer_-1_plated-drill">
<!--normal-->
 <circle cx="2.5400" cy="2.5400" r="0.4001" stroke-width="0.0000" fill="#ffffff" stroke="none"/>
</g>
</svg>
