%!PS-Adobe-3.0 EPSF-3.0
%%BoundingBox: 0 0 37.000000 37.000000
%%Pages: 1
save countdictstack mark newpath /showpage {} def /setpagedevice {pop} def
%%EndProlog
%%Page: 1 1
%%BeginDocument: thermal_last.eps

72 72 scale
1 dup neg scale
1 dup scale
0.00000 -0.50000 translate
/nclip { -0.01000 -0.01000 moveto -0.01000 0.51000 lineto 0.51000 0.51000 lineto 0.51000 -0.01000 lineto -0.01000 -0.01000 lineto eoclip newpath } def
/t { moveto lineto stroke } bind def
/tc { moveto lineto strokepath nclip } bind def
/r { /y2 exch def /x2 exch def /y1 exch def /x1 exch def
     x1 y1 moveto x1 y2 lineto x2 y2 lineto x2 y1 lineto closepath fill } bind def
/c { 0 360 arc fill } bind def
/cc { 0 360 arc nclip } bind def
/a { gsave setlinewidth translate scale 0 0 1 5 3 roll arc stroke grestore} bind def
% Layer bottomsilk group 12 drill 0 mask 0
% Layer bottom group 10 drill 0 mask 0
0.00000 setlinewidth
1 setlinecap
0.666667 0.666667 0.666667 setrgbcolor
0.10000 0.10000 0.03937 c
0.00000 setlinewidth
1 1 1 setrgbcolor
0.10000 0.10000 0.01575 c
% Layer group5 group 5 drill 0 mask 0
0.00000 setlinewidth
2 setlinecap
0.329412 0.545098 0.329412 setrgbcolor
0.12500 0.02500 moveto
0.12500 0.04609 lineto
0.11840 0.04336 lineto
0.10932 0.04118 lineto
0.10000 0.04045 lineto
0.09068 0.04118 lineto
0.08160 0.04336 lineto
0.07296 0.04694 lineto
0.06560 0.05145 lineto
0.08014 0.06600 lineto
0.08207 0.06481 lineto
0.08780 0.06244 lineto
0.09382 0.06099 lineto
0.10000 0.06051 lineto
0.10618 0.06099 lineto
0.11220 0.06244 lineto
0.11793 0.06481 lineto
0.11986 0.06600 lineto
0.12500 0.06086 lineto
0.12500 0.12500 lineto
0.06086 0.12500 lineto
0.06600 0.11986 lineto
0.06481 0.11793 lineto
0.06244 0.11220 lineto
0.06099 0.10618 lineto
0.06051 0.10000 lineto
0.06099 0.09382 lineto
0.06244 0.08780 lineto
0.06481 0.08207 lineto
0.06600 0.08014 lineto
0.05145 0.06560 lineto
0.04694 0.07296 lineto
0.04336 0.08160 lineto
0.04118 0.09068 lineto
0.04045 0.10000 lineto
0.04118 0.10932 lineto
0.04336 0.11840 lineto
0.04609 0.12500 lineto
0.02500 0.12500 lineto
0.02500 0.02500 lineto
fill
1 setlinecap
0.666667 0.666667 0.666667 setrgbcolor
0.10000 0.10000 0.03937 c
0.00000 setlinewidth
1 1 1 setrgbcolor
0.10000 0.10000 0.01575 c
% Layer group7 group 7 drill 0 mask 0
0.00000 setlinewidth
2 setlinecap
0.545098 0.45098 0.333333 setrgbcolor
0.13830 0.07500 moveto
0.13826 0.07504 lineto
0.13732 0.07630 lineto
0.13658 0.07770 lineto
0.13608 0.07920 lineto
0.13581 0.08076 lineto
0.13579 0.08234 lineto
0.13602 0.08390 lineto
0.13652 0.08540 lineto
0.13778 0.08892 lineto
0.13866 0.09256 lineto
0.13919 0.09626 lineto
0.13937 0.10000 lineto
0.13919 0.10374 lineto
0.13866 0.10744 lineto
0.13778 0.11108 lineto
0.13656 0.11461 lineto
0.13606 0.11611 lineto
0.13583 0.11766 lineto
0.13585 0.11924 lineto
0.13612 0.12079 lineto
0.13662 0.12228 lineto
0.13736 0.12367 lineto
0.13830 0.12493 lineto
0.13942 0.12603 lineto
0.14071 0.12694 lineto
0.14212 0.12764 lineto
0.14362 0.12811 lineto
0.14518 0.12833 lineto
0.14675 0.12832 lineto
0.14831 0.12805 lineto
0.14980 0.12754 lineto
0.15119 0.12681 lineto
0.15245 0.12587 lineto
0.15355 0.12475 lineto
0.15446 0.12346 lineto
0.15513 0.12204 lineto
0.15704 0.11672 lineto
0.15837 0.11123 lineto
0.15917 0.10564 lineto
0.15944 0.10000 lineto
0.15917 0.09436 lineto
0.15837 0.08877 lineto
0.15704 0.08328 lineto
0.15519 0.07794 lineto
0.15450 0.07652 lineto
0.15358 0.07523 lineto
0.15336 0.07500 lineto
0.17500 0.07500 lineto
0.17500 0.17500 lineto
0.07500 0.17500 lineto
0.07500 0.15330 lineto
0.07525 0.15355 lineto
0.07654 0.15446 lineto
0.07796 0.15513 lineto
0.08328 0.15704 lineto
0.08877 0.15837 lineto
0.09436 0.15917 lineto
0.10000 0.15944 lineto
0.10564 0.15917 lineto
0.11123 0.15837 lineto
0.11672 0.15704 lineto
0.12206 0.15519 lineto
0.12348 0.15450 lineto
0.12477 0.15358 lineto
0.12591 0.15248 lineto
0.12685 0.15121 lineto
0.12759 0.14981 lineto
0.12809 0.14832 lineto
0.12836 0.14676 lineto
0.12838 0.14518 lineto
0.12815 0.14361 lineto
0.12768 0.14210 lineto
0.12698 0.14069 lineto
0.12607 0.13939 lineto
0.12496 0.13826 lineto
0.12370 0.13732 lineto
0.12230 0.13658 lineto
0.12080 0.13608 lineto
0.11924 0.13581 lineto
0.11766 0.13579 lineto
0.11610 0.13602 lineto
0.11460 0.13652 lineto
0.11108 0.13778 lineto
0.10744 0.13866 lineto
0.10374 0.13919 lineto
0.10000 0.13937 lineto
0.09626 0.13919 lineto
0.09256 0.13866 lineto
0.08892 0.13778 lineto
0.08539 0.13656 lineto
0.08389 0.13606 lineto
0.08234 0.13583 lineto
0.08076 0.13585 lineto
0.07921 0.13612 lineto
0.07772 0.13662 lineto
0.07633 0.13736 lineto
0.07507 0.13830 lineto
0.07500 0.13836 lineto
0.07500 0.07500 lineto
fill
1 setlinecap
0.666667 0.666667 0.666667 setrgbcolor
0.10000 0.10000 0.03937 c
0.00000 setlinewidth
1 1 1 setrgbcolor
0.10000 0.10000 0.01575 c
% Layer top group 3 drill 0 mask 0
0.00000 setlinewidth
0.498039 0.498039 0.498039 setrgbcolor
0.10000 0.10000 0.03937 c
0.00000 setlinewidth
1 1 1 setrgbcolor
0.10000 0.10000 0.01575 c
% Layer topsilk group 1 drill 0 mask 0
% Layer plated-drill group -1 drill 1 mask 0
0.10000 0.10000 0.01575 c
showpage
%%EndDocument
%%Trailer
cleartomark countdictstack exch sub { end } repeat restore
%%EOF
