EESchema Schematic File Version 2
LIBS:power
LIBS:device
LIBS:transistors
LIBS:conn
LIBS:linear
LIBS:regul
LIBS:74xx
LIBS:cmos4000
LIBS:adc-dac
LIBS:memory
LIBS:xilinx
LIBS:special
LIBS:microcontrollers
LIBS:dsp
LIBS:microchip
LIBS:analog_switches
LIBS:motorola
LIBS:texas
LIBS:intel
LIBS:audio
LIBS:interface
LIBS:digital-audio
LIBS:philips
LIBS:display
LIBS:cypress
LIBS:siliconi
LIBS:opto
LIBS:atmel
LIBS:contrib
LIBS:valves
EELAYER 27 0
EELAYER END
$Descr A4 11693 8268
encoding utf-8
Sheet 1 1
Title ""
Date "18 feb 2017"
Rev ""
Comp ""
Comment1 ""
Comment2 ""
Comment3 ""
Comment4 ""
$EndDescr
$Comp
L R R1
U 1 1 58A83F39
P 6850 3200
F 0 "R1" V 6930 3200 40  0000 C CNN
F 1 "R" V 6857 3201 40  0000 C CNN
F 2 "~" V 6780 3200 30  0000 C CNN
F 3 "~" H 6850 3200 30  0000 C CNN
	1    6850 3200
	0    -1   -1   0   
$EndComp
$Comp
L R R5
U 1 1 58A83F4B
P 8400 2050
F 0 "R5" V 8480 2050 40  0000 C CNN
F 1 "R" V 8407 2051 40  0000 C CNN
F 2 "~" V 8330 2050 30  0000 C CNN
F 3 "~" H 8400 2050 30  0000 C CNN
	1    8400 2050
	1    0    0    -1  
$EndComp
$Comp
L R R2
U 1 1 58A84177
P 7600 2650
F 0 "R2" H 7680 2650 40  0000 C CNN
F 1 "R2" V 7607 2651 40  0000 C CNN
F 2 "~" V 7530 2650 30  0000 C CNN
F 3 "~" H 7600 2650 30  0000 C CNN
	1    7600 2650
	1    0    0    -1  
$EndComp
$Comp
L R R3
U 1 1 58A84186
P 7600 3850
F 0 "R3" V 7680 3850 40  0000 C CNN
F 1 "R" V 7607 3851 40  0000 C CNN
F 2 "~" V 7530 3850 30  0000 C CNN
F 3 "~" H 7600 3850 30  0000 C CNN
	1    7600 3850
	1    0    0    -1  
$EndComp
$Comp
L R R4
U 1 1 58A84195
P 8400 3850
F 0 "R4" V 8480 3850 40  0000 C CNN
F 1 "R" V 8407 3851 40  0000 C CNN
F 2 "~" V 8330 3850 30  0000 C CNN
F 3 "~" H 8400 3850 30  0000 C CNN
	1    8400 3850
	1    0    0    -1  
$EndComp
$Comp
L C C2
U 1 1 58A841B3
P 7950 2700
F 0 "C2" H 7950 2800 40  0000 L CNN
F 1 "C" H 7956 2615 40  0000 L CNN
F 2 "~" H 7988 2550 30  0000 C CNN
F 3 "~" H 7950 2700 60  0000 C CNN
	1    7950 2700
	1    0    0    -1  
$EndComp
$Comp
L C C3
U 1 1 58A841C2
P 8850 2850
F 0 "C3" H 8850 2950 40  0000 L CNN
F 1 "C" H 8856 2765 40  0000 L CNN
F 2 "~" H 8888 2700 30  0000 C CNN
F 3 "~" H 8850 2850 60  0000 C CNN
	1    8850 2850
	0    -1   -1   0   
$EndComp
$Comp
L CP1 C4
U 1 1 58A841E0
P 8800 3900
F 0 "C4" H 8850 4000 50  0000 L CNN
F 1 "CP1" H 8850 3800 50  0000 L CNN
F 2 "~" H 8800 3900 60  0000 C CNN
F 3 "~" H 8800 3900 60  0000 C CNN
	1    8800 3900
	1    0    0    -1  
$EndComp
$Comp
L NPN Q?
U 1 1 58A84286
P 8300 3200
F 0 "Q?" H 8300 3050 50  0000 R CNN
F 1 "NPN" H 8300 3350 50  0000 R CNN
F 2 "~" H 8300 3200 60  0000 C CNN
F 3 "~" H 8300 3200 60  0000 C CNN
	1    8300 3200
	1    0    0    -1  
$EndComp
$Comp
L CP1 C1
U 1 1 58A841D1
P 6200 3200
F 0 "C1" H 6250 3300 50  0000 L CNN
F 1 "CP1" H 6250 3100 50  0000 L CNN
F 2 "~" H 6200 3200 60  0000 C CNN
F 3 "~" H 6200 3200 60  0000 C CNN
	1    6200 3200
	0    1    1    0   
$EndComp
$Comp
L CP1 C5
U 1 1 58A84312
P 9900 3600
F 0 "C5" H 9950 3700 50  0000 L CNN
F 1 "CP1" H 9950 3500 50  0000 L CNN
F 2 "~" H 9900 3600 60  0000 C CNN
F 3 "~" H 9900 3600 60  0000 C CNN
	1    9900 3600
	1    0    0    -1  
$EndComp
Wire Wire Line
	6400 3200 6600 3200
Wire Wire Line
	7100 3200 8100 3200
Wire Wire Line
	7600 2900 7600 3600
Connection ~ 7600 3200
Wire Wire Line
	7950 2900 7950 3200
Connection ~ 7950 3200
Wire Wire Line
	8400 2300 8400 3000
Wire Wire Line
	7950 2500 7950 2400
Wire Wire Line
	7950 2400 8400 2400
Connection ~ 8400 2400
Wire Wire Line
	7600 2350 7600 1650
Wire Wire Line
	7600 1650 10550 1650
Wire Wire Line
	8400 1650 8400 1800
Connection ~ 8400 1650
Wire Wire Line
	8400 2850 8650 2850
Connection ~ 8400 2850
Wire Wire Line
	6100 4300 9900 4300
Wire Wire Line
	7600 4300 7600 4100
Wire Wire Line
	8400 4300 8400 4100
Connection ~ 7600 4300
Wire Wire Line
	8800 4300 8800 4100
Connection ~ 8400 4300
Wire Wire Line
	9900 4300 9900 3800
Connection ~ 8800 4300
Wire Wire Line
	9900 1650 9900 3400
Connection ~ 9900 1650
Wire Wire Line
	8400 3400 8400 3600
Wire Wire Line
	8400 3500 8800 3500
Wire Wire Line
	8800 3500 8800 3700
Connection ~ 8400 3500
Wire Wire Line
	5600 3200 6000 3200
$EndSCHEMATC
