v 20130925 2
C 40000 40000 0 0 0 title-C.sym
V 34200 50100 500 3 0 0 0 -1 -1 0 -1 -1 -1 -1 -1
V 67300 44800 500 3 0 0 0 -1 -1 0 -1 -1 -1 -1 -1
V 70700 48000 500 3 0 0 0 -1 -1 0 -1 -1 -1 -1 -1
V 34200 46200 500 3 0 0 0 -1 -1 0 -1 -1 -1 -1 -1
V 58700 51400 500 3 0 0 0 -1 -1 0 -1 -1 -1 -1 -1
V 34200 45000 500 3 0 0 0 -1 -1 0 -1 -1 -1 -1 -1
V 34200 48600 500 3 0 0 0 -1 -1 0 -1 -1 -1 -1 -1
V 34200 47400 500 3 0 0 0 -1 -1 0 -1 -1 -1 -1 -1
V 58700 52600 500 3 0 0 0 -1 -1 0 -1 -1 -1 -1 -1
V 70700 49200 500 3 0 0 0 -1 -1 0 -1 -1 -1 -1 -1
V 49700 48000 500 3 0 0 0 -1 -1 0 -1 -1 -1 -1 -1
V 49700 46900 500 3 0 0 0 -1 -1 0 -1 -1 -1 -1 -1
V 49700 45800 500 3 0 0 0 -1 -1 0 -1 -1 -1 -1 -1
V 49700 44700 500 3 0 0 0 -1 -1 0 -1 -1 -1 -1 -1
V 49700 43600 500 3 0 0 0 -1 -1 0 -1 -1 -1 -1 -1
V 49700 49100 500 3 0 0 0 -1 -1 0 -1 -1 -1 -1 -1
V 49700 50200 500 3 0 0 0 -1 -1 0 -1 -1 -1 -1 -1
V 49700 42500 500 3 0 0 0 -1 -1 0 -1 -1 -1 -1 -1
V 49700 40300 500 3 0 0 0 -1 -1 0 -1 -1 -1 -1 -1
V 49700 39200 500 3 0 0 0 -1 -1 0 -1 -1 -1 -1 -1
V 49700 41400 500 3 0 0 0 -1 -1 0 -1 -1 -1 -1 -1
V 49700 38100 500 3 0 0 0 -1 -1 0 -1 -1 -1 -1 -1
V 67300 43700 500 3 0 0 0 -1 -1 0 -1 -1 -1 -1 -1
V 49700 37000 500 3 0 0 0 -1 -1 0 -1 -1 -1 -1 -1
V 67300 42600 500 3 0 0 0 -1 -1 0 -1 -1 -1 -1 -1
V 68300 38700 500 3 0 0 0 -1 -1 0 -1 -1 -1 -1 -1
V 49700 35900 500 3 0 0 0 -1 -1 0 -1 -1 -1 -1 -1
V 49700 34800 500 3 0 0 0 -1 -1 0 -1 -1 -1 -1 -1
V 67300 41500 500 3 0 0 0 -1 -1 0 -1 -1 -1 -1 -1
V 67400 36800 500 3 0 0 0 -1 -1 0 -1 -1 -1 -1 -1
V 72000 35500 500 3 0 0 0 -1 -1 0 -1 -1 -1 -1 -1
V 72000 34400 500 3 0 0 0 -1 -1 0 -1 -1 -1 -1 -1
T 34200 50100 9 10 1 0 0 4 1
librecad
T 67300 44800 9 10 1 0 0 4 1
openfoam
T 70700 48000 9 10 1 0 0 4 1
paraview
T 34200 46200 9 10 1 0 0 4 1
gmsh
T 58700 51400 9 10 1 0 0 4 1
salome
T 34200 45000 9 10 1 0 0 4 1
freecad
T 34200 48600 9 10 1 0 0 4 1
brlcad
T 33800 49200 9 12 1 0 0 0 1
3D CAD
T 34200 47400 9 10 1 0 0 4 2
open
scad
T 33800 50700 9 12 1 0 0 0 1
2D CAD
T 58700 52600 9 10 1 0 0 4 1
onelab
T 70700 49200 9 10 1 0 0 4 1
opendx
T 49700 48000 9 10 1 0 0 4 1
maxfem
T 49700 46900 9 10 1 0 0 4 1
openems
T 49700 45800 9 10 1 0 0 4 1
meep
T 49700 44700 9 10 1 0 0 4 1
angora
T 49700 43600 9 10 1 0 0 4 1
EMTL
T 49700 49100 9 10 1 0 0 4 1
fastmaxwell
T 49700 50200 9 10 1 0 0 4 1
nec2
T 49700 42500 9 10 1 0 0 4 1
getdp
T 70000 49800 9 12 1 0 0 0 1
3D Graphing
T 66900 46500 9 12 1 0 0 0 1
3D CFD
T 49300 50800 9 12 1 0 0 0 2
3D FEM
w/E&M Ability
T 49700 40300 9 10 1 0 0 4 1
FEniCS
T 49700 39200 9 10 1 0 0 4 1
dealii
T 49700 41400 9 10 1 0 0 4 1
freedrake
T 50400 46800 9 12 1 0 0 0 2
openems uses it's own format in matlab/ocatve script to process everything including geometry
it's output includes but is not limited to paraview and octave's native grapher + ?gnuplot?
T 50400 49100 9 12 1 0 0 0 1
fastmaxwell might be abandonware. the project looks stalled post 2008. no info on mesh or geometry input is obivous on the site.
T 50400 48000 9 12 1 0 0 0 1
maxfem is more for FEM mechanical issues like mechancial stresses from magnetics than electrical/rf work
T 50400 50200 9 12 1 0 0 0 1
nec2 has frequency limitations and is meant mostly for the design of antennas. sadly versions after 2 are proprietary. this is the only solver i have seen that uses method of moments.
T 50500 41400 9 12 1 0 0 0 1
firedrake is cool because it has gpu processing. i question their meshing. as yet i see no em work done in it.
T 50500 39200 9 12 1 0 0 0 1
dealII is cool but i have trouble understanding it's documentation (only lgpl)
T 50500 40200 9 12 1 0 0 0 2
FEniCS is another tool that seems to be mostly for mechanical people. However I like their example work on electromagnetics. 
The one thing I dislike about their work is that the current front end is python.
T 50400 45700 9 12 1 0 0 0 1
meep uses scheme. I feel that says everything. it is actively developed. one positive for it is that it supports hdf5 for output. 
T 50400 43300 9 12 1 0 0 0 2
EMTL is hard to google for some reason http://fdtd.kintechlab.com/en/start is the url
it would be good for modeling semiconductors but they don't really talk about anyting rf or pcb related in the documentation.
T 50400 44500 9 12 1 0 0 0 2
angora is also hard to google to get results look for angoraftdt which should yeald http://www.angorafdtd.org/
i don't like their documentation. it would appear to have been developed over the course of 1 year 2012-2013 and then abandoned.
T 50400 42400 9 12 1 0 0 0 1
getdp is run via onelab using gmsh to do the meshing. i am not wild about onelab which is way too gui for me. we want to be able to drive everything from make.
T 49700 38100 9 10 1 0 0 4 1
calculix
T 50500 38100 9 12 1 0 0 0 1
calculix looks like a cfd/fem that someone wrote to do aeronautical work and then later an example of electromagnetics was run on it for show.
T 71400 49200 9 12 1 0 0 0 1
opendx has it's fans and is still in use but it has been with out a new release in like 10 years.
T 71400 48000 9 12 1 0 0 0 1
paraview has an excessive number of dependencies but just about everyone uses it. it is maintaned and well documented.
T 67300 43700 9 10 1 0 0 4 1
code saturne
T 57900 53300 9 12 1 0 0 0 1
FEM front ends
T 49700 37000 9 10 1 0 0 4 1
feel++
T 50500 37000 9 10 1 0 0 0 1
feel++ (http://www.feelpp.org/) has a lot of current development and has some examples in the E&M domain but they are not really over lapping with what I think our users need.
T 67300 42600 9 10 1 0 0 4 1
gerris
T 68000 42500 9 10 1 0 0 0 1
Gerris Flow Solver (http://gfs.sourceforge.net/wiki/index.php/Main_Page) 
T 68000 43700 9 10 1 0 0 0 1
Code Saturne (http://code-saturne.org/cms/)
T 68300 38700 9 10 1 0 0 4 1
code aster
T 50500 35800 9 10 1 0 0 0 1
S4 (https://web.stanford.edu/group/fan/S4/index.html) 
T 50500 34800 9 10 1 0 0 0 1
Elmer (https://csc.fi/web/elmer/elmer) (http://www.elmerfem.org/) this is able to connect to salome which is nice and lists E&M as a feature but I could not find a single example of it in actual use on E&M via their wiki or examples page.
T 68900 38600 9 10 1 0 0 0 1
Code Aster (http://code-aster.org/spip.php?rubrique2) This hooks into salome as well. For the mechanical folks it handles mechanical and thermal stuff. I know people who use it with Salome and love it. Honestly it is all over my head.
T 68700 40400 9 10 1 0 0 4 1
mooseframework.org
T 59400 52500 9 10 1 0 0 0 1
One Lab (http://onelab.info/wiki/Main_Page)
T 34800 46200 9 10 1 0 0 0 1
gmsh (http://gmsh.info/) is a very well respected mesh generation program for FEM that has a 3D CAD built into it. For some formats it falls back on opencascade.
T 49700 35900 9 10 1 0 0 4 1
s4
T 49700 34800 9 10 1 0 0 4 1
elmer
T 68000 44800 9 10 1 0 0 0 1
openfoam is impressive and is aiming to be like comsol interms of it's universality. it is very well documented but none of the people i know in the modeling field have ever used it or even know anyone who has used it.
T 59400 51400 9 12 1 0 0 0 1
i know a ton of people who use this and swear by it. the trouble is that all of the more appealing stuff in E&M is ftdt which this has yet to connect to as far as i can tell.
T 34800 50000 9 12 1 0 0 0 1
librecad was originally qcad from QT. i liked qcad which had a very short learning curve. i still haven't gotten the hang of librecad for some reason.
T 34800 44800 9 12 1 0 0 0 2
freecad is reported by some friends to be best in terms of ease of use compared to openscad and freecad.
I resist it because it uses opencascade which is only lgpl.
T 34800 47400 9 12 1 0 0 0 1
openscad is favored by Igor2. It's 3D kernel is opencsg which is distributed seperately. 
T 34800 48300 9 12 1 0 0 0 3
brlcad is the old and well respected. It is also painful to use a problem they are trying to address with a new gui called archer. 
brlcad supports more cad formats than any other open source program i could find. It has it's own 3D kernel.
they are so well respected openscad, linuxcnc and a few others have their google summer of code projects over seen by brlcad.
T 67300 41500 9 10 1 0 0 4 1
su2
T 68000 41500 9 12 1 0 0 0 1
su2 http://su2.stanford.edu/
T 67400 36800 9 10 1 0 0 4 1
openfcst
T 68100 36800 9 12 1 0 0 0 2
OpenFCST (http://www.openfcst.mece.ualberta.ca/index.html) open source fuel cell simulation tool box
Uses Deal.II, salome, and dakota
T 67400 37600 9 10 1 0 0 4 2
3D FEM
Left Field
T 72700 35500 9 12 1 0 0 0 1
dakota (https://dakota.sandia.gov/) ???
T 72000 35500 9 10 1 0 0 4 1
dakota
T 72000 36200 9 10 1 0 0 4 1
Associated Libraries of Interest
T 72000 34400 9 10 1 0 0 4 1
opencascade
V 67300 40400 500 3 0 0 0 -1 -1 0 -1 -1 -1 -1 -1
T 67300 40400 9 10 1 0 0 4 2
moose
framework
V 70900 40400 500 3 0 0 0 -1 -1 0 -1 -1 -1 -1 -1
T 72300 40400 9 10 1 0 0 4 1
http://asl.org.il/
T 70900 40400 9 10 1 0 0 4 3
advanced
simulation
library
V 49700 33700 500 3 0 0 0 -1 -1 0 -1 -1 -1 -1 -1
T 49700 33700 9 10 1 0 0 4 1
gsvit
T 50500 33700 9 10 1 0 0 0 1
GSVIT (http://gsvit.net/) This has gpu acceleration but is targetted at radar diffraction. For the purposes of simulating pcb it has a long way to go.
V 49700 32600 500 3 0 0 0 -1 -1 0 -1 -1 -1 -1 -1
T 49700 32600 9 10 1 0 0 4 1
scuffRF
T 50500 32500 9 10 1 0 0 0 2
scuffRF (http://homerreid.dyndns.org/scuff-EM/scuff-RF/) This tool is actively maintaned and it does a lot of what we want but not quite all. Unlike OpenEMS it doesn't let you add lumped passive impedance to ports but it does use a non rectangular gridded boundary-element analysis solver.
The mainline of this program is scuffEM which was I suspect created to do things like electrostatics studies for MEMS devices. (updated URL http://homerreid.github.io/scuff-em-documentation/) Accepts gmsh mesh!
V 49700 31500 500 3 0 0 0 -1 -1 0 -1 -1 -1 -1 -1
T 49700 31500 9 10 1 0 0 4 1
Puma-EM
T 50500 31500 9 10 1 0 0 0 1
Puma-EM (https://sourceforge.net/projects/puma-em/) Method of moments solver, looks like it might just be fore radar again but it does do antennas. They don't really have much in the way of documentation and the code's last commit was december 2016.
V 67300 45900 500 3 0 0 0 -1 -1 0 -1 -1 -1 -1 -1
T 67300 45900 9 10 1 0 0 4 1
openqbmm
T 68100 45900 9 10 1 0 0 0 1
openqbmm (https://www.openqbmm.org/the-project/) This is a very new fork of OpenFOAM targetted at doing cfd with a solver created for Method of Moments (MoM). It will likely out perform openfoam for many fluid flow problems.
