<?xml version="1.0" encoding="UTF-8" standalone="no"?>
<!-- Created with Inkscape (http://www.inkscape.org/) -->

<svg
   xmlns:dc="http://purl.org/dc/elements/1.1/"
   xmlns:cc="http://creativecommons.org/ns#"
   xmlns:rdf="http://www.w3.org/1999/02/22-rdf-syntax-ns#"
   xmlns:svg="http://www.w3.org/2000/svg"
   xmlns="http://www.w3.org/2000/svg"
   xmlns:sodipodi="http://sodipodi.sourceforge.net/DTD/sodipodi-0.dtd"
   xmlns:inkscape="http://www.inkscape.org/namespaces/inkscape"
   width="210mm"
   height="297mm"
   viewBox="0 0 210 297"
   version="1.1"
   id="svg8"
   inkscape:version="0.92.4 (5da689c313, 2019-01-14)"
   sodipodi:docname="ringdove1.svg">
  <defs
     id="defs2" />
  <sodipodi:namedview
     id="base"
     pagecolor="#ffffff"
     bordercolor="#666666"
     borderopacity="1.0"
     inkscape:pageopacity="0.0"
     inkscape:pageshadow="2"
     inkscape:zoom="0.98994949"
     inkscape:cx="452.05503"
     inkscape:cy="689.18681"
     inkscape:document-units="mm"
     inkscape:current-layer="layer1"
     showgrid="false"
     inkscape:window-width="1516"
     inkscape:window-height="895"
     inkscape:window-x="0"
     inkscape:window-y="16"
     inkscape:window-maximized="0" />
  <metadata
     id="metadata5">
    <rdf:RDF>
      <cc:Work
         rdf:about="">
        <dc:format>image/svg+xml</dc:format>
        <dc:type
           rdf:resource="http://purl.org/dc/dcmitype/StillImage" />
        <dc:title></dc:title>
      </cc:Work>
    </rdf:RDF>
  </metadata>
  <g
     inkscape:label="Layer 1"
     inkscape:groupmode="layer"
     id="layer1">
    <path
       style="fill:none;stroke:#000000;stroke-width:0.26458332px;stroke-linecap:butt;stroke-linejoin:miter;stroke-opacity:1"
       d="M 94.346142,144.12183 C 79.742054,140.05569 69.666115,135.83262 62.54107,123.00754 57.573472,109.33551 54.577093,97.095182 52.117558,83.184377 51.19785,81.060922 45.377212,79.064831 43.698568,79.208744 l -3.940206,1.577102 -3.777203,2.465348 c -0.754215,-1.409607 0.01534,-2.709382 0.01534,-2.709382 1.830203,-1.901243 4.869125,-3.274673 5.2974,-4.752377 2.957809,-10.966191 9.07014,-13.331766 18.142857,-12.189733 6.917276,1.500498 9.234409,11.321978 13.040178,19.938242 2.523166,5.614119 2.807696,3.803766 21.72413,12.688963 9.262536,4.350683 21.942386,11.664323 34.852136,18.103373 13.45521,6.71111 27.10828,12.53559 34.78604,16.26292 1.32754,3.1452 -1.02425,4.12658 -2.7336,4.90976 49.30422,23.43994 32.47493,18.10998 -6.75749,7.81706 -9.9439,-1.0397 -22.15712,-2.14763 -32.40643,0.40091 -3.10721,5.15366 -4.49968,5.13125 -10.7576,3.77517 -3.13812,5.26533 -9.95148,8.1261 -3.69987,6.41202 1.1223,-0.36839 2.15324,0.95827 2.11742,1.25433 -0.0213,0.17622 -0.70102,-0.703 -1.19299,-0.6234 -3.19388,1.27928 -10.523703,4.09076 -12.737775,4.62213 1.125663,-0.69514 2.51519,-1.64317 3.820176,-2.97881 2.944229,-3.05016 5.631339,-5.79131 7.082639,-9.52148 l -1.80407,-0.93545 c 0.31938,2.22357 -0.54644,3.47885 -1.60361,5.3454 l -9.087166,7.75081 c 0.412559,0.37304 0.990483,0.34447 1.592031,0.33953 -4.889988,2.08433 -7.922522,2.8365 -12.658723,6.34842 -0.713642,0.0449 -0.433446,-0.386 -0.933651,-0.40183 0,0 -0.588836,0.84955 -0.883253,1.27432 -0.234192,-0.80474 -0.1554,-1.41138 0.323318,-1.74397 1.482743,-1.06398 2.335791,-1.21935 4.007651,-1.90934 -3.048403,-0.14407 -6.341087,-0.0538 -9.653432,0.57061 l -0.06277,-0.50042 c -0.681221,-0.006 -1.315194,0.24858 -2.043662,0.83353 0.420104,-1.38664 0.724065,-1.7192 2.204974,-1.90429 3.101045,-0.32058 6.320207,-0.73565 9.232263,-1.67044 -0.557139,-1.11432 -1.161526,-1.61442 -2.049394,-2.13815 2.005941,-1.27317 3.277175,0.95198 4.87767,1.20271 l 10.430896,-8.11564 -1.774542,-4.0757 c -0.580252,-1.33729 -1.093687,-2.14004 -2.342112,-2.80916 z"
       id="path3797"
       inkscape:connector-curvature="0"
       sodipodi:nodetypes="ccccccccccssccccccscccccccccccccccccccccccc" />
    <path
       style="fill:#000000;stroke:#000000;stroke-width:0.26458332px;stroke-linecap:butt;stroke-linejoin:miter;stroke-opacity:1;fill-opacity:1"
       d="m 49.021772,73.986029 c -0.707065,-0.161298 -0.714599,-0.03915 -3.118231,1.647984 1.846669,-2.317805 2.102459,-2.76416 3.143533,-2.339238 1.061464,0.610964 -0.0253,0.691254 -0.0253,0.691254 z"
       id="path3818"
       inkscape:connector-curvature="0"
       sodipodi:nodetypes="ccccc" />
    <path
       style="fill:#000000;stroke:#000000;stroke-width:0.26458332px;stroke-linecap:butt;stroke-linejoin:miter;stroke-opacity:1;fill-opacity:1"
       d="m 72.363223,83.518464 c -3.420935,1.127504 -7.218671,1.119291 -10.490329,1.135896 -1.62773,-0.02056 -3.217865,1.151272 -4.944486,0.935442 1.925916,2.140094 4.36197,3.267617 7.216278,4.075861 4.295927,0.552992 7.541396,-0.05429 11.083579,-2.071341 -1.539787,-0.950054 -2.543273,-2.829176 -2.865042,-4.075858 z"
       id="path3820"
       inkscape:connector-curvature="0"
       sodipodi:nodetypes="cccccc" />
    <path
       style="fill:none;stroke:#000000;stroke-width:0.26458332px;stroke-linecap:butt;stroke-linejoin:miter;stroke-opacity:1"
       d="m 161.10564,135.50296 c -15.94131,2.24514 -33.2737,1.2419 -47.24882,1.00169 -4.48424,-0.24113 -8.63987,0.40993 -13.22984,0.8018 -4.343131,0.0101 -8.686262,-1.11363 -13.029393,-1.67044 -27.511723,-6.17689 -18.76814,-36.795129 6.492871,-39.451898 l 35.056902,18.160528 34.69188,16.24855 c 1.49423,2.50522 -0.88696,4.14181 -2.7336,4.90977 z"
       id="path3822"
       inkscape:connector-curvature="0"
       sodipodi:nodetypes="cccccccc" />
    <circle
       id="path14"
       cx="50.639221"
       cy="71.315933"
       r="2.0128736"
       style="stroke-width:0.30077633" />
    <path
       style="fill:#000000;fill-opacity:1;stroke:#000000;stroke-width:0.26458332px;stroke-linecap:butt;stroke-linejoin:miter;stroke-opacity:1"
       d="m 43.698567,79.208743 -3.940205,1.577103 -3.777204,2.465346 c -0.375059,-1.288268 -0.238219,-1.9816 0.01535,-2.709381 4.418906,-3.561404 4.741513,-4.243352 9.907042,-4.907798 -1.988264,1.950928 -4.225972,2.169061 -2.204974,3.57473 v 0"
       id="path4524"
       inkscape:connector-curvature="0"
       sodipodi:nodetypes="ccccccc" />
  </g>
</svg>
