G04 start of page 2 for group 0 layer_idx 0 *
G04 Title: Full overlap: the same line twice with different settings, TODO:group_name *
G04 Creator: <version>
G04 CreationDate: <date>
G04 For:  *
G04 Format: Gerber/RS-274X *
G04 PCB-Dimensions: 50000 50000 *
G04 PCB-Coordinate-Origin: lower left *
%MOIN*%
%FSLAX25Y25*%
%LNTOP*%
%ADD13C,0.0150*%
%ADD12C,0.0050*%
%ADD11C,0.0001*%
G54D11*G36*
X15000Y35000D02*X30000D01*
Y32250D01*
X20000D01*
X19647Y32229D01*
X19303Y32146D01*
X18975Y32011D01*
X18673Y31826D01*
X18404Y31596D01*
X18174Y31327D01*
X17989Y31025D01*
X17854Y30697D01*
X17771Y30353D01*
X17743Y30000D01*
X17771Y29647D01*
X17854Y29303D01*
X17989Y28975D01*
X18174Y28673D01*
X18404Y28404D01*
X18673Y28174D01*
X18975Y27989D01*
X19303Y27854D01*
X19647Y27771D01*
X20000Y27750D01*
X30000D01*
Y17500D01*
X15000D01*
Y35000D01*
G37*
G54D12*X20000Y30000D02*X35000D01*
G54D13*X20000D02*X35000D01*
M02*
