{
  "head": {
    "docType": "3",
    "editorVersion": "6.5.44",
    "newgId": true,
    "c_para": {},
    "x": "4020",
    "y": "3370.5",
    "hasIdFlag": true,
    "importFlag": 0,
    "transformList": ""
  },
  "canvas": "CA~1000~1000~#000000~yes~#FFFFFF~10~1000~1000~line~0.5~mm~1~45~visible~0.5~4020~3370.5~0~yes",
  "shape": [
    "TRACK~1~10~~4020 2976.8 4413.7 2976.8 4413.7 3370.5 4020 3370.5 4020 2976.8~gge7~0",
    "TRACK~1~1~S$474~4044.5568 3019.7557 4044.5568 3028.9432 4039 3034.5~gge473~0",
    "TRACK~1~2~S$474~4039 3034.5 4035.5 3034.5 4027.5 3042.5 4027.5 3046.9221 4032.5039 3051.926~gge477~0",
    "LIB~4042~3059.5~package`TSSOP-8_L4.4-W3.0-P0.65-LS6.4-BL`subpart_no`1`Supplier`LCSC`Supplier Part`C2863217`Manufacturer`TI(德州仪器)`Manufacturer Part`LM358LVIPWR`JLCPCB Part Class`Extended Part`link`https://lcsc.com/eda_search?q=C2863217&%26type=1&ref=editor`Contributor`lcsc`3DModel`TSSOP-8_L3.0-W4.4-H1.0-LS6.4-P0.65`~213~~gge469~2~ac3fffac6da64b5495d3fa41718a99f8~1629774032~0~~yes~~#@$TEXT~N~4053.688~3079.3341~0.6~213~1~4~~4.5~TSSOP-8_L4.4-W3.0-P0.65-LS6.4-BL~M 4057.36 3082.3628 L 4055.0235 3078.7649 M 4056.1607 3083.1416 L 4058.5593 3081.584 M 4061.7662 3078.774 L 4061.6457 3079.3411 L 4061.2346 3079.8466 L 4060.5553 3080.2877 L 4059.9264 3080.4577 L 4059.3593 3080.3371 L 4059.136 3079.9933 L 4059.0888 3079.535 L 4059.1421 3079.25 L 4059.3771 3078.8589 L 4060.1853 3077.8452 L 4060.4203 3077.4541 L 4060.4736 3077.1691 L 4060.4264 3076.7109 L 4060.0942 3076.1993 L 4059.527 3076.0787 L 4058.8981 3076.2487 L 4058.2188 3076.6898 L 4057.8078 3077.1952 L 4057.6872 3077.7624 M 4065.297 3076.4811 L 4065.1765 3077.0482 L 4064.7738 3077.5482 L 4064.0861 3077.9948 L 4063.4656 3078.1593 L 4062.8985 3078.0387 L 4062.6751 3077.6949 L 4062.6196 3077.2421 L 4062.6813 3076.9516 L 4062.9163 3076.5606 L 4063.7161 3075.5522 L 4063.9511 3075.1612 L 4064.0128 3074.8707 L 4063.9572 3074.4179 L 4063.625 3073.9063 L 4063.0579 3073.7858 L 4062.4373 3073.9503 L 4061.7496 3074.3969 L 4061.347 3074.8969 L 4061.2264 3075.464 M 4067.793 3075.5875 L 4067.3403 3075.6431 L 4066.7731 3075.5225 L 4066.3821 3075.2876 L 4065.8683 3074.882 L 4065.3127 3074.0265 L 4065.1566 3073.4006 L 4065.1011 3072.9478 L 4065.2216 3072.3806 L 4065.4565 3071.9896 L 4066.1443 3071.543 L 4066.597 3071.4874 L 4067.1558 3071.6134 L 4067.5552 3071.8429 L 4068.0552 3072.2456 L 4068.6107 3073.101 L 4068.7807 3073.7299 L 4068.8279 3074.1881 L 4068.7157 3074.7498 L 4068.4808 3075.1409 L 4067.793 3075.5875 M 4070.6361 3073.7412 L 4068.2996 3070.1433 M 4070.6361 3073.7412 L 4072.1793 3072.739 L 4072.5903 3072.2336 L 4072.6437 3071.9486 L 4072.5965 3071.4903 L 4072.2643 3070.9787 L 4071.8649 3070.7493 L 4071.5882 3070.6905 L 4070.9539 3070.852 L 4069.4107 3071.8541 M 4072.841 3069.388 L 4075.9273 3067.3838 M 4079.2493 3068.1477 L 4078.6288 3068.3122 L 4078.2293 3068.0827 L 4078.006 3067.7389 L 4077.9589 3067.2806 L 4078.1883 3066.8812 L 4078.7671 3066.2669 L 4079.1698 3065.7669 L 4079.2903 3065.1998 L 4079.2348 3064.747 L 4078.8971 3064.227 L 4078.5061 3063.9921 L 4078.221 3063.9387 L 4077.6005 3064.1032 L 4076.9128 3064.5498 L 4076.5101 3065.0498 L 4076.4429 3065.3319 L 4076.4985 3065.7847 L 4076.8362 3066.3046 L 4077.2272 3066.5396 L 4077.7944 3066.6601 L 4078.4233 3066.4902 L 4079.2115 3066.2168 L 4079.6698 3066.1696 L 4080.0692 3066.3991 L 4080.2925 3066.7429 L 4080.3397 3067.2011 L 4079.937 3067.7011 L 4079.2493 3068.1477 M 4078.8039 3061.6047 L 4081.8902 3059.6005 M 4086.1432 3063.6708 L 4083.8067 3060.0729 M 4083.8067 3060.0729 L 4085.8698 3058.7331 M 4091.0494 3060.4846 L 4087.7808 3059.1971 L 4090.3555 3057.5251 M 4091.0494 3060.4846 L 4088.7129 3056.8867 M 4091.4322 3056.337 L 4091.1501 3056.2698 L 4091.2089 3055.9932 L 4091.4939 3056.0465 L 4091.4322 3056.337 M 4096.2324 3057.1188 L 4092.9638 3055.8312 L 4095.5301 3054.1646 M 4096.2324 3057.1188 L 4093.8959 3053.5209 M 4096.8857 3053.7732 L 4099.9803 3051.7635 M 4102.4469 3053.083 L 4100.9659 3048.9296 M 4104.1578 3051.9719 L 4100.9659 3048.9296 M 4104.1578 3051.9719 L 4102.6767 3047.8185 M 4105.8771 3050.8554 L 4102.6767 3047.8185 M 4107.3531 3049.8969 L 4109.2401 3048.6714 L 4107.3154 3047.9659 L 4107.827 3047.6337 L 4108.0619 3047.2426 L 4108.1291 3046.9605 L 4107.9591 3046.3316 L 4107.7358 3045.9878 L 4107.2359 3045.5851 L 4106.6687 3045.4646 L 4106.0398 3045.6345 L 4105.5282 3045.9667 L 4105.1256 3046.4667 L 4105.0584 3046.7488 L 4105.1139 3047.2016 M 4108.9352 3044.9704 L 4108.6447 3044.9087 L 4108.7119 3044.6265 L 4108.9886 3044.6854 L 4108.9352 3044.9704 M 4113.0477 3046.1988 L 4112.4188 3046.3687 L 4111.7373 3046.072 L 4111.014 3045.3255 L 4110.6818 3044.8139 L 4110.2885 3043.8412 L 4110.3002 3043.1063 L 4110.7112 3042.6009 L 4111.0551 3042.3776 L 4111.6756 3042.2131 L 4112.3517 3042.5014 L 4113.0804 3043.2563 L 4113.4126 3043.7678 L 4113.8004 3044.7322 L 4113.7942 3045.4755 L 4113.3916 3045.9755 L 4113.0477 3046.1988 M 4114.2126 3042.521 L 4117.3073 3040.5113 M 4119.7739 3041.8308 L 4117.4373 3038.2329 M 4119.7739 3041.8308 L 4121.317 3040.8286 L 4121.7197 3040.3287 L 4121.773 3040.0436 L 4121.7258 3039.5854 L 4121.3936 3039.0738 L 4120.9942 3038.8443 L 4120.7175 3038.7855 L 4120.0916 3038.9416 L 4118.5484 3039.9437 M 4124.3362 3038.8679 L 4123.7073 3039.0379 L 4123.0258 3038.7412 L 4122.3025 3037.9947 L 4121.9703 3037.4831 L 4121.577 3036.5103 L 4121.5887 3035.7754 L 4121.9997 3035.27 L 4122.3436 3035.0467 L 4122.9641 3034.8822 L 4123.6402 3035.1705 L 4124.3689 3035.9254 L 4124.7011 3036.437 L 4125.0889 3037.4014 L 4125.0827 3038.1447 L 4124.6801 3038.6446 L 4124.3362 3038.8679 M 4125.2306 3034.3881 L 4124.9401 3034.3263 L 4125.0073 3034.0442 L 4125.284 3034.103 L 4125.2306 3034.3881 M 4130.0424 3034.4349 L 4130.0896 3034.8932 L 4129.6869 3035.3931 L 4129.3431 3035.6164 L 4128.7226 3035.7809 L 4128.041 3035.4842 L 4127.3094 3034.7432 L 4126.7538 3033.8877 L 4126.4834 3033.0856 L 4126.6039 3032.5185 L 4127.0066 3032.0185 L 4127.1743 3031.9096 L 4127.8032 3031.7397 L 4128.3704 3031.8602 L 4128.8703 3032.2629 L 4128.9847 3032.439 L 4129.1492 3033.0595 L 4129.0287 3033.6267 L 4128.6176 3034.1321 L 4128.4499 3034.241 L 4127.8294 3034.4055 L 4127.2622 3034.2849 L 4126.7538 3033.8877 M 4133.7377 3032.7625 L 4132.0184 3033.879 L 4130.8486 3032.4448 L 4131.1252 3032.5036 L 4131.7512 3032.3475 L 4132.2712 3032.0098 L 4132.6684 3031.5015 L 4132.7944 3030.9427 L 4132.6244 3030.3138 L 4132.4011 3029.9699 L 4131.9012 3029.5673 L 4131.334 3029.4467 L 4130.7135 3029.6112 L 4130.1935 3029.9489 L 4129.7909 3030.4489 L 4129.7321 3030.7255 L 4129.7792 3031.1838 M 4133.871 3029.7547 L 4136.9657 3027.7449 M 4139.4323 3029.0644 L 4137.0958 3025.4665 M 4137.0958 3025.4665 L 4139.1505 3024.1322 M 4144.6856 3024.9255 L 4144.5734 3025.4872 L 4144.1624 3025.9927 L 4143.4747 3026.4393 L 4142.8542 3026.6038 L 4142.287 3026.4832 L 4142.0637 3026.1393 L 4142.0165 3025.6811 L 4142.0699 3025.3961 L 4142.3048 3025.005 L 4143.1131 3023.9913 L 4143.348 3023.6002 L 4143.4014 3023.3152 L 4143.3458 3022.8624 L 4143.0136 3022.3508 L 4142.4548 3022.2248 L 4141.8259 3022.3948 L 4141.1382 3022.8414 L 4140.7355 3023.3413 L 4140.615 3023.9085 M 4147.8809 3022.8505 L 4147.9281 3023.3087 L 4147.5255 3023.8087 L 4147.1816 3024.032 L 4146.5611 3024.1964 L 4145.8796 3023.8998 L 4145.1479 3023.1587 L 4144.5924 3022.3033 L 4144.3219 3021.5012 L 4144.4424 3020.934 L 4144.8451 3020.4341 L 4145.0212 3020.3197 L 4145.6417 3020.1552 L 4146.2089 3020.2757 L 4146.7089 3020.6784 L 4146.8232 3020.8545 L 4146.9877 3021.475 L 4146.8672 3022.0422 L 4146.4645 3022.5422 L 4146.2884 3022.6565 L 4145.6679 3022.821 L 4145.1007 3022.7005 L 4144.5924 3022.3033 M 4147.9083 3019.661 L 4147.6178 3019.5993 L 4147.685 3019.3172 L 4147.9616 3019.376 L 4147.9083 3019.661 M 4152.7084 3020.4428 L 4149.4315 3019.1607 L 4152.0062 3017.4887 M 4152.7084 3020.4428 L 4150.3719 3016.8449 M 4153.3617 3017.0972 L 4156.448 3015.093 M 4158.9146 3016.4125 L 4156.5781 3012.8146 M 4158.9146 3016.4125 L 4160.4578 3015.4103 L 4160.8688 3014.9049 L 4160.9222 3014.6199 L 4160.875 3014.1616 L 4160.6517 3013.8178 L 4160.2523 3013.5883 L 4159.9756 3013.5295 L 4159.3467 3013.6994 M 4157.8035 3014.7016 L 4159.3467 3013.6994 L 4159.7523 3013.1856 L 4159.8111 3012.909 L 4159.7639 3012.4507 L 4159.4262 3011.9308 L 4159.0268 3011.7013 L 4158.7502 3011.6425 L 4158.1213 3011.8124 L 4156.5781 3012.8146 M 4162.4538 3014.1141 L 4160.1173 3010.5162 M 4160.1173 3010.5162 L 4162.172 3009.1818~none~gge247~~0~#@$TEXT~P~4057.627~3075.9206~0.6~0~1~4~~4.5~U2~M 4057.627 3071.3806 L 4057.627 3074.4506 L 4057.427 3075.0606 L 4057.017 3075.4706 L 4056.397 3075.6706 L 4055.987 3075.6706 L 4055.377 3075.4706 L 4054.967 3075.0606 L 4054.767 3074.4506 L 4054.767 3071.3806 M 4053.207 3072.4006 L 4053.207 3072.2006 L 4053.007 3071.7906 L 4052.797 3071.5806 L 4052.387 3071.3806 L 4051.577 3071.3806 L 4051.167 3071.5806 L 4050.957 3071.7906 L 4050.757 3072.2006 L 4050.757 3072.6106 L 4050.957 3073.0206 L 4051.367 3073.6306 L 4053.417 3075.6706 L 4050.547 3075.6706~~gge253~~0~#@$CIRCLE~4030.1863~3052.1505~0.118~0.2362~101~gge259~0~~#@$CIRCLE~4031.0612~3049.7044~0.591~1.1811~12~gge262~0~~#@$SOLIDREGION~100~~M 4031.5559 3051.2606 L 4032.628 3052.9116 L 4033.3544 3052.4398 L 4032.2823 3050.7889 Z~solid~gge265~~~~0#@$SOLIDREGION~100~~M 4032.6065 3052.8785 L 4033.7216 3054.5955 L 4034.448 3054.1238 L 4033.333 3052.4067 Z~cutout~gge268~~~~0#@$SOLIDREGION~100~~M 4033.7021 3049.8668 L 4034.7742 3051.5178 L 4035.5006 3051.0461 L 4034.4285 3049.3951 Z~solid~gge271~~~~0#@$SOLIDREGION~100~~M 4034.7528 3051.4847 L 4035.8678 3053.2017 L 4036.5942 3052.73 L 4035.4791 3051.013 Z~cutout~gge274~~~~0#@$SOLIDREGION~100~~M 4035.8484 3048.4731 L 4036.9205 3050.124 L 4037.6468 3049.6523 L 4036.5747 3048.0013 Z~solid~gge277~~~~0#@$SOLIDREGION~100~~M 4036.899 3050.0909 L 4038.0141 3051.8079 L 4038.7404 3051.3362 L 4037.6254 3049.6192 Z~cutout~gge280~~~~0#@$SOLIDREGION~100~~M 4037.9945 3047.0793 L 4039.0666 3048.7302 L 4039.7931 3048.2585 L 4038.721 3046.6076 Z~solid~gge283~~~~0#@$SOLIDREGION~100~~M 4039.0452 3048.6972 L 4040.1602 3050.4142 L 4040.8867 3049.9424 L 4039.7716 3048.2254 Z~cutout~gge286~~~~0#@$SOLIDREGION~100~~M 4045.279 3072.3924 L 4044.2069 3070.7415 L 4044.9334 3070.2698 L 4046.0055 3071.9207 Z~solid~gge289~~~~0#@$SOLIDREGION~100~~M 4044.2284 3070.7746 L 4043.1133 3069.0576 L 4043.8398 3068.5858 L 4044.9548 3070.3028 Z~cutout~gge292~~~~0#@$SOLIDREGION~100~~M 4047.4253 3070.9987 L 4046.3532 3069.3477 L 4047.0795 3068.876 L 4048.1516 3070.5269 Z~solid~gge295~~~~0#@$SOLIDREGION~100~~M 4046.3746 3069.3808 L 4045.2596 3067.6638 L 4045.9859 3067.1921 L 4047.101 3068.9091 Z~cutout~gge298~~~~0#@$SOLIDREGION~100~~M 4049.5715 3069.6049 L 4048.4994 3067.9539 L 4049.2258 3067.4822 L 4050.2979 3069.1332 Z~solid~gge301~~~~0#@$SOLIDREGION~100~~M 4048.5209 3067.987 L 4047.4058 3066.27 L 4048.1322 3065.7983 L 4049.2472 3067.5153 Z~cutout~gge304~~~~0#@$SOLIDREGION~100~~M 4051.7177 3068.2111 L 4050.6456 3066.5602 L 4051.372 3066.0884 L 4052.4441 3067.7394 Z~solid~gge307~~~~0#@$SOLIDREGION~100~~M 4050.667 3066.5933 L 4049.552 3064.8762 L 4050.2784 3064.4045 L 4051.3935 3066.1215 Z~cutout~gge310~~~~0#@$SOLIDREGION~99~~M 4032.3299 3055.4523 L 4041.7646 3069.9804 L 4051.6701 3063.5477 L 4042.2354 3049.0196 Z~solid~gge313~~~~0#@$TRACK~1~4~~4032.3299 3055.4523 4035.958 3061.039~gge316~0#@$TRACK~1~4~~4041.7646 3069.9804 4038.1365 3064.3937~gge319~0#@$TRACK~1~4~~4041.667 3049.3887 4042.2354 3049.0196~gge322~0#@$TRACK~1~4~~4032.3299 3055.4523 4032.8983 3055.0831~gge325~0#@$TRACK~1~4~~4051.1017 3063.9169 4051.6701 3063.5477~gge328~0#@$TRACK~1~4~~4041.7646 3069.9804 4042.333 3069.6113~gge331~0#@$TRACK~1~4~~4051.6701 3063.5477 4042.2354 3049.0196~gge334~0#@$ARC~1~4~S$1045~M 4035.958 3061.039 A 2 2 0 0 1 4038.1327 3064.3962~~gge337~0#@$CIRCLE~4030.502~3053.2261~0.591~1.1811~4~gge340~0~~#@$SVGNODE~{\"gId\":\"gge469_outline\",\"nodeName\":\"g\",\"nodeType\":1,\"layerid\":\"19\",\"attrs\":{\"c_width\":\"23.6714\",\"c_height\":\"11.811\",\"c_rotation\":\"0,0,123\",\"z\":\"0\",\"c_origin\":\"4042,3059.5\",\"uuid\":\"48b04392abf34c86b0eb1733fd4d278c\",\"c_etype\":\"outline3D\",\"title\":\"TSSOP-8_L3.0-W4.4-H1.0-LS6.4-P0.65\",\"layerid\":\"19\",\"transform\":\"scale(1) translate(0, 0)\",\"id\":\"gge469_outline\"},\"childNodes\":[{\"gId\":\"gge469_outline_line0\",\"nodeName\":\"polyline\",\"nodeType\":1,\"attrs\":{\"fill\":\"none\",\"c_shapetype\":\"line\",\"points\":\"4031.6827 3052.0703 4032.9374 3051.2554 4032.9705 3051.234 4033.0133 3051.3 4033.0348 3051.333 4033.4208 3051.9274 4033.4636 3051.9934 4033.5065 3052.0594 4033.5494 3052.1255 4033.5923 3052.1915 4033.6137 3052.2245 4033.6566 3052.2905 4033.7209 3052.3896 4033.7639 3052.4557 4033.8067 3052.5217 4033.8496 3052.5878 4033.8925 3052.6538 4033.9354 3052.7198 4033.9568 3052.7528 4033.9783 3052.7859 4034.0426 3052.8849 4034.0855 3052.9509 4034.1284 3053.017 4034.1712 3053.083 4034.2141 3053.149 4034.257 3053.2151 4034.2999 3053.2811 4034.3428 3053.3472 4034.3642 3053.3801 4034.7073 3053.9085 4035.5327 3053.3725 4035.1896 3052.8441 4035.1468 3052.7781 4035.1039 3052.7121 4035.061 3052.646 4035.0181 3052.58 4034.9752 3052.5139 4034.9538 3052.481 4034.9109 3052.4149 4034.868 3052.3489 4034.8037 3052.2498 4034.7394 3052.1508 4034.6965 3052.0847 4034.6536 3052.0187 4034.6107 3051.9526 4034.5893 3051.9196 4034.5249 3051.8206 4034.482 3051.7545 4034.4392 3051.6885 4034.3962 3051.6224 4034.3534 3051.5564 4034.3105 3051.4904 4034.2676 3051.4243 4034.2247 3051.3583 4033.8602 3050.797 4033.8174 3050.731 4033.8504 3050.7095 4033.8289 3050.6765 4035.0836 3049.8617 4035.1166 3049.8402 4035.1595 3049.9063 4035.181 3049.9393 4035.5669 3050.5337 4035.6098 3050.5997 4035.6527 3050.6657 4035.6956 3050.7318 4035.7384 3050.7978 4035.7599 3050.8308 4035.8028 3050.8968 4035.8671 3050.9959 4035.91 3051.0619 4035.9529 3051.1279 4035.9958 3051.194 4036.0387 3051.26 4036.0815 3051.326 4036.103 3051.3591 4036.1244 3051.3921 4036.1888 3051.4912 4036.2316 3051.5572 4036.2745 3051.6233 4036.3174 3051.6893 4036.3603 3051.7553 4036.4032 3051.8214 4036.446 3051.8874 4036.4675 3051.9204 4036.5104 3051.9864 4036.8535 3052.5148 4037.679 3051.9787 4037.3359 3051.4503 4037.293 3051.3843 4037.2501 3051.3183 4037.2072 3051.2522 4037.1644 3051.1862 4037.1214 3051.1201 4037.1 3051.0872 4037.0571 3051.0211 4037.0143 3050.9551 4036.9499 3050.856 4036.8856 3050.757 4036.8427 3050.6909 4036.7998 3050.6249 4036.7569 3050.5588 4036.7355 3050.5259 4036.6712 3050.4268 4036.6283 3050.3607 4036.5854 3050.2947 4036.5425 3050.2286 4036.4996 3050.1626 4036.4568 3050.0966 4036.4138 3050.0305 4036.371 3049.9645 4036.0065 3049.4032 4035.9636 3049.3372 4035.9966 3049.3158 4035.9751 3049.2828 4037.2298 3048.4679 4037.2629 3048.4465 4037.3057 3048.5125 4037.3272 3048.5455 4037.7132 3049.1399 4037.756 3049.2059 4037.7989 3049.2719 4037.8418 3049.338 4037.8847 3049.404 4037.9061 3049.437 4037.949 3049.503 4038.0133 3049.6021 4038.0562 3049.6682 4038.0991 3049.7342 4038.142 3049.8002 4038.1849 3049.8662 4038.2278 3049.9323 4038.2492 3049.9653 4038.2707 3049.9983 4038.335 3050.0974 4038.3779 3050.1634 4038.4208 3050.2295 4038.4636 3050.2955 4038.5065 3050.3615 4038.5494 3050.4276 4038.5923 3050.4936 4038.6137 3050.5266 4038.6566 3050.5926 4038.9997 3051.121 4039.8251 3050.5849 4039.6536 3050.3208 4039.482 3050.0566 4039.4392 3049.9906 4039.4177 3049.9575 4039.3534 3049.8585 4039.3105 3049.7925 4039.2676 3049.7264 4039.2462 3049.6934 4039.2033 3049.6274 4039.1604 3049.5614 4039.0961 3049.4623 4039.0318 3049.3633 4038.9889 3049.2972 4038.946 3049.2312 4038.9031 3049.1651 4038.8817 3049.1321 4038.8173 3049.0331 4038.7744 3048.967 4038.7316 3048.901 4038.6886 3048.8349 4038.6458 3048.7689 4038.6029 3048.7029 4038.56 3048.6368 4038.5171 3048.5708 4038.1526 3048.0095 4038.1098 3047.9435 4038.1428 3047.922 4038.1213 3047.889 4039.376 3047.0742 4039.409 3047.0527 4039.4519 3047.1187 4039.4734 3047.1518 4039.8593 3047.7461 4039.9022 3047.8121 4039.9451 3047.8782 4039.988 3047.9442 4040.0308 3048.0102 4040.0523 3048.0433 4040.0952 3048.1093 4040.1595 3048.2083 4040.2024 3048.2744 4040.2453 3048.3404 4040.2882 3048.4065 4040.3311 3048.4725 4040.3739 3048.5385 4040.3954 3048.5716 4040.4168 3048.6046 4040.4812 3048.7037 4040.524 3048.7697 4040.5669 3048.8357 4040.6098 3048.9017 4040.6527 3048.9678 4040.6956 3049.0338 4040.7384 3049.0998 4040.7814 3049.1659 4040.8028 3049.1989 4041.1459 3049.7273 4042.1364 3049.084 4042.1695 3049.0625 4042.2025 3049.0411 4042.2239 3049.074 4042.2784 3049.0857 4042.2998 3049.1187 4051.6058 3063.4486 4051.6487 3063.5147 4051.6157 3063.5361 4051.6372 3063.5692 4051.6042 3063.5906 4051.5711 3063.6121 4050.5806 3064.2554 4050.9236 3064.7837 4050.9665 3064.8497 4051.0094 3064.9157 4051.0523 3064.9817 4051.0951 3065.0478 4051.1381 3065.1138 4051.1595 3065.1468 4051.2238 3065.2459 4051.2667 3065.3119 4051.3096 3065.3779 4051.3525 3065.444 4051.3739 3065.477 4051.4168 3065.5431 4051.4597 3065.6091 4051.5026 3065.6752 4051.524 3065.7081 4051.5883 3065.8072 4051.6312 3065.8733 4051.6741 3065.9393 4051.717 3066.0053 4051.7599 3066.0713 4051.8027 3066.1374 4051.8456 3066.2034 4051.8885 3066.2694 4052.253 3066.8308 4052.296 3066.8969 4052.3174 3066.9298 4052.2843 3066.9513 4051.0297 3067.766 4051.0083 3067.7331 4050.9752 3067.7545 4050.9323 3067.6885 4050.5464 3067.0942 4050.5034 3067.0281 4050.4606 3066.9621 4050.4177 3066.896 4050.3748 3066.83 4050.3533 3066.797 4050.289 3066.6979 4050.2792 3066.6104 4050.2676 3066.6649 4050.3105 3066.731 4050.3435 3066.7095 4050.2792 3066.6104 4050.3105 3066.731 4050.3533 3066.797 4050.3435 3066.7095 4050.3105 3066.731 4050.2676 3066.6649 4050.2032 3066.5658 4050.1604 3066.4998 4050.1175 3066.4338 4050.0746 3066.3677 4050.0317 3066.3017 4049.9888 3066.2356 4049.9245 3066.1366 4049.8816 3066.0706 4049.8387 3066.0045 4049.7959 3065.9385 4049.7744 3065.9054 4049.7101 3065.8064 4049.6672 3065.7404 4049.6458 3065.7074 4049.6029 3065.6414 4049.4313 3065.3772 4049.2598 3065.1131 4048.4344 3065.6491 4048.7775 3066.1774 4048.8203 3066.2434 4048.8633 3066.3095 4048.9061 3066.3755 4048.949 3066.4415 4048.9919 3066.5076 4049.0133 3066.5405 4049.0777 3066.6397 4049.1205 3066.7057 4049.1634 3066.7717 4049.2063 3066.8378 4049.2277 3066.8707 4049.2706 3066.9368 4049.3135 3067.0028 4049.3564 3067.0689 4049.3778 3067.1019 4049.4421 3067.2009 4049.4851 3067.267 4049.5279 3067.333 4049.5708 3067.3991 4049.6137 3067.4651 4049.6566 3067.5311 4049.6995 3067.5972 4049.7424 3067.6632 4050.1069 3068.2245 4050.1498 3068.2906 4050.1712 3068.3235 4050.1382 3068.345 4048.8834 3069.1598 4048.862 3069.1269 4048.8291 3069.1483 4048.7861 3069.0822 4048.4002 3068.4879 4048.3573 3068.4218 4048.3144 3068.3558 4048.2715 3068.2897 4048.2286 3068.2237 4048.2072 3068.1907 4048.1643 3068.1247 4048.1214 3068.0586 4048.0571 3067.9595 4048.0142 3067.8935 4047.9714 3067.8275 4047.9284 3067.7615 4047.8856 3067.6955 4047.8427 3067.6294 4047.7783 3067.5303 4047.7355 3067.4643 4047.6926 3067.3982 4047.6497 3067.3322 4047.6282 3067.2992 4047.5639 3067.2001 4047.5211 3067.1341 4047.4996 3067.1011 4047.4567 3067.0351 4047.2852 3066.7709 4047.1137 3066.5068 4046.2882 3067.0429 4046.6312 3067.5712 4046.6741 3067.6372 4046.717 3067.7033 4046.7599 3067.7693 4046.8027 3067.8353 4046.8457 3067.9014 4046.8671 3067.9343 4046.9314 3068.0334 4046.9743 3068.0994 4047.0172 3068.1655 4047.0601 3068.2315 4047.0815 3068.2645 4047.1244 3068.3306 4047.1673 3068.3966 4047.2102 3068.4627 4047.2316 3068.4956 4047.2959 3068.5947 4047.3388 3068.6608 4047.3817 3068.7268 4047.4246 3068.7929 4047.4675 3068.8589 4047.5103 3068.9249 4047.5532 3068.991 4047.5961 3069.057 4047.9606 3069.6183 4048.0036 3069.6844 4048.025 3069.7173 4047.9919 3069.7388 4046.7373 3070.5536 4046.7159 3070.5206 4046.6828 3070.5421 4046.6399 3070.476 4046.254 3069.8817 4046.211 3069.8156 4046.1682 3069.7496 4046.1253 3069.6835 4046.0824 3069.6175 4046.0609 3069.5845 4046.0181 3069.5185 4045.9752 3069.4524 4045.9108 3069.3533 4045.868 3069.2873 4045.8251 3069.2213 4045.7822 3069.1552 4045.7393 3069.0892 4045.7179 3069.0562 4045.6964 3069.0231 4045.6321 3068.9241 4045.5892 3068.8581 4045.5463 3068.792 4045.5035 3068.726 4045.482 3068.693 4045.4177 3068.5939 4045.3748 3068.5279 4045.3534 3068.4949 4045.3105 3068.4289 4045.1389 3068.1647 4044.9674 3067.9006 4044.142 3068.4366 4044.4851 3068.9649 4044.5279 3069.0309 4044.5709 3069.097 4044.6137 3069.163 4044.6566 3069.229 4044.6995 3069.2951 4044.7209 3069.328 4044.7853 3069.4272 4044.8281 3069.4932 4044.871 3069.5592 4044.9139 3069.6253 4044.9353 3069.6582 4044.9782 3069.7243 4045.0211 3069.7903 4045.064 3069.8564 4045.0854 3069.8894 4045.1497 3069.9884 4045.1927 3070.0545 4045.2355 3070.1205 4045.2784 3070.1866 4045.3213 3070.2526 4045.3642 3070.3186 4045.4071 3070.3847 4045.45 3070.4507 4045.8145 3071.012 4045.8574 3071.0781 4045.8788 3071.1111 4045.8458 3071.1325 4044.591 3071.9474 4044.5696 3071.9144 4044.5367 3071.9358 4044.4937 3071.8697 4044.1078 3071.2754 4044.0649 3071.2093 4044.022 3071.1433 4043.9791 3071.0772 4043.9362 3071.0112 4043.9148 3070.9782 4043.8719 3070.9122 4043.829 3070.8461 4043.7647 3070.7471 4043.7218 3070.6811 4043.679 3070.6151 4043.636 3070.549 4043.5932 3070.483 4043.5503 3070.4169 4043.4859 3070.3178 4043.4431 3070.2518 4043.4002 3070.1857 4043.3573 3070.1197 4043.3358 3070.0867 4043.2715 3069.9876 4043.2287 3069.9216 4043.2072 3069.8886 4043.1643 3069.8226 4042.8213 3069.2943 4041.8637 3069.9162 4041.8307 3069.9376 4041.7977 3069.9591 4041.7762 3069.926 4041.7217 3069.9144 4041.7002 3069.8814 4032.3943 3055.5514 4032.3514 3055.4853 4032.3844 3055.4639 4032.363 3055.4309 4032.396 3055.4095 4032.429 3055.3881 4033.3866 3054.7662 4033.0435 3054.2378 4033.0006 3054.1718 4032.9791 3054.1388 4032.9148 3054.0397 4032.872 3053.9737 4032.829 3053.9077 4032.8076 3053.8747 4032.7647 3053.8086 4032.7219 3053.7426 4032.6575 3053.6436 4032.5932 3053.5445 4032.5503 3053.4784 4032.5074 3053.4124 4032.4645 3053.3463 4032.4431 3053.3134 4032.3788 3053.2143 4032.3359 3053.1482 4032.293 3053.0822 4032.2501 3053.0161 4032.2072 3052.9501 4032.1644 3052.8841 4032.1214 3052.818 4032.0786 3052.752 4031.7141 3052.1907 4031.6712 3052.1247 4031.7042 3052.1033 4031.6827 3052.0703 4031.6827 3052.0703\",\"id\":\"gge469_outline_line0\"}}]}#@$PAD~OVAL~4032.5039~3051.926~1.3898~5.7244~2~S$474~1~0~4033.6843 3053.7437 4031.3235 3050.1084~213~gge349~0~~Y~0~0.0000~0.2000~4032.5045,3051.9261#@$PAD~OVAL~4034.6509~3050.5318~1.3898~5.7244~2~~2~0~4035.8313 3052.3494 4033.4705 3048.7141~213~gge364~0~~Y~0~0.0000~0.2000~4034.6507,3050.5324#@$PAD~OVAL~4036.7971~3049.138~1.3898~5.7244~2~~3~0~4037.9775 3050.9557 4035.6167 3047.3204~213~gge379~0~~Y~0~0.0000~0.2000~4036.7969,3049.1386#@$PAD~OVAL~4038.9432~3047.7443~1.3898~5.7244~2~~4~0~4040.1236 3049.5619 4037.7628 3045.9266~213~gge394~0~~Y~0~0.0000~0.2000~4038.9431,3047.7448#@$PAD~OVAL~4045.0568~3071.2557~1.3898~5.7244~2~~8~0~4046.2372 3073.0734 4043.8764 3069.4381~213~gge409~0~~Y~0~0.0000~0.2000~4045.0569,3071.2552#@$PAD~OVAL~4047.2038~3069.8614~1.3898~5.7244~2~~7~0~4048.3842 3071.6791 4046.0234 3068.0438~213~gge424~0~~Y~0~0.0000~0.2000~4047.2031,3069.8614#@$PAD~OVAL~4049.3499~3068.4677~1.3898~5.7244~2~~6~0~4050.5303 3070.2854 4048.1695 3066.6501~213~gge439~0~~Y~0~0.0000~0.2000~4049.3493,3068.4676#@$PAD~OVAL~4051.4961~3067.074~1.3898~5.7244~2~~5~0~4052.6765 3068.8916 4050.3157 3065.2563~213~gge454~0~~Y~0~0.0000~0.2000~4051.4955,3067.0739",
    "LIB~4041.5~3008~package`TSSOP-8_L4.4-W3.0-P0.65-LS6.4-BL`subpart_no`1`Supplier`LCSC`Supplier Part`C2863217`Manufacturer`TI(德州仪器)`Manufacturer Part`LM358LVIPWR`JLCPCB Part Class`Extended Part`link`https://lcsc.com/eda_search?q=C2863217&%26type=1&ref=editor`Contributor`lcsc`3DModel`TSSOP-8_L3.0-W4.4-H1.0-LS6.4-P0.65`~33~~gge241~1~ac3fffac6da64b5495d3fa41718a99f8~1629774032~0~~yes~~#@$TEXT~N~4028.1346~2989.2552~0.6~33~0~3~~4.5~TSSOP-8_L4.4-W3.0-P0.65-LS6.4-BL~M 4026.8613 2984.6688 L 4029.1978 2988.2667 M 4025.662 2985.4477 L 4028.0606 2983.89 M 4031.932 2982.1032 L 4031.3648 2981.9826 L 4030.7359 2982.1526 L 4030.0566 2982.5937 L 4029.6456 2983.0992 L 4029.525 2983.6663 L 4029.7483 2984.0102 L 4030.1477 2984.2396 L 4030.4298 2984.3068 L 4030.8826 2984.2513 L 4032.1375 2983.9252 L 4032.5903 2983.8697 L 4032.8724 2983.9368 L 4033.2718 2984.1663 L 4033.604 2984.6779 L 4033.4835 2985.2451 L 4033.0724 2985.7505 L 4032.3931 2986.1916 L 4031.7642 2986.3616 L 4031.197 2986.241 M 4035.4628 2979.8103 L 4034.8956 2979.6897 L 4034.2751 2979.8542 L 4033.5874 2980.3008 L 4033.1847 2980.8008 L 4033.0642 2981.3679 L 4033.2875 2981.7118 L 4033.6785 2981.9467 L 4033.969 2982.0085 L 4034.4218 2981.9529 L 4035.6683 2981.6323 L 4036.1211 2981.5767 L 4036.4116 2981.6385 L 4036.8026 2981.8734 L 4037.1348 2982.385 L 4037.0143 2982.9521 L 4036.6116 2983.4521 L 4035.9239 2983.8987 L 4035.3034 2984.0632 L 4034.7362 2983.9427 M 4037.2943 2977.8935 L 4037.0594 2978.2845 L 4036.9389 2978.8517 L 4036.9944 2979.3045 L 4037.156 2979.9388 L 4037.7115 2980.7943 L 4038.2199 2981.1915 L 4038.6109 2981.4264 L 4039.178 2981.547 L 4039.6308 2981.4914 L 4040.3185 2981.0448 L 4040.5535 2980.6538 L 4040.6656 2980.0921 L 4040.6185 2979.6338 L 4040.454 2979.0133 L 4039.8984 2978.1579 L 4039.393 2977.7468 L 4038.9936 2977.5173 L 4038.4348 2977.3913 L 4037.982 2977.4469 L 4037.2943 2977.8935 M 4040.1374 2976.0472 L 4042.4739 2979.6451 M 4040.1374 2976.0472 L 4041.6806 2975.045 L 4042.3095 2974.8751 L 4042.5916 2974.9423 L 4042.991 2975.1718 L 4043.3232 2975.6834 L 4043.3704 2976.1416 L 4043.3116 2976.4183 L 4042.906 2976.9321 L 4041.3629 2977.9342 M 4045.011 2975.8035 L 4048.0973 2973.7993 M 4048.7506 2970.4537 L 4048.3479 2970.9537 L 4048.3951 2971.4119 L 4048.6184 2971.7558 L 4049.0178 2971.9853 L 4049.476 2971.9381 L 4050.2727 2971.6592 L 4050.8932 2971.4947 L 4051.4604 2971.6153 L 4051.8514 2971.8502 L 4052.1891 2972.3702 L 4052.2446 2972.823 L 4052.1774 2973.1051 L 4051.7748 2973.605 L 4051.0871 2974.0516 L 4050.4666 2974.2161 L 4050.1815 2974.1628 L 4049.7905 2973.9278 L 4049.4528 2973.4079 L 4049.3972 2972.9551 L 4049.5178 2972.3879 L 4049.9288 2971.8825 L 4050.4992 2971.2736 L 4050.7287 2970.8742 L 4050.6815 2970.416 L 4050.4582 2970.0721 L 4050.0588 2969.8426 L 4049.4383 2970.0071 L 4048.7506 2970.4537 M 4054.5467 2973.5219 L 4057.633 2971.5177 M 4055.6444 2965.9768 L 4057.9809 2969.5747 M 4057.9809 2969.5747 L 4060.0441 2968.2349 M 4060.5507 2962.7907 L 4060.3974 2966.3003 L 4062.9722 2964.6283 M 4060.5507 2962.7907 L 4062.8872 2966.3886 M 4064.4954 2964.128 L 4064.442 2964.413 L 4064.7187 2964.4718 L 4064.7859 2964.1897 L 4064.4954 2964.128 M 4065.7337 2959.4248 L 4065.5804 2962.9345 L 4068.1468 2961.2679 M 4065.7337 2959.4248 L 4068.0702 2963.0227 M 4069.0557 2960.1887 L 4072.1504 2958.179 M 4071.9482 2955.389 L 4075.1401 2958.4314 M 4073.6591 2954.278 L 4075.1401 2958.4314 M 4073.6591 2954.278 L 4076.851 2957.3203 M 4075.3784 2953.1614 L 4076.851 2957.3203 M 4076.8544 2952.2029 L 4078.7414 2950.9774 L 4078.6031 2953.0228 L 4079.1147 2952.6905 L 4079.5674 2952.635 L 4079.8525 2952.6883 L 4080.3579 2953.0994 L 4080.5812 2953.4432 L 4080.7457 2954.0638 L 4080.6251 2954.6309 L 4080.2141 2955.1363 L 4079.7025 2955.4686 L 4079.082 2955.633 L 4078.7969 2955.5797 L 4078.4059 2955.3448 M 4081.9985 2952.7613 L 4081.9367 2953.0518 L 4082.2218 2953.1052 L 4082.2806 2952.8285 L 4081.9985 2952.7613 M 4082.549 2948.5048 L 4082.1379 2949.0102 L 4082.1318 2949.7535 L 4082.5196 2950.7178 L 4082.8518 2951.2294 L 4083.5805 2951.9843 L 4084.2566 2952.2726 L 4084.8855 2952.1027 L 4085.2294 2951.8794 L 4085.632 2951.3794 L 4085.6436 2950.6445 L 4085.2504 2949.6718 L 4084.9182 2949.1602 L 4084.1949 2948.4137 L 4083.5134 2948.117 L 4082.8928 2948.2815 L 4082.549 2948.5048 M 4086.3826 2948.9365 L 4089.4773 2946.9268 M 4089.2751 2944.1368 L 4091.6116 2947.7347 M 4089.2751 2944.1368 L 4090.8183 2943.1346 L 4091.4388 2942.9701 L 4091.7209 2943.0373 L 4092.1203 2943.2668 L 4092.4526 2943.7784 L 4092.4997 2944.2366 L 4092.4409 2944.5133 L 4092.0437 2945.0217 L 4090.5006 2946.0238 M 4093.8375 2941.1739 L 4093.4265 2941.6794 L 4093.4203 2942.4226 L 4093.8081 2943.387 L 4094.1403 2943.8986 L 4094.869 2944.6535 L 4095.5451 2944.9418 L 4096.174 2944.7718 L 4096.5179 2944.5485 L 4096.9205 2944.0486 L 4096.9321 2943.3137 L 4096.5389 2942.3409 L 4096.2067 2941.8293 L 4095.4834 2941.0828 L 4094.8019 2940.7861 L 4094.1814 2940.9506 L 4093.8375 2941.1739 M 4098.2938 2942.179 L 4098.2321 2942.4695 L 4098.5171 2942.5229 L 4098.5759 2942.2462 L 4098.2938 2942.179 M 4100.2082 2937.7641 L 4099.8087 2937.5347 L 4099.1882 2937.6991 L 4098.8444 2937.9224 L 4098.4417 2938.4224 L 4098.4355 2939.1657 L 4098.8149 2940.1355 L 4099.3705 2940.991 L 4099.9932 2941.5643 L 4100.5603 2941.6848 L 4101.1809 2941.5203 L 4101.3486 2941.4114 L 4101.7596 2940.906 L 4101.8802 2940.3389 L 4101.7157 2939.7183 L 4101.6013 2939.5422 L 4101.1014 2939.1396 L 4100.5342 2939.019 L 4099.9053 2939.1889 L 4099.7376 2939.2979 L 4099.3349 2939.7978 L 4099.2144 2940.365 L 4099.3705 2940.991 M 4103.239 2935.0685 L 4101.5197 2936.1851 L 4102.3541 2937.8371 L 4102.4129 2937.5605 L 4102.8101 2937.0521 L 4103.3301 2936.7144 L 4103.9561 2936.5583 L 4104.5178 2936.6705 L 4105.0232 2937.0815 L 4105.2465 2937.4254 L 4105.411 2938.0459 L 4105.2905 2938.6131 L 4104.8878 2939.113 L 4104.3678 2939.4507 L 4103.7473 2939.6152 L 4103.4706 2939.5564 L 4103.0712 2939.3269 M 4106.041 2936.1702 L 4109.1357 2934.1604 M 4108.9336 2931.3704 L 4111.2701 2934.9683 M 4111.2701 2934.9683 L 4113.3248 2933.634 M 4114.8513 2928.2547 L 4114.2926 2928.1287 L 4113.6637 2928.2987 L 4112.976 2928.7453 L 4112.5733 2929.2452 L 4112.4527 2929.8124 L 4112.6761 2930.1563 L 4113.0755 2930.3857 L 4113.3576 2930.4529 L 4113.8104 2930.3974 L 4115.0652 2930.0713 L 4115.518 2930.0157 L 4115.8001 2930.0829 L 4116.1912 2930.3179 L 4116.5234 2930.8295 L 4116.4112 2931.3912 L 4116.0002 2931.8966 L 4115.3125 2932.3432 L 4114.6919 2932.5077 L 4114.1248 2932.3871 M 4118.0467 2926.1797 L 4117.6473 2925.9502 L 4117.0267 2926.1147 L 4116.6829 2926.338 L 4116.2802 2926.8379 L 4116.274 2927.5812 L 4116.6535 2928.551 L 4117.209 2929.4065 L 4117.8317 2929.9798 L 4118.3989 2930.1004 L 4119.0194 2929.9359 L 4119.1955 2929.8215 L 4119.5982 2929.3215 L 4119.7187 2928.7544 L 4119.5542 2928.1339 L 4119.4399 2927.9577 L 4118.9399 2927.5551 L 4118.3727 2927.4345 L 4117.7522 2927.599 L 4117.5761 2927.7134 L 4117.1734 2928.2134 L 4117.0529 2928.7805 L 4117.209 2929.4065 M 4120.9715 2927.452 L 4120.9097 2927.7425 L 4121.1948 2927.7958 L 4121.2536 2927.5192 L 4120.9715 2927.452 M 4122.2097 2922.7488 L 4122.0481 2926.2639 L 4124.6228 2924.5919 M 4122.2097 2922.7488 L 4124.5462 2926.3467 M 4125.5317 2923.5128 L 4128.618 2921.5085 M 4128.4159 2918.7185 L 4130.7524 2922.3164 M 4128.4159 2918.7185 L 4129.959 2917.7163 L 4130.5879 2917.5464 L 4130.8701 2917.6136 L 4131.2695 2917.8431 L 4131.4928 2918.1869 L 4131.54 2918.6452 L 4131.4812 2918.9218 L 4131.0701 2919.4272 M 4129.527 2920.4294 L 4131.0701 2919.4272 L 4131.7045 2919.2657 L 4131.9811 2919.3245 L 4132.3805 2919.554 L 4132.7182 2920.0739 L 4132.7654 2920.5322 L 4132.7066 2920.8088 L 4132.2955 2921.3142 L 4130.7524 2922.3164 M 4131.9551 2916.4201 L 4134.2916 2920.018 M 4134.2916 2920.018 L 4136.3463 2918.6836~none~gge19~~0~#@$TEXT~P~4030.0838~2994.045~0.6~0~0~3~~4.5~U1~M 4030.0838 2989.505 L 4030.0838 2992.575 L 4030.2838 2993.185 L 4030.6938 2993.595 L 4031.3138 2993.795 L 4031.7238 2993.795 L 4032.3338 2993.595 L 4032.7438 2993.185 L 4032.9438 2992.575 L 4032.9438 2989.505 M 4034.2938 2990.325 L 4034.7038 2990.115 L 4035.3238 2989.505 L 4035.3238 2993.795~~gge25~~0~#@$CIRCLE~4043.409~3021.7817~0.118~0.2362~101~gge31~0~~#@$CIRCLE~4045.9995~3021.9773~0.591~1.1811~12~gge34~0~~#@$SOLIDREGION~100~~M 4044.779 3020.8924 L 4043.7069 3019.2415 L 4044.4334 3018.7698 L 4045.5055 3020.4207 Z~solid~gge37~~~~0#@$SOLIDREGION~100~~M 4043.7284 3019.2746 L 4042.6133 3017.5576 L 4043.3398 3017.0858 L 4044.4548 3018.8028 Z~cutout~gge40~~~~0#@$SOLIDREGION~100~~M 4046.9253 3019.4987 L 4045.8532 3017.8477 L 4046.5795 3017.376 L 4047.6516 3019.0269 Z~solid~gge43~~~~0#@$SOLIDREGION~100~~M 4045.8746 3017.8808 L 4044.7596 3016.1638 L 4045.4859 3015.6921 L 4046.601 3017.4091 Z~cutout~gge46~~~~0#@$SOLIDREGION~100~~M 4049.0715 3018.1049 L 4047.9994 3016.4539 L 4048.7258 3015.9822 L 4049.7979 3017.6332 Z~solid~gge49~~~~0#@$SOLIDREGION~100~~M 4048.0209 3016.487 L 4046.9058 3014.77 L 4047.6322 3014.2983 L 4048.7472 3016.0153 Z~cutout~gge52~~~~0#@$SOLIDREGION~100~~M 4051.2177 3016.7111 L 4050.1456 3015.0602 L 4050.872 3014.5884 L 4051.9441 3016.2394 Z~solid~gge55~~~~0#@$SOLIDREGION~100~~M 4050.167 3015.0933 L 4049.052 3013.3762 L 4049.7784 3012.9045 L 4050.8935 3014.6215 Z~cutout~gge58~~~~0#@$SOLIDREGION~100~~M 4031.0559 2999.7606 L 4032.128 3001.4116 L 4032.8544 3000.9398 L 4031.7823 2999.2889 Z~solid~gge61~~~~0#@$SOLIDREGION~100~~M 4032.1065 3001.3785 L 4033.2216 3003.0955 L 4033.948 3002.6238 L 4032.833 3000.9067 Z~cutout~gge64~~~~0#@$SOLIDREGION~100~~M 4033.2021 2998.3668 L 4034.2742 3000.0178 L 4035.0006 2999.5461 L 4033.9285 2997.8951 Z~solid~gge67~~~~0#@$SOLIDREGION~100~~M 4034.2528 2999.9847 L 4035.3678 3001.7017 L 4036.0942 3001.23 L 4034.9791 2999.513 Z~cutout~gge70~~~~0#@$SOLIDREGION~100~~M 4035.3484 2996.9731 L 4036.4205 2998.624 L 4037.1468 2998.1523 L 4036.0747 2996.5013 Z~solid~gge73~~~~0#@$SOLIDREGION~100~~M 4036.399 2998.5909 L 4037.5141 3000.3079 L 4038.2404 2999.8362 L 4037.1254 2998.1192 Z~cutout~gge76~~~~0#@$SOLIDREGION~100~~M 4037.4945 2995.5793 L 4038.5666 2997.2302 L 4039.2931 2996.7585 L 4038.221 2995.1076 Z~solid~gge79~~~~0#@$SOLIDREGION~100~~M 4038.5452 2997.1972 L 4039.6602 2998.9142 L 4040.3867 2998.4424 L 4039.2716 2996.7254 Z~cutout~gge82~~~~0#@$SOLIDREGION~99~~M 4041.2646 3018.4804 L 4031.8299 3003.9523 L 4041.7354 2997.5196 L 4051.1701 3012.0477 Z~solid~gge85~~~~0#@$TRACK~1~3~~4041.2646 3018.4804 4037.6365 3012.8937~gge88~0#@$TRACK~1~3~~4031.8299 3003.9523 4035.458 3009.539~gge91~0#@$TRACK~1~3~~4050.6017 3012.4169 4051.1701 3012.0477~gge94~0#@$TRACK~1~3~~4041.2646 3018.4804 4041.833 3018.1113~gge97~0#@$TRACK~1~3~~4041.167 2997.8887 4041.7354 2997.5196~gge100~0#@$TRACK~1~3~~4031.8299 3003.9523 4032.3983 3003.5831~gge103~0#@$TRACK~1~3~~4041.7354 2997.5196 4051.1701 3012.0477~gge106~0#@$ARC~1~3~S$1045~M 4037.6365 3012.8937 A 2 2 0 0 0 4035.4542 3009.5415~~gge109~0#@$CIRCLE~4042.5549~3021.0558~0.591~1.1811~3~gge112~0~~#@$PAD~OVAL~4044.5568~3019.7557~1.3898~5.7244~1~S$474~1~0~4043.3764 3017.9381 4045.7372 3021.5734~33~gge121~0~~Y~0~0.0000~0.2000~4044.5569,3019.7552#@$PAD~OVAL~4046.7038~3018.3614~1.3898~5.7244~1~~2~0~4045.5234 3016.5438 4047.8842 3020.1791~33~gge136~0~~Y~0~0.0000~0.2000~4046.7031,3018.3614#@$PAD~OVAL~4048.8499~3016.9677~1.3898~5.7244~1~~3~0~4047.6695 3015.1501 4050.0303 3018.7854~33~gge151~0~~Y~0~0.0000~0.2000~4048.8493,3016.9676#@$PAD~OVAL~4050.9961~3015.574~1.3898~5.7244~1~~4~0~4049.8157 3013.7563 4052.1765 3017.3916~33~gge166~0~~Y~0~0.0000~0.2000~4050.9955,3015.5739#@$PAD~OVAL~4032.0039~3000.426~1.3898~5.7244~1~~8~0~4030.8235 2998.6084 4033.1843 3002.2437~33~gge181~0~~Y~0~0.0000~0.2000~4032.0045,3000.4261#@$PAD~OVAL~4034.1509~2999.0318~1.3898~5.7244~1~~7~0~4032.9705 2997.2141 4035.3313 3000.8494~33~gge196~0~~Y~0~0.0000~0.2000~4034.1507,2999.0324#@$PAD~OVAL~4036.2971~2997.638~1.3898~5.7244~1~~6~0~4035.1167 2995.8204 4037.4775 2999.4557~33~gge211~0~~Y~0~0.0000~0.2000~4036.2969,2997.6386#@$PAD~OVAL~4038.4432~2996.2443~1.3898~5.7244~1~~5~0~4037.2628 2994.4266 4039.6236 2998.0619~33~gge226~0~~Y~0~0.0000~0.2000~4038.4431,2996.2448#@$SVGNODE~{\"gId\":\"gge241_outline\",\"nodeName\":\"g\",\"nodeType\":1,\"layerid\":\"19\",\"attrs\":{\"c_width\":\"23.6714\",\"c_height\":\"11.811\",\"c_rotation\":\"0,0,123\",\"z\":\"0\",\"c_origin\":\"4041.5,3008\",\"uuid\":\"48b04392abf34c86b0eb1733fd4d278c\",\"c_etype\":\"outline3D\",\"title\":\"TSSOP-8_L3.0-W4.4-H1.0-LS6.4-P0.65\",\"layerid\":\"19\",\"transform\":\"scale(1) translate(0, 0)\",\"id\":\"gge241_outline\"},\"childNodes\":[{\"gId\":\"gge241_outline_line0\",\"nodeName\":\"polyline\",\"nodeType\":1,\"attrs\":{\"fill\":\"none\",\"c_shapetype\":\"line\",\"points\":\"4044.091 3020.4473 4045.3457 3019.6324 4045.3787 3019.611 4045.3359 3019.545 4045.3144 3019.5119 4044.9284 3018.9176 4044.8856 3018.8516 4044.8427 3018.7856 4044.7998 3018.7195 4044.7569 3018.6535 4044.7355 3018.6204 4044.6926 3018.5544 4044.6283 3018.4554 4044.5854 3018.3893 4044.5425 3018.3233 4044.4996 3018.2572 4044.4567 3018.1912 4044.4139 3018.1252 4044.3924 3018.0921 4044.3709 3018.0591 4044.3066 3017.9601 4044.2638 3017.894 4044.2208 3017.828 4044.178 3017.762 4044.1351 3017.696 4044.0922 3017.6299 4044.0493 3017.5639 4044.0064 3017.4978 4043.985 3017.4648 4043.6419 3016.9365 4044.4673 3016.4004 4044.8104 3016.9288 4044.8533 3016.9948 4044.8962 3017.0608 4044.9391 3017.1269 4044.9819 3017.1929 4045.0249 3017.259 4045.0463 3017.2919 4045.0892 3017.358 4045.132 3017.424 4045.1964 3017.5231 4045.2607 3017.6221 4045.3036 3017.6882 4045.3465 3017.7542 4045.3894 3017.8203 4045.4108 3017.8533 4045.4751 3017.9523 4045.518 3018.0184 4045.5609 3018.0844 4045.6038 3018.1505 4045.6467 3018.2165 4045.6895 3018.2825 4045.7325 3018.3486 4045.7753 3018.4146 4046.1398 3018.9759 4046.1827 3019.0419 4046.2158 3019.0204 4046.2372 3019.0535 4047.4919 3018.2387 4047.5249 3018.2172 4047.482 3018.1512 4047.4606 3018.1182 4047.0746 3017.5238 4047.0317 3017.4578 4046.9889 3017.3918 4046.946 3017.3257 4046.9031 3017.2597 4046.8816 3017.2267 4046.8388 3017.1607 4046.7744 3017.0616 4046.7315 3016.9956 4046.6887 3016.9295 4046.6457 3016.8635 4046.6029 3016.7975 4046.56 3016.7315 4046.5386 3016.6984 4046.5171 3016.6654 4046.4528 3016.5663 4046.4099 3016.5003 4046.367 3016.4342 4046.3241 3016.3682 4046.2813 3016.3022 4046.2384 3016.2361 4046.1955 3016.1701 4046.174 3016.1371 4046.1312 3016.0711 4045.7881 3015.5427 4046.6136 3015.0066 4046.9567 3015.535 4046.9995 3015.601 4047.0424 3015.667 4047.0853 3015.7331 4047.1282 3015.7991 4047.1711 3015.8652 4047.1925 3015.8981 4047.2354 3015.9642 4047.2783 3016.0302 4047.3426 3016.1293 4047.4069 3016.2283 4047.4498 3016.2944 4047.4927 3016.3604 4047.5356 3016.4265 4047.557 3016.4595 4047.6214 3016.5585 4047.6643 3016.6246 4047.7071 3016.6906 4047.7501 3016.7567 4047.7929 3016.8227 4047.8358 3016.8887 4047.8787 3016.9548 4047.9216 3017.0208 4048.2861 3017.5821 4048.3289 3017.6481 4048.3619 3017.6267 4048.3834 3017.6598 4049.6381 3016.8449 4049.6711 3016.8235 4049.6283 3016.7575 4049.6068 3016.7244 4049.2208 3016.13 4049.178 3016.064 4049.1351 3015.998 4049.0922 3015.932 4049.0493 3015.8659 4049.0279 3015.8329 4048.985 3015.7669 4048.9207 3015.6679 4048.8778 3015.6018 4048.8349 3015.5358 4048.792 3015.4697 4048.7491 3015.4037 4048.7063 3015.3377 4048.6848 3015.3046 4048.6633 3015.2716 4048.599 3015.1725 4048.5562 3015.1065 4048.5132 3015.0404 4048.4704 3014.9744 4048.4275 3014.9084 4048.3846 3014.8424 4048.3417 3014.7763 4048.3203 3014.7433 4048.2774 3014.6773 4047.9343 3014.1489 4048.7597 3013.6129 4048.9313 3013.8771 4049.1028 3014.1413 4049.1457 3014.2073 4049.1672 3014.2403 4049.2315 3014.3394 4049.2743 3014.4054 4049.3173 3014.4715 4049.3387 3014.5044 4049.3816 3014.5705 4049.4244 3014.6365 4049.4888 3014.7355 4049.5531 3014.8346 4049.596 3014.9007 4049.6389 3014.9667 4049.6818 3015.0328 4049.7032 3015.0657 4049.7675 3015.1648 4049.8104 3015.2309 4049.8533 3015.2969 4049.8962 3015.363 4049.9391 3015.429 4049.9819 3015.495 4050.0249 3015.5611 4050.0677 3015.6271 4050.4322 3016.1884 4050.4751 3016.2544 4050.5082 3016.2329 4050.5296 3016.266 4051.7843 3015.4512 4051.8173 3015.4297 4051.7744 3015.3637 4051.753 3015.3307 4051.367 3014.7363 4051.3241 3014.6703 4051.2813 3014.6043 4051.2384 3014.5382 4051.1955 3014.4722 4051.174 3014.4392 4051.1312 3014.3732 4051.0668 3014.2741 4051.0239 3014.208 4050.9811 3014.142 4050.9381 3014.0759 4050.8953 3014.0099 4050.8524 3013.9439 4050.831 3013.9109 4050.8095 3013.8779 4050.7452 3013.7788 4050.7023 3013.7128 4050.6594 3013.6467 4050.6165 3013.5807 4050.5737 3013.5147 4050.5308 3013.4486 4050.4879 3013.3826 4050.445 3013.3165 4050.4236 3013.2836 4050.0805 3012.7552 4051.071 3012.1119 4051.104 3012.0905 4051.1371 3012.069 4051.1157 3012.0361 4051.1272 3011.9816 4051.1057 3011.9486 4041.7998 2997.6186 4041.7568 2997.5525 4041.7239 2997.5739 4041.7024 2997.5409 4041.6694 2997.5624 4041.6363 2997.5838 4040.6458 2998.2271 4040.3027 2997.6988 4040.2598 2997.6328 4040.2169 2997.5667 4040.1741 2997.5007 4040.1312 2997.4347 4040.0883 2997.3686 4040.0669 2997.3357 4040.0025 2997.2365 4039.9596 2997.1705 4039.9168 2997.1045 4039.8739 2997.0384 4039.8525 2997.0055 4039.8095 2996.9394 4039.7667 2996.8734 4039.7238 2996.8073 4039.7024 2996.7743 4039.638 2996.6753 4039.5951 2996.6092 4039.5523 2996.5432 4039.5093 2996.4771 4039.4665 2996.4111 4039.4236 2996.3451 4039.3807 2996.279 4039.3378 2996.213 4038.9733 2995.6517 4038.9304 2995.5856 4038.909 2995.5526 4038.8759 2995.5741 4037.6213 2996.3889 4037.6427 2996.4218 4037.6096 2996.4433 4037.6526 2996.5094 4038.0385 2997.1037 4038.0814 2997.1698 4038.1243 2997.2358 4038.1672 2997.3019 4038.2101 2997.3679 4038.2315 2997.4009 4038.2958 2997.4999 4038.3717 2997.5445 4038.3173 2997.533 4038.2744 2997.4669 4038.3074 2997.4454 4038.3717 2997.5445 4038.2744 2997.4669 4038.2315 2997.4009 4038.3074 2997.4454 4038.2744 2997.4669 4038.3173 2997.533 4038.3816 2997.632 4038.4245 2997.698 4038.4673 2997.764 4038.5103 2997.8301 4038.5531 2997.8961 4038.596 2997.9622 4038.6604 2998.0613 4038.7032 2998.1273 4038.7461 2998.1934 4038.789 2998.2594 4038.8105 2998.2924 4038.8748 2998.3915 4038.9176 2998.4575 4038.9391 2998.4905 4038.982 2998.5565 4039.1535 2998.8207 4039.325 2999.0848 4038.4996 2999.6208 4038.1566 2999.0925 4038.1137 2999.0265 4038.0708 2998.9604 4038.0279 2998.8944 4037.985 2998.8284 4037.9421 2998.7624 4037.9207 2998.7294 4037.8563 2998.6303 4037.8135 2998.5643 4037.7706 2998.4983 4037.7277 2998.4322 4037.7063 2998.3992 4037.6634 2998.3331 4037.6205 2998.2671 4037.5776 2998.201 4037.5562 2998.1681 4037.4919 2998.069 4037.449 2998.0029 4037.4061 2997.9369 4037.3632 2997.8708 4037.3203 2997.8048 4037.2774 2997.7388 4037.2345 2997.6728 4037.1917 2997.6067 4036.8271 2997.0454 4036.7842 2996.9793 4036.7628 2996.9464 4036.7298 2996.9678 4035.475 2997.7827 4035.4964 2997.8156 4035.4635 2997.837 4035.5064 2997.9031 4035.8923 2998.4974 4035.9353 2998.5635 4035.9781 2998.6295 4036.021 2998.6956 4036.0639 2998.7616 4036.0854 2998.7946 4036.1282 2998.8606 4036.1711 2998.9267 4036.2355 2999.0258 4036.2783 2999.0918 4036.3212 2999.1578 4036.3641 2999.2239 4036.407 2999.2899 4036.4499 2999.356 4036.5142 2999.455 4036.5571 2999.521 4036.6 2999.5871 4036.6428 2999.6531 4036.6643 2999.6861 4036.7286 2999.7852 4036.7715 2999.8512 4036.7929 2999.8842 4036.8358 2999.9502 4037.0074 3000.2144 4037.1789 3000.4785 4036.3534 3001.0146 4036.0103 3000.4863 4035.9674 3000.4203 4035.9245 3000.3542 4035.8817 3000.2882 4035.8388 3000.2222 4035.7959 3000.1561 4035.7745 3000.1232 4035.7101 3000.024 4035.6672 2999.958 4035.6244 2999.892 4035.5815 2999.826 4035.5601 2999.793 4035.5171 2999.7269 4035.4743 2999.6609 4035.4314 2999.5948 4035.41 2999.5619 4035.3456 2999.4628 4035.3027 2999.3967 4035.2599 2999.3307 4035.2169 2999.2646 4035.1741 2999.1986 4035.1312 2999.1326 4035.0883 2999.0665 4035.0454 2999.0005 4034.6809 2998.4392 4034.638 2998.3731 4034.6166 2998.3402 4034.5835 2998.3616 4033.3289 2999.1764 4033.3503 2999.2094 4033.3172 2999.2308 4033.3602 2999.2969 4033.7461 2999.8912 4033.789 2999.9573 4033.8319 3000.0233 4033.8748 3000.0894 4033.9177 3000.1554 4033.9391 3000.1884 4033.982 3000.2544 4034.0249 3000.3205 4034.0892 3000.4196 4034.1321 3000.4856 4034.1749 3000.5516 4034.2179 3000.6176 4034.2607 3000.6837 4034.2822 3000.7167 4034.3036 3000.7497 4034.368 3000.8488 4034.4108 3000.9148 4034.4537 3000.9809 4034.4966 3001.0469 4034.5181 3001.0799 4034.5824 3001.179 4034.6252 3001.245 4034.6467 3001.278 4034.6896 3001.344 4034.8611 3001.6082 4035.0326 3001.8723 4034.2072 3002.4083 4033.8642 3001.8801 4033.8213 3001.8141 4033.7784 3001.748 4033.7355 3001.682 4033.6926 3001.616 4033.6497 3001.5499 4033.6283 3001.5169 4033.5639 3001.4178 4033.5211 3001.3518 4033.4782 3001.2858 4033.4353 3001.2197 4033.4139 3001.1867 4033.371 3001.1206 4033.3281 3001.0546 4033.2852 3000.9885 4033.2638 3000.9556 4033.1995 3000.8565 4033.1566 3000.7905 4033.1137 3000.7244 4033.0708 3000.6584 4033.0279 3000.5924 4032.985 3000.5264 4032.9421 3000.4603 4032.8993 3000.3943 4032.5347 2999.8329 4032.4918 2999.7669 4032.4704 2999.7339 4032.4374 2999.7554 4031.1826 3000.5702 4031.204 3000.6031 4031.1711 3000.6246 4031.214 3000.6906 4031.5999 3001.2849 4031.6429 3001.351 4031.6857 3001.417 4031.7286 3001.4831 4031.7715 3001.5491 4031.793 3001.5821 4031.8358 3001.6482 4031.8787 3001.7142 4031.9431 3001.8133 4031.9859 3001.8793 4032.0288 3001.9453 4032.0717 3002.0114 4032.1146 3002.0774 4032.1575 3002.1435 4032.2218 3002.2425 4032.2647 3002.3085 4032.3076 3002.3746 4032.3504 3002.4406 4032.3719 3002.4737 4032.4362 3002.5727 4032.4791 3002.6387 4032.5005 3002.6717 4032.5434 3002.7378 4032.8865 3003.266 4031.9289 3003.8879 4031.8959 3003.9093 4031.8629 3003.9308 4031.8843 3003.9638 4031.8728 3004.0183 4031.8942 3004.0514 4041.2002 3018.3813 4041.2431 3018.4474 4041.2762 3018.4259 4041.2976 3018.4589 4041.3306 3018.4374 4041.3636 3018.416 4042.3212 3017.7942 4042.6643 3018.3225 4042.7071 3018.3885 4042.7286 3018.4216 4042.7929 3018.5206 4042.8358 3018.5866 4042.8787 3018.6527 4042.9001 3018.6857 4042.943 3018.7517 4042.9859 3018.8177 4043.0502 3018.9168 4043.1145 3019.0158 4043.1574 3019.0819 4043.2003 3019.1479 4043.2432 3019.214 4043.2646 3019.247 4043.329 3019.346 4043.3719 3019.4121 4043.4147 3019.4781 4043.4577 3019.5442 4043.5005 3019.6102 4043.5434 3019.6762 4043.5863 3019.7423 4043.6292 3019.8083 4043.9937 3020.3696 4044.0365 3020.4356 4044.0695 3020.4142 4044.091 3020.4473 4044.091 3020.4473\",\"id\":\"gge241_outline_line0\"}}]}",
    "VIA~4039~3034.5~2.441~S$474~0.6102~gge478~0"
  ],
  "layers": [
    "1~TopLayer~#FF0000~true~false~true~",
    "2~BottomLayer~#0000FF~true~true~true~",
    "3~TopSilkLayer~#FFCC00~true~false~true~",
    "4~BottomSilkLayer~#66CC33~true~false~true~",
    "5~TopPasteMaskLayer~#808080~true~false~true~",
    "6~BottomPasteMaskLayer~#800000~true~false~true~",
    "7~TopSolderMaskLayer~#800080~true~false~true~0.3",
    "8~BottomSolderMaskLayer~#AA00FF~true~false~true~0.3",
    "9~Ratlines~#6464FF~false~false~true~",
    "10~BoardOutLine~#FF00FF~true~false~true~",
    "11~Multi-Layer~#C0C0C0~true~false~true~",
    "12~Document~#FFFFFF~true~false~true~",
    "13~TopAssembly~#33CC99~false~false~false~",
    "14~BottomAssembly~#5555FF~false~false~false~",
    "15~Mechanical~#F022F0~false~false~false~",
    "19~3DModel~#66CCFF~false~false~false~",
    "21~Inner1~#999966~false~false~false~~",
    "22~Inner2~#008000~false~false~false~~",
    "23~Inner3~#00FF00~false~false~false~~",
    "24~Inner4~#BC8E00~false~false~false~~",
    "25~Inner5~#70DBFA~false~false~false~~",
    "26~Inner6~#00CC66~false~false~false~~",
    "27~Inner7~#9966FF~false~false~false~~",
    "28~Inner8~#800080~false~false~false~~",
    "29~Inner9~#008080~false~false~false~~",
    "30~Inner10~#15935F~false~false~false~~",
    "31~Inner11~#000080~false~false~false~~",
    "32~Inner12~#00B400~false~false~false~~",
    "33~Inner13~#2E4756~false~false~false~~",
    "34~Inner14~#99842F~false~false~false~~",
    "35~Inner15~#FFFFAA~false~false~false~~",
    "36~Inner16~#99842F~false~false~false~~",
    "37~Inner17~#2E4756~false~false~false~~",
    "38~Inner18~#3535FF~false~false~false~~",
    "39~Inner19~#8000BC~false~false~false~~",
    "40~Inner20~#43AE5F~false~false~false~~",
    "41~Inner21~#C3ECCE~false~false~false~~",
    "42~Inner22~#728978~false~false~false~~",
    "43~Inner23~#39503F~false~false~false~~",
    "44~Inner24~#0C715D~false~false~false~~",
    "45~Inner25~#5A8A80~false~false~false~~",
    "46~Inner26~#2B937E~false~false~false~~",
    "47~Inner27~#23999D~false~false~false~~",
    "48~Inner28~#45B4E3~false~false~false~~",
    "49~Inner29~#215DA1~false~false~false~~",
    "50~Inner30~#4564D7~false~false~false~~",
    "51~Inner31~#6969E9~false~false~false~~",
    "52~Inner32~#9069E9~false~false~false~~",
    "99~ComponentShapeLayer~#00CCCC~false~false~false~0.4",
    "100~LeadShapeLayer~#CC9999~false~false~false~",
    "101~ComponentMarkingLayer~#66FFCC~false~false~false~",
    "Hole~Hole~#222222~false~false~true~",
    "DRCError~DRCError~#FAD609~false~false~true~"
  ],
  "objects": [
    "All~true~false",
    "Component~true~true",
    "Prefix~true~true",
    "Name~true~false",
    "Track~true~true",
    "Pad~true~true",
    "Via~true~true",
    "Hole~true~true",
    "Copper_Area~true~true",
    "Circle~true~true",
    "Arc~true~true",
    "Solid_Region~true~true",
    "Text~true~true",
    "Image~true~true",
    "Rect~true~true",
    "Dimension~true~true",
    "Protractor~true~true"
  ],
  "BBox": {
    "x": 4020,
    "y": 2976.8,
    "width": 393.7,
    "height": 393.7
  },
  "preference": {
    "hideFootprints": "",
    "hideNets": ""
  },
  "DRCRULE": {
    "Default": {
      "trackWidth": 1,
      "clearance": 0.6,
      "viaHoleDiameter": 2.4,
      "viaHoleD": 1.2
    },
    "isRealtime": false,
    "isDrcOnRoutingOrPlaceVia": false,
    "checkObjectToCopperarea": true,
    "showDRCRangeLine": true
  },
  "netColors": {}
}