<?xml version="1.0"?>
<svg xmlns="http://www.w3.org/2000/svg" xmlns:xlink="http://www.w3.org/1999/xlink" version="1.0" width="1625.6000" height="1625.6000" viewBox="-2.0000 -2.0000 17.7000 17.7000">
<g id="layer_9_outline">
<!--normal-->
 <rect x="0.0000" y="0.0000" width="12.7000" height="12.7000" stroke-width="0.2540" stroke="#00868b" stroke-linecap="round" fill="none"/>
</g>
<g id="layer_7_group7">
</g>
<g id="layer_5_group5">
</g>
<g id="layer_10_bottom">
</g>
<g id="layer_3_top">
<!--normal-->
 <line x1="5.6896" y1="9.2710" x2="5.6896" y2="9.7790" stroke-width="0.3810" stroke="#4d4d4d" stroke-linecap="square"/>
 <line x1="6.9850" y1="9.2710" x2="6.9850" y2="9.7790" stroke-width="0.3810" stroke="#4d4d4d" stroke-linecap="square"/>
 <line x1="6.9850" y1="7.4930" x2="6.9850" y2="8.0010" stroke-width="0.3810" stroke="#4d4d4d" stroke-linecap="square"/>
 <line x1="6.3500" y1="7.4930" x2="6.3500" y2="8.0010" stroke-width="0.3810" stroke="#4d4d4d" stroke-linecap="square"/>
 <line x1="5.6896" y1="7.4930" x2="5.6896" y2="8.0010" stroke-width="0.3810" stroke="#4d4d4d" stroke-linecap="square"/>
 <line x1="4.8501" y1="2.2400" x2="4.8501" y2="2.8400" stroke-width="1.3000" stroke="#4d4d4d" stroke-linecap="square"/>
 <line x1="7.8499" y1="2.2400" x2="7.8499" y2="2.8400" stroke-width="1.3000" stroke="#4d4d4d" stroke-linecap="square"/>
</g>
<g id="layer_1_topsilk">
<!--normal-->
 <line x1="5.7501" y1="1.5900" x2="6.9499" y2="1.5900" stroke-width="0.2032" stroke="#000000" stroke-linecap="round"/>
 <line x1="5.7501" y1="3.4900" x2="6.9499" y2="3.4900" stroke-width="0.2032" stroke="#000000" stroke-linecap="round"/>
 <line x1="5.3340" y1="7.1374" x2="5.3340" y2="10.1600" stroke-width="0.2540" stroke="#000000" stroke-linecap="round"/>
 <line x1="5.3340" y1="10.1600" x2="7.3660" y2="10.1600" stroke-width="0.2540" stroke="#000000" stroke-linecap="round"/>
 <line x1="7.3660" y1="10.1600" x2="7.3660" y2="7.1374" stroke-width="0.2540" stroke="#000000" stroke-linecap="round"/>
 <line x1="7.3660" y1="7.1374" x2="5.3340" y2="7.1374" stroke-width="0.2540" stroke="#000000" stroke-linecap="round"/>
 <line x1="5.5499" y1="3.6449" x2="6.0579" y2="3.6449" stroke-width="0.1778" stroke="#000000" stroke-linecap="round"/>
 <line x1="6.0579" y1="3.6449" x2="6.1849" y2="3.7719" stroke-width="0.1778" stroke="#000000" stroke-linecap="round"/>
 <line x1="6.1849" y1="3.7719" x2="6.1849" y2="4.0259" stroke-width="0.1778" stroke="#000000" stroke-linecap="round"/>
 <line x1="6.0579" y1="4.1529" x2="6.1849" y2="4.0259" stroke-width="0.1778" stroke="#000000" stroke-linecap="round"/>
 <line x1="5.6769" y1="4.1529" x2="6.0579" y2="4.1529" stroke-width="0.1778" stroke="#000000" stroke-linecap="round"/>
 <line x1="5.6769" y1="3.6449" x2="5.6769" y2="4.6609" stroke-width="0.1778" stroke="#000000" stroke-linecap="round"/>
 <line x1="5.8801" y1="4.1529" x2="6.1849" y2="4.6609" stroke-width="0.1778" stroke="#000000" stroke-linecap="round"/>
 <line x1="6.4897" y1="3.8481" x2="6.6929" y2="3.6449" stroke-width="0.1778" stroke="#000000" stroke-linecap="round"/>
 <line x1="6.6929" y1="3.6449" x2="6.6929" y2="4.6609" stroke-width="0.1778" stroke="#000000" stroke-linecap="round"/>
 <line x1="6.4897" y1="4.6609" x2="6.8707" y2="4.6609" stroke-width="0.1778" stroke="#000000" stroke-linecap="round"/>
 <line x1="5.7150" y1="10.5410" x2="5.7150" y2="11.4300" stroke-width="0.1778" stroke="#000000" stroke-linecap="round"/>
 <line x1="5.7150" y1="11.4300" x2="5.8420" y2="11.5570" stroke-width="0.1778" stroke="#000000" stroke-linecap="round"/>
 <line x1="5.8420" y1="11.5570" x2="6.0960" y2="11.5570" stroke-width="0.1778" stroke="#000000" stroke-linecap="round"/>
 <line x1="6.0960" y1="11.5570" x2="6.2230" y2="11.4300" stroke-width="0.1778" stroke="#000000" stroke-linecap="round"/>
 <line x1="6.2230" y1="10.5410" x2="6.2230" y2="11.4300" stroke-width="0.1778" stroke="#000000" stroke-linecap="round"/>
 <line x1="6.5278" y1="10.7442" x2="6.7310" y2="10.5410" stroke-width="0.1778" stroke="#000000" stroke-linecap="round"/>
 <line x1="6.7310" y1="10.5410" x2="6.7310" y2="11.5570" stroke-width="0.1778" stroke="#000000" stroke-linecap="round"/>
 <line x1="6.5278" y1="11.5570" x2="6.9088" y2="11.5570" stroke-width="0.1778" stroke="#000000" stroke-linecap="round"/>
</g>
</svg>
