G04 start of page 3 for group 2 layer_idx 0 *
G04 Title: pads with different geometry, top_mask *
G04 Creator: <version>
G04 CreationDate: <date>
G04 For: TEST *
G04 Format: Gerber/RS-274X *
G04 PCB-Dimensions: 50000 50000 *
G04 PCB-Coordinate-Origin: lower left *
%MOIN*%
%FSLAX25Y25*%
%LNTOPMASK*%
%ADD14R,0.0572X0.0572*%
%ADD13R,0.0210X0.0210*%
G54D13*X22400Y13500D02*Y11500D01*
X27500Y13500D02*Y11500D01*
Y20500D02*Y18500D01*
X25000Y20500D02*Y18500D01*
X22400Y20500D02*Y18500D01*
G54D14*X19095Y41181D02*Y38819D01*
X30905Y41181D02*Y38819D01*
M02*
