G04 start of page 2 for group 3 layer_idx 0 *
G04 Title: board with minimal netlist and some back-annotation changes, top_copper *
G04 Creator: <version>
G04 CreationDate: <date>
G04 For: TEST *
G04 Format: Gerber/RS-274X *
G04 PCB-Dimensions: 50000 50000 *
G04 PCB-Coordinate-Origin: lower left *
%MOIN*%
%FSLAX25Y25*%
%LNTOP*%
%ADD13C,0.0394*%
%ADD12C,0.0800*%
%ADD11C,0.0001*%
G54D11*G36*
X6000Y36500D02*X14000D01*
Y28500D01*
X6000D01*
Y36500D01*
G37*
G54D12*X40000Y32500D03*
X10000Y22500D03*
X40000D03*
G54D13*M02*
