G04 start of page 7 for group 11 layer_idx 10 *
G04 Title: pins with different shapes, bottom_mask *
G04 Creator: <version>
G04 CreationDate: <date>
G04 For: TEST *
G04 Format: Gerber/RS-274X *
G04 PCB-Dimensions: 50000 50000 *
G04 PCB-Coordinate-Origin: lower left *
%MOIN*%
%FSLAX25Y25*%
%LNBOTTOMMASK*%
%ADD26C,0.0860*%
%ADD25C,0.0001*%
G54D25*G36*
X3200Y41800D02*X11800D01*
Y33200D01*
X3200D01*
Y41800D01*
G37*
G54D26*X37500Y37500D03*
G54D25*G36*
X16100Y19281D02*X11062Y21800D01*
X5719D01*
X3200Y19281D01*
Y15719D01*
X5719Y13200D01*
X11062D01*
X16100Y15719D01*
Y19281D01*
G37*
G36*
X46100Y21062D02*X41062Y26100D01*
X33938D01*
X28900Y21062D01*
Y15719D01*
X33938Y13200D01*
X41062D01*
X46100Y15719D01*
Y21062D01*
G37*
M02*
