G04 start of page 5 for group 0 layer_idx 0 *
G04 Title: pads with different geometry, top paste *
G04 Creator: <version>
G04 CreationDate: <date>
G04 For:  *
G04 Format: Gerber/RS-274X *
G04 PCB-Dimensions: 50000 50000 *
G04 PCB-Coordinate-Origin: lower left *
%MOIN*%
%FSLAX25Y25*%
%LNTOPPASTE*%
%ADD19R,0.0150X0.0150*%
%ADD18R,0.0512X0.0512*%
G54D18*X19095Y41181D02*Y38819D01*
X30905Y41181D02*Y38819D01*
G54D19*X22400Y13500D02*Y11500D01*
X27500Y13500D02*Y11500D01*
Y20500D02*Y18500D01*
X25000Y20500D02*Y18500D01*
X22400Y20500D02*Y18500D01*
M02*
