<?xml version="1.0" encoding="UTF-8" standalone="no"?>
<!DOCTYPE svg PUBLIC "-//W3C//DTD SVG 1.1//EN"
 "http://www.w3.org/Graphics/SVG/1.1/DTD/svg11.dtd">
<!-- Generated by graphviz version 2.40.1 (20161225.0304)
 -->
<!-- Title: ha:coraleda&#45;project&#45;v1 Pages: 1 -->
<svg width="869pt" height="426pt"
 viewBox="0.00 0.00 869.47 426.36" xmlns="http://www.w3.org/2000/svg" xmlns:xlink="http://www.w3.org/1999/xlink">
<g id="graph0" class="graph" transform="scale(1 1) rotate(0) translate(4 422.3574)">
<title>ha:coraleda&#45;project&#45;v1</title>
<polygon fill="#ffffff" stroke="transparent" points="-4,4 -4,-422.3574 865.468,-422.3574 865.468,4 -4,4"/>
<!-- /lht_tree_doc/roots/coraleda&#45;project&#45;v1 -->
<g id="node1" class="node">
<title>/lht_tree_doc/roots/coraleda&#45;project&#45;v1</title>
<g id="a_node1"><a xlink:href="tree.html#/lht_tree_doc/roots/coraleda-project-v1" xlink:title="Project file root. Except for &quot;common&quot;, each software package should create a single subtree under the root; the subtree shall be named after the software package ">
<ellipse fill="none" stroke="#000000" cx="353.234" cy="-390.7803" rx="98.0761" ry="27.6545"/>
<text text-anchor="middle" x="353.234" y="-395.0803" font-family="Times,serif" font-size="14.00" fill="#000000">ha:coraleda&#45;project&#45;v1</text>
</a>
</g>
</g>
<!-- /lht_tree_doc/roots/coraleda&#45;project&#45;v1/children/common -->
<g id="node2" class="node">
<title>/lht_tree_doc/roots/coraleda&#45;project&#45;v1/children/common</title>
<g id="a_node2"><a xlink:href="tree.html#/lht_tree_doc/roots/coraleda-project-v1/children/common" xlink:title="project settings that should be common to all software packages">
<ellipse fill="none" stroke="#000000" cx="285.234" cy="-299.6259" rx="57.9655" ry="27.6545"/>
<text text-anchor="middle" x="285.234" y="-303.9259" font-family="Times,serif" font-size="14.00" fill="#000000">ha:common</text>
</a>
</g>
</g>
<!-- /lht_tree_doc/roots/coraleda&#45;project&#45;v1&#45;&gt;/lht_tree_doc/roots/coraleda&#45;project&#45;v1/children/common -->
<g id="edge1" class="edge">
<title>/lht_tree_doc/roots/coraleda&#45;project&#45;v1&#45;&gt;/lht_tree_doc/roots/coraleda&#45;project&#45;v1/children/common</title>
<path fill="none" stroke="#000000" d="M332.8318,-363.431C325.9331,-354.1832 318.1402,-343.7368 310.8874,-334.0144"/>
<polygon fill="#000000" stroke="#000000" points="313.4736,-331.6278 304.6888,-325.7052 307.8628,-335.8134 313.4736,-331.6278"/>
</g>
<!-- dup23_/lht_tree_doc/roots/coraleda&#45;project&#45;v1/children/pcb&#45;rnd&#45;conf&#45;v1 -->
<g id="node19" class="node">
<title>dup23_/lht_tree_doc/roots/coraleda&#45;project&#45;v1/children/pcb&#45;rnd&#45;conf&#45;v1</title>
<g id="a_node19"><a xlink:href="pcb-rnd-conf-v1.svg" xlink:title="pcb&#45;rnd&#45;conf&#45;v1 &#45;&gt;\n\n\n">
<text text-anchor="middle" x="422.234" y="-311.9259" font-family="Times,serif" font-size="14.00" fill="#000000">pcb&#45;rnd&#45;conf&#45;v1 &#45;&gt;</text>
</a>
</g>
</g>
<!-- /lht_tree_doc/roots/coraleda&#45;project&#45;v1&#45;&gt;dup23_/lht_tree_doc/roots/coraleda&#45;project&#45;v1/children/pcb&#45;rnd&#45;conf&#45;v1 -->
<g id="edge18" class="edge">
<title>/lht_tree_doc/roots/coraleda&#45;project&#45;v1&#45;&gt;dup23_/lht_tree_doc/roots/coraleda&#45;project&#45;v1/children/pcb&#45;rnd&#45;conf&#45;v1</title>
<path fill="none" stroke="#000000" d="M373.9363,-363.431C380.6294,-354.5888 388.1521,-344.6508 395.232,-335.2977"/>
<polygon fill="#000000" stroke="#000000" points="398.063,-337.3567 401.3079,-327.271 392.4817,-333.1319 398.063,-337.3567"/>
</g>
<!-- /lht_tree_doc/roots/coraleda&#45;project&#45;v1/children/common/children/name -->
<g id="node3" class="node">
<title>/lht_tree_doc/roots/coraleda&#45;project&#45;v1/children/common/children/name</title>
<g id="a_node3"><a xlink:href="tree.html#/lht_tree_doc/roots/coraleda-project-v1/children/common/children/name" xlink:title="long name of the project ">
<ellipse fill="none" stroke="#000000" cx="33.234" cy="-208.4716" rx="33.4697" ry="26.7407"/>
<text text-anchor="middle" x="33.234" y="-212.2716" font-family="Times,serif" font-size="14.00" fill="#000000">name</text>
<text text-anchor="middle" x="33.234" y="-197.2716" font-family="Times,serif" font-size="14.00" fill="#000000">string</text>
</a>
</g>
</g>
<!-- /lht_tree_doc/roots/coraleda&#45;project&#45;v1/children/common&#45;&gt;/lht_tree_doc/roots/coraleda&#45;project&#45;v1/children/common/children/name -->
<g id="edge2" class="edge">
<title>/lht_tree_doc/roots/coraleda&#45;project&#45;v1/children/common&#45;&gt;/lht_tree_doc/roots/coraleda&#45;project&#45;v1/children/common/children/name</title>
<path fill="none" stroke="#000000" d="M232.349,-288.0867C188.9305,-277.5693 126.4738,-260.0144 75.234,-236.0488 72.4784,-234.7599 69.6941,-233.3104 66.9401,-231.768"/>
<polygon fill="#000000" stroke="#000000" points="68.6971,-228.7406 58.3191,-226.6078 65.1019,-234.7469 68.6971,-228.7406"/>
</g>
<!-- /lht_tree_doc/roots/coraleda&#45;project&#45;v1/children/common/children/desc -->
<g id="node4" class="node">
<title>/lht_tree_doc/roots/coraleda&#45;project&#45;v1/children/common/children/desc</title>
<g id="a_node4"><a xlink:href="tree.html#/lht_tree_doc/roots/coraleda-project-v1/children/common/children/desc" xlink:title="description of the project ">
<ellipse fill="none" stroke="#000000" cx="117.234" cy="-208.4716" rx="33.4697" ry="26.7407"/>
<text text-anchor="middle" x="117.234" y="-212.2716" font-family="Times,serif" font-size="14.00" fill="#000000">desc</text>
<text text-anchor="middle" x="117.234" y="-197.2716" font-family="Times,serif" font-size="14.00" fill="#000000">string</text>
</a>
</g>
</g>
<!-- /lht_tree_doc/roots/coraleda&#45;project&#45;v1/children/common&#45;&gt;/lht_tree_doc/roots/coraleda&#45;project&#45;v1/children/common/children/desc -->
<g id="edge3" class="edge">
<title>/lht_tree_doc/roots/coraleda&#45;project&#45;v1/children/common&#45;&gt;/lht_tree_doc/roots/coraleda&#45;project&#45;v1/children/common/children/desc</title>
<path fill="none" stroke="#000000" d="M243.7514,-280.1678C218.8715,-268.1361 186.8103,-251.9903 159.234,-236.0488 156.6003,-234.5262 153.9047,-232.9067 151.2129,-231.245"/>
<polygon fill="#000000" stroke="#000000" points="153.0302,-228.253 142.7091,-225.8601 149.2853,-234.1671 153.0302,-228.253"/>
</g>
<!-- /lht_tree_doc/roots/coraleda&#45;project&#45;v1/children/common/children/url -->
<g id="node5" class="node">
<title>/lht_tree_doc/roots/coraleda&#45;project&#45;v1/children/common/children/url</title>
<g id="a_node5"><a xlink:href="tree.html#/lht_tree_doc/roots/coraleda-project-v1/children/common/children/url" xlink:title="homepage of the project ">
<ellipse fill="none" stroke="#000000" cx="201.234" cy="-208.4716" rx="33.4697" ry="26.7407"/>
<text text-anchor="middle" x="201.234" y="-212.2716" font-family="Times,serif" font-size="14.00" fill="#000000">url</text>
<text text-anchor="middle" x="201.234" y="-197.2716" font-family="Times,serif" font-size="14.00" fill="#000000">string</text>
</a>
</g>
</g>
<!-- /lht_tree_doc/roots/coraleda&#45;project&#45;v1/children/common&#45;&gt;/lht_tree_doc/roots/coraleda&#45;project&#45;v1/children/common/children/url -->
<g id="edge4" class="edge">
<title>/lht_tree_doc/roots/coraleda&#45;project&#45;v1/children/common&#45;&gt;/lht_tree_doc/roots/coraleda&#45;project&#45;v1/children/common/children/url</title>
<path fill="none" stroke="#000000" d="M261.8353,-274.2344C251.3224,-262.826 238.8608,-249.3031 227.98,-237.4955"/>
<polygon fill="#000000" stroke="#000000" points="230.4447,-235.0054 221.0943,-230.0234 225.2971,-239.749 230.4447,-235.0054"/>
</g>
<!-- /lht_tree_doc/roots/coraleda&#45;project&#45;v1/children/common/children/vcs -->
<g id="node6" class="node">
<title>/lht_tree_doc/roots/coraleda&#45;project&#45;v1/children/common/children/vcs</title>
<g id="a_node6"><a xlink:href="tree.html#/lht_tree_doc/roots/coraleda-project-v1/children/common/children/vcs" xlink:title="main vcs url for the project ">
<ellipse fill="none" stroke="#000000" cx="285.234" cy="-208.4716" rx="33.4697" ry="26.7407"/>
<text text-anchor="middle" x="285.234" y="-212.2716" font-family="Times,serif" font-size="14.00" fill="#000000">vcs</text>
<text text-anchor="middle" x="285.234" y="-197.2716" font-family="Times,serif" font-size="14.00" fill="#000000">string</text>
</a>
</g>
</g>
<!-- /lht_tree_doc/roots/coraleda&#45;project&#45;v1/children/common&#45;&gt;/lht_tree_doc/roots/coraleda&#45;project&#45;v1/children/common/children/vcs -->
<g id="edge5" class="edge">
<title>/lht_tree_doc/roots/coraleda&#45;project&#45;v1/children/common&#45;&gt;/lht_tree_doc/roots/coraleda&#45;project&#45;v1/children/common/children/vcs</title>
<path fill="none" stroke="#000000" d="M285.234,-271.7813C285.234,-263.5024 285.234,-254.2986 285.234,-245.5309"/>
<polygon fill="#000000" stroke="#000000" points="288.7341,-245.5202 285.234,-235.5202 281.7341,-245.5202 288.7341,-245.5202"/>
</g>
<!-- /lht_tree_doc/roots/coraleda&#45;project&#45;v1/children/common/children/contact -->
<g id="node7" class="node">
<title>/lht_tree_doc/roots/coraleda&#45;project&#45;v1/children/common/children/contact</title>
<g id="a_node7"><a xlink:href="tree.html#/lht_tree_doc/roots/coraleda-project-v1/children/common/children/contact" xlink:title="author/maintainer contact info ">
<ellipse fill="none" stroke="#000000" cx="376.234" cy="-208.4716" rx="39.6962" ry="26.7407"/>
<text text-anchor="middle" x="376.234" y="-212.2716" font-family="Times,serif" font-size="14.00" fill="#000000">contact</text>
<text text-anchor="middle" x="376.234" y="-197.2716" font-family="Times,serif" font-size="14.00" fill="#000000">string</text>
</a>
</g>
</g>
<!-- /lht_tree_doc/roots/coraleda&#45;project&#45;v1/children/common&#45;&gt;/lht_tree_doc/roots/coraleda&#45;project&#45;v1/children/common/children/contact -->
<g id="edge6" class="edge">
<title>/lht_tree_doc/roots/coraleda&#45;project&#45;v1/children/common&#45;&gt;/lht_tree_doc/roots/coraleda&#45;project&#45;v1/children/common/children/contact</title>
<path fill="none" stroke="#000000" d="M310.5826,-274.2344C321.7128,-263.0853 334.8591,-249.9167 346.4529,-238.3032"/>
<polygon fill="#000000" stroke="#000000" points="349.2227,-240.4827 353.8108,-230.9329 344.2687,-235.5372 349.2227,-240.4827"/>
</g>
<!-- /lht_tree_doc/roots/coraleda&#45;project&#45;v1/children/common/children/files -->
<g id="node8" class="node">
<title>/lht_tree_doc/roots/coraleda&#45;project&#45;v1/children/common/children/files</title>
<g id="a_node8"><a xlink:href="tree.html#/lht_tree_doc/roots/coraleda-project-v1/children/common/children/files" xlink:title="ordered list of source files being used by the project">
<ellipse fill="none" stroke="#000000" cx="470.234" cy="-208.4716" rx="36.125" ry="27.6545"/>
<text text-anchor="middle" x="470.234" y="-212.7716" font-family="Times,serif" font-size="14.00" fill="#000000">li:files</text>
</a>
</g>
</g>
<!-- /lht_tree_doc/roots/coraleda&#45;project&#45;v1/children/common&#45;&gt;/lht_tree_doc/roots/coraleda&#45;project&#45;v1/children/common/children/files -->
<g id="edge7" class="edge">
<title>/lht_tree_doc/roots/coraleda&#45;project&#45;v1/children/common&#45;&gt;/lht_tree_doc/roots/coraleda&#45;project&#45;v1/children/common/children/files</title>
<path fill="none" stroke="#000000" d="M329.1028,-281.3636C357.0375,-269.3303 393.7574,-252.7587 425.234,-236.0488 427.9781,-234.592 430.7847,-233.0374 433.5891,-231.4364"/>
<polygon fill="#000000" stroke="#000000" points="435.6084,-234.3095 442.4595,-226.2278 432.064,-228.2731 435.6084,-234.3095"/>
</g>
<!-- /lht_tree_doc/roots/coraleda&#45;project&#45;v1/children/common/children/libs -->
<g id="node13" class="node">
<title>/lht_tree_doc/roots/coraleda&#45;project&#45;v1/children/common/children/libs</title>
<g id="a_node13"><a xlink:href="tree.html#/lht_tree_doc/roots/coraleda-project-v1/children/common/children/libs" xlink:title="ordered list of libraries the project depends on">
<ellipse fill="none" stroke="#000000" cx="597.234" cy="-208.4716" rx="33.4697" ry="27.6545"/>
<text text-anchor="middle" x="597.234" y="-212.7716" font-family="Times,serif" font-size="14.00" fill="#000000">li:libs</text>
</a>
</g>
</g>
<!-- /lht_tree_doc/roots/coraleda&#45;project&#45;v1/children/common&#45;&gt;/lht_tree_doc/roots/coraleda&#45;project&#45;v1/children/common/children/libs -->
<g id="edge12" class="edge">
<title>/lht_tree_doc/roots/coraleda&#45;project&#45;v1/children/common&#45;&gt;/lht_tree_doc/roots/coraleda&#45;project&#45;v1/children/common/children/libs</title>
<path fill="none" stroke="#000000" d="M327.7191,-280.8509C335.7709,-277.6617 344.1925,-274.5709 352.234,-272.0488 423.0243,-249.8466 443.7494,-255.9018 515.234,-236.0488 528.9574,-232.2375 543.7654,-227.4658 556.9713,-222.9682"/>
<polygon fill="#000000" stroke="#000000" points="558.4042,-226.1762 566.7133,-219.6028 556.1185,-219.5599 558.4042,-226.1762"/>
</g>
<!-- /lht_tree_doc/roots/coraleda&#45;project&#45;v1/children/common/children/files/children/NAME -->
<g id="node9" class="node">
<title>/lht_tree_doc/roots/coraleda&#45;project&#45;v1/children/common/children/files/children/NAME</title>
<g id="a_node9"><a xlink:href="tree.html#/lht_tree_doc/roots/coraleda-project-v1/children/common/children/files/children/NAME" xlink:title="a project member file">
<ellipse fill="none" stroke="#000000" cx="450.234" cy="-117.3173" rx="52.1524" ry="27.6545"/>
<text text-anchor="middle" x="450.234" y="-121.6173" font-family="Times,serif" font-size="14.00" fill="#000000">ha:NAME</text>
</a>
</g>
</g>
<!-- /lht_tree_doc/roots/coraleda&#45;project&#45;v1/children/common/children/files&#45;&gt;/lht_tree_doc/roots/coraleda&#45;project&#45;v1/children/common/children/files/children/NAME -->
<g id="edge8" class="edge">
<title>/lht_tree_doc/roots/coraleda&#45;project&#45;v1/children/common/children/files&#45;&gt;/lht_tree_doc/roots/coraleda&#45;project&#45;v1/children/common/children/files/children/NAME</title>
<path fill="none" stroke="#000000" d="M464.2334,-181.1223C462.4305,-172.9054 460.42,-163.7421 458.4978,-154.9812"/>
<polygon fill="#000000" stroke="#000000" points="461.8614,-153.9799 456.2996,-144.9623 455.0241,-155.4801 461.8614,-153.9799"/>
</g>
<!-- /lht_tree_doc/roots/coraleda&#45;project&#45;v1/children/common/children/files/children/NAME/children/path -->
<g id="node10" class="node">
<title>/lht_tree_doc/roots/coraleda&#45;project&#45;v1/children/common/children/files/children/NAME/children/path</title>
<g id="a_node10"><a xlink:href="tree.html#/lht_tree_doc/roots/coraleda-project-v1/children/common/children/files/children/NAME/children/path" xlink:title="path to the file, relative to the project file ">
<ellipse fill="none" stroke="#000000" cx="324.234" cy="-26.8701" rx="33.4697" ry="26.7407"/>
<text text-anchor="middle" x="324.234" y="-30.6701" font-family="Times,serif" font-size="14.00" fill="#000000">path</text>
<text text-anchor="middle" x="324.234" y="-15.6701" font-family="Times,serif" font-size="14.00" fill="#000000">string</text>
</a>
</g>
</g>
<!-- /lht_tree_doc/roots/coraleda&#45;project&#45;v1/children/common/children/files/children/NAME&#45;&gt;/lht_tree_doc/roots/coraleda&#45;project&#45;v1/children/common/children/files/children/NAME/children/path -->
<g id="edge9" class="edge">
<title>/lht_tree_doc/roots/coraleda&#45;project&#45;v1/children/common/children/files/children/NAME&#45;&gt;/lht_tree_doc/roots/coraleda&#45;project&#45;v1/children/common/children/files/children/NAME/children/path</title>
<path fill="none" stroke="#000000" d="M419.0879,-94.9595C400.2975,-81.4711 376.3765,-64.2998 357.258,-50.5759"/>
<polygon fill="#000000" stroke="#000000" points="359.2829,-47.721 349.1182,-44.7328 355.2008,-53.4076 359.2829,-47.721"/>
</g>
<!-- /lht_tree_doc/roots/coraleda&#45;project&#45;v1/children/common/children/files/children/NAME/children/desc -->
<g id="node11" class="node">
<title>/lht_tree_doc/roots/coraleda&#45;project&#45;v1/children/common/children/files/children/NAME/children/desc</title>
<g id="a_node11"><a xlink:href="tree.html#/lht_tree_doc/roots/coraleda-project-v1/children/common/children/files/children/NAME/children/desc" xlink:title="description of the file ">
<ellipse fill="none" stroke="#000000" cx="408.234" cy="-26.8701" rx="33.4697" ry="26.7407"/>
<text text-anchor="middle" x="408.234" y="-30.6701" font-family="Times,serif" font-size="14.00" fill="#000000">desc</text>
<text text-anchor="middle" x="408.234" y="-15.6701" font-family="Times,serif" font-size="14.00" fill="#000000">string</text>
</a>
</g>
</g>
<!-- /lht_tree_doc/roots/coraleda&#45;project&#45;v1/children/common/children/files/children/NAME&#45;&gt;/lht_tree_doc/roots/coraleda&#45;project&#45;v1/children/common/children/files/children/NAME/children/desc -->
<g id="edge10" class="edge">
<title>/lht_tree_doc/roots/coraleda&#45;project&#45;v1/children/common/children/files/children/NAME&#45;&gt;/lht_tree_doc/roots/coraleda&#45;project&#45;v1/children/common/children/files/children/NAME/children/desc</title>
<path fill="none" stroke="#000000" d="M437.6326,-90.1801C433.4283,-81.1261 428.6862,-70.914 424.2575,-61.3768"/>
<polygon fill="#000000" stroke="#000000" points="427.3509,-59.728 419.9648,-52.1323 421.002,-62.6762 427.3509,-59.728"/>
</g>
<!-- /lht_tree_doc/roots/coraleda&#45;project&#45;v1/children/common/children/files/children/NAME/children/type -->
<g id="node12" class="node">
<title>/lht_tree_doc/roots/coraleda&#45;project&#45;v1/children/common/children/files/children/NAME/children/type</title>
<g id="a_node12"><a xlink:href="tree.html#/lht_tree_doc/roots/coraleda-project-v1/children/common/children/files/children/NAME/children/type" xlink:title="optional: type of the file; one of: &quot;pcb&quot;, &quot;schematic&quot;, &quot;doc&quot; ">
<ellipse fill="none" stroke="#000000" cx="492.234" cy="-26.8701" rx="33.4697" ry="26.7407"/>
<text text-anchor="middle" x="492.234" y="-30.6701" font-family="Times,serif" font-size="14.00" fill="#000000">type</text>
<text text-anchor="middle" x="492.234" y="-15.6701" font-family="Times,serif" font-size="14.00" fill="#000000">string</text>
</a>
</g>
</g>
<!-- /lht_tree_doc/roots/coraleda&#45;project&#45;v1/children/common/children/files/children/NAME&#45;&gt;/lht_tree_doc/roots/coraleda&#45;project&#45;v1/children/common/children/files/children/NAME/children/type -->
<g id="edge11" class="edge">
<title>/lht_tree_doc/roots/coraleda&#45;project&#45;v1/children/common/children/files/children/NAME&#45;&gt;/lht_tree_doc/roots/coraleda&#45;project&#45;v1/children/common/children/files/children/NAME/children/type</title>
<path fill="none" stroke="#000000" d="M462.8354,-90.1801C467.0397,-81.1261 471.7818,-70.914 476.2105,-61.3768"/>
<polygon fill="#000000" stroke="#000000" points="479.466,-62.6762 480.5033,-52.1323 473.1171,-59.728 479.466,-62.6762"/>
</g>
<!-- /lht_tree_doc/roots/coraleda&#45;project&#45;v1/children/common/children/libs/children/NAME -->
<g id="node14" class="node">
<title>/lht_tree_doc/roots/coraleda&#45;project&#45;v1/children/common/children/libs/children/NAME</title>
<g id="a_node14"><a xlink:href="tree.html#/lht_tree_doc/roots/coraleda-project-v1/children/common/children/libs/children/NAME" xlink:title="a library">
<ellipse fill="none" stroke="#000000" cx="660.234" cy="-117.3173" rx="52.1524" ry="27.6545"/>
<text text-anchor="middle" x="660.234" y="-121.6173" font-family="Times,serif" font-size="14.00" fill="#000000">ha:NAME</text>
</a>
</g>
</g>
<!-- /lht_tree_doc/roots/coraleda&#45;project&#45;v1/children/common/children/libs&#45;&gt;/lht_tree_doc/roots/coraleda&#45;project&#45;v1/children/common/children/libs/children/NAME -->
<g id="edge13" class="edge">
<title>/lht_tree_doc/roots/coraleda&#45;project&#45;v1/children/common/children/libs&#45;&gt;/lht_tree_doc/roots/coraleda&#45;project&#45;v1/children/common/children/libs/children/NAME</title>
<path fill="none" stroke="#000000" d="M613.7865,-184.5219C620.6905,-174.5326 628.8416,-162.7388 636.3727,-151.842"/>
<polygon fill="#000000" stroke="#000000" points="639.4376,-153.5634 642.244,-143.3469 633.6791,-149.5834 639.4376,-153.5634"/>
</g>
<!-- /lht_tree_doc/roots/coraleda&#45;project&#45;v1/children/common/children/libs/children/NAME/children/path -->
<g id="node15" class="node">
<title>/lht_tree_doc/roots/coraleda&#45;project&#45;v1/children/common/children/libs/children/NAME/children/path</title>
<g id="a_node15"><a xlink:href="tree.html#/lht_tree_doc/roots/coraleda-project-v1/children/common/children/libs/children/NAME/children/path" xlink:title="path to the library, relative to the project file; all files and subdirectories under the root, recursively, are considered part of the library (must not be used together with url) ">
<ellipse fill="none" stroke="#000000" cx="576.234" cy="-26.8701" rx="33.4697" ry="26.7407"/>
<text text-anchor="middle" x="576.234" y="-30.6701" font-family="Times,serif" font-size="14.00" fill="#000000">path</text>
<text text-anchor="middle" x="576.234" y="-15.6701" font-family="Times,serif" font-size="14.00" fill="#000000">string</text>
</a>
</g>
</g>
<!-- /lht_tree_doc/roots/coraleda&#45;project&#45;v1/children/common/children/libs/children/NAME&#45;&gt;/lht_tree_doc/roots/coraleda&#45;project&#45;v1/children/common/children/libs/children/NAME/children/path -->
<g id="edge14" class="edge">
<title>/lht_tree_doc/roots/coraleda&#45;project&#45;v1/children/common/children/libs/children/NAME&#45;&gt;/lht_tree_doc/roots/coraleda&#45;project&#45;v1/children/common/children/libs/children/NAME/children/path</title>
<path fill="none" stroke="#000000" d="M636.8353,-92.1227C626.402,-80.8886 614.0495,-67.588 603.2275,-55.9354"/>
<polygon fill="#000000" stroke="#000000" points="605.7422,-53.4998 596.3725,-48.5542 600.613,-58.2634 605.7422,-53.4998"/>
</g>
<!-- /lht_tree_doc/roots/coraleda&#45;project&#45;v1/children/common/children/libs/children/NAME/children/url -->
<g id="node16" class="node">
<title>/lht_tree_doc/roots/coraleda&#45;project&#45;v1/children/common/children/libs/children/NAME/children/url</title>
<g id="a_node16"><a xlink:href="tree.html#/lht_tree_doc/roots/coraleda-project-v1/children/common/children/libs/children/NAME/children/url" xlink:title="url to the library (must not be used together with path) ">
<ellipse fill="none" stroke="#000000" cx="660.234" cy="-26.8701" rx="33.4697" ry="26.7407"/>
<text text-anchor="middle" x="660.234" y="-30.6701" font-family="Times,serif" font-size="14.00" fill="#000000">url</text>
<text text-anchor="middle" x="660.234" y="-15.6701" font-family="Times,serif" font-size="14.00" fill="#000000">string</text>
</a>
</g>
</g>
<!-- /lht_tree_doc/roots/coraleda&#45;project&#45;v1/children/common/children/libs/children/NAME&#45;&gt;/lht_tree_doc/roots/coraleda&#45;project&#45;v1/children/common/children/libs/children/NAME/children/url -->
<g id="edge15" class="edge">
<title>/lht_tree_doc/roots/coraleda&#45;project&#45;v1/children/common/children/libs/children/NAME&#45;&gt;/lht_tree_doc/roots/coraleda&#45;project&#45;v1/children/common/children/libs/children/NAME/children/url</title>
<path fill="none" stroke="#000000" d="M660.234,-89.6887C660.234,-81.6371 660.234,-72.704 660.234,-64.1607"/>
<polygon fill="#000000" stroke="#000000" points="663.7341,-64.0187 660.234,-54.0187 656.7341,-64.0187 663.7341,-64.0187"/>
</g>
<!-- /lht_tree_doc/roots/coraleda&#45;project&#45;v1/children/common/children/libs/children/NAME/children/desc -->
<g id="node17" class="node">
<title>/lht_tree_doc/roots/coraleda&#45;project&#45;v1/children/common/children/libs/children/NAME/children/desc</title>
<g id="a_node17"><a xlink:href="tree.html#/lht_tree_doc/roots/coraleda-project-v1/children/common/children/libs/children/NAME/children/desc" xlink:title="description of the library ">
<ellipse fill="none" stroke="#000000" cx="744.234" cy="-26.8701" rx="33.4697" ry="26.7407"/>
<text text-anchor="middle" x="744.234" y="-30.6701" font-family="Times,serif" font-size="14.00" fill="#000000">desc</text>
<text text-anchor="middle" x="744.234" y="-15.6701" font-family="Times,serif" font-size="14.00" fill="#000000">string</text>
</a>
</g>
</g>
<!-- /lht_tree_doc/roots/coraleda&#45;project&#45;v1/children/common/children/libs/children/NAME&#45;&gt;/lht_tree_doc/roots/coraleda&#45;project&#45;v1/children/common/children/libs/children/NAME/children/desc -->
<g id="edge16" class="edge">
<title>/lht_tree_doc/roots/coraleda&#45;project&#45;v1/children/common/children/libs/children/NAME&#45;&gt;/lht_tree_doc/roots/coraleda&#45;project&#45;v1/children/common/children/libs/children/NAME/children/desc</title>
<path fill="none" stroke="#000000" d="M683.6327,-92.1227C694.066,-80.8886 706.4185,-67.588 717.2405,-55.9354"/>
<polygon fill="#000000" stroke="#000000" points="719.855,-58.2634 724.0956,-48.5542 714.7258,-53.4998 719.855,-58.2634"/>
</g>
<!-- /lht_tree_doc/roots/coraleda&#45;project&#45;v1/children/common/children/libs/children/NAME/children/type -->
<g id="node18" class="node">
<title>/lht_tree_doc/roots/coraleda&#45;project&#45;v1/children/common/children/libs/children/NAME/children/type</title>
<g id="a_node18"><a xlink:href="tree.html#/lht_tree_doc/roots/coraleda-project-v1/children/common/children/libs/children/NAME/children/type" xlink:title="optional: type of the library; one of: &quot;footprint&quot; (for pcb design), &quot;symbol&quot; (for schematic), &quot;sim&quot; (models and subcircuits for e.g. spice simulation) ">
<ellipse fill="none" stroke="#000000" cx="828.234" cy="-26.8701" rx="33.4697" ry="26.7407"/>
<text text-anchor="middle" x="828.234" y="-30.6701" font-family="Times,serif" font-size="14.00" fill="#000000">type</text>
<text text-anchor="middle" x="828.234" y="-15.6701" font-family="Times,serif" font-size="14.00" fill="#000000">string</text>
</a>
</g>
</g>
<!-- /lht_tree_doc/roots/coraleda&#45;project&#45;v1/children/common/children/libs/children/NAME&#45;&gt;/lht_tree_doc/roots/coraleda&#45;project&#45;v1/children/common/children/libs/children/NAME/children/type -->
<g id="edge17" class="edge">
<title>/lht_tree_doc/roots/coraleda&#45;project&#45;v1/children/common/children/libs/children/NAME&#45;&gt;/lht_tree_doc/roots/coraleda&#45;project&#45;v1/children/common/children/libs/children/NAME/children/type</title>
<path fill="none" stroke="#000000" d="M699.3747,-98.843C724.5269,-86.6604 757.7123,-70.0034 786.234,-53.7401 788.7014,-52.3332 791.2263,-50.8455 793.7534,-49.3208"/>
<polygon fill="#000000" stroke="#000000" points="795.6048,-52.2912 802.2736,-44.0584 791.9263,-46.3356 795.6048,-52.2912"/>
</g>
</g>
</svg>
