G04 start of page 3 for group 12 layer_idx 7 *
G04 Title: one line on each silk layer, bottom silk *
G04 Creator: <version>
G04 CreationDate: <date>
G04 For:  *
G04 Format: Gerber/RS-274X *
G04 PCB-Dimensions: 50000 50000 *
G04 PCB-Coordinate-Origin: lower left *
%MOIN*%
%FSLAX25Y25*%
%LNBOTTOMSILK*%
%ADD12C,0.0100*%
G54D12*X7500Y7500D02*X30000Y30000D01*
M02*
