G04 start of page 2 for group 3 layer_idx 0 *
G04 Title: Normal triangular polygons, top copper *
G04 Creator: <version>
G04 CreationDate: <date>
G04 For:  *
G04 Format: Gerber/RS-274X *
G04 PCB-Dimensions: 50000 50000 *
G04 PCB-Coordinate-Origin: lower left *
%MOIN*%
%FSLAX25Y25*%
%LNTOP*%
%ADD11C,0.0001*%
G54D11*G36*
X2500Y47500D02*X12500D01*
X2500Y37500D01*
Y47500D01*
G37*
G36*
Y35000D02*X15000Y47500D01*
Y35000D01*
X2500D01*
G37*
G36*
X17500D02*X30000Y47500D01*
X42500Y35000D01*
X17500D01*
G37*
G36*
X2500Y32500D02*X30000Y30000D01*
X5000Y15000D01*
X2500Y32500D01*
G37*
M02*
