G04 start of page 2 for group 3 layer_idx 0 *
G04 Title: Rotated round cap and square pads, top_copper *
G04 Creator: <version>
G04 CreationDate: <date>
G04 For: TEST *
G04 Format: Gerber/RS-274X *
G04 PCB-Dimensions: 50000 50000 *
G04 PCB-Coordinate-Origin: lower left *
%MOIN*%
%FSLAX25Y25*%
%LNTOP*%
%ADD12C,0.0001*%
%ADD11C,0.0100*%
G54D11*X5000Y45000D02*X12500D01*
X5000Y37500D02*Y30000D01*
G54D12*G36*
X19500Y45500D02*Y44500D01*
X28000D01*
Y45500D01*
X19500D01*
G37*
G36*
X5500Y23000D02*X4500D01*
Y14500D01*
X5500D01*
Y23000D01*
G37*
G54D11*X12500Y35000D02*X17803Y29697D01*
G54D12*G36*
X22500Y35707D02*X21793Y35000D01*
X27803Y28990D01*
X28510Y29697D01*
X22500Y35707D01*
G37*
G54D11*X12500Y20000D02*X19443Y17164D01*
G54D12*G36*
X27226Y20652D02*X26848Y19726D01*
X34717Y16512D01*
X35095Y17438D01*
X27226Y20652D01*
G37*
M02*
