%!PS-Adobe-3.0 EPSF-3.0
%%BoundingBox: 0 0 37.000000 37.000000
%%Pages: 1
save countdictstack mark newpath /showpage {} def /setpagedevice {pop} def
%%EndProlog
%%Page: 1 1
%%BeginDocument: elem_sides_smd.eps

72 72 scale
1 dup neg scale
1 dup scale
0.00000 -0.50000 translate
/nclip { -0.01000 -0.01000 moveto -0.01000 0.51000 lineto 0.51000 0.51000 lineto 0.51000 -0.01000 lineto -0.01000 -0.01000 lineto eoclip newpath } def
/t { moveto lineto stroke } bind def
/tc { moveto lineto strokepath nclip } bind def
/r { /y2 exch def /x2 exch def /y1 exch def /x1 exch def
     x1 y1 moveto x1 y2 lineto x2 y2 lineto x2 y1 lineto closepath fill } bind def
/c { 0 360 arc fill } bind def
/cc { 0 360 arc nclip } bind def
/a { gsave setlinewidth translate scale 0 0 1 5 3 roll arc stroke grestore} bind def
% Layer bottom group 10 drill 0 mask 0
0.05118 setlinewidth
2 setlinecap
0.8 0.8 0.8 setrgbcolor
0.16595 0.33819 0.16595 0.36181 t
0.28405 0.33819 0.28405 0.36181 t
% Layer group5 group 5 drill 0 mask 0
% Layer group7 group 7 drill 0 mask 0
% Layer top group 3 drill 0 mask 0
0.301961 0.301961 0.301961 setrgbcolor
0.16595 0.11319 0.16595 0.13681 t
0.28405 0.11319 0.28405 0.13681 t
% Layer topsilk group 1 drill 0 mask 0
0.00800 setlinewidth
1 setlinecap
0 0 0 setrgbcolor
0.20138 0.08760 0.24862 0.08760 t
0.20138 0.16240 0.24862 0.16240 t
0.00700 setlinewidth
0.34350 0.09350 0.36350 0.09350 t
0.36350 0.09350 0.36850 0.09850 t
0.36850 0.09850 0.36850 0.10850 t
0.36350 0.11350 0.36850 0.10850 t
0.34850 0.11350 0.36350 0.11350 t
0.34850 0.09350 0.34850 0.13350 t
0.35650 0.11350 0.36850 0.13350 t
0.38050 0.10150 0.38850 0.09350 t
0.38850 0.09350 0.38850 0.13350 t
0.38050 0.13350 0.39550 0.13350 t
% Layer bottomsilk group 12 drill 0 mask 0
showpage
%%EndDocument
%%Trailer
cleartomark countdictstack exch sub { end } repeat restore
%%EOF
