G04 start of page 3 for group -1 layer_idx 268435461 *
G04 Title: outline layer triangle, <virtual group> *
G04 Creator: <version>
G04 CreationDate: <date>
G04 For: TEST *
G04 Format: Gerber/RS-274X *
G04 PCB-Dimensions: 50000 50000 *
G04 PCB-Coordinate-Origin: lower left *
%MOIN*%
%FSLAX25Y25*%
%LNFAB*%
%ADD14C,0.0100*%
%ADD13C,0.0001*%
%ADD12C,0.0060*%
G54D12*X3000Y125000D02*X3750Y124250D01*
X750Y125000D02*X3000D01*
X0Y124250D02*X750Y125000D01*
X0Y124250D02*Y122750D01*
X750Y122000D01*
X3000D01*
X3750Y121250D01*
Y119750D01*
X3000Y119000D02*X3750Y119750D01*
X750Y119000D02*X3000D01*
X0Y119750D02*X750Y119000D01*
G54D13*G36*
X5550Y125000D02*X10050D01*
Y119000D01*
X5550D01*
Y125000D01*
G37*
G36*
X10950D02*X15450D01*
Y119000D01*
X10950D01*
Y125000D01*
G37*
G36*
X16350D02*X20850D01*
Y119000D01*
X16350D01*
Y125000D01*
G37*
G36*
X21750D02*X26250D01*
Y119000D01*
X21750D01*
Y125000D01*
G37*
G36*
X27150D02*X31650D01*
Y119000D01*
X27150D01*
Y125000D01*
G37*
G54D12*X0Y118000D02*X5550D01*
X41750Y125000D02*Y119000D01*
X43700Y125000D02*X44750Y123950D01*
Y120050D01*
X43700Y119000D02*X44750Y120050D01*
X41000Y119000D02*X43700D01*
X41000Y125000D02*X43700D01*
G54D13*G36*
X46550D02*X51050D01*
Y119000D01*
X46550D01*
Y125000D01*
G37*
G36*
X51950D02*X56450D01*
Y119000D01*
X51950D01*
Y125000D01*
G37*
G36*
X57350D02*X61850D01*
Y119000D01*
X57350D01*
Y125000D01*
G37*
G36*
X62750D02*X67250D01*
Y119000D01*
X62750D01*
Y125000D01*
G37*
G36*
X70850D02*X75350D01*
Y119000D01*
X70850D01*
Y125000D01*
G37*
G54D12*X76250D02*X77750D01*
X77000D02*Y119000D01*
X76250D02*X77750D01*
G54D13*G36*
X79550Y125000D02*X84050D01*
Y119000D01*
X79550D01*
Y125000D01*
G37*
G36*
X84950D02*X89450D01*
Y119000D01*
X84950D01*
Y125000D01*
G37*
G36*
X90350D02*X94850D01*
Y119000D01*
X90350D01*
Y125000D01*
G37*
G36*
X95750D02*X100250D01*
Y119000D01*
X95750D01*
Y125000D01*
G37*
G54D12*X41000Y118000D02*X52550D01*
X96050Y119000D02*X98000D01*
X95000Y120050D02*X96050Y119000D01*
X95000Y123950D02*Y120050D01*
Y123950D02*X96050Y125000D01*
X98000D01*
G54D13*G36*
X99800D02*X104300D01*
Y119000D01*
X99800D01*
Y125000D01*
G37*
G36*
X105200D02*X109700D01*
Y119000D01*
X105200D01*
Y125000D01*
G37*
G36*
X110600D02*X115100D01*
Y119000D01*
X110600D01*
Y125000D01*
G37*
G36*
X116000D02*X120500D01*
Y119000D01*
X116000D01*
Y125000D01*
G37*
G54D12*X95000Y118000D02*X99800D01*
X130750Y125000D02*Y119000D01*
X130000Y125000D02*X133000D01*
X133750Y124250D01*
Y122750D01*
X133000Y122000D02*X133750Y122750D01*
X130750Y122000D02*X133000D01*
G54D13*G36*
X135550Y125000D02*X140050D01*
Y119000D01*
X135550D01*
Y125000D01*
G37*
G36*
X140950D02*X145450D01*
Y119000D01*
X140950D01*
Y125000D01*
G37*
G36*
X146350D02*X150850D01*
Y119000D01*
X146350D01*
Y125000D01*
G37*
G36*
X151750D02*X156250D01*
Y119000D01*
X151750D01*
Y125000D01*
G37*
G36*
X157150D02*X161650D01*
Y119000D01*
X157150D01*
Y125000D01*
G37*
G36*
X162550D02*X167050D01*
Y119000D01*
X162550D01*
Y125000D01*
G37*
G54D12*X130000Y118000D02*X135550D01*
X0Y140000D02*X3000D01*
X1500D02*Y134000D01*
G54D13*G36*
X4800Y140000D02*X9300D01*
Y134000D01*
X4800D01*
Y140000D01*
G37*
G36*
X10200D02*X14700D01*
Y134000D01*
X10200D01*
Y140000D01*
G37*
G36*
X15600D02*X20100D01*
Y134000D01*
X15600D01*
Y140000D01*
G37*
G36*
X21000D02*X25500D01*
Y134000D01*
X21000D01*
Y140000D01*
G37*
G36*
X29100D02*X33600D01*
Y134000D01*
X29100D01*
Y140000D01*
G37*
G36*
X34500D02*X39000D01*
Y134000D01*
X34500D01*
Y140000D01*
G37*
G36*
X39900D02*X44400D01*
Y134000D01*
X39900D01*
Y140000D01*
G37*
G36*
X48000D02*X52500D01*
Y134000D01*
X48000D01*
Y140000D01*
G37*
G36*
X56100D02*X60600D01*
Y134000D01*
X56100D01*
Y140000D01*
G37*
G36*
X61500D02*X66000D01*
Y134000D01*
X61500D01*
Y140000D01*
G37*
G36*
X66900D02*X71400D01*
Y134000D01*
X66900D01*
Y140000D01*
G37*
G36*
X72300D02*X76800D01*
Y134000D01*
X72300D01*
Y140000D01*
G37*
G36*
X77700D02*X82200D01*
Y134000D01*
X77700D01*
Y140000D01*
G37*
G36*
X83100D02*X87600D01*
Y134000D01*
X83100D01*
Y140000D01*
G37*
G36*
X88500D02*X93000D01*
Y134000D01*
X88500D01*
Y140000D01*
G37*
G36*
X93900D02*X98400D01*
Y134000D01*
X93900D01*
Y140000D01*
G37*
G36*
X99300D02*X103800D01*
Y134000D01*
X99300D01*
Y140000D01*
G37*
G36*
X107400D02*X111900D01*
Y134000D01*
X107400D01*
Y140000D01*
G37*
G36*
X112800D02*X117300D01*
Y134000D01*
X112800D01*
Y140000D01*
G37*
G36*
X118200D02*X122700D01*
Y134000D01*
X118200D01*
Y140000D01*
G37*
G36*
X123600D02*X128100D01*
Y134000D01*
X123600D01*
Y140000D01*
G37*
G36*
X129000D02*X133500D01*
Y134000D01*
X129000D01*
Y140000D01*
G37*
G36*
X137100D02*X141600D01*
Y134000D01*
X137100D01*
Y140000D01*
G37*
G36*
X142500D02*X147000D01*
Y134000D01*
X142500D01*
Y140000D01*
G37*
G36*
X147900D02*X152400D01*
Y134000D01*
X147900D01*
Y140000D01*
G37*
G36*
X153300D02*X157800D01*
Y134000D01*
X153300D01*
Y140000D01*
G37*
G36*
X158700D02*X163200D01*
Y134000D01*
X158700D01*
Y140000D01*
G37*
G36*
X166800D02*X171300D01*
Y134000D01*
X166800D01*
Y140000D01*
G37*
G36*
X172200D02*X176700D01*
Y134000D01*
X172200D01*
Y140000D01*
G37*
G36*
X177600D02*X182100D01*
Y134000D01*
X177600D01*
Y140000D01*
G37*
G36*
X183000D02*X187500D01*
Y134000D01*
X183000D01*
Y140000D01*
G37*
G36*
X191100D02*X195600D01*
Y134000D01*
X191100D01*
Y140000D01*
G37*
G36*
X196500D02*X201000D01*
Y134000D01*
X196500D01*
Y140000D01*
G37*
G36*
X204600D02*X209100D01*
Y134000D01*
X204600D01*
Y140000D01*
G37*
G36*
X210000D02*X214500D01*
Y134000D01*
X210000D01*
Y140000D01*
G37*
G36*
X215400D02*X219900D01*
Y134000D01*
X215400D01*
Y140000D01*
G37*
G36*
X220800D02*X225300D01*
Y134000D01*
X220800D01*
Y140000D01*
G37*
G36*
X228900D02*X233400D01*
Y134000D01*
X228900D01*
Y140000D01*
G37*
G36*
X234300D02*X238800D01*
Y134000D01*
X234300D01*
Y140000D01*
G37*
G36*
X239700D02*X244200D01*
Y134000D01*
X239700D01*
Y140000D01*
G37*
G36*
X245100D02*X249600D01*
Y134000D01*
X245100D01*
Y140000D01*
G37*
G36*
X250500D02*X255000D01*
Y134000D01*
X250500D01*
Y140000D01*
G37*
G36*
X255900D02*X260400D01*
Y134000D01*
X255900D01*
Y140000D01*
G37*
G36*
X261300D02*X265800D01*
Y134000D01*
X261300D01*
Y140000D01*
G37*
G36*
X269400D02*X273900D01*
Y134000D01*
X269400D01*
Y140000D01*
G37*
G36*
X277500D02*X282000D01*
Y134000D01*
X277500D01*
Y140000D01*
G37*
G36*
X282900D02*X287400D01*
Y134000D01*
X282900D01*
Y140000D01*
G37*
G36*
X288300D02*X292800D01*
Y134000D01*
X288300D01*
Y140000D01*
G37*
G36*
X293700D02*X298200D01*
Y134000D01*
X293700D01*
Y140000D01*
G37*
G36*
X299100D02*X303600D01*
Y134000D01*
X299100D01*
Y140000D01*
G37*
G36*
X307200D02*X311700D01*
Y134000D01*
X307200D01*
Y140000D01*
G37*
G36*
X312600D02*X317100D01*
Y134000D01*
X312600D01*
Y140000D01*
G37*
G36*
X318000D02*X322500D01*
Y134000D01*
X318000D01*
Y140000D01*
G37*
G36*
X323400D02*X327900D01*
Y134000D01*
X323400D01*
Y140000D01*
G37*
G36*
X328800D02*X333300D01*
Y134000D01*
X328800D01*
Y140000D01*
G37*
G54D14*X7500Y40000D02*Y10000D01*
X37500D01*
X7500Y40000D01*
G54D12*X12775Y-8000D02*X15775D01*
X16525Y-7250D01*
Y-5450D02*Y-7250D01*
X15775Y-4700D02*X16525Y-5450D01*
X13525Y-4700D02*X15775D01*
X13525Y-2000D02*Y-8000D01*
X12775Y-2000D02*X15775D01*
X16525Y-2750D01*
Y-3950D01*
X15775Y-4700D02*X16525Y-3950D01*
G54D13*G36*
X18325Y-2000D02*X22825D01*
Y-8000D01*
X18325D01*
Y-2000D01*
G37*
G36*
X23725D02*X28225D01*
Y-8000D01*
X23725D01*
Y-2000D01*
G37*
G36*
X29125D02*X33625D01*
Y-8000D01*
X29125D01*
Y-2000D01*
G37*
G36*
X34525D02*X39025D01*
Y-8000D01*
X34525D01*
Y-2000D01*
G37*
G36*
X42625D02*X47125D01*
Y-8000D01*
X42625D01*
Y-2000D01*
G37*
G36*
X48025D02*X52525D01*
Y-8000D01*
X48025D01*
Y-2000D01*
G37*
G36*
X53425D02*X57925D01*
Y-8000D01*
X53425D01*
Y-2000D01*
G37*
G36*
X58825D02*X63325D01*
Y-8000D01*
X58825D01*
Y-2000D01*
G37*
G36*
X64225D02*X68725D01*
Y-8000D01*
X64225D01*
Y-2000D01*
G37*
G36*
X69625D02*X74125D01*
Y-8000D01*
X69625D01*
Y-2000D01*
G37*
G36*
X75025D02*X79525D01*
Y-8000D01*
X75025D01*
Y-2000D01*
G37*
G36*
X83125D02*X87625D01*
Y-8000D01*
X83125D01*
Y-2000D01*
G37*
G36*
X88525D02*X93025D01*
Y-8000D01*
X88525D01*
Y-2000D01*
G37*
G36*
X96625D02*X101125D01*
Y-8000D01*
X96625D01*
Y-2000D01*
G37*
G36*
X102025D02*X106525D01*
Y-8000D01*
X102025D01*
Y-2000D01*
G37*
G36*
X107425D02*X111925D01*
Y-8000D01*
X107425D01*
Y-2000D01*
G37*
G36*
X115525D02*X120025D01*
Y-8000D01*
X115525D01*
Y-2000D01*
G37*
G36*
X120925D02*X125425D01*
Y-8000D01*
X120925D01*
Y-2000D01*
G37*
G36*
X126325D02*X130825D01*
Y-8000D01*
X126325D01*
Y-2000D01*
G37*
G36*
X131725D02*X136225D01*
Y-8000D01*
X131725D01*
Y-2000D01*
G37*
G36*
X137125D02*X141625D01*
Y-8000D01*
X137125D01*
Y-2000D01*
G37*
G36*
X142525D02*X147025D01*
Y-8000D01*
X142525D01*
Y-2000D01*
G37*
G36*
X147925D02*X152425D01*
Y-8000D01*
X147925D01*
Y-2000D01*
G37*
G36*
X153325D02*X157825D01*
Y-8000D01*
X153325D01*
Y-2000D01*
G37*
G36*
X158725D02*X163225D01*
Y-8000D01*
X158725D01*
Y-2000D01*
G37*
G36*
X164125D02*X168625D01*
Y-8000D01*
X164125D01*
Y-2000D01*
G37*
G36*
X172225D02*X176725D01*
Y-8000D01*
X172225D01*
Y-2000D01*
G37*
G36*
X177625D02*X182125D01*
Y-8000D01*
X177625D01*
Y-2000D01*
G37*
G36*
X185725D02*X190225D01*
Y-8000D01*
X185725D01*
Y-2000D01*
G37*
G36*
X191125D02*X195625D01*
Y-8000D01*
X191125D01*
Y-2000D01*
G37*
G36*
X196525D02*X201025D01*
Y-8000D01*
X196525D01*
Y-2000D01*
G37*
G36*
X201925D02*X206425D01*
Y-8000D01*
X201925D01*
Y-2000D01*
G37*
G36*
X210025D02*X214525D01*
Y-8000D01*
X210025D01*
Y-2000D01*
G37*
G36*
X215425D02*X219925D01*
Y-8000D01*
X215425D01*
Y-2000D01*
G37*
G36*
X220825D02*X225325D01*
Y-8000D01*
X220825D01*
Y-2000D01*
G37*
G36*
X226225D02*X230725D01*
Y-8000D01*
X226225D01*
Y-2000D01*
G37*
G54D12*X200750Y80000D02*Y74000D01*
X202700Y80000D02*X203750Y78950D01*
Y75050D01*
X202700Y74000D02*X203750Y75050D01*
X200000Y74000D02*X202700D01*
X200000Y80000D02*X202700D01*
G54D13*G36*
X205550D02*X210050D01*
Y74000D01*
X205550D01*
Y80000D01*
G37*
G36*
X210950D02*X215450D01*
Y74000D01*
X210950D01*
Y80000D01*
G37*
G36*
X216350D02*X220850D01*
Y74000D01*
X216350D01*
Y80000D01*
G37*
G36*
X221750D02*X226250D01*
Y74000D01*
X221750D01*
Y80000D01*
G37*
G36*
X229850D02*X234350D01*
Y74000D01*
X229850D01*
Y80000D01*
G37*
G36*
X235250D02*X239750D01*
Y74000D01*
X235250D01*
Y80000D01*
G37*
G36*
X240650D02*X245150D01*
Y74000D01*
X240650D01*
Y80000D01*
G37*
G36*
X246050D02*X250550D01*
Y74000D01*
X246050D01*
Y80000D01*
G37*
G36*
X251450D02*X255950D01*
Y74000D01*
X251450D01*
Y80000D01*
G37*
G36*
X256850D02*X261350D01*
Y74000D01*
X256850D01*
Y80000D01*
G37*
G54D12*X200000Y93500D02*Y89000D01*
Y93500D02*X201050Y95000D01*
X202700D01*
X203750Y93500D01*
Y89000D01*
X200000Y92000D02*X203750D01*
G54D13*G36*
X205550Y95000D02*X210050D01*
Y89000D01*
X205550D01*
Y95000D01*
G37*
G36*
X210950D02*X215450D01*
Y89000D01*
X210950D01*
Y95000D01*
G37*
G36*
X216350D02*X220850D01*
Y89000D01*
X216350D01*
Y95000D01*
G37*
G36*
X221750D02*X226250D01*
Y89000D01*
X221750D01*
Y95000D01*
G37*
G36*
X227150D02*X231650D01*
Y89000D01*
X227150D01*
Y95000D01*
G37*
G36*
X232550D02*X237050D01*
Y89000D01*
X232550D01*
Y95000D01*
G37*
G54D12*X240650D02*X243650D01*
X242150D02*Y89000D01*
X245450Y92300D02*X247700D01*
X245450Y89000D02*X248450D01*
X245450Y95000D02*Y89000D01*
Y95000D02*X248450D01*
X253250D02*X254000Y94250D01*
X251000Y95000D02*X253250D01*
X250250Y94250D02*X251000Y95000D01*
X250250Y94250D02*Y92750D01*
X251000Y92000D01*
X253250D01*
X254000Y91250D01*
Y89750D01*
X253250Y89000D02*X254000Y89750D01*
X251000Y89000D02*X253250D01*
X250250Y89750D02*X251000Y89000D01*
X255800Y95000D02*X258800D01*
X257300D02*Y89000D01*
X200000Y110000D02*X203000D01*
X201500D02*Y104000D01*
G54D13*G36*
X204800Y110000D02*X209300D01*
Y104000D01*
X204800D01*
Y110000D01*
G37*
G36*
X210200D02*X214700D01*
Y104000D01*
X210200D01*
Y110000D01*
G37*
G36*
X215600D02*X220100D01*
Y104000D01*
X215600D01*
Y110000D01*
G37*
G36*
X221000D02*X225500D01*
Y104000D01*
X221000D01*
Y110000D01*
G37*
G36*
X226400D02*X230900D01*
Y104000D01*
X226400D01*
Y110000D01*
G37*
G36*
X234500D02*X239000D01*
Y104000D01*
X234500D01*
Y110000D01*
G37*
G36*
X239900D02*X244400D01*
Y104000D01*
X239900D01*
Y110000D01*
G37*
G36*
X245300D02*X249800D01*
Y104000D01*
X245300D01*
Y110000D01*
G37*
G36*
X250700D02*X255200D01*
Y104000D01*
X250700D01*
Y110000D01*
G37*
G36*
X256100D02*X260600D01*
Y104000D01*
X256100D01*
Y110000D01*
G37*
G36*
X261500D02*X266000D01*
Y104000D01*
X261500D01*
Y110000D01*
G37*
G36*
X266900D02*X271400D01*
Y104000D01*
X266900D01*
Y110000D01*
G37*
G36*
X275000D02*X279500D01*
Y104000D01*
X275000D01*
Y110000D01*
G37*
G36*
X280400D02*X284900D01*
Y104000D01*
X280400D01*
Y110000D01*
G37*
G36*
X285800D02*X290300D01*
Y104000D01*
X285800D01*
Y110000D01*
G37*
G36*
X291200D02*X295700D01*
Y104000D01*
X291200D01*
Y110000D01*
G37*
G36*
X296600D02*X301100D01*
Y104000D01*
X296600D01*
Y110000D01*
G37*
G36*
X304700D02*X309200D01*
Y104000D01*
X304700D01*
Y110000D01*
G37*
G36*
X310100D02*X314600D01*
Y104000D01*
X310100D01*
Y110000D01*
G37*
G36*
X315500D02*X320000D01*
Y104000D01*
X315500D01*
Y110000D01*
G37*
G36*
X320900D02*X325400D01*
Y104000D01*
X320900D01*
Y110000D01*
G37*
G36*
X326300D02*X330800D01*
Y104000D01*
X326300D01*
Y110000D01*
G37*
G36*
X331700D02*X336200D01*
Y104000D01*
X331700D01*
Y110000D01*
G37*
G36*
X337100D02*X341600D01*
Y104000D01*
X337100D01*
Y110000D01*
G37*
G36*
X342500D02*X347000D01*
Y104000D01*
X342500D01*
Y110000D01*
G37*
G36*
X350600D02*X355100D01*
Y104000D01*
X350600D01*
Y110000D01*
G37*
G54D12*X358700D02*Y104000D01*
Y110000D02*X361700D01*
X358700Y107300D02*X360950D01*
G54D13*G36*
X363500Y110000D02*X368000D01*
Y104000D01*
X363500D01*
Y110000D01*
G37*
G36*
X368900D02*X373400D01*
Y104000D01*
X368900D01*
Y110000D01*
G37*
G36*
X374300D02*X378800D01*
Y104000D01*
X374300D01*
Y110000D01*
G37*
G36*
X379700D02*X384200D01*
Y104000D01*
X379700D01*
Y110000D01*
G37*
G36*
X385100D02*X389600D01*
Y104000D01*
X385100D01*
Y110000D01*
G37*
G36*
X390500D02*X395000D01*
Y104000D01*
X390500D01*
Y110000D01*
G37*
G36*
X395900D02*X400400D01*
Y104000D01*
X395900D01*
Y110000D01*
G37*
G36*
X401300D02*X405800D01*
Y104000D01*
X401300D01*
Y110000D01*
G37*
G36*
X406700D02*X411200D01*
Y104000D01*
X406700D01*
Y110000D01*
G37*
G36*
X412100D02*X416600D01*
Y104000D01*
X412100D01*
Y110000D01*
G37*
G54D12*X420950D02*Y104000D01*
X422900Y110000D02*X423950Y108950D01*
Y105050D01*
X422900Y104000D02*X423950Y105050D01*
X420200Y104000D02*X422900D01*
X420200Y110000D02*X422900D01*
G54D13*G36*
X425750D02*X430250D01*
Y104000D01*
X425750D01*
Y110000D01*
G37*
G36*
X431150D02*X435650D01*
Y104000D01*
X431150D01*
Y110000D01*
G37*
G36*
X436550D02*X441050D01*
Y104000D01*
X436550D01*
Y110000D01*
G37*
G36*
X441950D02*X446450D01*
Y104000D01*
X441950D01*
Y110000D01*
G37*
G36*
X447350D02*X451850D01*
Y104000D01*
X447350D01*
Y110000D01*
G37*
G36*
X452750D02*X457250D01*
Y104000D01*
X452750D01*
Y110000D01*
G37*
M02*
