%!PS-Adobe-3.0 EPSF-3.0
%%BoundingBox: 0 0 37.000000 37.000000
%%Pages: 1
save countdictstack mark newpath /showpage {} def /setpagedevice {pop} def
%%EndProlog
%%Page: 1 1
%%BeginDocument: line_overlap4.eps

72 72 scale
1 dup neg scale
1 dup scale
0.00000 -0.50000 translate
/nclip { -0.01000 -0.01000 moveto -0.01000 0.51000 lineto 0.51000 0.51000 lineto 0.51000 -0.01000 lineto -0.01000 -0.01000 lineto eoclip newpath } def
/t { moveto lineto stroke } bind def
/tc { moveto lineto strokepath nclip } bind def
/r { /y2 exch def /x2 exch def /y1 exch def /x1 exch def
     x1 y1 moveto x1 y2 lineto x2 y2 lineto x2 y1 lineto closepath fill } bind def
/c { 0 360 arc fill } bind def
/cc { 0 360 arc nclip } bind def
/a { gsave setlinewidth translate scale 0 0 1 5 3 roll arc stroke grestore} bind def
% Layer bottomsilk group 12 drill 0 mask 0
% Layer bottom group 10 drill 0 mask 0
% Layer group5 group 5 drill 0 mask 0
% Layer group7 group 7 drill 0 mask 0
% Layer top group 3 drill 0 mask 0
0.00000 setlinewidth
2 setlinecap
0.545098 0.137255 0.137255 setrgbcolor
0.15000 0.15000 moveto
0.30000 0.15000 lineto
0.30000 0.17750 lineto
0.20000 0.17750 lineto
0.19647 0.17771 lineto
0.19303 0.17854 lineto
0.18975 0.17989 lineto
0.18673 0.18174 lineto
0.18404 0.18404 lineto
0.18174 0.18673 lineto
0.17989 0.18975 lineto
0.17854 0.19303 lineto
0.17771 0.19647 lineto
0.17743 0.20000 lineto
0.17771 0.20353 lineto
0.17854 0.20697 lineto
0.17989 0.21025 lineto
0.18174 0.21327 lineto
0.18404 0.21596 lineto
0.18673 0.21826 lineto
0.18975 0.22011 lineto
0.19303 0.22146 lineto
0.19647 0.22229 lineto
0.20000 0.22250 lineto
0.30000 0.22250 lineto
0.30000 0.32500 lineto
0.15000 0.32500 lineto
fill
0.00500 setlinewidth
1 setlinecap
0.20000 0.20000 0.35000 0.20000 t
0.01500 setlinewidth
0.20000 0.20000 0.35000 0.20000 t
% Layer topsilk group 1 drill 0 mask 0
showpage
%%EndDocument
%%Trailer
cleartomark countdictstack exch sub { end } repeat restore
%%EOF
