G04 start of page 7 for group 1 layer_idx 8 *
G04 Title: (unknown), top_silk *
G04 Creator: <version>
G04 CreationDate: <date>
G04 For: TEST *
G04 Format: Gerber/RS-274X *
G04 PCB-Dimensions: 50000 50000 *
G04 PCB-Coordinate-Origin: lower left *
%MOIN*%
%FSLAX25Y25*%
%LNTOPSILK*%
%ADD24C,0.0200*%
%ADD23C,0.0800*%
%ADD22C,0.0001*%
G54D22*G36*
X2500Y47500D02*X17500D01*
Y32500D01*
X2500D01*
Y47500D01*
G37*
G36*
X20000D02*X47500D01*
Y2500D01*
X20000D01*
Y47500D01*
G37*
%LPC*%
G36*
X22500Y45000D02*X45000D01*
Y5000D01*
X22500D01*
Y45000D01*
G37*
G54D23*X10000Y25000D02*Y37500D01*
G54D24*X0Y42500D02*G75*G03X7500Y50000I0J7500D01*G01*
%LPD*%
X10000Y27500D02*Y37500D01*
M02*
