<?xml version="1.0"?>
<svg xmlns="http://www.w3.org/2000/svg" xmlns:xlink="http://www.w3.org/1999/xlink" version="1.0" width="1625.6000" height="1625.6000" viewBox="-2.0000 -2.0000 17.7000 17.7000">
<g id="layer_9_outline">
<!--normal-->
 <rect x="0.0000" y="0.0000" width="12.7000" height="12.7000" stroke-width="0.2540" stroke="#00868b" stroke-linecap="round" fill="none"/>
</g>
<g id="layer_7_group7">
</g>
<g id="layer_5_group5">
</g>
<g id="layer_10_bottom">
</g>
<g id="layer_3_top">
<!--normal-->
 <path d="M 5.08000000 8.89000000 A 3.1750 3.1750 0 0 1 1.9050 5.7150" stroke-width="0.2540" stroke="#8b2323" stroke-linecap="round" fill="none"/>
 <path d="M 4.44500000 3.17500000 A 2.5400 2.5400 0 0 0 1.9436 5.2739" stroke-width="0.5080" stroke="#8b2323" stroke-linecap="round" fill="none"/>
 <path d="M 7.30250000 6.43507400 A 0.6350 0.6350 0 1 1 6.9850 6.9850" stroke-width="0.2540" stroke="#8b2323" stroke-linecap="round" fill="none"/>
 <path d="M 9.33352400 4.62908600 A 3.1750 3.1750 0 0 0 5.2641 2.7315" stroke-width="0.7620" stroke="#8b2323" stroke-linecap="round" fill="none"/>
</g>
<g id="layer_1_topsilk">
</g>
</svg>
