G04 start of page 4 for group 7 layer_idx 5 *
G04 Title: (unknown), Intern *
G04 Creator: <version>
G04 CreationDate: <date>
G04 For: TEST *
G04 Format: Gerber/RS-274X *
G04 PCB-Dimensions: 50000 50000 *
G04 PCB-Coordinate-Origin: lower left *
%MOIN*%
%FSLAX25Y25*%
%LNGROUP7*%
%ADD25C,0.0394*%
%ADD24C,0.0315*%
%ADD23C,0.0966*%
%ADD22C,0.0866*%
%ADD21C,0.0787*%
G54D21*X7500Y40000D03*
G54D22*X37500D03*
G54D23*X22500Y17500D03*
G54D24*G54D25*M02*
