<?xml version="1.0"?>
<svg xmlns="http://www.w3.org/2000/svg" xmlns:xlink="http://www.w3.org/1999/xlink" version="1.0" width="1625.6000" height="1625.6000" viewBox="-2.0000 -2.0000 17.7000 17.7000">
<g id="layer_9_outline">
<!--normal-->
 <rect x="0.0000" y="0.0000" width="12.7000" height="12.7000" stroke-width="0.2540" stroke="#00868b" stroke-linecap="round" fill="none"/>
</g>
<g id="layer_7_group7">
</g>
<g id="layer_5_group5">
</g>
<g id="layer_10_bottom">
</g>
<g id="layer_3_top">
<!--normal-->
 <polygon points="6.6675,0.6350 12.0650,0.6350 12.0650,12.0650 6.6675,12.0650 6.6675,10.6765 6.7200,10.6639 6.8936,10.5920 7.0539,10.4938 7.1967,10.3717 7.3188,10.2289 7.4170,10.0686 7.4889,9.8950 7.5327,9.7123 7.5438,9.5250 7.5438,6.8453 10.1600,6.8453 10.2377,6.8407 10.3135,6.8225 10.3856,6.7927 10.4520,6.7519 10.5113,6.7013 10.5619,6.6420 10.6027,6.5756 10.6325,6.5035 10.6507,6.4277 10.6568,6.3500 10.6507,6.2723 10.6325,6.1965 10.6027,6.1244 10.5619,6.0580 10.5113,5.9987 10.4520,5.9481 10.3856,5.9073 10.3135,5.8775 10.2377,5.8593 10.1600,5.8547 7.5438,5.8547 7.5438,3.1750 7.5327,2.9877 7.4889,2.8050 7.4170,2.6314 7.3188,2.4711 7.1967,2.3283 7.0539,2.2062 6.8936,2.1080 6.7200,2.0361 6.6675,2.0235 " stroke-width="0.075" stroke="#8b2323" fill="#8b2323"/>
 <polygon points="0.6350,0.6350 6.6675,0.6350 6.6675,2.0235 6.5373,1.9923 6.3500,1.9775 6.1627,1.9923 5.9800,2.0361 5.8064,2.1080 5.6461,2.2062 5.5033,2.3283 5.3812,2.4711 5.2830,2.6314 5.2111,2.8050 5.1673,2.9877 5.1562,3.1750 5.1562,5.8547 3.1750,5.8547 3.0973,5.8593 3.0215,5.8775 2.9494,5.9073 2.8830,5.9481 2.8237,5.9987 2.7731,6.0580 2.7323,6.1244 2.7025,6.1965 2.6843,6.2723 2.6782,6.3500 2.6843,6.4277 2.7025,6.5035 2.7323,6.5756 2.7731,6.6420 2.8237,6.7013 2.8830,6.7519 2.9494,6.7927 3.0215,6.8225 3.0973,6.8407 3.1750,6.8453 5.1562,6.8453 5.1562,9.5250 5.1673,9.7123 5.2111,9.8950 5.2830,10.0686 5.3812,10.2289 5.5033,10.3717 5.6461,10.4938 5.8064,10.5920 5.9800,10.6639 6.1627,10.7077 6.3500,10.7225 6.5373,10.7077 6.6675,10.6765 6.6675,12.0650 0.6350,12.0650 " stroke-width="0.075" stroke="#8b2323" fill="#8b2323"/>
 <line x1="3.1750" y1="6.3500" x2="10.1600" y2="6.3500" stroke-width="0.3810" stroke="#8b2323" stroke-linecap="round"/>
 <line x1="6.3500" y1="3.1750" x2="6.3500" y2="9.5250" stroke-width="0.2540" stroke="#8b2323" stroke-linecap="round"/>
 <line x1="6.3500" y1="6.3500" x2="10.1600" y2="5.0800" stroke-width="0.5080" stroke="#8b2323" stroke-linecap="round"/>
 <line x1="6.3500" y1="6.3500" x2="3.8100" y2="3.8100" stroke-width="0.1270" stroke="#8b2323" stroke-linecap="round"/>
</g>
<g id="layer_1_topsilk">
</g>
</svg>
