G04 start of page 2 for group 3 layer_idx 0 *
G04 Title: pads with different geometry, top_copper *
G04 Creator: <version>
G04 CreationDate: <date>
G04 For: TEST *
G04 Format: Gerber/RS-274X *
G04 PCB-Dimensions: 50000 50000 *
G04 PCB-Coordinate-Origin: lower left *
%MOIN*%
%FSLAX25Y25*%
%LNTOP*%
%ADD11C,0.0001*%
G54D11*G36*
X21654Y43740D02*X16536D01*
Y36260D01*
X21654D01*
Y43740D01*
G37*
G36*
X33464D02*X28346D01*
Y36260D01*
X33464D01*
Y43740D01*
G37*
G36*
X23150Y14250D02*X21650D01*
Y10750D01*
X23150D01*
Y14250D01*
G37*
G36*
X28250D02*X26750D01*
Y10750D01*
X28250D01*
Y14250D01*
G37*
G36*
Y21250D02*X26750D01*
Y17750D01*
X28250D01*
Y21250D01*
G37*
G36*
X25750D02*X24250D01*
Y17750D01*
X25750D01*
Y21250D01*
G37*
G36*
X23150D02*X21650D01*
Y17750D01*
X23150D01*
Y21250D01*
G37*
M02*
