v 20130925 2
C 40000 40000 0 0 0 title-B.sym
B 40800 46000 3000 400 3 0 0 0 -1 -1 3 1 -1 100 -1 -1
L 44000 46000 40600 46000 3 0 0 0 -1 -1
B 40300 43000 4000 6500 3 0 0 0 -1 -1 0 -1 -1 -1 -1 -1
L 44000 46400 40600 46400 3 0 0 0 -1 -1
L 44000 46900 40600 46900 3 0 0 0 -1 -1
L 44000 47400 40600 47400 3 0 0 0 -1 -1
L 44000 47900 40600 47900 3 0 0 0 -1 -1
L 44000 48400 40600 48400 3 0 0 0 -1 -1
L 44000 45000 40600 45000 3 0 0 0 -1 -1
L 44000 45500 40600 45500 3 0 0 0 -1 -1
L 44000 44000 40600 44000 3 0 0 0 -1 -1
L 44000 44500 40600 44500 3 0 0 0 -1 -1
L 44000 43500 40600 43500 3 0 0 0 -1 -1
L 44000 48900 40600 48900 3 0 0 0 -1 -1
T 42400 46200 9 10 1 0 0 4 1
Substrate
T 40300 49500 9 10 1 0 0 0 3
Special case 2 layers, no internal features, and 
copper on the side that has the z line on it is a 
ground plane. This is the most common.
B 44900 46100 3000 400 3 0 0 0 -1 -1 3 1 -1 100 -1 -1
L 48100 46100 44700 46100 3 0 0 0 -1 -1
B 44400 43000 4000 6500 3 0 0 0 -1 -1 0 -1 -1 -1 -1 -1
L 48100 46500 44700 46500 3 0 0 0 -1 -1
L 48100 46900 44700 46900 3 0 0 0 -1 -1
L 48100 47400 44700 47400 3 0 0 0 -1 -1
L 48100 47900 44700 47900 3 0 0 0 -1 -1
L 48100 48400 44700 48400 3 0 0 0 -1 -1
L 48100 45100 44700 45100 3 0 0 0 -1 -1
L 48100 45600 44700 45600 3 0 0 0 -1 -1
L 48100 44100 44700 44100 3 0 0 0 -1 -1
L 48100 44600 44700 44600 3 0 0 0 -1 -1
L 48100 43600 44700 43600 3 0 0 0 -1 -1
L 48100 48900 44700 48900 3 0 0 0 -1 -1
T 46500 46300 9 10 1 0 0 4 1
Substrate
T 44400 49500 9 10 1 0 0 0 6
This has the z mesh jump kind of crazily and I think
it should transition smoother but I am not the 
expert Koen is. This has a cutout in the bottom 
copper plane and I am not sure if that explains the 
added complexity. I am not sure but I believe mesh
inside the substrate is part of how you do vias.
L 48100 46300 44700 46300 3 0 0 0 -1 -1
T 40300 42700 9 10 1 0 0 0 1
Koen's notchfilter, hairpinfilter, 
T 44400 42700 9 10 1 0 0 0 1
Koen's tutorial on hyp2mat
B 49000 46200 3000 400 3 0 0 0 -1 -1 3 1 -1 100 -1 -1
B 48500 43000 4000 6500 3 0 0 0 -1 -1 0 -1 -1 -1 -1 -1
L 52200 46500 48800 46500 3 0 0 0 -1 -1
L 52200 47100 48800 47100 3 0 0 0 -1 -1
L 52200 47500 48800 47500 3 0 0 0 -1 -1
L 52200 48000 48800 48000 3 0 0 0 -1 -1
L 52200 45300 48800 45300 3 0 0 0 -1 -1
L 52200 44300 48800 44300 3 0 0 0 -1 -1
L 52200 44800 48800 44800 3 0 0 0 -1 -1
L 52200 43800 48800 43800 3 0 0 0 -1 -1
L 52200 48500 48800 48500 3 0 0 0 -1 -1
L 52200 46400 48800 46400 3 0 0 0 -1 -1
T 50600 46400 9 10 1 0 0 4 1
Substrate
T 48500 49500 9 10 1 0 0 0 5
This example involved a very smoothed mesh which 
is probably because it's an antenna example and it 
divided the substrate up to handle everything being 
done in 3D (meaning 3D copper too). This is probably 
what people should use for multilayer (>2) boards.
T 48500 42700 9 10 1 0 0 0 1
Thorsten's tutorial on f antennas
L 52200 46300 48800 46300 3 0 0 0 -1 -1
L 52200 46200 48800 46200 3 0 0 0 -1 -1
L 52200 46600 48800 46600 3 0 0 0 -1 -1
L 52200 46800 48800 46800 3 0 0 0 -1 -1
L 52200 46000 48800 46000 3 0 0 0 -1 -1
L 52200 45700 48800 45700 3 0 0 0 -1 -1
L 52200 49000 48800 49000 3 0 0 0 -1 -1
L 52200 43300 48800 43300 3 0 0 0 -1 -1
B 53100 46200 3000 400 3 0 0 0 -1 -1 3 1 -1 100 -1 -1
B 52600 43000 4000 6500 3 0 0 0 -1 -1 0 -1 -1 -1 -1 -1
L 56300 46500 52900 46500 3 0 0 0 -1 -1
L 56300 47100 52900 47100 3 0 0 0 -1 -1
L 56300 47500 52900 47500 3 0 0 0 -1 -1
L 56300 48000 52900 48000 3 0 0 0 -1 -1
L 56300 48500 52900 48500 3 0 0 0 -1 -1
L 56300 46400 52900 46400 3 0 0 0 -1 -1
L 56300 46300 52900 46300 3 0 0 0 -1 -1
L 56300 46200 52900 46200 3 0 0 0 -1 -1
L 56300 46600 52900 46600 3 0 0 0 -1 -1
L 56300 46800 52900 46800 3 0 0 0 -1 -1
L 56300 49000 52900 49000 3 0 0 0 -1 -1
T 54700 46400 9 10 1 0 0 4 1
Substrate
T 52600 49500 9 10 1 0 0 0 5
This z mesh ends at the bottom of the board. The boundary 
conditions on this simulation are probably why they are able 
to end the mesh here. It also has to do with the field not 
being important. What is interesting is the miss use of 
(addbox) for a 2D construct. 
T 52600 42700 9 10 1 0 0 0 1
Thorsten's tutorial on stub filter
T 53900 40100 14 9 1 0 0 0 1
Evan Foss
T 50000 40700 14 9 1 0 0 0 1
Mesh Examples
