<?xml version="1.0" encoding="UTF-8" standalone="no"?>
<!DOCTYPE svg PUBLIC "-//W3C//DTD SVG 1.1//EN"
 "http://www.w3.org/Graphics/SVG/1.1/DTD/svg11.dtd">
<!-- Generated by graphviz version 2.40.1 (20161225.0304)
 -->
<!-- Title: li:submenu Pages: 1 -->
<svg width="1214pt" height="245pt"
 viewBox="0.00 0.00 1213.85 245.46" xmlns="http://www.w3.org/2000/svg" xmlns:xlink="http://www.w3.org/1999/xlink">
<g id="graph0" class="graph" transform="scale(1 1) rotate(0) translate(4 241.463)">
<title>li:submenu</title>
<polygon fill="#ffffff" stroke="transparent" points="-4,4 -4,-241.463 1209.8528,-241.463 1209.8528,4 -4,4"/>
<!-- /lht_tree_doc/comm/submenu -->
<g id="node1" class="node">
<title>/lht_tree_doc/comm/submenu</title>
<g id="a_node1"><a xlink:href="tree.html#/lht_tree_doc/comm/submenu" xlink:title="ordered list of menu items for a submenu">
<ellipse fill="none" stroke="#000000" cx="224.234" cy="-209.8858" rx="54.3945" ry="27.6545"/>
<text text-anchor="middle" x="224.234" y="-214.1858" font-family="Times,serif" font-size="14.00" fill="#000000">li:submenu</text>
</a>
</g>
</g>
<!-- /lht_tree_doc/comm/submenu/children/m -->
<g id="node2" class="node">
<title>/lht_tree_doc/comm/submenu/children/m</title>
<g id="a_node2"><a xlink:href="tree.html#/lht_tree_doc/comm/submenu/children/m" xlink:title="mnemonic: single character that should be underlined and used as a hot key in the menu name">
<ellipse fill="none" stroke="#000000" cx="33.234" cy="-118.7315" rx="33.4697" ry="26.7407"/>
<text text-anchor="middle" x="33.234" y="-122.5315" font-family="Times,serif" font-size="14.00" fill="#000000">m</text>
<text text-anchor="middle" x="33.234" y="-107.5315" font-family="Times,serif" font-size="14.00" fill="#000000">string</text>
</a>
</g>
</g>
<!-- /lht_tree_doc/comm/submenu&#45;&gt;/lht_tree_doc/comm/submenu/children/m -->
<g id="edge1" class="edge">
<title>/lht_tree_doc/comm/submenu&#45;&gt;/lht_tree_doc/comm/submenu/children/m</title>
<path fill="none" stroke="#000000" d="M180.6149,-193.3478C150.665,-181.4638 110.3209,-164.4026 76.234,-146.3087 73.3357,-144.7702 70.3769,-143.1003 67.4356,-141.3692"/>
<polygon fill="#000000" stroke="#000000" points="69.1017,-138.2857 58.7428,-136.0623 65.4542,-144.2603 69.1017,-138.2857"/>
</g>
<!-- /lht_tree_doc/comm/submenu/children/&#45; -->
<g id="node3" class="node">
<title>/lht_tree_doc/comm/submenu/children/&#45;</title>
<g id="a_node3"><a xlink:href="tree.html#/lht_tree_doc/comm/submenu/children/-" xlink:title="horizontal separator">
<ellipse fill="none" stroke="#000000" cx="115.234" cy="-118.7315" rx="30.3115" ry="26.7407"/>
<text text-anchor="middle" x="115.234" y="-122.5315" font-family="Times,serif" font-size="14.00" fill="#000000">&#45;</text>
<text text-anchor="middle" x="115.234" y="-107.5315" font-family="Times,serif" font-size="14.00" fill="#000000">none</text>
</a>
</g>
</g>
<!-- /lht_tree_doc/comm/submenu&#45;&gt;/lht_tree_doc/comm/submenu/children/&#45; -->
<g id="edge2" class="edge">
<title>/lht_tree_doc/comm/submenu&#45;&gt;/lht_tree_doc/comm/submenu/children/&#45;</title>
<path fill="none" stroke="#000000" d="M195.8801,-186.1741C180.4101,-173.2368 161.2566,-157.2192 145.498,-144.0406"/>
<polygon fill="#000000" stroke="#000000" points="147.5207,-141.1695 137.6043,-137.4392 143.03,-146.5393 147.5207,-141.1695"/>
</g>
<!-- /lht_tree_doc/comm/submenu/children/@ANCHOR -->
<g id="node4" class="node">
<title>/lht_tree_doc/comm/submenu/children/@ANCHOR</title>
<g id="a_node4"><a xlink:href="tree.html#/lht_tree_doc/comm/submenu/children/@ANCHOR" xlink:title="an anchor is an invisible placeholder where a dynamically generated set of menu items should be inserted runtime">
<ellipse fill="none" stroke="#000000" cx="224.234" cy="-118.7315" rx="60.623" ry="26.7407"/>
<text text-anchor="middle" x="224.234" y="-122.5315" font-family="Times,serif" font-size="14.00" fill="#000000">@ANCHOR</text>
<text text-anchor="middle" x="224.234" y="-107.5315" font-family="Times,serif" font-size="14.00" fill="#000000">none</text>
</a>
</g>
</g>
<!-- /lht_tree_doc/comm/submenu&#45;&gt;/lht_tree_doc/comm/submenu/children/@ANCHOR -->
<g id="edge3" class="edge">
<title>/lht_tree_doc/comm/submenu&#45;&gt;/lht_tree_doc/comm/submenu/children/@ANCHOR</title>
<path fill="none" stroke="#000000" d="M224.234,-182.0412C224.234,-173.7623 224.234,-164.5585 224.234,-155.7908"/>
<polygon fill="#000000" stroke="#000000" points="227.7341,-155.7801 224.234,-145.7801 220.7341,-155.7801 227.7341,-155.7801"/>
</g>
<!-- /lht_tree_doc/comm/submenu/children/SUBSUBMENUNAME -->
<g id="node5" class="node">
<title>/lht_tree_doc/comm/submenu/children/SUBSUBMENUNAME</title>
<g id="a_node5"><a xlink:href="tree.html#/lht_tree_doc/comm/submenu/children/SUBSUBMENUNAME" xlink:title="sub&#45;submenu item: opens a new level of submenu when clicked">
<ellipse fill="none" stroke="#000000" cx="421.234" cy="-118.7315" rx="118.1737" ry="27.6545"/>
<text text-anchor="middle" x="421.234" y="-123.0315" font-family="Times,serif" font-size="14.00" fill="#000000">ha:SUBSUBMENUNAME</text>
</a>
</g>
</g>
<!-- /lht_tree_doc/comm/submenu&#45;&gt;/lht_tree_doc/comm/submenu/children/SUBSUBMENUNAME -->
<g id="edge4" class="edge">
<title>/lht_tree_doc/comm/submenu&#45;&gt;/lht_tree_doc/comm/submenu/children/SUBSUBMENUNAME</title>
<path fill="none" stroke="#000000" d="M264.5753,-191.2194C291.6093,-178.7105 327.7493,-161.988 358.5051,-147.7569"/>
<polygon fill="#000000" stroke="#000000" points="360.2553,-150.8037 367.8611,-143.4278 357.3158,-144.4508 360.2553,-150.8037"/>
</g>
<!-- /lht_tree_doc/comm/submenu/children/LEAFSUBMENUNAME -->
<g id="node8" class="node">
<title>/lht_tree_doc/comm/submenu/children/LEAFSUBMENUNAME</title>
<g id="a_node8"><a xlink:href="tree.html#/lht_tree_doc/comm/submenu/children/LEAFSUBMENUNAME" xlink:title="leaf submenu item: executes an action when clicked">
<ellipse fill="none" stroke="#000000" cx="764.234" cy="-118.7315" rx="123.0732" ry="27.6545"/>
<text text-anchor="middle" x="764.234" y="-123.0315" font-family="Times,serif" font-size="14.00" fill="#000000">ha:LEAFSUBMENUNAME</text>
</a>
</g>
</g>
<!-- /lht_tree_doc/comm/submenu&#45;&gt;/lht_tree_doc/comm/submenu/children/LEAFSUBMENUNAME -->
<g id="edge7" class="edge">
<title>/lht_tree_doc/comm/submenu&#45;&gt;/lht_tree_doc/comm/submenu/children/LEAFSUBMENUNAME</title>
<path fill="none" stroke="#000000" d="M276.0115,-201.1456C363.0945,-186.4456 540.6378,-156.4755 655.922,-137.015"/>
<polygon fill="#000000" stroke="#000000" points="656.5617,-140.4566 665.8396,-135.3409 655.3965,-133.5543 656.5617,-140.4566"/>
</g>
<!-- dup57_/lht_tree_doc/comm/submenu/children/m -->
<g id="node6" class="node">
<title>dup57_/lht_tree_doc/comm/submenu/children/m</title>
<g id="a_node6"><a xlink:href="tree.html#/lht_tree_doc/comm/submenu/children/m" xlink:title="mnemonic: single character that should be underlined and used as a hot key in the menu name">
<ellipse fill="none" stroke="#000000" cx="328.234" cy="-27.5772" rx="33.4697" ry="26.7407"/>
<text text-anchor="middle" x="328.234" y="-31.3772" font-family="Times,serif" font-size="14.00" fill="#000000">m</text>
<text text-anchor="middle" x="328.234" y="-16.3772" font-family="Times,serif" font-size="14.00" fill="#000000">string</text>
</a>
</g>
</g>
<!-- /lht_tree_doc/comm/submenu/children/SUBSUBMENUNAME&#45;&gt;dup57_/lht_tree_doc/comm/submenu/children/m -->
<g id="edge5" class="edge">
<title>/lht_tree_doc/comm/submenu/children/SUBSUBMENUNAME&#45;&gt;dup57_/lht_tree_doc/comm/submenu/children/m</title>
<path fill="none" stroke="#000000" d="M393.834,-91.8752C382.2306,-80.5022 368.7069,-67.2468 356.9631,-55.7361"/>
<polygon fill="#000000" stroke="#000000" points="359.1325,-52.9615 349.5409,-48.4612 354.2326,-57.9607 359.1325,-52.9615"/>
</g>
<!-- dup58_/lht_tree_doc/comm/submenu/children/SUBSUBMENUNAME/children/submenu -->
<g id="node7" class="node">
<title>dup58_/lht_tree_doc/comm/submenu/children/SUBSUBMENUNAME/children/submenu</title>
<g id="a_node7"><a xlink:href="submenu.svg" xlink:title="submenu &#45;&gt;\n\n\n">
<text text-anchor="middle" x="421.234" y="-39.8772" font-family="Times,serif" font-size="14.00" fill="#000000">submenu &#45;&gt;</text>
</a>
</g>
</g>
<!-- /lht_tree_doc/comm/submenu/children/SUBSUBMENUNAME&#45;&gt;dup58_/lht_tree_doc/comm/submenu/children/SUBSUBMENUNAME/children/submenu -->
<g id="edge6" class="edge">
<title>/lht_tree_doc/comm/submenu/children/SUBSUBMENUNAME&#45;&gt;dup58_/lht_tree_doc/comm/submenu/children/SUBSUBMENUNAME/children/submenu</title>
<path fill="none" stroke="#000000" d="M421.234,-90.8869C421.234,-82.8468 421.234,-73.9345 421.234,-65.3964"/>
<polygon fill="#000000" stroke="#000000" points="424.7341,-65.2512 421.234,-55.2513 417.7341,-65.2513 424.7341,-65.2512"/>
</g>
<!-- dup59_/lht_tree_doc/comm/submenu/children/m -->
<g id="node9" class="node">
<title>dup59_/lht_tree_doc/comm/submenu/children/m</title>
<g id="a_node9"><a xlink:href="tree.html#/lht_tree_doc/comm/submenu/children/m" xlink:title="mnemonic: single character that should be underlined and used as a hot key in the menu name">
<ellipse fill="none" stroke="#000000" cx="514.234" cy="-27.5772" rx="33.4697" ry="26.7407"/>
<text text-anchor="middle" x="514.234" y="-31.3772" font-family="Times,serif" font-size="14.00" fill="#000000">m</text>
<text text-anchor="middle" x="514.234" y="-16.3772" font-family="Times,serif" font-size="14.00" fill="#000000">string</text>
</a>
</g>
</g>
<!-- /lht_tree_doc/comm/submenu/children/LEAFSUBMENUNAME&#45;&gt;dup59_/lht_tree_doc/comm/submenu/children/m -->
<g id="edge8" class="edge">
<title>/lht_tree_doc/comm/submenu/children/LEAFSUBMENUNAME&#45;&gt;dup59_/lht_tree_doc/comm/submenu/children/m</title>
<path fill="none" stroke="#000000" d="M679.4618,-98.6997C640.9111,-88.1157 595.2877,-73.4838 556.234,-55.1543 553.4801,-53.8618 550.6971,-52.4097 547.9439,-50.8653"/>
<polygon fill="#000000" stroke="#000000" points="549.7017,-47.8384 539.3246,-45.7016 546.1043,-53.8433 549.7017,-47.8384"/>
</g>
<!-- /lht_tree_doc/comm/submenu/children/LEAFSUBMENUNAME/children/a1 -->
<g id="node10" class="node">
<title>/lht_tree_doc/comm/submenu/children/LEAFSUBMENUNAME/children/a1</title>
<g id="a_node10"><a xlink:href="tree.html#/lht_tree_doc/comm/submenu/children/LEAFSUBMENUNAME/children/a1" xlink:title="list of alternative hotkey sequences to activate the menu">
<ellipse fill="none" stroke="#000000" cx="592.234" cy="-27.5772" rx="27" ry="27.6545"/>
<text text-anchor="middle" x="592.234" y="-31.8772" font-family="Times,serif" font-size="14.00" fill="#000000">li:a</text>
</a>
</g>
</g>
<!-- /lht_tree_doc/comm/submenu/children/LEAFSUBMENUNAME&#45;&gt;/lht_tree_doc/comm/submenu/children/LEAFSUBMENUNAME/children/a1 -->
<g id="edge9" class="edge">
<title>/lht_tree_doc/comm/submenu/children/LEAFSUBMENUNAME&#45;&gt;/lht_tree_doc/comm/submenu/children/LEAFSUBMENUNAME/children/a1</title>
<path fill="none" stroke="#000000" d="M705.2283,-94.4973C680.7809,-83.608 652.5205,-69.8942 628.234,-55.1543 626.055,-53.8319 623.8514,-52.4029 621.6643,-50.9154"/>
<polygon fill="#000000" stroke="#000000" points="623.5639,-47.9708 613.3969,-44.9903 619.4862,-53.6605 623.5639,-47.9708"/>
</g>
<!-- /lht_tree_doc/comm/submenu/children/LEAFSUBMENUNAME/children/a2 -->
<g id="node11" class="node">
<title>/lht_tree_doc/comm/submenu/children/LEAFSUBMENUNAME/children/a2</title>
<g id="a_node11"><a xlink:href="tree.html#/lht_tree_doc/comm/submenu/children/LEAFSUBMENUNAME/children/a2" xlink:title="a single hotkey sequences to activate the menu">
<ellipse fill="none" stroke="#000000" cx="670.234" cy="-27.5772" rx="33.4697" ry="26.7407"/>
<text text-anchor="middle" x="670.234" y="-31.3772" font-family="Times,serif" font-size="14.00" fill="#000000">a</text>
<text text-anchor="middle" x="670.234" y="-16.3772" font-family="Times,serif" font-size="14.00" fill="#000000">string</text>
</a>
</g>
</g>
<!-- /lht_tree_doc/comm/submenu/children/LEAFSUBMENUNAME&#45;&gt;/lht_tree_doc/comm/submenu/children/LEAFSUBMENUNAME/children/a2 -->
<g id="edge10" class="edge">
<title>/lht_tree_doc/comm/submenu/children/LEAFSUBMENUNAME&#45;&gt;/lht_tree_doc/comm/submenu/children/LEAFSUBMENUNAME/children/a2</title>
<path fill="none" stroke="#000000" d="M736.2854,-91.629C724.5654,-80.2638 710.9429,-67.0536 699.124,-55.5926"/>
<polygon fill="#000000" stroke="#000000" points="701.2714,-52.7996 691.6559,-48.3506 696.3983,-57.8248 701.2714,-52.7996"/>
</g>
<!-- /lht_tree_doc/comm/submenu/children/LEAFSUBMENUNAME/children/action1 -->
<g id="node12" class="node">
<title>/lht_tree_doc/comm/submenu/children/LEAFSUBMENUNAME/children/action1</title>
<g id="a_node12"><a xlink:href="tree.html#/lht_tree_doc/comm/submenu/children/LEAFSUBMENUNAME/children/action1" xlink:title="list of actions to execute when the menu is activated">
<ellipse fill="none" stroke="#000000" cx="764.234" cy="-27.5772" rx="43.2674" ry="27.6545"/>
<text text-anchor="middle" x="764.234" y="-31.8772" font-family="Times,serif" font-size="14.00" fill="#000000">li:action</text>
</a>
</g>
</g>
<!-- /lht_tree_doc/comm/submenu/children/LEAFSUBMENUNAME&#45;&gt;/lht_tree_doc/comm/submenu/children/LEAFSUBMENUNAME/children/action1 -->
<g id="edge11" class="edge">
<title>/lht_tree_doc/comm/submenu/children/LEAFSUBMENUNAME&#45;&gt;/lht_tree_doc/comm/submenu/children/LEAFSUBMENUNAME/children/action1</title>
<path fill="none" stroke="#000000" d="M764.234,-90.8869C764.234,-82.8468 764.234,-73.9345 764.234,-65.3964"/>
<polygon fill="#000000" stroke="#000000" points="767.7341,-65.2512 764.234,-55.2513 760.7341,-65.2513 767.7341,-65.2512"/>
</g>
<!-- /lht_tree_doc/comm/submenu/children/LEAFSUBMENUNAME/children/action2 -->
<g id="node13" class="node">
<title>/lht_tree_doc/comm/submenu/children/LEAFSUBMENUNAME/children/action2</title>
<g id="a_node13"><a xlink:href="tree.html#/lht_tree_doc/comm/submenu/children/LEAFSUBMENUNAME/children/action2" xlink:title="a single action to execute when the menu is activated">
<ellipse fill="none" stroke="#000000" cx="860.234" cy="-27.5772" rx="35.2113" ry="26.7407"/>
<text text-anchor="middle" x="860.234" y="-31.3772" font-family="Times,serif" font-size="14.00" fill="#000000">action</text>
<text text-anchor="middle" x="860.234" y="-16.3772" font-family="Times,serif" font-size="14.00" fill="#000000">string</text>
</a>
</g>
</g>
<!-- /lht_tree_doc/comm/submenu/children/LEAFSUBMENUNAME&#45;&gt;/lht_tree_doc/comm/submenu/children/LEAFSUBMENUNAME/children/action2 -->
<g id="edge12" class="edge">
<title>/lht_tree_doc/comm/submenu/children/LEAFSUBMENUNAME&#45;&gt;/lht_tree_doc/comm/submenu/children/LEAFSUBMENUNAME/children/action2</title>
<path fill="none" stroke="#000000" d="M792.518,-91.8752C804.518,-80.4808 818.508,-67.197 830.6464,-55.6714"/>
<polygon fill="#000000" stroke="#000000" points="833.0889,-58.1786 837.9306,-48.7548 828.2689,-53.1024 833.0889,-58.1786"/>
</g>
<!-- /lht_tree_doc/comm/submenu/children/LEAFSUBMENUNAME/children/tip -->
<g id="node14" class="node">
<title>/lht_tree_doc/comm/submenu/children/LEAFSUBMENUNAME/children/tip</title>
<g id="a_node14"><a xlink:href="tree.html#/lht_tree_doc/comm/submenu/children/LEAFSUBMENUNAME/children/tip" xlink:title="tooltip text">
<ellipse fill="none" stroke="#000000" cx="947.234" cy="-27.5772" rx="33.4697" ry="26.7407"/>
<text text-anchor="middle" x="947.234" y="-31.3772" font-family="Times,serif" font-size="14.00" fill="#000000">tip</text>
<text text-anchor="middle" x="947.234" y="-16.3772" font-family="Times,serif" font-size="14.00" fill="#000000">string</text>
</a>
</g>
</g>
<!-- /lht_tree_doc/comm/submenu/children/LEAFSUBMENUNAME&#45;&gt;/lht_tree_doc/comm/submenu/children/LEAFSUBMENUNAME/children/tip -->
<g id="edge13" class="edge">
<title>/lht_tree_doc/comm/submenu/children/LEAFSUBMENUNAME&#45;&gt;/lht_tree_doc/comm/submenu/children/LEAFSUBMENUNAME/children/tip</title>
<path fill="none" stroke="#000000" d="M822.704,-94.4264C848.1603,-83.273 878.0887,-69.3788 904.234,-55.1543 907.1164,-53.5861 910.0639,-51.8952 912.9974,-50.1497"/>
<polygon fill="#000000" stroke="#000000" points="914.9881,-53.0345 921.6769,-44.818 911.3241,-47.07 914.9881,-53.0345"/>
</g>
<!-- /lht_tree_doc/comm/submenu/children/LEAFSUBMENUNAME/children/checked -->
<g id="node15" class="node">
<title>/lht_tree_doc/comm/submenu/children/LEAFSUBMENUNAME/children/checked</title>
<g id="a_node15"><a xlink:href="tree.html#/lht_tree_doc/comm/submenu/children/LEAFSUBMENUNAME/children/checked" xlink:title="the menu item has a checkbox; value is the action to execute to determine whether the menu item&#39;s checkbox is checked or not">
<ellipse fill="none" stroke="#000000" cx="1041.234" cy="-27.5772" rx="43.2674" ry="26.7407"/>
<text text-anchor="middle" x="1041.234" y="-31.3772" font-family="Times,serif" font-size="14.00" fill="#000000">checked</text>
<text text-anchor="middle" x="1041.234" y="-16.3772" font-family="Times,serif" font-size="14.00" fill="#000000">string</text>
</a>
</g>
</g>
<!-- /lht_tree_doc/comm/submenu/children/LEAFSUBMENUNAME&#45;&gt;/lht_tree_doc/comm/submenu/children/LEAFSUBMENUNAME/children/checked -->
<g id="edge14" class="edge">
<title>/lht_tree_doc/comm/submenu/children/LEAFSUBMENUNAME&#45;&gt;/lht_tree_doc/comm/submenu/children/LEAFSUBMENUNAME/children/checked</title>
<path fill="none" stroke="#000000" d="M850.3298,-98.9787C892.8496,-88.078 944.4965,-73.101 989.234,-55.1543 992.8646,-53.6979 996.5722,-52.0604 1000.2526,-50.3285"/>
<polygon fill="#000000" stroke="#000000" points="1001.8616,-53.4375 1009.2855,-45.8786 998.7682,-47.1582 1001.8616,-53.4375"/>
</g>
<!-- /lht_tree_doc/comm/submenu/children/LEAFSUBMENUNAME/children/update_on -->
<g id="node16" class="node">
<title>/lht_tree_doc/comm/submenu/children/LEAFSUBMENUNAME/children/update_on</title>
<g id="a_node16"><a xlink:href="tree.html#/lht_tree_doc/comm/submenu/children/LEAFSUBMENUNAME/children/update_on" xlink:title="path of a conf node that triggers re&#45;evaluation of the checkbox state">
<ellipse fill="none" stroke="#000000" cx="1154.234" cy="-27.5772" rx="51.7379" ry="26.7407"/>
<text text-anchor="middle" x="1154.234" y="-31.3772" font-family="Times,serif" font-size="14.00" fill="#000000">update_on</text>
<text text-anchor="middle" x="1154.234" y="-16.3772" font-family="Times,serif" font-size="14.00" fill="#000000">string</text>
</a>
</g>
</g>
<!-- /lht_tree_doc/comm/submenu/children/LEAFSUBMENUNAME&#45;&gt;/lht_tree_doc/comm/submenu/children/LEAFSUBMENUNAME/children/update_on -->
<g id="edge15" class="edge">
<title>/lht_tree_doc/comm/submenu/children/LEAFSUBMENUNAME&#45;&gt;/lht_tree_doc/comm/submenu/children/LEAFSUBMENUNAME/children/update_on</title>
<path fill="none" stroke="#000000" d="M870.2586,-104.6881C935.5121,-94.4682 1020.3281,-78.3264 1093.234,-55.1543 1097.8376,-53.6912 1102.5542,-51.9762 1107.2258,-50.1298"/>
<polygon fill="#000000" stroke="#000000" points="1108.809,-53.2621 1116.7012,-46.1936 1106.1236,-46.7977 1108.809,-53.2621"/>
</g>
</g>
</svg>
