G04 start of page 5 for group 10 layer_idx 1 *
G04 Title: thermals vs. multiple layer polygons, bottom_copper *
G04 Creator: <version>
G04 CreationDate: <date>
G04 For: TEST *
G04 Format: Gerber/RS-274X *
G04 PCB-Dimensions: 50000 50000 *
G04 PCB-Coordinate-Origin: lower left *
%MOIN*%
%FSLAX25Y25*%
%LNBOTTOM*%
%ADD20C,0.0315*%
%ADD19C,0.0787*%
%ADD18C,0.0001*%
G54D18*G36*
X7500Y42500D02*X13914D01*
X13400Y41986D01*
X13519Y41793D01*
X13756Y41220D01*
X13901Y40618D01*
X13937Y40000D01*
X13901Y39382D01*
X13756Y38780D01*
X13519Y38207D01*
X13400Y38014D01*
X14855Y36560D01*
X15306Y37296D01*
X15664Y38160D01*
X15882Y39068D01*
X15937Y40000D01*
X15882Y40932D01*
X15664Y41840D01*
X15391Y42500D01*
X17500D01*
Y32500D01*
X7500D01*
Y34609D01*
X8160Y34336D01*
X9068Y34118D01*
X10000Y34045D01*
X10932Y34118D01*
X11840Y34336D01*
X12704Y34694D01*
X13440Y35145D01*
X11986Y36600D01*
X11793Y36481D01*
X11220Y36244D01*
X10618Y36099D01*
X10000Y36051D01*
X9382Y36099D01*
X8780Y36244D01*
X8207Y36481D01*
X8014Y36600D01*
X7500Y36086D01*
Y42500D01*
G37*
G36*
Y25000D02*X17500D01*
Y15000D01*
X7500D01*
Y25000D01*
G37*
G54D19*X10000Y40000D03*
X27500D03*
X10000Y22500D03*
X27500D03*
G54D20*M02*
