G04 start of page 2 for group 3 layer_idx 0 *
G04 Title: Polygons with holes, top copper *
G04 Creator: <version>
G04 CreationDate: <date>
G04 For:  *
G04 Format: Gerber/RS-274X *
G04 PCB-Dimensions: 50000 50000 *
G04 PCB-Coordinate-Origin: lower left *
%MOIN*%
%FSLAX25Y25*%
%LNTOP*%
%ADD11C,0.0001*%
G54D11*G36*
X6250Y47500D02*X12500D01*
X6250Y41250D01*
Y43750D01*
X7500Y45000D01*
X6250D01*
Y47500D01*
G37*
G36*
X2500D02*X6250D01*
Y45000D01*
X5000D01*
Y42500D01*
X6250Y43750D01*
Y41250D01*
X2500Y37500D01*
Y47500D01*
G37*
G36*
X10000Y42500D02*X15000Y47500D01*
Y35000D01*
X10000D01*
Y37500D01*
X12500D01*
Y40000D01*
X10000D01*
Y42500D01*
G37*
G36*
X2500Y35000D02*X10000Y42500D01*
Y40000D01*
X7500Y37500D01*
X10000D01*
Y35000D01*
X2500D01*
G37*
G36*
X30000Y47500D02*X42500Y35000D01*
X30000D01*
Y37500D01*
X32500D01*
Y42500D01*
X30000D01*
Y47500D01*
G37*
G36*
X17500Y35000D02*X30000Y47500D01*
Y42500D01*
X27500D01*
Y37500D01*
X30000D01*
Y35000D01*
X17500D01*
G37*
G36*
X16250Y31250D02*X30000Y30000D01*
X16250Y21750D01*
Y25000D01*
X17500D01*
Y27500D01*
X16250D01*
Y31250D01*
G37*
G36*
X10000Y31818D02*X16250Y31250D01*
Y27500D01*
X15000D01*
Y25000D01*
X16250D01*
Y21750D01*
X10000Y18000D01*
Y20000D01*
X12500Y22500D01*
Y25000D01*
X10000Y27500D01*
Y31818D01*
G37*
G36*
X2500Y32500D02*X10000Y31818D01*
Y27500D01*
X7500D01*
Y22500D01*
X10000Y20000D01*
Y18000D01*
X5000Y15000D01*
X2500Y32500D01*
G37*
M02*
