%!PS-Adobe-3.0 EPSF-3.0
%%BoundingBox: 0 0 37.000000 37.000000
%%Pages: 1
save countdictstack mark newpath /showpage {} def /setpagedevice {pop} def
%%EndProlog
%%Page: 1 1
%%BeginDocument: elem_pins.eps

72 72 scale
1 dup neg scale
1 dup scale
0.00000 -0.50000 translate
/nclip { -0.01000 -0.01000 moveto -0.01000 0.51000 lineto 0.51000 0.51000 lineto 0.51000 -0.01000 lineto -0.01000 -0.01000 lineto eoclip newpath } def
/t { moveto lineto stroke } bind def
/tc { moveto lineto strokepath nclip } bind def
/r { /y2 exch def /x2 exch def /y1 exch def /x1 exch def
     x1 y1 moveto x1 y2 lineto x2 y2 lineto x2 y1 lineto closepath fill } bind def
/c { 0 360 arc fill } bind def
/cc { 0 360 arc nclip } bind def
/a { gsave setlinewidth translate scale 0 0 1 5 3 roll arc stroke grestore} bind def
% Layer bottomsilk group 12 drill 0 mask 0
% Layer bottom group 10 drill 0 mask 0
0.00000 setlinewidth
1 setlinecap
0.8 0.8 0.8 setrgbcolor
0.03500 0.08500 moveto
0.11500 0.08500 lineto
0.11500 0.16500 lineto
0.03500 0.16500 lineto
fill
0.37500 0.12500 0.04000 c
0.15500 0.30843 moveto
0.10814 0.28500 lineto
0.05843 0.28500 lineto
0.03500 0.30843 lineto
0.03500 0.34157 lineto
0.05843 0.36500 lineto
0.10814 0.36500 lineto
0.15500 0.34157 lineto
fill
0.45500 0.29186 moveto
0.40814 0.24500 lineto
0.34186 0.24500 lineto
0.29500 0.29186 lineto
0.29500 0.34157 lineto
0.34186 0.36500 lineto
0.40814 0.36500 lineto
0.45500 0.34157 lineto
fill
0.00000 setlinewidth
1 1 1 setrgbcolor
0.07500 0.12500 0.01968 c
0.37500 0.12500 0.01968 c
0.07500 0.32500 0.01968 c
0.37500 0.32500 0.01968 c
% Layer group5 group 5 drill 0 mask 0
0.00000 setlinewidth
0.8 0.8 0.8 setrgbcolor
0.03500 0.08500 moveto
0.11500 0.08500 lineto
0.11500 0.16500 lineto
0.03500 0.16500 lineto
fill
0.37500 0.12500 0.04000 c
0.15500 0.30843 moveto
0.10814 0.28500 lineto
0.05843 0.28500 lineto
0.03500 0.30843 lineto
0.03500 0.34157 lineto
0.05843 0.36500 lineto
0.10814 0.36500 lineto
0.15500 0.34157 lineto
fill
0.45500 0.29186 moveto
0.40814 0.24500 lineto
0.34186 0.24500 lineto
0.29500 0.29186 lineto
0.29500 0.34157 lineto
0.34186 0.36500 lineto
0.40814 0.36500 lineto
0.45500 0.34157 lineto
fill
0.00000 setlinewidth
1 1 1 setrgbcolor
0.07500 0.12500 0.01968 c
0.37500 0.12500 0.01968 c
0.07500 0.32500 0.01968 c
0.37500 0.32500 0.01968 c
% Layer group7 group 7 drill 0 mask 0
0.00000 setlinewidth
0.8 0.8 0.8 setrgbcolor
0.03500 0.08500 moveto
0.11500 0.08500 lineto
0.11500 0.16500 lineto
0.03500 0.16500 lineto
fill
0.37500 0.12500 0.04000 c
0.15500 0.30843 moveto
0.10814 0.28500 lineto
0.05843 0.28500 lineto
0.03500 0.30843 lineto
0.03500 0.34157 lineto
0.05843 0.36500 lineto
0.10814 0.36500 lineto
0.15500 0.34157 lineto
fill
0.45500 0.29186 moveto
0.40814 0.24500 lineto
0.34186 0.24500 lineto
0.29500 0.29186 lineto
0.29500 0.34157 lineto
0.34186 0.36500 lineto
0.40814 0.36500 lineto
0.45500 0.34157 lineto
fill
0.00000 setlinewidth
1 1 1 setrgbcolor
0.07500 0.12500 0.01968 c
0.37500 0.12500 0.01968 c
0.07500 0.32500 0.01968 c
0.37500 0.32500 0.01968 c
% Layer top group 3 drill 0 mask 0
0.00000 setlinewidth
0.301961 0.301961 0.301961 setrgbcolor
0.03500 0.08500 moveto
0.11500 0.08500 lineto
0.11500 0.16500 lineto
0.03500 0.16500 lineto
fill
0.37500 0.12500 0.04000 c
0.15500 0.30843 moveto
0.10814 0.28500 lineto
0.05843 0.28500 lineto
0.03500 0.30843 lineto
0.03500 0.34157 lineto
0.05843 0.36500 lineto
0.10814 0.36500 lineto
0.15500 0.34157 lineto
fill
0.45500 0.29186 moveto
0.40814 0.24500 lineto
0.34186 0.24500 lineto
0.29500 0.29186 lineto
0.29500 0.34157 lineto
0.34186 0.36500 lineto
0.40814 0.36500 lineto
0.45500 0.34157 lineto
fill
0.00000 setlinewidth
1 1 1 setrgbcolor
0.07500 0.12500 0.01968 c
0.37500 0.12500 0.01968 c
0.07500 0.32500 0.01968 c
0.37500 0.32500 0.01968 c
% Layer topsilk group 1 drill 0 mask 0
0.01000 setlinewidth
0 0 0 setrgbcolor
0.02500 0.07500 0.02500 0.17500 t
0.42500 0.17500 0.02500 0.17500 t
0.02500 0.07500 0.17500 0.07500 t
0.02500 0.27500 0.02500 0.37500 t
0.27500 0.27500 0.42500 0.27500 t
0.42500 0.37500 0.02500 0.37500 t
0.42500 0.37500 0.42500 0.27500 t
0.02500 0.27500 0.17500 0.27500 t
0.42500 0.17500 0.42500 0.07500 t
0.27500 0.07500 0.42500 0.07500 t
0 180 -0.05000 0.05000 0.22500 0.07500 0.200000 a
0 180 -0.05000 0.05000 0.22500 0.27500 0.200000 a
0.00700 setlinewidth
0.07500 0.02500 0.07500 0.06000 t
0.07500 0.06000 0.08000 0.06500 t
0.08000 0.06500 0.09000 0.06500 t
0.09000 0.06500 0.09500 0.06000 t
0.09500 0.02500 0.09500 0.06000 t
0.10700 0.03300 0.11500 0.02500 t
0.11500 0.02500 0.11500 0.06500 t
0.10700 0.06500 0.12200 0.06500 t
0.07500 0.22500 0.07500 0.26000 t
0.07500 0.26000 0.08000 0.26500 t
0.08000 0.26500 0.09000 0.26500 t
0.09000 0.26500 0.09500 0.26000 t
0.09500 0.22500 0.09500 0.26000 t
0.10700 0.23000 0.11200 0.22500 t
0.11200 0.22500 0.12700 0.22500 t
0.12700 0.22500 0.13200 0.23000 t
0.13200 0.23000 0.13200 0.24000 t
0.10700 0.26500 0.13200 0.24000 t
0.10700 0.26500 0.13200 0.26500 t
% Layer plated-drill group -1 drill 1 mask 0
0.00000 setlinewidth
1 1 1 setrgbcolor
0.07500 0.12500 0.01968 c
0.37500 0.12500 0.01968 c
0.07500 0.32500 0.01968 c
0.37500 0.32500 0.01968 c
showpage
%%EndDocument
%%Trailer
cleartomark countdictstack exch sub { end } repeat restore
%%EOF
