G04 start of page 3 for group 5 layer_idx 4 *
G04 Title: one line per each type of copper layer, Intern *
G04 Creator: <version>
G04 CreationDate: <date>
G04 For: TEST *
G04 Format: Gerber/RS-274X *
G04 PCB-Dimensions: 50000 50000 *
G04 PCB-Coordinate-Origin: lower left *
%MOIN*%
%FSLAX25Y25*%
%LNGROUP5*%
%ADD12C,0.0100*%
G54D12*X10000Y35000D02*X32500Y12500D01*
M02*
