G04 start of page 3 for group 1 layer_idx 8 *
G04 Title: text on both sides, top_silk *
G04 Creator: <version>
G04 CreationDate: <date>
G04 For: TEST *
G04 Format: Gerber/RS-274X *
G04 PCB-Dimensions: 50000 50000 *
G04 PCB-Coordinate-Origin: lower left *
%MOIN*%
%FSLAX25Y25*%
%LNTOPSILK*%
%ADD12C,0.0070*%
G54D12*X22500Y31500D02*Y28500D01*
Y31500D02*X23200Y32500D01*
X24300D01*
X25000Y31500D01*
Y28500D01*
X22500Y30500D02*X25000D01*
X26200Y31700D02*X27000Y32500D01*
Y28500D01*
X26200D02*X27700D01*
M02*
