G04 start of page 2 for group 3 layer_idx 0 *
G04 Title: Normal rectangular polygons, top_copper *
G04 Creator: <version>
G04 CreationDate: <date>
G04 For: TEST *
G04 Format: Gerber/RS-274X *
G04 PCB-Dimensions: 50000 50000 *
G04 PCB-Coordinate-Origin: lower left *
%MOIN*%
%FSLAX25Y25*%
%LNTOP*%
%ADD11C,0.0001*%
G54D11*G36*
X5000Y47500D02*X7500D01*
Y5000D01*
X5000D01*
Y47500D01*
G37*
G36*
X12500D02*X47500D01*
Y45000D01*
X12500D01*
Y47500D01*
G37*
G36*
X42500Y7500D02*X45000D01*
Y5000D01*
X42500D01*
Y7500D01*
G37*
G36*
X12500Y42500D02*X40000D01*
Y5000D01*
X12500D01*
Y42500D01*
G37*
M02*
