G04 start of page 7 for group 12 layer_idx 7 *
G04 Title: smd elements on both sides, bottom silk *
G04 Creator: <version>
G04 CreationDate: <date>
G04 For:  *
G04 Format: Gerber/RS-274X *
G04 PCB-Dimensions: 50000 50000 *
G04 PCB-Coordinate-Origin: lower left *
%MOIN*%
%FSLAX25Y25*%
%LNBOTTOMSILK*%
%ADD18C,0.0070*%
%ADD17C,0.0080*%
G54D17*X20138Y11260D02*X24862D01*
X20138Y18740D02*X24862D01*
G54D18*X34350Y11850D02*X36350D01*
X36850Y12350D01*
Y13350D01*
X36350Y13850D02*X36850Y13350D01*
X34850Y13850D02*X36350D01*
X34850Y11850D02*Y15850D01*
X35650Y13850D02*X36850Y15850D01*
X38050Y12350D02*X38550Y11850D01*
X40050D01*
X40550Y12350D01*
Y13350D01*
X38050Y15850D02*X40550Y13350D01*
X38050Y15850D02*X40550D01*
M02*
