G04 start of page 2 for group 3 layer_idx 0 *
G04 Title: smd elements on both sides, top copper *
G04 Creator: <version>
G04 CreationDate: <date>
G04 For: TEST *
G04 Format: Gerber/RS-274X *
G04 PCB-Dimensions: 50000 50000 *
G04 PCB-Coordinate-Origin: lower left *
%MOIN*%
%FSLAX25Y25*%
%LNTOP*%
%ADD11R,0.0512X0.0512*%
G54D11*X16595Y38681D02*Y36319D01*
X28405Y38681D02*Y36319D01*
M02*
