G04 start of page 5 for group 11 layer_idx 10 *
G04 Title: element with pads on both sides, bottom_mask *
G04 Creator: <version>
G04 CreationDate: <date>
G04 For: TEST *
G04 Format: Gerber/RS-274X *
G04 PCB-Dimensions: 50000 50000 *
G04 PCB-Coordinate-Origin: lower left *
%MOIN*%
%FSLAX25Y25*%
%LNBOTTOMMASK*%
%ADD14C,0.0500*%
G54D14*X27500Y32500D02*Y25000D01*
M02*
