G04 start of page 5 for group 10 layer_idx 1 *
G04 Title: (unknown), bottom_copper *
G04 Creator: <version>
G04 CreationDate: <date>
G04 For: TEST *
G04 Format: Gerber/RS-274X *
G04 PCB-Dimensions: 50000 50000 *
G04 PCB-Coordinate-Origin: lower left *
%MOIN*%
%FSLAX25Y25*%
%LNBOTTOM*%
%ADD20C,0.0394*%
%ADD19C,0.0866*%
%ADD18C,0.0200*%
G54D18*X2500Y37500D02*X47500D01*
G54D19*X25000Y42500D03*
G54D20*M02*
