G04 start of page 2 for group 3 layer_idx 0 *
G04 Title: Full overlap: the same line twice, top_copper *
G04 Creator: <version>
G04 CreationDate: <date>
G04 For: TEST *
G04 Format: Gerber/RS-274X *
G04 PCB-Dimensions: 50000 50000 *
G04 PCB-Coordinate-Origin: lower left *
%MOIN*%
%FSLAX25Y25*%
%LNTOP*%
%ADD11C,0.0150*%
G54D11*X20000Y30000D02*X35000D01*
X20000D02*X35000D01*
M02*
