G04 start of page 4 for group 10 layer_idx 1 *
G04 Title: smd elements on both sides, bottom_copper *
G04 Creator: <version>
G04 CreationDate: <date>
G04 For: TEST *
G04 Format: Gerber/RS-274X *
G04 PCB-Dimensions: 50000 50000 *
G04 PCB-Coordinate-Origin: lower left *
%MOIN*%
%FSLAX25Y25*%
%LNBOTTOM*%
%ADD14C,0.0001*%
G54D14*G36*
X14036Y11260D02*X19154D01*
Y18740D01*
X14036D01*
Y11260D01*
G37*
G36*
X25846D02*X30964D01*
Y18740D01*
X25846D01*
Y11260D01*
G37*
M02*
