G04 start of page 8 for group -1 layer_idx 268435462 *
G04 Title: (unknown), <virtual group> *
G04 Creator: <version>
G04 CreationDate: <date>
G04 For: TEST *
G04 Format: Gerber/RS-274X *
G04 PCB-Dimensions: 65000 62500 *
G04 PCB-Coordinate-Origin: lower left *
%MOIN*%
%FSLAX25Y25*%
%LNGLOBAL_VIRTUAL_PDRILL_NONE*%
%ADD23C,0.0315*%
G54D23*X10000Y52500D03*
X25000D03*
X10000Y40000D03*
X25000D03*
M02*
