G04 start of page 6 for group 1 layer_idx 8 *
G04 Title: element with pads on both sides, top_silk *
G04 Creator: <version>
G04 CreationDate: <date>
G04 For: TEST *
G04 Format: Gerber/RS-274X *
G04 PCB-Dimensions: 50000 50000 *
G04 PCB-Coordinate-Origin: lower left *
%MOIN*%
%FSLAX25Y25*%
%LNTOPSILK*%
%ADD16C,0.0070*%
%ADD15C,0.0100*%
G54D15*X17500Y35000D02*Y25000D01*
G54D16*Y40700D02*X19000D01*
X17500Y38500D02*X19500D01*
X17500Y42500D02*Y38500D01*
Y42500D02*X19500D01*
X20700Y41700D02*X21500Y42500D01*
Y38500D01*
X20700D02*X22200D01*
M02*
