%!PS-Adobe-3.0 EPSF-3.0
%%BoundingBox: 0 0 37.000000 37.000000
%%Pages: 1
save countdictstack mark newpath /showpage {} def /setpagedevice {pop} def
%%EndProlog
%%Page: 1 1
%%BeginDocument: padrot.eps

72 72 scale
1 dup neg scale
1 dup scale
0.00000 -0.50000 translate
/nclip { -0.01000 -0.01000 moveto -0.01000 0.51000 lineto 0.51000 0.51000 lineto 0.51000 -0.01000 lineto -0.01000 -0.01000 lineto eoclip newpath } def
/t { moveto lineto stroke } bind def
/tc { moveto lineto strokepath nclip } bind def
/r { /y2 exch def /x2 exch def /y1 exch def /x1 exch def
     x1 y1 moveto x1 y2 lineto x2 y2 lineto x2 y1 lineto closepath fill } bind def
/c { 0 360 arc fill } bind def
/cc { 0 360 arc nclip } bind def
/a { gsave setlinewidth translate scale 0 0 1 5 3 roll arc stroke grestore} bind def
% Layer bottomsilk group 12 drill 0 mask 0
% Layer bottom group 10 drill 0 mask 0
% Layer group5 group 5 drill 0 mask 0
% Layer group7 group 7 drill 0 mask 0
% Layer top group 3 drill 0 mask 0
0.01000 setlinewidth
1 setlinecap
0.301961 0.301961 0.301961 setrgbcolor
0.05000 0.05000 0.12500 0.05000 t
0.05000 0.12500 0.05000 0.20000 t
0.19500 0.04500 moveto
0.19500 0.05500 lineto
0.28000 0.05500 lineto
0.28000 0.04500 lineto
fill
0.05500 0.27000 moveto
0.04500 0.27000 lineto
0.04500 0.35500 lineto
0.05500 0.35500 lineto
fill
0.12500 0.15000 0.17803 0.20303 t
0.22500 0.14293 moveto
0.21793 0.15000 lineto
0.27803 0.21010 lineto
0.28510 0.20303 lineto
fill
0.12500 0.30000 0.19443 0.32836 t
0.27226 0.29348 moveto
0.26848 0.30274 lineto
0.34717 0.33488 lineto
0.35095 0.32562 lineto
fill
% Layer topsilk group 1 drill 0 mask 0
0.00500 setlinewidth
0 0 0 setrgbcolor
0.02500 0.07500 0.15000 0.07500 t
0.15000 0.07500 0.15000 0.02500 t
0.15000 0.02500 0.02500 0.02500 t
0.02500 0.07500 0.02500 0.02500 t
0.02500 0.10000 0.07500 0.10000 t
0.07500 0.10000 0.07500 0.22500 t
0.02500 0.10000 0.02500 0.22500 t
0.02500 0.22500 0.07500 0.22500 t
0.02500 0.25000 0.02500 0.37500 t
0.02500 0.37500 0.07500 0.37500 t
0.07500 0.25000 0.07500 0.37500 t
0.02500 0.25000 0.07500 0.25000 t
0.17500 0.07500 0.30000 0.07500 t
0.30000 0.02500 0.30000 0.07500 t
0.17500 0.02500 0.30000 0.02500 t
0.17500 0.02500 0.17500 0.07500 t
0.08964 0.15000 0.12500 0.11464 t
0.08964 0.15000 0.17803 0.23839 t
0.12500 0.11464 0.21339 0.20303 t
0.17803 0.23839 0.21339 0.20303 t
0.18964 0.15000 0.27803 0.23839 t
0.27803 0.23839 0.31339 0.20303 t
0.22500 0.11464 0.31339 0.20303 t
0.18964 0.15000 0.22500 0.11464 t
0.09240 0.31369 0.20812 0.36096 t
0.20812 0.36096 0.22703 0.31467 t
0.24240 0.31369 0.35812 0.36096 t
0.35812 0.36096 0.37703 0.31467 t
0.11131 0.26740 0.22703 0.31467 t
0.26131 0.26740 0.37703 0.31467 t
0.24240 0.31369 0.26131 0.26740 t
0.09240 0.31369 0.11131 0.26740 t
0.00700 setlinewidth
0.01500 0.01500 0.02600 0.01500 t
0.02600 0.01500 0.02875 0.01775 t
0.02875 0.01775 0.02875 0.02325 t
0.02600 0.02600 0.02875 0.02325 t
0.01775 0.02600 0.02600 0.02600 t
0.01775 0.01500 0.01775 0.03700 t
0.02215 0.02600 0.02875 0.03700 t
0.03535 0.01940 0.03975 0.01500 t
0.03975 0.01500 0.03975 0.03700 t
0.03535 0.03700 0.04360 0.03700 t
0.31250 0.02500 0.33250 0.02500 t
0.33250 0.02500 0.33750 0.03000 t
0.33750 0.03000 0.33750 0.04000 t
0.33250 0.04500 0.33750 0.04000 t
0.31750 0.04500 0.33250 0.04500 t
0.31750 0.02500 0.31750 0.06500 t
0.32550 0.04500 0.33750 0.06500 t
0.34950 0.03000 0.35450 0.02500 t
0.35450 0.02500 0.36950 0.02500 t
0.36950 0.02500 0.37450 0.03000 t
0.37450 0.03000 0.37450 0.04000 t
0.34950 0.06500 0.37450 0.04000 t
0.34950 0.06500 0.37450 0.06500 t
0.14000 0.14500 0.14000 0.13300 t
0.14000 0.13300 0.14300 0.13000 t
0.14300 0.13000 0.14900 0.13000 t
0.15200 0.13300 0.14900 0.13000 t
0.15200 0.14200 0.15200 0.13300 t
0.14000 0.14200 0.16400 0.14200 t
0.15200 0.13720 0.16400 0.13000 t
0.15500 0.12280 0.14000 0.11080 t
0.15500 0.12280 0.15500 0.10780 t
0.14000 0.11080 0.16400 0.11080 t
0.35500 0.13500 0.35500 0.15500 t
0.35500 0.15500 0.35000 0.16000 t
0.35000 0.16000 0.34000 0.16000 t
0.33500 0.15500 0.34000 0.16000 t
0.33500 0.14000 0.33500 0.15500 t
0.35500 0.14000 0.31500 0.14000 t
0.33500 0.14800 0.31500 0.16000 t
0.35500 0.17200 0.35500 0.19200 t
0.35500 0.17200 0.33500 0.17200 t
0.33500 0.17200 0.34000 0.17700 t
0.34000 0.17700 0.34000 0.18700 t
0.34000 0.18700 0.33500 0.19200 t
0.33500 0.19200 0.32000 0.19200 t
0.31500 0.18700 0.32000 0.19200 t
0.31500 0.17700 0.31500 0.18700 t
0.32000 0.17200 0.31500 0.17700 t
0.08000 0.23250 0.08000 0.21950 t
0.08000 0.21950 0.08325 0.21625 t
0.08325 0.21625 0.08975 0.21625 t
0.09300 0.21950 0.08975 0.21625 t
0.09300 0.22925 0.09300 0.21950 t
0.08000 0.22925 0.10600 0.22925 t
0.09300 0.22405 0.10600 0.21625 t
0.08325 0.20845 0.08000 0.20520 t
0.08000 0.20520 0.08000 0.19870 t
0.08000 0.19870 0.08325 0.19545 t
0.10600 0.19870 0.10275 0.19545 t
0.10600 0.20520 0.10600 0.19870 t
0.10275 0.20845 0.10600 0.20520 t
0.09170 0.20520 0.09170 0.19870 t
0.08325 0.19545 0.08845 0.19545 t
0.09495 0.19545 0.10275 0.19545 t
0.09495 0.19545 0.09170 0.19870 t
0.08845 0.19545 0.09170 0.19870 t
0.07000 0.39000 0.07000 0.41000 t
0.07000 0.41000 0.06500 0.41500 t
0.06500 0.41500 0.05500 0.41500 t
0.05000 0.41000 0.05500 0.41500 t
0.05000 0.39500 0.05000 0.41000 t
0.07000 0.39500 0.03000 0.39500 t
0.05000 0.40300 0.03000 0.41500 t
0.07000 0.44200 0.06500 0.44700 t
0.07000 0.43200 0.07000 0.44200 t
0.06500 0.42700 0.07000 0.43200 t
0.06500 0.42700 0.03500 0.42700 t
0.03500 0.42700 0.03000 0.43200 t
0.05200 0.44200 0.04700 0.44700 t
0.05200 0.42700 0.05200 0.44200 t
0.03000 0.43200 0.03000 0.44200 t
0.03000 0.44200 0.03500 0.44700 t
0.04700 0.44700 0.03500 0.44700 t
0.19500 0.36500 0.19500 0.38500 t
0.19500 0.38500 0.19000 0.39000 t
0.19000 0.39000 0.18000 0.39000 t
0.17500 0.38500 0.18000 0.39000 t
0.17500 0.37000 0.17500 0.38500 t
0.19500 0.37000 0.15500 0.37000 t
0.17500 0.37800 0.15500 0.39000 t
0.15500 0.40700 0.19500 0.42700 t
0.19500 0.40200 0.19500 0.42700 t
0.33500 0.37500 0.33500 0.39500 t
0.33500 0.39500 0.33000 0.40000 t
0.33000 0.40000 0.32000 0.40000 t
0.31500 0.39500 0.32000 0.40000 t
0.31500 0.38000 0.31500 0.39500 t
0.33500 0.38000 0.29500 0.38000 t
0.31500 0.38800 0.29500 0.40000 t
0.30000 0.41200 0.29500 0.41700 t
0.30800 0.41200 0.30000 0.41200 t
0.30800 0.41200 0.31500 0.41900 t
0.31500 0.41900 0.31500 0.42500 t
0.31500 0.42500 0.30800 0.43200 t
0.30800 0.43200 0.30000 0.43200 t
0.29500 0.42700 0.30000 0.43200 t
0.29500 0.41700 0.29500 0.42700 t
0.32200 0.41200 0.31500 0.41900 t
0.33000 0.41200 0.32200 0.41200 t
0.33000 0.41200 0.33500 0.41700 t
0.33500 0.41700 0.33500 0.42700 t
0.33500 0.42700 0.33000 0.43200 t
0.33000 0.43200 0.32200 0.43200 t
0.31500 0.42500 0.32200 0.43200 t
showpage
%%EndDocument
%%Trailer
cleartomark countdictstack exch sub { end } repeat restore
%%EOF
