G04 start of page 2 for group 0 layer_idx 0 *
G04 Title: thermals vs. multiple layer polygons, TODO:group_name *
G04 Creator: <version>
G04 CreationDate: <date>
G04 For:  *
G04 Format: Gerber/RS-274X *
G04 PCB-Dimensions: 50000 50000 *
G04 PCB-Coordinate-Origin: lower left *
%MOIN*%
%FSLAX25Y25*%
%LNTOP*%
%ADD13C,0.0315*%
%ADD12C,0.0787*%
%ADD11C,0.0001*%
G54D11*G36*
X25000Y42500D02*X31414D01*
X30900Y41986D01*
X31019Y41793D01*
X31256Y41220D01*
X31401Y40618D01*
X31437Y40000D01*
X31401Y39382D01*
X31256Y38780D01*
X31019Y38207D01*
X30900Y38014D01*
X32355Y36560D01*
X32806Y37296D01*
X33164Y38160D01*
X33382Y39068D01*
X33437Y40000D01*
X33382Y40932D01*
X33164Y41840D01*
X32891Y42500D01*
X35000D01*
Y32500D01*
X25000D01*
Y34609D01*
X25660Y34336D01*
X26568Y34118D01*
X27500Y34045D01*
X28432Y34118D01*
X29340Y34336D01*
X30204Y34694D01*
X30940Y35145D01*
X29486Y36600D01*
X29293Y36481D01*
X28720Y36244D01*
X28118Y36099D01*
X27500Y36051D01*
X26882Y36099D01*
X26280Y36244D01*
X25707Y36481D01*
X25514Y36600D01*
X25000Y36086D01*
Y42500D01*
G37*
G36*
Y25000D02*X35000D01*
Y15000D01*
X25000D01*
Y25000D01*
G37*
G36*
X2500Y47500D02*X12500D01*
Y45330D01*
X12475Y45355D01*
X12346Y45446D01*
X12204Y45513D01*
X11672Y45704D01*
X11123Y45837D01*
X10564Y45917D01*
X10000Y45944D01*
X9436Y45917D01*
X8877Y45837D01*
X8328Y45704D01*
X7794Y45519D01*
X7652Y45450D01*
X7523Y45358D01*
X7409Y45248D01*
X7315Y45121D01*
X7241Y44981D01*
X7191Y44832D01*
X7164Y44676D01*
X7162Y44518D01*
X7185Y44361D01*
X7232Y44210D01*
X7302Y44069D01*
X7393Y43939D01*
X7504Y43826D01*
X7630Y43732D01*
X7770Y43658D01*
X7920Y43608D01*
X8076Y43581D01*
X8234Y43579D01*
X8390Y43602D01*
X8540Y43652D01*
X8892Y43778D01*
X9256Y43866D01*
X9626Y43919D01*
X10000Y43937D01*
X10374Y43919D01*
X10744Y43866D01*
X11108Y43778D01*
X11461Y43656D01*
X11611Y43606D01*
X11766Y43583D01*
X11924Y43585D01*
X12079Y43612D01*
X12228Y43662D01*
X12367Y43736D01*
X12493Y43830D01*
X12500Y43836D01*
Y37500D01*
X6170D01*
X6174Y37504D01*
X6268Y37630D01*
X6342Y37770D01*
X6392Y37920D01*
X6419Y38076D01*
X6421Y38234D01*
X6398Y38390D01*
X6348Y38540D01*
X6222Y38892D01*
X6134Y39256D01*
X6081Y39626D01*
X6063Y40000D01*
X6081Y40374D01*
X6134Y40744D01*
X6222Y41108D01*
X6344Y41461D01*
X6394Y41611D01*
X6417Y41766D01*
X6415Y41924D01*
X6388Y42079D01*
X6338Y42228D01*
X6264Y42367D01*
X6170Y42493D01*
X6058Y42603D01*
X5929Y42694D01*
X5788Y42764D01*
X5638Y42811D01*
X5482Y42833D01*
X5325Y42832D01*
X5169Y42805D01*
X5020Y42754D01*
X4881Y42681D01*
X4755Y42587D01*
X4645Y42475D01*
X4554Y42346D01*
X4487Y42204D01*
X4296Y41672D01*
X4163Y41123D01*
X4083Y40564D01*
X4056Y40000D01*
X4083Y39436D01*
X4163Y38877D01*
X4296Y38328D01*
X4481Y37794D01*
X4550Y37652D01*
X4642Y37523D01*
X4664Y37500D01*
X2500D01*
Y47500D01*
G37*
G36*
X20000D02*X30000D01*
Y45330D01*
X29975Y45355D01*
X29846Y45446D01*
X29704Y45513D01*
X29172Y45704D01*
X28623Y45837D01*
X28064Y45917D01*
X27500Y45944D01*
X26936Y45917D01*
X26377Y45837D01*
X25828Y45704D01*
X25294Y45519D01*
X25152Y45450D01*
X25023Y45358D01*
X24909Y45248D01*
X24815Y45121D01*
X24741Y44981D01*
X24691Y44832D01*
X24664Y44676D01*
X24662Y44518D01*
X24685Y44361D01*
X24732Y44210D01*
X24802Y44069D01*
X24893Y43939D01*
X25004Y43826D01*
X25130Y43732D01*
X25270Y43658D01*
X25420Y43608D01*
X25576Y43581D01*
X25734Y43579D01*
X25890Y43602D01*
X26040Y43652D01*
X26392Y43778D01*
X26756Y43866D01*
X27126Y43919D01*
X27500Y43937D01*
X27874Y43919D01*
X28244Y43866D01*
X28608Y43778D01*
X28961Y43656D01*
X29111Y43606D01*
X29266Y43583D01*
X29424Y43585D01*
X29579Y43612D01*
X29728Y43662D01*
X29867Y43736D01*
X29993Y43830D01*
X30000Y43836D01*
Y37500D01*
X23670D01*
X23674Y37504D01*
X23768Y37630D01*
X23842Y37770D01*
X23892Y37920D01*
X23919Y38076D01*
X23921Y38234D01*
X23898Y38390D01*
X23848Y38540D01*
X23722Y38892D01*
X23634Y39256D01*
X23581Y39626D01*
X23563Y40000D01*
X23581Y40374D01*
X23634Y40744D01*
X23722Y41108D01*
X23844Y41461D01*
X23894Y41611D01*
X23917Y41766D01*
X23915Y41924D01*
X23888Y42079D01*
X23838Y42228D01*
X23764Y42367D01*
X23670Y42493D01*
X23558Y42603D01*
X23429Y42694D01*
X23288Y42764D01*
X23138Y42811D01*
X22982Y42833D01*
X22825Y42832D01*
X22669Y42805D01*
X22520Y42754D01*
X22381Y42681D01*
X22255Y42587D01*
X22145Y42475D01*
X22054Y42346D01*
X21987Y42204D01*
X21796Y41672D01*
X21663Y41123D01*
X21583Y40564D01*
X21556Y40000D01*
X21583Y39436D01*
X21663Y38877D01*
X21796Y38328D01*
X21981Y37794D01*
X22050Y37652D01*
X22142Y37523D01*
X22164Y37500D01*
X20000D01*
Y47500D01*
G37*
G36*
X2500Y30000D02*X12500D01*
Y27891D01*
X11840Y28164D01*
X10932Y28382D01*
X10000Y28455D01*
X9068Y28382D01*
X8160Y28164D01*
X7296Y27806D01*
X6500Y27318D01*
X5789Y26711D01*
X5182Y26000D01*
X4694Y25204D01*
X4336Y24340D01*
X4118Y23432D01*
X4045Y22500D01*
X4118Y21568D01*
X4336Y20660D01*
X4609Y20000D01*
X2500D01*
Y30000D01*
G37*
G36*
X20000D02*X30000D01*
Y27891D01*
X29340Y28164D01*
X28432Y28382D01*
X27500Y28455D01*
X26568Y28382D01*
X25660Y28164D01*
X24796Y27806D01*
X24000Y27318D01*
X23289Y26711D01*
X22682Y26000D01*
X22194Y25204D01*
X21836Y24340D01*
X21618Y23432D01*
X21545Y22500D01*
X21618Y21568D01*
X21836Y20660D01*
X22109Y20000D01*
X20000D01*
Y30000D01*
G37*
G54D12*X10000Y40000D03*
X27500D03*
X10000Y22500D03*
X27500D03*
G54D13*M02*
