*PADS2000*
*Z:\home\esh\Source\pcb-rnd\work\LT-Spice\eheinzleTransAmpv2.asc Wed Feb 08 22:02:21 2017*
*PART*
R1	2.7k
R2	100
R3	47k
R4	10k
R5	270
R6	1k
V1	
V2	9
C1	220000n
C2	0.22nF
C3	10000n
C4	4700000n
C5	100
Q1	2N2222.pcb-rnd-to92

*NET*
*SIGNAL* N005
R1.1 R2.1 C1.2
*SIGNAL* N004
R1.2 V1.1
*SIGNAL* 0
R2.2 R4.2 R5.2 V1.2 V2.2 C3.2 C4.2
*SIGNAL* N001
R3.1 R6.1 V2.1 C3.1
*SIGNAL* N002
R3.2 R4.1 C1.1 C2.1 Q1.2
*SIGNAL* N006
R5.1 C4.1 Q1.3
*SIGNAL* N003
R6.2 C2.2 C5.2 Q1.1
*SIGNAL* NC_01
C5.1
*END*
