G04 start of page 4 for group 5 layer_idx 4 *
G04 Title: thru-hole elements on both sides, Intern *
G04 Creator: <version>
G04 CreationDate: <date>
G04 For: TEST *
G04 Format: Gerber/RS-274X *
G04 PCB-Dimensions: 50000 50000 *
G04 PCB-Coordinate-Origin: lower left *
%MOIN*%
%FSLAX25Y25*%
%LNGROUP5*%
%ADD18C,0.0394*%
%ADD17C,0.0800*%
%ADD16C,0.0001*%
G54D16*G36*
X6000Y39000D02*X14000D01*
Y31000D01*
X6000D01*
Y39000D01*
G37*
G54D17*X40000Y35000D03*
G54D16*G36*
X6000Y11000D02*X14000D01*
Y19000D01*
X6000D01*
Y11000D01*
G37*
G54D17*X40000Y15000D03*
G54D18*M02*
