G04 start of page 2 for group 3 layer_idx 0 *
G04 Title: (unknown), top_copper *
G04 Creator: <version>
G04 CreationDate: <date>
G04 For: TEST *
G04 Format: Gerber/RS-274X *
G04 PCB-Dimensions: 50000 50000 *
G04 PCB-Coordinate-Origin: lower left *
%MOIN*%
%FSLAX25Y25*%
%LNTOP*%
%ADD13C,0.0394*%
%ADD12C,0.0866*%
%ADD11C,0.0200*%
G54D11*X2500Y35000D02*X47500D01*
G54D12*X25000Y42500D03*
G54D13*M02*
