<?xml version="1.0"?>
<svg xmlns="http://www.w3.org/2000/svg" xmlns:xlink="http://www.w3.org/1999/xlink" version="1.0" width="1625.6000" height="1625.6000" viewBox="-2.0000 -2.0000 17.7000 17.7000">
<g id="layer_9_outline">
<!--normal-->
 <rect x="0.0000" y="0.0000" width="12.7000" height="12.7000" stroke-width="0.2540" stroke="#00868b" stroke-linecap="round" fill="none"/>
</g>
<g id="layer_7_group7">
</g>
<g id="layer_5_group5">
</g>
<g id="layer_10_bottom">
</g>
<g id="layer_3_top">
<!--normal-->
 <line x1="3.1750" y1="6.3500" x2="10.1600" y2="6.3500" stroke-width="0.3810" stroke="#8b2323" stroke-linecap="round"/>
 <line x1="6.3500" y1="3.1750" x2="6.3500" y2="9.5250" stroke-width="0.2540" stroke="#8b2323" stroke-linecap="round"/>
 <line x1="6.3500" y1="6.3500" x2="10.1600" y2="5.0800" stroke-width="0.5080" stroke="#8b2323" stroke-linecap="round"/>
 <line x1="6.3500" y1="6.3500" x2="3.8100" y2="3.8100" stroke-width="0.1270" stroke="#8b2323" stroke-linecap="round"/>
</g>
<g id="layer_1_topsilk">
</g>
</svg>
