%!PS-Adobe-3.0 EPSF-3.0
%%BoundingBox: 0 0 37.000000 37.000000
%%Pages: 1
save countdictstack mark newpath /showpage {} def /setpagedevice {pop} def
%%EndProlog
%%Page: 1 1
%%BeginDocument: text_rot.eps

72 72 scale
1 dup neg scale
1 dup scale
0.00000 -0.50000 translate
/nclip { -0.01000 -0.01000 moveto -0.01000 0.51000 lineto 0.51000 0.51000 lineto 0.51000 -0.01000 lineto -0.01000 -0.01000 lineto eoclip newpath } def
/t { moveto lineto stroke } bind def
/tc { moveto lineto strokepath nclip } bind def
/r { /y2 exch def /x2 exch def /y1 exch def /x1 exch def
     x1 y1 moveto x1 y2 lineto x2 y2 lineto x2 y1 lineto closepath fill } bind def
/c { 0 360 arc fill } bind def
/cc { 0 360 arc nclip } bind def
/a { gsave setlinewidth translate scale 0 0 1 5 3 roll arc stroke grestore} bind def
% Layer bottom group 10 drill 0 mask 0
% Layer group5 group 5 drill 0 mask 0
% Layer group7 group 7 drill 0 mask 0
% Layer top group 3 drill 0 mask 0
% Layer topsilk group 1 drill 0 mask 0
0.00700 setlinewidth
1 setlinecap
0 0 0 setrgbcolor
0.22500 0.16000 0.22500 0.19000 t
0.22500 0.16000 0.23200 0.15000 t
0.23200 0.15000 0.24300 0.15000 t
0.24300 0.15000 0.25000 0.16000 t
0.25000 0.16000 0.25000 0.19000 t
0.22500 0.17000 0.25000 0.17000 t
0.26200 0.15800 0.27000 0.15000 t
0.27000 0.15000 0.27000 0.19000 t
0.26200 0.19000 0.27700 0.19000 t
0.16000 0.27500 0.19000 0.27500 t
0.16000 0.27500 0.15000 0.26800 t
0.15000 0.25700 0.15000 0.26800 t
0.15000 0.25700 0.16000 0.25000 t
0.16000 0.25000 0.19000 0.25000 t
0.17000 0.25000 0.17000 0.27500 t
0.15500 0.23800 0.15000 0.23300 t
0.15000 0.21800 0.15000 0.23300 t
0.15000 0.21800 0.15500 0.21300 t
0.15500 0.21300 0.16500 0.21300 t
0.19000 0.23800 0.16500 0.21300 t
0.19000 0.21300 0.19000 0.23800 t
0.27500 0.31000 0.27500 0.34000 t
0.27500 0.34000 0.26800 0.35000 t
0.25700 0.35000 0.26800 0.35000 t
0.25700 0.35000 0.25000 0.34000 t
0.25000 0.31000 0.25000 0.34000 t
0.25000 0.33000 0.27500 0.33000 t
0.23800 0.34500 0.23300 0.35000 t
0.22300 0.35000 0.23300 0.35000 t
0.22300 0.35000 0.21800 0.34500 t
0.22300 0.31000 0.21800 0.31500 t
0.22300 0.31000 0.23300 0.31000 t
0.23800 0.31500 0.23300 0.31000 t
0.22300 0.33200 0.23300 0.33200 t
0.21800 0.33700 0.21800 0.34500 t
0.21800 0.31500 0.21800 0.32700 t
0.21800 0.32700 0.22300 0.33200 t
0.21800 0.33700 0.22300 0.33200 t
0.31000 0.22500 0.34000 0.22500 t
0.34000 0.22500 0.35000 0.23200 t
0.35000 0.23200 0.35000 0.24300 t
0.35000 0.24300 0.34000 0.25000 t
0.31000 0.25000 0.34000 0.25000 t
0.33000 0.22500 0.33000 0.25000 t
0.32500 0.26200 0.35000 0.28200 t
0.32500 0.26200 0.32500 0.28700 t
0.31000 0.28200 0.35000 0.28200 t
% Layer bottomsilk group 12 drill 0 mask 0
showpage
%%EndDocument
%%Trailer
cleartomark countdictstack exch sub { end } repeat restore
%%EOF
