<?xml version="1.0"?>
<svg xmlns="http://www.w3.org/2000/svg" xmlns:xlink="http://www.w3.org/1999/xlink" version="1.0" width="1625.6000" height="1625.6000" viewBox="-2.0000 -2.0000 17.7000 17.7000">
<g id="layer_9_outline">
<!--normal-->
 <rect x="0.0000" y="0.0000" width="12.7000" height="12.7000" stroke-width="0.2540" stroke="#00868b" stroke-linecap="round" fill="none"/>
</g>
<g id="layer_7_group7">
</g>
<g id="layer_5_group5">
</g>
<g id="layer_10_bottom">
</g>
<g id="layer_3_top">
<!--normal-->
 <polygon points="1.5875,0.6350 3.1750,0.6350 1.5875,2.2225 1.5875,1.5875 1.9050,1.2700 1.5875,1.2700 " stroke-width="0.075" stroke="#8b2323" fill="#8b2323"/>
 <polygon points="0.6350,0.6350 1.5875,0.6350 1.5875,1.2700 1.2700,1.2700 1.2700,1.9050 1.5875,1.5875 1.5875,2.2225 0.6350,3.1750 " stroke-width="0.075" stroke="#8b2323" fill="#8b2323"/>
 <polygon points="2.5400,1.9050 3.8100,0.6350 3.8100,3.8100 2.5400,3.8100 2.5400,3.1750 3.1750,3.1750 3.1750,2.5400 2.5400,2.5400 " stroke-width="0.075" stroke="#8b2323" fill="#8b2323"/>
 <polygon points="0.6350,3.8100 2.5400,1.9050 2.5400,2.5400 1.9050,3.1750 2.5400,3.1750 2.5400,3.8100 " stroke-width="0.075" stroke="#8b2323" fill="#8b2323"/>
 <polygon points="7.6200,0.6350 10.7950,3.8100 7.6200,3.8100 7.6200,3.1750 8.2550,3.1750 8.2550,1.9050 7.6200,1.9050 " stroke-width="0.075" stroke="#8b2323" fill="#8b2323"/>
 <polygon points="4.4450,3.8100 7.6200,0.6350 7.6200,1.9050 6.9850,1.9050 6.9850,3.1750 7.6200,3.1750 7.6200,3.8100 " stroke-width="0.075" stroke="#8b2323" fill="#8b2323"/>
 <polygon points="4.1275,4.7625 7.6200,5.0800 4.1275,7.1755 4.1275,6.3500 4.4450,6.3500 4.4450,5.7150 4.1275,5.7150 " stroke-width="0.075" stroke="#8b2323" fill="#8b2323"/>
 <polygon points="2.5400,4.6182 4.1275,4.7625 4.1275,5.7150 3.8100,5.7150 3.8100,6.3500 4.1275,6.3500 4.1275,7.1755 2.5400,8.1280 2.5400,7.6200 3.1750,6.9850 3.1750,6.3500 2.5400,5.7150 " stroke-width="0.075" stroke="#8b2323" fill="#8b2323"/>
 <polygon points="0.6350,4.4450 2.5400,4.6182 2.5400,5.7150 1.9050,5.7150 1.9050,6.9850 2.5400,7.6200 2.5400,8.1280 1.2700,8.8900 " stroke-width="0.075" stroke="#8b2323" fill="#8b2323"/>
</g>
<g id="layer_1_topsilk">
</g>
</svg>
