%!PS-Adobe-3.0 EPSF-3.0
%%BoundingBox: 0 0 37.000000 37.000000
%%Pages: 1
save countdictstack mark newpath /showpage {} def /setpagedevice {pop} def
%%EndProlog
%%Page: 1 1
%%BeginDocument: mech.eps

72 72 scale
1 dup neg scale
1 dup scale
0.00000 -0.50000 translate
/nclip { -0.01000 -0.01000 moveto -0.01000 0.51000 lineto 0.51000 0.51000 lineto 0.51000 -0.01000 lineto -0.01000 -0.01000 lineto eoclip newpath } def
/t { moveto lineto stroke } bind def
/tc { moveto lineto strokepath nclip } bind def
/r { /y2 exch def /x2 exch def /y1 exch def /x1 exch def
     x1 y1 moveto x1 y2 lineto x2 y2 lineto x2 y1 lineto closepath fill } bind def
/c { 0 360 arc fill } bind def
/cc { 0 360 arc nclip } bind def
/a { gsave setlinewidth translate scale 0 0 1 5 3 roll arc stroke grestore} bind def
% Layer bottomsilk group 12 drill 0 mask 0
% Layer bottom group 10 drill 0 mask 0
0.00000 setlinewidth
2 setlinecap
0.227451 0.372549 0.803922 setrgbcolor
0.12000 0.16000 moveto
0.17000 0.16000 lineto
0.17000 0.20000 lineto
0.12000 0.20000 lineto
fill
0.20000 0.16000 moveto
0.25000 0.16000 lineto
0.25000 0.20000 lineto
0.20000 0.20000 lineto
fill
1 setlinecap
0.8 0.8 0.8 setrgbcolor
0.12500 0.03000 moveto
0.15500 0.03000 lineto
0.15500 0.07000 lineto
0.12500 0.07000 lineto
fill
0.20500 0.03000 moveto
0.23500 0.03000 lineto
0.23500 0.07000 lineto
0.20500 0.07000 lineto
fill
0.02000 setlinewidth
0.14000 0.12000 0.14000 0.10000 t
0.22000 0.12000 0.22000 0.10000 t
0.13500 0.31000 moveto
0.16500 0.31000 lineto
0.16500 0.35000 lineto
0.13500 0.35000 lineto
fill
0.21500 0.31000 moveto
0.24500 0.31000 lineto
0.24500 0.35000 lineto
0.21500 0.35000 lineto
fill
0.00000 setlinewidth
1 1 1 setrgbcolor
0.14000 0.11000 0.00500 c
0.8 0 0 setrgbcolor
20 310 -0.00438 0.00438 0.14000 0.11000 0.000000 a
1 1 1 setrgbcolor
0.22000 0.11000 0.00500 c
% Layer group5 group 5 drill 0 mask 0
0.00000 setlinewidth
2 setlinecap
0.329412 0.545098 0.329412 setrgbcolor
0.12000 0.16000 moveto
0.17000 0.16000 lineto
0.17000 0.20000 lineto
0.12000 0.20000 lineto
fill
0.20000 0.16000 moveto
0.25000 0.16000 lineto
0.25000 0.20000 lineto
0.20000 0.20000 lineto
fill
1 setlinecap
0.8 0.8 0.8 setrgbcolor
0.11500 0.04000 moveto
0.15500 0.04000 lineto
0.15500 0.06000 lineto
0.11500 0.06000 lineto
fill
0.19500 0.04000 moveto
0.23500 0.04000 lineto
0.23500 0.06000 lineto
0.19500 0.06000 lineto
fill
0.02000 setlinewidth
0.13000 0.10000 0.15000 0.12000 t
0.21000 0.10000 0.23000 0.12000 t
0.12500 0.32000 moveto
0.16500 0.32000 lineto
0.16500 0.34000 lineto
0.12500 0.34000 lineto
fill
0.20500 0.32000 moveto
0.24500 0.32000 lineto
0.24500 0.34000 lineto
0.20500 0.34000 lineto
fill
0.00000 setlinewidth
1 1 1 setrgbcolor
0.14000 0.11000 0.00500 c
0.8 0 0 setrgbcolor
20 310 -0.00438 0.00438 0.14000 0.11000 0.000000 a
1 1 1 setrgbcolor
0.22000 0.11000 0.00500 c
% Layer top group 3 drill 0 mask 0
0.00000 setlinewidth
2 setlinecap
0.545098 0.137255 0.137255 setrgbcolor
0.12000 0.16000 moveto
0.17000 0.16000 lineto
0.17000 0.20000 lineto
0.12000 0.20000 lineto
fill
0.20000 0.16000 moveto
0.25000 0.16000 lineto
0.25000 0.20000 lineto
0.20000 0.20000 lineto
fill
1 setlinecap
0.498039 0.498039 0.498039 setrgbcolor
0.12500 0.04000 moveto
0.16500 0.04000 lineto
0.16500 0.06000 lineto
0.12500 0.06000 lineto
fill
0.20500 0.04000 moveto
0.24500 0.04000 lineto
0.24500 0.06000 lineto
0.20500 0.06000 lineto
fill
0.02000 setlinewidth
0.13000 0.11000 0.15000 0.11000 t
0.21000 0.11000 0.23000 0.11000 t
0.13500 0.32000 moveto
0.17500 0.32000 lineto
0.17500 0.34000 lineto
0.13500 0.34000 lineto
fill
0.21500 0.32000 moveto
0.25500 0.32000 lineto
0.25500 0.34000 lineto
0.21500 0.34000 lineto
fill
0.00000 setlinewidth
1 1 1 setrgbcolor
0.14000 0.11000 0.00500 c
0.8 0 0 setrgbcolor
20 310 -0.00438 0.00438 0.14000 0.11000 0.000000 a
1 1 1 setrgbcolor
0.22000 0.11000 0.00500 c
% Layer topsilk group 1 drill 0 mask 0
% Layer plated-drill group -1 drill 1 mask 0
0.22000 0.11000 0.00500 c
% Layer unplated-drill group -1 drill 1 mask 0
0.14000 0.11000 0.00500 c
0.8 0 0 setrgbcolor
20 310 -0.00438 0.00438 0.14000 0.11000 0.000000 a
% Layer group8 group 8 drill 0 mask 0
0.01000 setlinewidth
1 0.545098 0.329412 setrgbcolor
0.13000 0.18000 0.16000 0.18000 t
% Layer group9 group 9 drill 0 mask 0
0 0.545098 0.329412 setrgbcolor
0.21000 0.18000 0.24000 0.18000 t
% Layer group8 group 8 drill 0 mask 0
1 1 1 setrgbcolor
0.13500 0.05000 0.14500 0.05000 t
0.15000 0.32500 moveto
0.14000 0.33500 lineto
0.16000 0.33500 lineto
fill
0.23000 0.33000 0.00500 c
% Layer group9 group 9 drill 0 mask 0
0.21500 0.05000 0.22500 0.05000 t
showpage
%%EndDocument
%%Trailer
cleartomark countdictstack exch sub { end } repeat restore
%%EOF
