G04 start of page 2 for group 3 layer_idx 0 *
G04 Title: arcs with different strange sizes, top_copper *
G04 Creator: <version>
G04 CreationDate: <date>
G04 For: TEST *
G04 Format: Gerber/RS-274X *
G04 PCB-Dimensions: 50000 50000 *
G04 PCB-Coordinate-Origin: lower left *
%MOIN*%
%FSLAX25Y25*%
%LNTOP*%
%ADD11C,0.0100*%
G54D11*X10000Y30000D02*Y29587D01*
Y29177D01*
Y28773D01*
Y28377D01*
Y27992D01*
Y27620D01*
Y27265D01*
Y26929D01*
Y26614D01*
Y26321D01*
Y26054D01*
Y25814D01*
Y25603D01*
Y25421D01*
Y25271D01*
Y25153D01*
Y25068D01*
Y25017D01*
Y25000D01*
X15000Y30000D02*X15017D01*
X15068D01*
X15153D01*
X15271D01*
X15421D01*
X15603D01*
X15814D01*
X16054D01*
X16321D01*
X16614D01*
X16929D01*
X17265D01*
X17620D01*
X17992D01*
X18376D01*
X18773D01*
X19177D01*
X19587D01*
X20000D01*
X30000D02*G75*G03X30000Y30000I0J0D01*G01*
M02*
