<?xml version="1.0" encoding="UTF-8" standalone="no"?>
<!DOCTYPE svg PUBLIC "-//W3C//DTD SVG 1.1//EN"
 "http://www.w3.org/Graphics/SVG/1.1/DTD/svg11.dtd">
<!-- Generated by graphviz version 2.38.0 (20140413.2041)
 -->
<!-- Title: li:pcb&#45;rnd&#45;conf&#45;v1 Pages: 1 -->
<svg width="375pt" height="154pt"
 viewBox="0.00 0.00 375.02 154.31" xmlns="http://www.w3.org/2000/svg" xmlns:xlink="http://www.w3.org/1999/xlink">
<g id="graph0" class="graph" transform="scale(1 1) rotate(0) translate(4 150.309)">
<title>li:pcb&#45;rnd&#45;conf&#45;v1</title>
<polygon fill="white" stroke="none" points="-4,4 -4,-150.309 371.016,-150.309 371.016,4 -4,4"/>
<!-- /lht_tree_doc/roots/pcb&#45;rnd&#45;conf&#45;v1 -->
<g id="node1" class="node"><title>/lht_tree_doc/roots/pcb&#45;rnd&#45;conf&#45;v1</title>
<g id="a_node1"><a xlink:href="tree.html#/lht_tree_doc/roots/pcb-rnd-conf-v1" xlink:title="complete pcb&#45;rnd configuration tree">
<ellipse fill="none" stroke="black" cx="193.104" cy="-118.731" rx="82.0488" ry="27.6545"/>
<text text-anchor="middle" x="193.104" y="-123.031" font-family="Times,serif" font-size="14.00">li:pcb&#45;rnd&#45;conf&#45;v1</text>
</a>
</g>
</g>
<!-- /lht_tree_doc/roots/pcb&#45;rnd&#45;conf&#45;v1/children/overwrite -->
<g id="node2" class="node"><title>/lht_tree_doc/roots/pcb&#45;rnd&#45;conf&#45;v1/children/overwrite</title>
<g id="a_node2"><a xlink:href="tree.html#/lht_tree_doc/roots/pcb-rnd-conf-v1/children/overwrite" xlink:title="overwrite values while merging; children: a full or partial &lt;a href=&quot;../../conf/groups.html#tree&quot;&gt;config tree&lt;/a&gt;">
<ellipse fill="none" stroke="black" cx="60.1041" cy="-27.5772" rx="60.2083" ry="27.6545"/>
<text text-anchor="middle" x="60.1041" y="-31.8772" font-family="Times,serif" font-size="14.00">ha:overwrite</text>
</a>
</g>
</g>
<!-- /lht_tree_doc/roots/pcb&#45;rnd&#45;conf&#45;v1&#45;&gt;/lht_tree_doc/roots/pcb&#45;rnd&#45;conf&#45;v1/children/overwrite -->
<g id="edge1" class="edge"><title>/lht_tree_doc/roots/pcb&#45;rnd&#45;conf&#45;v1&#45;&gt;/lht_tree_doc/roots/pcb&#45;rnd&#45;conf&#45;v1/children/overwrite</title>
<path fill="none" stroke="black" d="M157.463,-93.8398C140.27,-82.315 119.542,-68.4201 101.638,-56.4185"/>
<polygon fill="black" stroke="black" points="103.359,-53.3585 93.1033,-50.6976 99.4609,-59.173 103.359,-53.3585"/>
</g>
<!-- /lht_tree_doc/roots/pcb&#45;rnd&#45;conf&#45;v1/children/prepend -->
<g id="node3" class="node"><title>/lht_tree_doc/roots/pcb&#45;rnd&#45;conf&#45;v1/children/prepend</title>
<g id="a_node3"><a xlink:href="tree.html#/lht_tree_doc/roots/pcb-rnd-conf-v1/children/prepend" xlink:title="prepend values while merging; children: a full or partial &lt;a href=&quot;../../conf/groups.html#tree&quot;&gt;config tree&lt;/a&gt;">
<ellipse fill="none" stroke="black" cx="193.104" cy="-27.5772" rx="54.3945" ry="27.6545"/>
<text text-anchor="middle" x="193.104" y="-31.8772" font-family="Times,serif" font-size="14.00">ha:prepend</text>
</a>
</g>
</g>
<!-- /lht_tree_doc/roots/pcb&#45;rnd&#45;conf&#45;v1&#45;&gt;/lht_tree_doc/roots/pcb&#45;rnd&#45;conf&#45;v1/children/prepend -->
<g id="edge2" class="edge"><title>/lht_tree_doc/roots/pcb&#45;rnd&#45;conf&#45;v1&#45;&gt;/lht_tree_doc/roots/pcb&#45;rnd&#45;conf&#45;v1/children/prepend</title>
<path fill="none" stroke="black" d="M193.104,-90.9823C193.104,-82.96 193.104,-74.0155 193.104,-65.4608"/>
<polygon fill="black" stroke="black" points="196.604,-65.3075 193.104,-55.3075 189.604,-65.3076 196.604,-65.3075"/>
</g>
<!-- /lht_tree_doc/roots/pcb&#45;rnd&#45;conf&#45;v1/children/append -->
<g id="node4" class="node"><title>/lht_tree_doc/roots/pcb&#45;rnd&#45;conf&#45;v1/children/append</title>
<g id="a_node4"><a xlink:href="tree.html#/lht_tree_doc/roots/pcb-rnd-conf-v1/children/append" xlink:title="append values while merging; children: a full or partial &lt;a href=&quot;../../conf/groups.html#tree&quot;&gt;config tree&lt;/a&gt;">
<ellipse fill="none" stroke="black" cx="316.104" cy="-27.5772" rx="50.8235" ry="27.6545"/>
<text text-anchor="middle" x="316.104" y="-31.8772" font-family="Times,serif" font-size="14.00">ha:append</text>
</a>
</g>
</g>
<!-- /lht_tree_doc/roots/pcb&#45;rnd&#45;conf&#45;v1&#45;&gt;/lht_tree_doc/roots/pcb&#45;rnd&#45;conf&#45;v1/children/append -->
<g id="edge3" class="edge"><title>/lht_tree_doc/roots/pcb&#45;rnd&#45;conf&#45;v1&#45;&gt;/lht_tree_doc/roots/pcb&#45;rnd&#45;conf&#45;v1/children/append</title>
<path fill="none" stroke="black" d="M226.714,-93.3697C242.584,-81.8669 261.597,-68.0858 278,-56.1962"/>
<polygon fill="black" stroke="black" points="280.267,-58.8759 286.31,-50.1732 276.159,-53.2081 280.267,-58.8759"/>
</g>
</g>
</svg>
