<?xml version="1.0"?>
<svg xmlns="http://www.w3.org/2000/svg" xmlns:xlink="http://www.w3.org/1999/xlink" version="1.0" width="1625.6000" height="1625.6000" viewBox="-2.0000 -2.0000 17.7000 17.7000">
<g id="layer_7_group7">
</g>
<g id="layer_5_group5">
</g>
<g id="layer_10_bottom">
</g>
<g id="layer_3_top">
<!--normal-->
 <polygon points="1.2700,0.6350 1.9050,0.6350 1.9050,11.4300 1.2700,11.4300 " stroke-width="0.010" stroke="#8b2323" fill="#8b2323"/>
 <polygon points="3.1750,0.6350 12.0650,0.6350 12.0650,1.2700 3.1750,1.2700 " stroke-width="0.010" stroke="#8b2323" fill="#8b2323"/>
 <polygon points="10.7950,10.7950 11.4300,10.7950 11.4300,11.4300 10.7950,11.4300 " stroke-width="0.010" stroke="#8b2323" fill="#8b2323"/>
 <polygon points="3.1750,1.9050 10.1600,1.9050 10.1600,11.4300 3.1750,11.4300 " stroke-width="0.010" stroke="#8b2323" fill="#8b2323"/>
</g>
<g id="layer_1_topsilk">
</g>
<g id="layer_9_outline">
<!--normal-->
 <rect x="0.0000" y="0.0000" width="12.7000" height="12.7000" stroke-width="0.2540" stroke="#00868b" stroke-linecap="round" fill="none"/>
</g>
<g id="layer_9_outline">
</g>
</svg>
