G04 start of page 2 for group 3 layer_idx 0 *
G04 Title: (unknown), top_copper *
G04 Creator: <version>
G04 CreationDate: <date>
G04 For: TEST *
G04 Format: Gerber/RS-274X *
G04 PCB-Dimensions: 50000 50000 *
G04 PCB-Coordinate-Origin: lower left *
%MOIN*%
%FSLAX25Y25*%
%LNTOP*%
%ADD15C,0.0394*%
%ADD14C,0.0315*%
%ADD13C,0.0916*%
%ADD12C,0.0866*%
%ADD11C,0.0001*%
G54D11*G36*
X2500Y45000D02*Y35000D01*
X12500Y37500D01*
Y45000D01*
X2500D01*
G37*
G54D12*X37500Y40000D03*
G54D13*X7500Y17500D03*
G54D14*G54D15*M02*
