
                        PCB Job Preferences to ASCII Log
                        --------------------------------

                       12:29 PM Monday, February 20, 2017
                                   Job Name: 


Linear values will be specified in the following units: MM

Creating Job Preferences ASCII file 'JobPrefs.hkp'.

Job Preferences ASCII file 'JobPrefs.hkp' was successfully created.
