<?xml version="1.0" encoding="UTF-8" standalone="no"?>
<!DOCTYPE svg PUBLIC "-//W3C//DTD SVG 1.1//EN"
 "http://www.w3.org/Graphics/SVG/1.1/DTD/svg11.dtd">
<!-- Generated by graphviz version 2.38.0 (20140413.2041)
 -->
<!-- Title: li:pcb&#45;rnd&#45;font&#45;v1 Pages: 1 -->
<svg width="976pt" height="609pt"
 viewBox="0.00 0.00 975.88 608.67" xmlns="http://www.w3.org/2000/svg" xmlns:xlink="http://www.w3.org/1999/xlink">
<g id="graph0" class="graph" transform="scale(1 1) rotate(0) translate(4 604.666)">
<title>li:pcb&#45;rnd&#45;font&#45;v1</title>
<polygon fill="white" stroke="none" points="-4,4 -4,-604.666 971.882,-604.666 971.882,4 -4,4"/>
<!-- /lht_tree_doc/roots/pcb&#45;rnd&#45;font&#45;v1 -->
<g id="node1" class="node"><title>/lht_tree_doc/roots/pcb&#45;rnd&#45;font&#45;v1</title>
<g id="a_node1"><a xlink:href="tree.html#/lht_tree_doc/roots/pcb-rnd-font-v1" xlink:title="font description">
<ellipse fill="none" stroke="black" cx="315.234" cy="-573.089" rx="80.7205" ry="27.6545"/>
<text text-anchor="middle" x="315.234" y="-577.389" font-family="Times,serif" font-size="14.00">li:pcb&#45;rnd&#45;font&#45;v1</text>
</a>
</g>
</g>
<!-- /lht_tree_doc/roots/pcb&#45;rnd&#45;font&#45;v1/children/FONT&#45;ID -->
<g id="node2" class="node"><title>/lht_tree_doc/roots/pcb&#45;rnd&#45;font&#45;v1/children/FONT&#45;ID</title>
<g id="a_node2"><a xlink:href="tree.html#/lht_tree_doc/roots/pcb-rnd-font-v1/children/FONT-ID" xlink:title=" the full description of a font; the node name is the integer font id or &quot;geda_pcb&quot; for font 0 (for historical reasons); the name is used only to make each node unique, the ID is also a field below ">
<ellipse fill="none" stroke="black" cx="315.234" cy="-481.935" rx="61.5366" ry="27.6545"/>
<text text-anchor="middle" x="315.234" y="-486.235" font-family="Times,serif" font-size="14.00">ha:FONT&#45;ID</text>
</a>
</g>
</g>
<!-- /lht_tree_doc/roots/pcb&#45;rnd&#45;font&#45;v1&#45;&gt;/lht_tree_doc/roots/pcb&#45;rnd&#45;font&#45;v1/children/FONT&#45;ID -->
<g id="edge1" class="edge"><title>/lht_tree_doc/roots/pcb&#45;rnd&#45;font&#45;v1&#45;&gt;/lht_tree_doc/roots/pcb&#45;rnd&#45;font&#45;v1/children/FONT&#45;ID</title>
<path fill="none" stroke="black" d="M315.234,-545.34C315.234,-537.317 315.234,-528.373 315.234,-519.818"/>
<polygon fill="black" stroke="black" points="318.734,-519.665 315.234,-509.665 311.734,-519.665 318.734,-519.665"/>
</g>
<!-- /lht_tree_doc/roots/pcb&#45;rnd&#45;font&#45;v1/children/FONT&#45;ID/children/cell_height -->
<g id="node3" class="node"><title>/lht_tree_doc/roots/pcb&#45;rnd&#45;font&#45;v1/children/FONT&#45;ID/children/cell_height</title>
<g id="a_node3"><a xlink:href="tree.html#/lht_tree_doc/roots/pcb-rnd-font-v1/children/FONT-ID/children/cell_height" xlink:title="height of the tallest glyph">
<ellipse fill="none" stroke="black" cx="81.234" cy="-390.78" rx="54.3945" ry="26.7407"/>
<text text-anchor="middle" x="81.234" y="-394.58" font-family="Times,serif" font-size="14.00">cell_height</text>
<text text-anchor="middle" x="81.234" y="-379.58" font-family="Times,serif" font-size="14.00">coord</text>
</a>
</g>
</g>
<!-- /lht_tree_doc/roots/pcb&#45;rnd&#45;font&#45;v1/children/FONT&#45;ID&#45;&gt;/lht_tree_doc/roots/pcb&#45;rnd&#45;font&#45;v1/children/FONT&#45;ID/children/cell_height -->
<g id="edge2" class="edge"><title>/lht_tree_doc/roots/pcb&#45;rnd&#45;font&#45;v1/children/FONT&#45;ID&#45;&gt;/lht_tree_doc/roots/pcb&#45;rnd&#45;font&#45;v1/children/FONT&#45;ID/children/cell_height</title>
<path fill="none" stroke="black" d="M268.137,-464.183C233.904,-451.865 186.527,-434.523 145.234,-418.357 140.711,-416.587 136.022,-414.713 131.333,-412.814"/>
<polygon fill="black" stroke="black" points="132.342,-409.445 121.761,-408.903 129.694,-415.925 132.342,-409.445"/>
</g>
<!-- /lht_tree_doc/roots/pcb&#45;rnd&#45;font&#45;v1/children/FONT&#45;ID/children/cell_width -->
<g id="node4" class="node"><title>/lht_tree_doc/roots/pcb&#45;rnd&#45;font&#45;v1/children/FONT&#45;ID/children/cell_width</title>
<g id="a_node4"><a xlink:href="tree.html#/lht_tree_doc/roots/pcb-rnd-font-v1/children/FONT-ID/children/cell_width" xlink:title="width of the widest glyph">
<ellipse fill="none" stroke="black" cx="206.234" cy="-390.78" rx="52.1524" ry="26.7407"/>
<text text-anchor="middle" x="206.234" y="-394.58" font-family="Times,serif" font-size="14.00">cell_width</text>
<text text-anchor="middle" x="206.234" y="-379.58" font-family="Times,serif" font-size="14.00">coord</text>
</a>
</g>
</g>
<!-- /lht_tree_doc/roots/pcb&#45;rnd&#45;font&#45;v1/children/FONT&#45;ID&#45;&gt;/lht_tree_doc/roots/pcb&#45;rnd&#45;font&#45;v1/children/FONT&#45;ID/children/cell_width -->
<g id="edge3" class="edge"><title>/lht_tree_doc/roots/pcb&#45;rnd&#45;font&#45;v1/children/FONT&#45;ID&#45;&gt;/lht_tree_doc/roots/pcb&#45;rnd&#45;font&#45;v1/children/FONT&#45;ID/children/cell_width</title>
<path fill="none" stroke="black" d="M286.596,-457.51C272.652,-446.105 255.768,-432.296 241.082,-420.284"/>
<polygon fill="black" stroke="black" points="243.139,-417.444 233.182,-413.822 238.707,-422.862 243.139,-417.444"/>
</g>
<!-- /lht_tree_doc/roots/pcb&#45;rnd&#45;font&#45;v1/children/FONT&#45;ID/children/id -->
<g id="node5" class="node"><title>/lht_tree_doc/roots/pcb&#45;rnd&#45;font&#45;v1/children/FONT&#45;ID/children/id</title>
<g id="a_node5"><a xlink:href="tree.html#/lht_tree_doc/roots/pcb-rnd-font-v1/children/FONT-ID/children/id" xlink:title="unique font ID within the fontkit; fonts are referenced by ID">
<ellipse fill="none" stroke="black" cx="315.234" cy="-390.78" rx="38.3684" ry="26.7407"/>
<text text-anchor="middle" x="315.234" y="-394.58" font-family="Times,serif" font-size="14.00">id</text>
<text text-anchor="middle" x="315.234" y="-379.58" font-family="Times,serif" font-size="14.00">integer</text>
</a>
</g>
</g>
<!-- /lht_tree_doc/roots/pcb&#45;rnd&#45;font&#45;v1/children/FONT&#45;ID&#45;&gt;/lht_tree_doc/roots/pcb&#45;rnd&#45;font&#45;v1/children/FONT&#45;ID/children/id -->
<g id="edge4" class="edge"><title>/lht_tree_doc/roots/pcb&#45;rnd&#45;font&#45;v1/children/FONT&#45;ID&#45;&gt;/lht_tree_doc/roots/pcb&#45;rnd&#45;font&#45;v1/children/FONT&#45;ID/children/id</title>
<path fill="none" stroke="black" d="M315.234,-454.185C315.234,-445.928 315.234,-436.692 315.234,-427.911"/>
<polygon fill="black" stroke="black" points="318.734,-427.897 315.234,-417.897 311.734,-427.897 318.734,-427.897"/>
</g>
<!-- /lht_tree_doc/roots/pcb&#45;rnd&#45;font&#45;v1/children/FONT&#45;ID/children/name -->
<g id="node6" class="node"><title>/lht_tree_doc/roots/pcb&#45;rnd&#45;font&#45;v1/children/FONT&#45;ID/children/name</title>
<g id="a_node6"><a xlink:href="tree.html#/lht_tree_doc/roots/pcb-rnd-font-v1/children/FONT-ID/children/name" xlink:title="user specified, user readable font name">
<ellipse fill="none" stroke="black" cx="404.234" cy="-390.78" rx="33.4697" ry="26.7407"/>
<text text-anchor="middle" x="404.234" y="-394.58" font-family="Times,serif" font-size="14.00">name</text>
<text text-anchor="middle" x="404.234" y="-379.58" font-family="Times,serif" font-size="14.00">string</text>
</a>
</g>
</g>
<!-- /lht_tree_doc/roots/pcb&#45;rnd&#45;font&#45;v1/children/FONT&#45;ID&#45;&gt;/lht_tree_doc/roots/pcb&#45;rnd&#45;font&#45;v1/children/FONT&#45;ID/children/name -->
<g id="edge5" class="edge"><title>/lht_tree_doc/roots/pcb&#45;rnd&#45;font&#45;v1/children/FONT&#45;ID&#45;&gt;/lht_tree_doc/roots/pcb&#45;rnd&#45;font&#45;v1/children/FONT&#45;ID/children/name</title>
<path fill="none" stroke="black" d="M339.554,-456.573C351.061,-445.045 364.854,-431.229 376.74,-419.322"/>
<polygon fill="black" stroke="black" points="379.27,-421.742 383.857,-412.192 374.315,-416.797 379.27,-421.742"/>
</g>
<!-- /lht_tree_doc/roots/pcb&#45;rnd&#45;font&#45;v1/children/FONT&#45;ID/children/symbols -->
<g id="node7" class="node"><title>/lht_tree_doc/roots/pcb&#45;rnd&#45;font&#45;v1/children/FONT&#45;ID/children/symbols</title>
<g id="a_node7"><a xlink:href="tree.html#/lht_tree_doc/roots/pcb-rnd-font-v1/children/FONT-ID/children/symbols" xlink:title=" a collections of glyphs availbale in the font ">
<ellipse fill="none" stroke="black" cx="511.234" cy="-390.78" rx="55.7232" ry="27.6545"/>
<text text-anchor="middle" x="511.234" y="-395.08" font-family="Times,serif" font-size="14.00">ha:symbols</text>
</a>
</g>
</g>
<!-- /lht_tree_doc/roots/pcb&#45;rnd&#45;font&#45;v1/children/FONT&#45;ID&#45;&gt;/lht_tree_doc/roots/pcb&#45;rnd&#45;font&#45;v1/children/FONT&#45;ID/children/symbols -->
<g id="edge6" class="edge"><title>/lht_tree_doc/roots/pcb&#45;rnd&#45;font&#45;v1/children/FONT&#45;ID&#45;&gt;/lht_tree_doc/roots/pcb&#45;rnd&#45;font&#45;v1/children/FONT&#45;ID/children/symbols</title>
<path fill="none" stroke="black" d="M357.763,-461.589C388.402,-447.653 429.828,-428.809 461.918,-414.212"/>
<polygon fill="black" stroke="black" points="463.476,-417.349 471.129,-410.023 460.577,-410.977 463.476,-417.349"/>
</g>
<!-- /lht_tree_doc/roots/pcb&#45;rnd&#45;font&#45;v1/children/FONT&#45;ID/children/symbols/children/CHARACTER -->
<g id="node8" class="node"><title>/lht_tree_doc/roots/pcb&#45;rnd&#45;font&#45;v1/children/FONT&#45;ID/children/symbols/children/CHARACTER</title>
<g id="a_node8"><a xlink:href="tree.html#/lht_tree_doc/roots/pcb-rnd-font-v1/children/FONT-ID/children/symbols/children/CHARACTER" xlink:title=" Description of a glyph (symbol). Node name is a signel ASCII character or is of format &amp;xx where xx is a hex digit of the ASCII code of the character. Characters that must use the hex version are: codes below 33 or over 126, &amp;, #, {, }, /, :, ;, =, \, :">
<ellipse fill="none" stroke="black" cx="511.234" cy="-299.626" rx="81.135" ry="27.6545"/>
<text text-anchor="middle" x="511.234" y="-303.926" font-family="Times,serif" font-size="14.00">ha:CHARACTER</text>
</a>
</g>
</g>
<!-- /lht_tree_doc/roots/pcb&#45;rnd&#45;font&#45;v1/children/FONT&#45;ID/children/symbols&#45;&gt;/lht_tree_doc/roots/pcb&#45;rnd&#45;font&#45;v1/children/FONT&#45;ID/children/symbols/children/CHARACTER -->
<g id="edge7" class="edge"><title>/lht_tree_doc/roots/pcb&#45;rnd&#45;font&#45;v1/children/FONT&#45;ID/children/symbols&#45;&gt;/lht_tree_doc/roots/pcb&#45;rnd&#45;font&#45;v1/children/FONT&#45;ID/children/symbols/children/CHARACTER</title>
<path fill="none" stroke="black" d="M511.234,-363.031C511.234,-355.009 511.234,-346.064 511.234,-337.51"/>
<polygon fill="black" stroke="black" points="514.734,-337.356 511.234,-327.356 507.734,-337.356 514.734,-337.356"/>
</g>
<!-- /lht_tree_doc/roots/pcb&#45;rnd&#45;font&#45;v1/children/FONT&#45;ID/children/symbols/children/CHARACTER/children/height -->
<g id="node9" class="node"><title>/lht_tree_doc/roots/pcb&#45;rnd&#45;font&#45;v1/children/FONT&#45;ID/children/symbols/children/CHARACTER/children/height</title>
<g id="a_node9"><a xlink:href="tree.html#/lht_tree_doc/roots/pcb-rnd-font-v1/children/FONT-ID/children/symbols/children/CHARACTER/children/height" xlink:title="height of the glyph">
<ellipse fill="none" stroke="black" cx="382.234" cy="-208.472" rx="35.2113" ry="26.7407"/>
<text text-anchor="middle" x="382.234" y="-212.272" font-family="Times,serif" font-size="14.00">height</text>
<text text-anchor="middle" x="382.234" y="-197.272" font-family="Times,serif" font-size="14.00">coord</text>
</a>
</g>
</g>
<!-- /lht_tree_doc/roots/pcb&#45;rnd&#45;font&#45;v1/children/FONT&#45;ID/children/symbols/children/CHARACTER&#45;&gt;/lht_tree_doc/roots/pcb&#45;rnd&#45;font&#45;v1/children/FONT&#45;ID/children/symbols/children/CHARACTER/children/height -->
<g id="edge8" class="edge"><title>/lht_tree_doc/roots/pcb&#45;rnd&#45;font&#45;v1/children/FONT&#45;ID/children/symbols/children/CHARACTER&#45;&gt;/lht_tree_doc/roots/pcb&#45;rnd&#45;font&#45;v1/children/FONT&#45;ID/children/symbols/children/CHARACTER/children/height</title>
<path fill="none" stroke="black" d="M476.325,-274.499C457.644,-261.589 434.736,-245.757 416.201,-232.947"/>
<polygon fill="black" stroke="black" points="417.974,-229.918 407.758,-227.111 413.994,-235.676 417.974,-229.918"/>
</g>
<!-- /lht_tree_doc/roots/pcb&#45;rnd&#45;font&#45;v1/children/FONT&#45;ID/children/symbols/children/CHARACTER/children/width -->
<g id="node10" class="node"><title>/lht_tree_doc/roots/pcb&#45;rnd&#45;font&#45;v1/children/FONT&#45;ID/children/symbols/children/CHARACTER/children/width</title>
<g id="a_node10"><a xlink:href="tree.html#/lht_tree_doc/roots/pcb-rnd-font-v1/children/FONT-ID/children/symbols/children/CHARACTER/children/width" xlink:title="width of the glyph">
<ellipse fill="none" stroke="black" cx="469.234" cy="-208.472" rx="33.4697" ry="26.7407"/>
<text text-anchor="middle" x="469.234" y="-212.272" font-family="Times,serif" font-size="14.00">width</text>
<text text-anchor="middle" x="469.234" y="-197.272" font-family="Times,serif" font-size="14.00">coord</text>
</a>
</g>
</g>
<!-- /lht_tree_doc/roots/pcb&#45;rnd&#45;font&#45;v1/children/FONT&#45;ID/children/symbols/children/CHARACTER&#45;&gt;/lht_tree_doc/roots/pcb&#45;rnd&#45;font&#45;v1/children/FONT&#45;ID/children/symbols/children/CHARACTER/children/width -->
<g id="edge9" class="edge"><title>/lht_tree_doc/roots/pcb&#45;rnd&#45;font&#45;v1/children/FONT&#45;ID/children/symbols/children/CHARACTER&#45;&gt;/lht_tree_doc/roots/pcb&#45;rnd&#45;font&#45;v1/children/FONT&#45;ID/children/symbols/children/CHARACTER/children/width</title>
<path fill="none" stroke="black" d="M498.86,-272.359C494.496,-263.095 489.53,-252.554 484.928,-242.785"/>
<polygon fill="black" stroke="black" points="488.087,-241.278 480.659,-233.723 481.754,-244.261 488.087,-241.278"/>
</g>
<!-- /lht_tree_doc/roots/pcb&#45;rnd&#45;font&#45;v1/children/FONT&#45;ID/children/symbols/children/CHARACTER/children/delta -->
<g id="node11" class="node"><title>/lht_tree_doc/roots/pcb&#45;rnd&#45;font&#45;v1/children/FONT&#45;ID/children/symbols/children/CHARACTER/children/delta</title>
<g id="a_node11"><a xlink:href="tree.html#/lht_tree_doc/roots/pcb-rnd-font-v1/children/FONT-ID/children/symbols/children/CHARACTER/children/delta" xlink:title="extra space always inserted after the current symbol, before the next character">
<ellipse fill="none" stroke="black" cx="553.234" cy="-208.472" rx="33.4697" ry="26.7407"/>
<text text-anchor="middle" x="553.234" y="-212.272" font-family="Times,serif" font-size="14.00">delta</text>
<text text-anchor="middle" x="553.234" y="-197.272" font-family="Times,serif" font-size="14.00">coord</text>
</a>
</g>
</g>
<!-- /lht_tree_doc/roots/pcb&#45;rnd&#45;font&#45;v1/children/FONT&#45;ID/children/symbols/children/CHARACTER&#45;&gt;/lht_tree_doc/roots/pcb&#45;rnd&#45;font&#45;v1/children/FONT&#45;ID/children/symbols/children/CHARACTER/children/delta -->
<g id="edge10" class="edge"><title>/lht_tree_doc/roots/pcb&#45;rnd&#45;font&#45;v1/children/FONT&#45;ID/children/symbols/children/CHARACTER&#45;&gt;/lht_tree_doc/roots/pcb&#45;rnd&#45;font&#45;v1/children/FONT&#45;ID/children/symbols/children/CHARACTER/children/delta</title>
<path fill="none" stroke="black" d="M523.608,-272.359C527.972,-263.095 532.938,-252.554 537.54,-242.785"/>
<polygon fill="black" stroke="black" points="540.714,-244.261 541.809,-233.723 534.381,-241.278 540.714,-244.261"/>
</g>
<!-- /lht_tree_doc/roots/pcb&#45;rnd&#45;font&#45;v1/children/FONT&#45;ID/children/symbols/children/CHARACTER/children/objects -->
<g id="node12" class="node"><title>/lht_tree_doc/roots/pcb&#45;rnd&#45;font&#45;v1/children/FONT&#45;ID/children/symbols/children/CHARACTER/children/objects</title>
<g id="a_node12"><a xlink:href="tree.html#/lht_tree_doc/roots/pcb-rnd-font-v1/children/FONT-ID/children/symbols/children/CHARACTER/children/objects" xlink:title="objects that make up the symbol; IDs are per symbol local IDs counted from 0">
<ellipse fill="none" stroke="black" cx="651.234" cy="-208.472" rx="46.8387" ry="27.6545"/>
<text text-anchor="middle" x="651.234" y="-212.772" font-family="Times,serif" font-size="14.00">li:objects</text>
</a>
</g>
</g>
<!-- /lht_tree_doc/roots/pcb&#45;rnd&#45;font&#45;v1/children/FONT&#45;ID/children/symbols/children/CHARACTER&#45;&gt;/lht_tree_doc/roots/pcb&#45;rnd&#45;font&#45;v1/children/FONT&#45;ID/children/symbols/children/CHARACTER/children/objects -->
<g id="edge11" class="edge"><title>/lht_tree_doc/roots/pcb&#45;rnd&#45;font&#45;v1/children/FONT&#45;ID/children/symbols/children/CHARACTER&#45;&gt;/lht_tree_doc/roots/pcb&#45;rnd&#45;font&#45;v1/children/FONT&#45;ID/children/symbols/children/CHARACTER/children/objects</title>
<path fill="none" stroke="black" d="M548.384,-274.968C567.86,-262.566 591.723,-247.369 611.56,-234.737"/>
<polygon fill="black" stroke="black" points="613.519,-237.639 620.074,-229.315 609.759,-231.734 613.519,-237.639"/>
</g>
<!-- /lht_tree_doc/roots/pcb&#45;rnd&#45;font&#45;v1/children/FONT&#45;ID/children/symbols/children/CHARACTER/children/objects/children/line.ID -->
<g id="node13" class="node"><title>/lht_tree_doc/roots/pcb&#45;rnd&#45;font&#45;v1/children/FONT&#45;ID/children/symbols/children/CHARACTER/children/objects/children/line.ID</title>
<g id="a_node13"><a xlink:href="tree.html#/lht_tree_doc/roots/pcb-rnd-font-v1/children/FONT-ID/children/symbols/children/CHARACTER/children/objects/children/line.ID" xlink:title="round cap line, simplified">
<ellipse fill="none" stroke="black" cx="243.234" cy="-117.317" rx="50.41" ry="27.6545"/>
<text text-anchor="middle" x="243.234" y="-121.617" font-family="Times,serif" font-size="14.00">ha:line.ID</text>
</a>
</g>
</g>
<!-- /lht_tree_doc/roots/pcb&#45;rnd&#45;font&#45;v1/children/FONT&#45;ID/children/symbols/children/CHARACTER/children/objects&#45;&gt;/lht_tree_doc/roots/pcb&#45;rnd&#45;font&#45;v1/children/FONT&#45;ID/children/symbols/children/CHARACTER/children/objects/children/line.ID -->
<g id="edge12" class="edge"><title>/lht_tree_doc/roots/pcb&#45;rnd&#45;font&#45;v1/children/FONT&#45;ID/children/symbols/children/CHARACTER/children/objects&#45;&gt;/lht_tree_doc/roots/pcb&#45;rnd&#45;font&#45;v1/children/FONT&#45;ID/children/symbols/children/CHARACTER/children/objects/children/line.ID</title>
<path fill="none" stroke="black" d="M617.169,-189.54C610.06,-186.303 602.512,-183.222 595.234,-180.894 495.216,-148.908 373.663,-131.869 302.72,-123.991"/>
<polygon fill="black" stroke="black" points="302.948,-120.495 292.628,-122.894 302.192,-127.454 302.948,-120.495"/>
</g>
<!-- /lht_tree_doc/roots/pcb&#45;rnd&#45;font&#45;v1/children/FONT&#45;ID/children/symbols/children/CHARACTER/children/objects/children/simplearc.ID -->
<g id="node19" class="node"><title>/lht_tree_doc/roots/pcb&#45;rnd&#45;font&#45;v1/children/FONT&#45;ID/children/symbols/children/CHARACTER/children/objects/children/simplearc.ID</title>
<g id="a_node19"><a xlink:href="tree.html#/lht_tree_doc/roots/pcb-rnd-font-v1/children/FONT-ID/children/symbols/children/CHARACTER/children/objects/children/simplearc.ID" xlink:title="round cap arc, simplified ">
<ellipse fill="none" stroke="black" cx="651.234" cy="-117.317" rx="73.5782" ry="27.6545"/>
<text text-anchor="middle" x="651.234" y="-121.617" font-family="Times,serif" font-size="14.00">ha:simplearc.ID</text>
</a>
</g>
</g>
<!-- /lht_tree_doc/roots/pcb&#45;rnd&#45;font&#45;v1/children/FONT&#45;ID/children/symbols/children/CHARACTER/children/objects&#45;&gt;/lht_tree_doc/roots/pcb&#45;rnd&#45;font&#45;v1/children/FONT&#45;ID/children/symbols/children/CHARACTER/children/objects/children/simplearc.ID -->
<g id="edge18" class="edge"><title>/lht_tree_doc/roots/pcb&#45;rnd&#45;font&#45;v1/children/FONT&#45;ID/children/symbols/children/CHARACTER/children/objects&#45;&gt;/lht_tree_doc/roots/pcb&#45;rnd&#45;font&#45;v1/children/FONT&#45;ID/children/symbols/children/CHARACTER/children/objects/children/simplearc.ID</title>
<path fill="none" stroke="black" d="M651.234,-180.722C651.234,-172.7 651.234,-163.756 651.234,-155.201"/>
<polygon fill="black" stroke="black" points="654.734,-155.048 651.234,-145.048 647.734,-155.048 654.734,-155.048"/>
</g>
<!-- /lht_tree_doc/roots/pcb&#45;rnd&#45;font&#45;v1/children/FONT&#45;ID/children/symbols/children/CHARACTER/children/objects/children/simplepoly.ID -->
<g id="node26" class="node"><title>/lht_tree_doc/roots/pcb&#45;rnd&#45;font&#45;v1/children/FONT&#45;ID/children/symbols/children/CHARACTER/children/objects/children/simplepoly.ID</title>
<g id="a_node26"><a xlink:href="tree.html#/lht_tree_doc/roots/pcb-rnd-font-v1/children/FONT-ID/children/symbols/children/CHARACTER/children/objects/children/simplepoly.ID" xlink:title="round cap arc, simplified; contains a flat list of coords; each coord pair is an x;y corner of the outline of the polygon (odd indices are x coords, even indices are y coords) ">
<ellipse fill="none" stroke="black" cx="818.234" cy="-117.317" rx="75.8212" ry="27.6545"/>
<text text-anchor="middle" x="818.234" y="-121.617" font-family="Times,serif" font-size="14.00">li:simplepoly.ID</text>
</a>
</g>
</g>
<!-- /lht_tree_doc/roots/pcb&#45;rnd&#45;font&#45;v1/children/FONT&#45;ID/children/symbols/children/CHARACTER/children/objects&#45;&gt;/lht_tree_doc/roots/pcb&#45;rnd&#45;font&#45;v1/children/FONT&#45;ID/children/symbols/children/CHARACTER/children/objects/children/simplepoly.ID -->
<g id="edge25" class="edge"><title>/lht_tree_doc/roots/pcb&#45;rnd&#45;font&#45;v1/children/FONT&#45;ID/children/symbols/children/CHARACTER/children/objects&#45;&gt;/lht_tree_doc/roots/pcb&#45;rnd&#45;font&#45;v1/children/FONT&#45;ID/children/symbols/children/CHARACTER/children/objects/children/simplepoly.ID</title>
<path fill="none" stroke="black" d="M685.029,-189.43C708.834,-176.722 741.112,-159.489 767.933,-145.171"/>
<polygon fill="black" stroke="black" points="769.626,-148.235 776.799,-140.438 766.329,-142.06 769.626,-148.235"/>
</g>
<!-- /lht_tree_doc/roots/pcb&#45;rnd&#45;font&#45;v1/children/FONT&#45;ID/children/symbols/children/CHARACTER/children/objects/children/line.ID/children/x1 -->
<g id="node14" class="node"><title>/lht_tree_doc/roots/pcb&#45;rnd&#45;font&#45;v1/children/FONT&#45;ID/children/symbols/children/CHARACTER/children/objects/children/line.ID/children/x1</title>
<g id="a_node14"><a xlink:href="tree.html#/lht_tree_doc/roots/pcb-rnd-font-v1/children/FONT-ID/children/symbols/children/CHARACTER/children/objects/children/line.ID/children/x1" xlink:title="line first endpoint, horizontal offset ">
<ellipse fill="none" stroke="black" cx="33.234" cy="-26.8701" rx="33.4697" ry="26.7407"/>
<text text-anchor="middle" x="33.234" y="-30.6701" font-family="Times,serif" font-size="14.00">x1</text>
<text text-anchor="middle" x="33.234" y="-15.6701" font-family="Times,serif" font-size="14.00">coord</text>
</a>
</g>
</g>
<!-- /lht_tree_doc/roots/pcb&#45;rnd&#45;font&#45;v1/children/FONT&#45;ID/children/symbols/children/CHARACTER/children/objects/children/line.ID&#45;&gt;/lht_tree_doc/roots/pcb&#45;rnd&#45;font&#45;v1/children/FONT&#45;ID/children/symbols/children/CHARACTER/children/objects/children/line.ID/children/x1 -->
<g id="edge13" class="edge"><title>/lht_tree_doc/roots/pcb&#45;rnd&#45;font&#45;v1/children/FONT&#45;ID/children/symbols/children/CHARACTER/children/objects/children/line.ID&#45;&gt;/lht_tree_doc/roots/pcb&#45;rnd&#45;font&#45;v1/children/FONT&#45;ID/children/symbols/children/CHARACTER/children/objects/children/line.ID/children/x1</title>
<path fill="none" stroke="black" d="M200.159,-102.864C165.637,-91.4716 116.346,-73.8186 75.234,-53.7401 72.6369,-52.4717 69.9946,-51.0881 67.3641,-49.6417"/>
<polygon fill="black" stroke="black" points="68.9605,-46.5221 58.5492,-44.5584 65.4636,-52.5861 68.9605,-46.5221"/>
</g>
<!-- /lht_tree_doc/roots/pcb&#45;rnd&#45;font&#45;v1/children/FONT&#45;ID/children/symbols/children/CHARACTER/children/objects/children/line.ID/children/y1 -->
<g id="node15" class="node"><title>/lht_tree_doc/roots/pcb&#45;rnd&#45;font&#45;v1/children/FONT&#45;ID/children/symbols/children/CHARACTER/children/objects/children/line.ID/children/y1</title>
<g id="a_node15"><a xlink:href="tree.html#/lht_tree_doc/roots/pcb-rnd-font-v1/children/FONT-ID/children/symbols/children/CHARACTER/children/objects/children/line.ID/children/y1" xlink:title="line first endpoint, vertical offset ">
<ellipse fill="none" stroke="black" cx="117.234" cy="-26.8701" rx="33.4697" ry="26.7407"/>
<text text-anchor="middle" x="117.234" y="-30.6701" font-family="Times,serif" font-size="14.00">y1</text>
<text text-anchor="middle" x="117.234" y="-15.6701" font-family="Times,serif" font-size="14.00">coord</text>
</a>
</g>
</g>
<!-- /lht_tree_doc/roots/pcb&#45;rnd&#45;font&#45;v1/children/FONT&#45;ID/children/symbols/children/CHARACTER/children/objects/children/line.ID&#45;&gt;/lht_tree_doc/roots/pcb&#45;rnd&#45;font&#45;v1/children/FONT&#45;ID/children/symbols/children/CHARACTER/children/objects/children/line.ID/children/y1 -->
<g id="edge14" class="edge"><title>/lht_tree_doc/roots/pcb&#45;rnd&#45;font&#45;v1/children/FONT&#45;ID/children/symbols/children/CHARACTER/children/objects/children/line.ID&#45;&gt;/lht_tree_doc/roots/pcb&#45;rnd&#45;font&#45;v1/children/FONT&#45;ID/children/symbols/children/CHARACTER/children/objects/children/line.ID/children/y1</title>
<path fill="none" stroke="black" d="M213.054,-95.132C194.155,-81.8655 169.789,-64.7615 150.357,-51.1214"/>
<polygon fill="black" stroke="black" points="152.284,-48.1979 142.089,-45.3172 148.263,-53.9273 152.284,-48.1979"/>
</g>
<!-- /lht_tree_doc/roots/pcb&#45;rnd&#45;font&#45;v1/children/FONT&#45;ID/children/symbols/children/CHARACTER/children/objects/children/line.ID/children/x2 -->
<g id="node16" class="node"><title>/lht_tree_doc/roots/pcb&#45;rnd&#45;font&#45;v1/children/FONT&#45;ID/children/symbols/children/CHARACTER/children/objects/children/line.ID/children/x2</title>
<g id="a_node16"><a xlink:href="tree.html#/lht_tree_doc/roots/pcb-rnd-font-v1/children/FONT-ID/children/symbols/children/CHARACTER/children/objects/children/line.ID/children/x2" xlink:title="line second endpoint, horizontal offset ">
<ellipse fill="none" stroke="black" cx="201.234" cy="-26.8701" rx="33.4697" ry="26.7407"/>
<text text-anchor="middle" x="201.234" y="-30.6701" font-family="Times,serif" font-size="14.00">x2</text>
<text text-anchor="middle" x="201.234" y="-15.6701" font-family="Times,serif" font-size="14.00">coord</text>
</a>
</g>
</g>
<!-- /lht_tree_doc/roots/pcb&#45;rnd&#45;font&#45;v1/children/FONT&#45;ID/children/symbols/children/CHARACTER/children/objects/children/line.ID&#45;&gt;/lht_tree_doc/roots/pcb&#45;rnd&#45;font&#45;v1/children/FONT&#45;ID/children/symbols/children/CHARACTER/children/objects/children/line.ID/children/x2 -->
<g id="edge15" class="edge"><title>/lht_tree_doc/roots/pcb&#45;rnd&#45;font&#45;v1/children/FONT&#45;ID/children/symbols/children/CHARACTER/children/objects/children/line.ID&#45;&gt;/lht_tree_doc/roots/pcb&#45;rnd&#45;font&#45;v1/children/FONT&#45;ID/children/symbols/children/CHARACTER/children/objects/children/line.ID/children/x2</title>
<path fill="none" stroke="black" d="M230.86,-90.2586C226.577,-81.2393 221.715,-70.9999 217.185,-61.4619"/>
<polygon fill="black" stroke="black" points="220.252,-59.7608 212.801,-52.2288 213.929,-62.7635 220.252,-59.7608"/>
</g>
<!-- /lht_tree_doc/roots/pcb&#45;rnd&#45;font&#45;v1/children/FONT&#45;ID/children/symbols/children/CHARACTER/children/objects/children/line.ID/children/y2 -->
<g id="node17" class="node"><title>/lht_tree_doc/roots/pcb&#45;rnd&#45;font&#45;v1/children/FONT&#45;ID/children/symbols/children/CHARACTER/children/objects/children/line.ID/children/y2</title>
<g id="a_node17"><a xlink:href="tree.html#/lht_tree_doc/roots/pcb-rnd-font-v1/children/FONT-ID/children/symbols/children/CHARACTER/children/objects/children/line.ID/children/y2" xlink:title="line second endpoint, vertical offset ">
<ellipse fill="none" stroke="black" cx="285.234" cy="-26.8701" rx="33.4697" ry="26.7407"/>
<text text-anchor="middle" x="285.234" y="-30.6701" font-family="Times,serif" font-size="14.00">y2</text>
<text text-anchor="middle" x="285.234" y="-15.6701" font-family="Times,serif" font-size="14.00">coord</text>
</a>
</g>
</g>
<!-- /lht_tree_doc/roots/pcb&#45;rnd&#45;font&#45;v1/children/FONT&#45;ID/children/symbols/children/CHARACTER/children/objects/children/line.ID&#45;&gt;/lht_tree_doc/roots/pcb&#45;rnd&#45;font&#45;v1/children/FONT&#45;ID/children/symbols/children/CHARACTER/children/objects/children/line.ID/children/y2 -->
<g id="edge16" class="edge"><title>/lht_tree_doc/roots/pcb&#45;rnd&#45;font&#45;v1/children/FONT&#45;ID/children/symbols/children/CHARACTER/children/objects/children/line.ID&#45;&gt;/lht_tree_doc/roots/pcb&#45;rnd&#45;font&#45;v1/children/FONT&#45;ID/children/symbols/children/CHARACTER/children/objects/children/line.ID/children/y2</title>
<path fill="none" stroke="black" d="M255.608,-90.2586C259.891,-81.2393 264.753,-70.9999 269.283,-61.4619"/>
<polygon fill="black" stroke="black" points="272.539,-62.7635 273.667,-52.2288 266.216,-59.7608 272.539,-62.7635"/>
</g>
<!-- /lht_tree_doc/roots/pcb&#45;rnd&#45;font&#45;v1/children/FONT&#45;ID/children/symbols/children/CHARACTER/children/objects/children/line.ID/children/thickness -->
<g id="node18" class="node"><title>/lht_tree_doc/roots/pcb&#45;rnd&#45;font&#45;v1/children/FONT&#45;ID/children/symbols/children/CHARACTER/children/objects/children/line.ID/children/thickness</title>
<g id="a_node18"><a xlink:href="tree.html#/lht_tree_doc/roots/pcb-rnd-font-v1/children/FONT-ID/children/symbols/children/CHARACTER/children/objects/children/line.ID/children/thickness" xlink:title="width of the line ">
<ellipse fill="none" stroke="black" cx="384.234" cy="-26.8701" rx="47.2526" ry="26.7407"/>
<text text-anchor="middle" x="384.234" y="-30.6701" font-family="Times,serif" font-size="14.00">thickness</text>
<text text-anchor="middle" x="384.234" y="-15.6701" font-family="Times,serif" font-size="14.00">coord</text>
</a>
</g>
</g>
<!-- /lht_tree_doc/roots/pcb&#45;rnd&#45;font&#45;v1/children/FONT&#45;ID/children/symbols/children/CHARACTER/children/objects/children/line.ID&#45;&gt;/lht_tree_doc/roots/pcb&#45;rnd&#45;font&#45;v1/children/FONT&#45;ID/children/symbols/children/CHARACTER/children/objects/children/line.ID/children/thickness -->
<g id="edge17" class="edge"><title>/lht_tree_doc/roots/pcb&#45;rnd&#45;font&#45;v1/children/FONT&#45;ID/children/symbols/children/CHARACTER/children/objects/children/line.ID&#45;&gt;/lht_tree_doc/roots/pcb&#45;rnd&#45;font&#45;v1/children/FONT&#45;ID/children/symbols/children/CHARACTER/children/objects/children/line.ID/children/thickness</title>
<path fill="none" stroke="black" d="M275.582,-96.0257C296.02,-83.2057 322.578,-66.5459 344.321,-52.9066"/>
<polygon fill="black" stroke="black" points="346.394,-55.738 353.006,-47.4591 342.675,-49.8081 346.394,-55.738"/>
</g>
<!-- /lht_tree_doc/roots/pcb&#45;rnd&#45;font&#45;v1/children/FONT&#45;ID/children/symbols/children/CHARACTER/children/objects/children/simplearc.ID/children/x -->
<g id="node20" class="node"><title>/lht_tree_doc/roots/pcb&#45;rnd&#45;font&#45;v1/children/FONT&#45;ID/children/symbols/children/CHARACTER/children/objects/children/simplearc.ID/children/x</title>
<g id="a_node20"><a xlink:href="tree.html#/lht_tree_doc/roots/pcb-rnd-font-v1/children/FONT-ID/children/symbols/children/CHARACTER/children/objects/children/simplearc.ID/children/x" xlink:title="center, X coord">
<ellipse fill="none" stroke="black" cx="483.234" cy="-26.8701" rx="33.4697" ry="26.7407"/>
<text text-anchor="middle" x="483.234" y="-30.6701" font-family="Times,serif" font-size="14.00">x</text>
<text text-anchor="middle" x="483.234" y="-15.6701" font-family="Times,serif" font-size="14.00">coord</text>
</a>
</g>
</g>
<!-- /lht_tree_doc/roots/pcb&#45;rnd&#45;font&#45;v1/children/FONT&#45;ID/children/symbols/children/CHARACTER/children/objects/children/simplearc.ID&#45;&gt;/lht_tree_doc/roots/pcb&#45;rnd&#45;font&#45;v1/children/FONT&#45;ID/children/symbols/children/CHARACTER/children/objects/children/simplearc.ID/children/x -->
<g id="edge19" class="edge"><title>/lht_tree_doc/roots/pcb&#45;rnd&#45;font&#45;v1/children/FONT&#45;ID/children/symbols/children/CHARACTER/children/objects/children/simplearc.ID&#45;&gt;/lht_tree_doc/roots/pcb&#45;rnd&#45;font&#45;v1/children/FONT&#45;ID/children/symbols/children/CHARACTER/children/objects/children/simplearc.ID/children/x</title>
<path fill="none" stroke="black" d="M606.405,-95.2816C582.107,-83.5738 551.717,-68.4328 525.234,-53.7401 522.707,-52.3379 520.116,-50.8558 517.522,-49.3392"/>
<polygon fill="black" stroke="black" points="519.159,-46.2406 508.78,-44.1161 515.569,-52.2498 519.159,-46.2406"/>
</g>
<!-- /lht_tree_doc/roots/pcb&#45;rnd&#45;font&#45;v1/children/FONT&#45;ID/children/symbols/children/CHARACTER/children/objects/children/simplearc.ID/children/y -->
<g id="node21" class="node"><title>/lht_tree_doc/roots/pcb&#45;rnd&#45;font&#45;v1/children/FONT&#45;ID/children/symbols/children/CHARACTER/children/objects/children/simplearc.ID/children/y</title>
<g id="a_node21"><a xlink:href="tree.html#/lht_tree_doc/roots/pcb-rnd-font-v1/children/FONT-ID/children/symbols/children/CHARACTER/children/objects/children/simplearc.ID/children/y" xlink:title="center, Y coord">
<ellipse fill="none" stroke="black" cx="567.234" cy="-26.8701" rx="33.4697" ry="26.7407"/>
<text text-anchor="middle" x="567.234" y="-30.6701" font-family="Times,serif" font-size="14.00">y</text>
<text text-anchor="middle" x="567.234" y="-15.6701" font-family="Times,serif" font-size="14.00">coord</text>
</a>
</g>
</g>
<!-- /lht_tree_doc/roots/pcb&#45;rnd&#45;font&#45;v1/children/FONT&#45;ID/children/symbols/children/CHARACTER/children/objects/children/simplearc.ID&#45;&gt;/lht_tree_doc/roots/pcb&#45;rnd&#45;font&#45;v1/children/FONT&#45;ID/children/symbols/children/CHARACTER/children/objects/children/simplearc.ID/children/y -->
<g id="edge20" class="edge"><title>/lht_tree_doc/roots/pcb&#45;rnd&#45;font&#45;v1/children/FONT&#45;ID/children/symbols/children/CHARACTER/children/objects/children/simplearc.ID&#45;&gt;/lht_tree_doc/roots/pcb&#45;rnd&#45;font&#45;v1/children/FONT&#45;ID/children/symbols/children/CHARACTER/children/objects/children/simplearc.ID/children/y</title>
<path fill="none" stroke="black" d="M627.388,-91.2084C616.984,-80.2535 604.739,-67.3607 594.022,-56.0766"/>
<polygon fill="black" stroke="black" points="596.313,-53.4059 586.889,-48.5651 591.237,-58.2264 596.313,-53.4059"/>
</g>
<!-- /lht_tree_doc/roots/pcb&#45;rnd&#45;font&#45;v1/children/FONT&#45;ID/children/symbols/children/CHARACTER/children/objects/children/simplearc.ID/children/r -->
<g id="node22" class="node"><title>/lht_tree_doc/roots/pcb&#45;rnd&#45;font&#45;v1/children/FONT&#45;ID/children/symbols/children/CHARACTER/children/objects/children/simplearc.ID/children/r</title>
<g id="a_node22"><a xlink:href="tree.html#/lht_tree_doc/roots/pcb-rnd-font-v1/children/FONT-ID/children/symbols/children/CHARACTER/children/objects/children/simplearc.ID/children/r" xlink:title="radius (of the centerline of the arc) ">
<ellipse fill="none" stroke="black" cx="651.234" cy="-26.8701" rx="33.4697" ry="26.7407"/>
<text text-anchor="middle" x="651.234" y="-30.6701" font-family="Times,serif" font-size="14.00">r</text>
<text text-anchor="middle" x="651.234" y="-15.6701" font-family="Times,serif" font-size="14.00">coord</text>
</a>
</g>
</g>
<!-- /lht_tree_doc/roots/pcb&#45;rnd&#45;font&#45;v1/children/FONT&#45;ID/children/symbols/children/CHARACTER/children/objects/children/simplearc.ID&#45;&gt;/lht_tree_doc/roots/pcb&#45;rnd&#45;font&#45;v1/children/FONT&#45;ID/children/symbols/children/CHARACTER/children/objects/children/simplearc.ID/children/r -->
<g id="edge21" class="edge"><title>/lht_tree_doc/roots/pcb&#45;rnd&#45;font&#45;v1/children/FONT&#45;ID/children/symbols/children/CHARACTER/children/objects/children/simplearc.ID&#45;&gt;/lht_tree_doc/roots/pcb&#45;rnd&#45;font&#45;v1/children/FONT&#45;ID/children/symbols/children/CHARACTER/children/objects/children/simplearc.ID/children/r</title>
<path fill="none" stroke="black" d="M651.234,-89.2996C651.234,-81.2816 651.234,-72.3696 651.234,-63.8767"/>
<polygon fill="black" stroke="black" points="654.734,-63.8132 651.234,-53.8132 647.734,-63.8133 654.734,-63.8132"/>
</g>
<!-- /lht_tree_doc/roots/pcb&#45;rnd&#45;font&#45;v1/children/FONT&#45;ID/children/symbols/children/CHARACTER/children/objects/children/simplearc.ID/children/thickness -->
<g id="node23" class="node"><title>/lht_tree_doc/roots/pcb&#45;rnd&#45;font&#45;v1/children/FONT&#45;ID/children/symbols/children/CHARACTER/children/objects/children/simplearc.ID/children/thickness</title>
<g id="a_node23"><a xlink:href="tree.html#/lht_tree_doc/roots/pcb-rnd-font-v1/children/FONT-ID/children/symbols/children/CHARACTER/children/objects/children/simplearc.ID/children/thickness" xlink:title="width of the pen the arc is drawn with ">
<ellipse fill="none" stroke="black" cx="750.234" cy="-26.8701" rx="47.2526" ry="26.7407"/>
<text text-anchor="middle" x="750.234" y="-30.6701" font-family="Times,serif" font-size="14.00">thickness</text>
<text text-anchor="middle" x="750.234" y="-15.6701" font-family="Times,serif" font-size="14.00">coord</text>
</a>
</g>
</g>
<!-- /lht_tree_doc/roots/pcb&#45;rnd&#45;font&#45;v1/children/FONT&#45;ID/children/symbols/children/CHARACTER/children/objects/children/simplearc.ID&#45;&gt;/lht_tree_doc/roots/pcb&#45;rnd&#45;font&#45;v1/children/FONT&#45;ID/children/symbols/children/CHARACTER/children/objects/children/simplearc.ID/children/thickness -->
<g id="edge22" class="edge"><title>/lht_tree_doc/roots/pcb&#45;rnd&#45;font&#45;v1/children/FONT&#45;ID/children/symbols/children/CHARACTER/children/objects/children/simplearc.ID&#45;&gt;/lht_tree_doc/roots/pcb&#45;rnd&#45;font&#45;v1/children/FONT&#45;ID/children/symbols/children/CHARACTER/children/objects/children/simplearc.ID/children/thickness</title>
<path fill="none" stroke="black" d="M678.811,-91.6798C690.94,-80.8434 705.27,-68.0409 717.899,-56.7583"/>
<polygon fill="black" stroke="black" points="720.382,-59.2334 725.508,-49.9609 715.718,-54.0133 720.382,-59.2334"/>
</g>
<!-- /lht_tree_doc/roots/pcb&#45;rnd&#45;font&#45;v1/children/FONT&#45;ID/children/symbols/children/CHARACTER/children/objects/children/simplearc.ID/children/astart -->
<g id="node24" class="node"><title>/lht_tree_doc/roots/pcb&#45;rnd&#45;font&#45;v1/children/FONT&#45;ID/children/symbols/children/CHARACTER/children/objects/children/simplearc.ID/children/astart</title>
<g id="a_node24"><a xlink:href="tree.html#/lht_tree_doc/roots/pcb-rnd-font-v1/children/FONT-ID/children/symbols/children/CHARACTER/children/objects/children/simplearc.ID/children/astart" xlink:title=" start angle">
<ellipse fill="none" stroke="black" cx="848.234" cy="-26.8701" rx="32.5538" ry="26.7407"/>
<text text-anchor="middle" x="848.234" y="-30.6701" font-family="Times,serif" font-size="14.00">astart</text>
<text text-anchor="middle" x="848.234" y="-15.6701" font-family="Times,serif" font-size="14.00">angle</text>
</a>
</g>
</g>
<!-- /lht_tree_doc/roots/pcb&#45;rnd&#45;font&#45;v1/children/FONT&#45;ID/children/symbols/children/CHARACTER/children/objects/children/simplearc.ID&#45;&gt;/lht_tree_doc/roots/pcb&#45;rnd&#45;font&#45;v1/children/FONT&#45;ID/children/symbols/children/CHARACTER/children/objects/children/simplearc.ID/children/astart -->
<g id="edge23" class="edge"><title>/lht_tree_doc/roots/pcb&#45;rnd&#45;font&#45;v1/children/FONT&#45;ID/children/symbols/children/CHARACTER/children/objects/children/simplearc.ID&#45;&gt;/lht_tree_doc/roots/pcb&#45;rnd&#45;font&#45;v1/children/FONT&#45;ID/children/symbols/children/CHARACTER/children/objects/children/simplearc.ID/children/astart</title>
<path fill="none" stroke="black" d="M703.512,-97.7274C734.028,-86.2594 772.951,-70.5584 806.234,-53.7401 808.974,-52.3557 811.77,-50.8518 814.552,-49.289"/>
<polygon fill="black" stroke="black" points="816.442,-52.2386 823.31,-44.1711 812.91,-46.1949 816.442,-52.2386"/>
</g>
<!-- /lht_tree_doc/roots/pcb&#45;rnd&#45;font&#45;v1/children/FONT&#45;ID/children/symbols/children/CHARACTER/children/objects/children/simplearc.ID/children/adelta -->
<g id="node25" class="node"><title>/lht_tree_doc/roots/pcb&#45;rnd&#45;font&#45;v1/children/FONT&#45;ID/children/symbols/children/CHARACTER/children/objects/children/simplearc.ID/children/adelta</title>
<g id="a_node25"><a xlink:href="tree.html#/lht_tree_doc/roots/pcb-rnd-font-v1/children/FONT-ID/children/symbols/children/CHARACTER/children/objects/children/simplearc.ID/children/adelta" xlink:title=" delta angle">
<ellipse fill="none" stroke="black" cx="933.234" cy="-26.8701" rx="34.7971" ry="26.7407"/>
<text text-anchor="middle" x="933.234" y="-30.6701" font-family="Times,serif" font-size="14.00">adelta</text>
<text text-anchor="middle" x="933.234" y="-15.6701" font-family="Times,serif" font-size="14.00">angle</text>
</a>
</g>
</g>
<!-- /lht_tree_doc/roots/pcb&#45;rnd&#45;font&#45;v1/children/FONT&#45;ID/children/symbols/children/CHARACTER/children/objects/children/simplearc.ID&#45;&gt;/lht_tree_doc/roots/pcb&#45;rnd&#45;font&#45;v1/children/FONT&#45;ID/children/symbols/children/CHARACTER/children/objects/children/simplearc.ID/children/adelta -->
<g id="edge24" class="edge"><title>/lht_tree_doc/roots/pcb&#45;rnd&#45;font&#45;v1/children/FONT&#45;ID/children/symbols/children/CHARACTER/children/objects/children/simplearc.ID&#45;&gt;/lht_tree_doc/roots/pcb&#45;rnd&#45;font&#45;v1/children/FONT&#45;ID/children/symbols/children/CHARACTER/children/objects/children/simplearc.ID/children/adelta</title>
<path fill="none" stroke="black" d="M704.842,-98.1947C714.261,-95.2251 724.002,-92.2894 733.234,-89.7401 802.24,-70.6855 823.846,-80.527 890.234,-53.7401 893.052,-52.6032 895.9,-51.296 898.717,-49.8859"/>
<polygon fill="black" stroke="black" points="900.409,-52.9501 907.54,-45.1145 897.079,-46.7928 900.409,-52.9501"/>
</g>
</g>
</svg>
