%!PS-Adobe-3.0 EPSF-3.0
%%BoundingBox: 0 0 37.000000 37.000000
%%Pages: 1
save countdictstack mark newpath /showpage {} def /setpagedevice {pop} def
%%EndProlog
%%Page: 1 1
%%BeginDocument: thermal_layer.eps

72 72 scale
1 dup neg scale
1 dup scale
0.00000 -0.50000 translate
/nclip { -0.01000 -0.01000 moveto -0.01000 0.51000 lineto 0.51000 0.51000 lineto 0.51000 -0.01000 lineto -0.01000 -0.01000 lineto eoclip newpath } def
/t { moveto lineto stroke } bind def
/tc { moveto lineto strokepath nclip } bind def
/r { /y2 exch def /x2 exch def /y1 exch def /x1 exch def
     x1 y1 moveto x1 y2 lineto x2 y2 lineto x2 y1 lineto closepath fill } bind def
/c { 0 360 arc fill } bind def
/cc { 0 360 arc nclip } bind def
/a { gsave setlinewidth translate scale 0 0 1 5 3 roll arc stroke grestore} bind def
% Layer bottom group 10 drill 0 mask 0
0.00000 setlinewidth
1 setlinecap
0.227451 0.372549 0.803922 setrgbcolor
0.07500 0.07500 moveto
0.13914 0.07500 lineto
0.13400 0.08014 lineto
0.13519 0.08207 lineto
0.13756 0.08780 lineto
0.13901 0.09382 lineto
0.13937 0.10000 lineto
0.13901 0.10618 lineto
0.13756 0.11220 lineto
0.13519 0.11793 lineto
0.13400 0.11986 lineto
0.14855 0.13440 lineto
0.15306 0.12704 lineto
0.15664 0.11840 lineto
0.15882 0.10932 lineto
0.15937 0.10000 lineto
0.15882 0.09068 lineto
0.15664 0.08160 lineto
0.15391 0.07500 lineto
0.17500 0.07500 lineto
0.17500 0.17500 lineto
0.07500 0.17500 lineto
0.07500 0.15391 lineto
0.08160 0.15664 lineto
0.09068 0.15882 lineto
0.10000 0.15955 lineto
0.10932 0.15882 lineto
0.11840 0.15664 lineto
0.12704 0.15306 lineto
0.13440 0.14855 lineto
0.11986 0.13400 lineto
0.11793 0.13519 lineto
0.11220 0.13756 lineto
0.10618 0.13901 lineto
0.10000 0.13949 lineto
0.09382 0.13901 lineto
0.08780 0.13756 lineto
0.08207 0.13519 lineto
0.08014 0.13400 lineto
0.07500 0.13914 lineto
fill
0.07500 0.25000 moveto
0.17500 0.25000 lineto
0.17500 0.35000 lineto
0.07500 0.35000 lineto
fill
0.498039 0.498039 0.498039 setrgbcolor
0.10000 0.10000 0.03937 c
0.27500 0.10000 0.03937 c
0.10000 0.27500 0.03937 c
0.27500 0.27500 0.03937 c
1 1 1 setrgbcolor
0.10000 0.10000 0.01575 c
0.27500 0.10000 0.01575 c
0.10000 0.27500 0.01575 c
0.27500 0.27500 0.01575 c
% Layer group5 group 5 drill 0 mask 0
0.498039 0.498039 0.498039 setrgbcolor
0.10000 0.10000 0.03937 c
0.27500 0.10000 0.03937 c
0.10000 0.27500 0.03937 c
0.27500 0.27500 0.03937 c
1 1 1 setrgbcolor
0.10000 0.10000 0.01575 c
0.27500 0.10000 0.01575 c
0.10000 0.27500 0.01575 c
0.27500 0.27500 0.01575 c
% Layer group7 group 7 drill 0 mask 0
0.498039 0.498039 0.498039 setrgbcolor
0.10000 0.10000 0.03937 c
0.27500 0.10000 0.03937 c
0.10000 0.27500 0.03937 c
0.27500 0.27500 0.03937 c
1 1 1 setrgbcolor
0.10000 0.10000 0.01575 c
0.27500 0.10000 0.01575 c
0.10000 0.27500 0.01575 c
0.27500 0.27500 0.01575 c
% Layer top group 3 drill 0 mask 0
0.0627451 0.305882 0.545098 setrgbcolor
0.25000 0.07500 moveto
0.31414 0.07500 lineto
0.30900 0.08014 lineto
0.31019 0.08207 lineto
0.31256 0.08780 lineto
0.31401 0.09382 lineto
0.31437 0.10000 lineto
0.31401 0.10618 lineto
0.31256 0.11220 lineto
0.31019 0.11793 lineto
0.30900 0.11986 lineto
0.32355 0.13440 lineto
0.32806 0.12704 lineto
0.33164 0.11840 lineto
0.33382 0.10932 lineto
0.33437 0.10000 lineto
0.33382 0.09068 lineto
0.33164 0.08160 lineto
0.32891 0.07500 lineto
0.35000 0.07500 lineto
0.35000 0.17500 lineto
0.25000 0.17500 lineto
0.25000 0.15391 lineto
0.25660 0.15664 lineto
0.26568 0.15882 lineto
0.27500 0.15955 lineto
0.28432 0.15882 lineto
0.29340 0.15664 lineto
0.30204 0.15306 lineto
0.30940 0.14855 lineto
0.29486 0.13400 lineto
0.29293 0.13519 lineto
0.28720 0.13756 lineto
0.28118 0.13901 lineto
0.27500 0.13949 lineto
0.26882 0.13901 lineto
0.26280 0.13756 lineto
0.25707 0.13519 lineto
0.25514 0.13400 lineto
0.25000 0.13914 lineto
fill
0.25000 0.25000 moveto
0.35000 0.25000 lineto
0.35000 0.35000 lineto
0.25000 0.35000 lineto
fill
0.545098 0.137255 0.137255 setrgbcolor
0.02500 0.02500 moveto
0.12500 0.02500 lineto
0.12500 0.04670 lineto
0.12475 0.04645 lineto
0.12346 0.04554 lineto
0.12204 0.04487 lineto
0.11672 0.04296 lineto
0.11123 0.04163 lineto
0.10564 0.04083 lineto
0.10000 0.04056 lineto
0.09436 0.04083 lineto
0.08877 0.04163 lineto
0.08328 0.04296 lineto
0.07794 0.04481 lineto
0.07652 0.04550 lineto
0.07523 0.04642 lineto
0.07409 0.04752 lineto
0.07315 0.04879 lineto
0.07241 0.05019 lineto
0.07191 0.05168 lineto
0.07164 0.05324 lineto
0.07162 0.05482 lineto
0.07185 0.05639 lineto
0.07232 0.05790 lineto
0.07302 0.05931 lineto
0.07393 0.06061 lineto
0.07504 0.06174 lineto
0.07630 0.06268 lineto
0.07770 0.06342 lineto
0.07920 0.06392 lineto
0.08076 0.06419 lineto
0.08234 0.06421 lineto
0.08390 0.06398 lineto
0.08540 0.06348 lineto
0.08892 0.06222 lineto
0.09256 0.06134 lineto
0.09626 0.06081 lineto
0.10000 0.06063 lineto
0.10374 0.06081 lineto
0.10744 0.06134 lineto
0.11108 0.06222 lineto
0.11461 0.06344 lineto
0.11611 0.06394 lineto
0.11766 0.06417 lineto
0.11924 0.06415 lineto
0.12079 0.06388 lineto
0.12228 0.06338 lineto
0.12367 0.06264 lineto
0.12493 0.06170 lineto
0.12500 0.06164 lineto
0.12500 0.12500 lineto
0.06170 0.12500 lineto
0.06174 0.12496 lineto
0.06268 0.12370 lineto
0.06342 0.12230 lineto
0.06392 0.12080 lineto
0.06419 0.11924 lineto
0.06421 0.11766 lineto
0.06398 0.11610 lineto
0.06348 0.11460 lineto
0.06222 0.11108 lineto
0.06134 0.10744 lineto
0.06081 0.10374 lineto
0.06063 0.10000 lineto
0.06081 0.09626 lineto
0.06134 0.09256 lineto
0.06222 0.08892 lineto
0.06344 0.08539 lineto
0.06394 0.08389 lineto
0.06417 0.08234 lineto
0.06415 0.08076 lineto
0.06388 0.07921 lineto
0.06338 0.07772 lineto
0.06264 0.07633 lineto
0.06170 0.07507 lineto
0.06058 0.07397 lineto
0.05929 0.07306 lineto
0.05788 0.07236 lineto
0.05638 0.07189 lineto
0.05482 0.07167 lineto
0.05325 0.07168 lineto
0.05169 0.07195 lineto
0.05020 0.07246 lineto
0.04881 0.07319 lineto
0.04755 0.07413 lineto
0.04645 0.07525 lineto
0.04554 0.07654 lineto
0.04487 0.07796 lineto
0.04296 0.08328 lineto
0.04163 0.08877 lineto
0.04083 0.09436 lineto
0.04056 0.10000 lineto
0.04083 0.10564 lineto
0.04163 0.11123 lineto
0.04296 0.11672 lineto
0.04481 0.12206 lineto
0.04550 0.12348 lineto
0.04642 0.12477 lineto
0.04664 0.12500 lineto
0.02500 0.12500 lineto
fill
0.20000 0.02500 moveto
0.30000 0.02500 lineto
0.30000 0.04670 lineto
0.29975 0.04645 lineto
0.29846 0.04554 lineto
0.29704 0.04487 lineto
0.29172 0.04296 lineto
0.28623 0.04163 lineto
0.28064 0.04083 lineto
0.27500 0.04056 lineto
0.26936 0.04083 lineto
0.26377 0.04163 lineto
0.25828 0.04296 lineto
0.25294 0.04481 lineto
0.25152 0.04550 lineto
0.25023 0.04642 lineto
0.24909 0.04752 lineto
0.24815 0.04879 lineto
0.24741 0.05019 lineto
0.24691 0.05168 lineto
0.24664 0.05324 lineto
0.24662 0.05482 lineto
0.24685 0.05639 lineto
0.24732 0.05790 lineto
0.24802 0.05931 lineto
0.24893 0.06061 lineto
0.25004 0.06174 lineto
0.25130 0.06268 lineto
0.25270 0.06342 lineto
0.25420 0.06392 lineto
0.25576 0.06419 lineto
0.25734 0.06421 lineto
0.25890 0.06398 lineto
0.26040 0.06348 lineto
0.26392 0.06222 lineto
0.26756 0.06134 lineto
0.27126 0.06081 lineto
0.27500 0.06063 lineto
0.27874 0.06081 lineto
0.28244 0.06134 lineto
0.28608 0.06222 lineto
0.28961 0.06344 lineto
0.29111 0.06394 lineto
0.29266 0.06417 lineto
0.29424 0.06415 lineto
0.29579 0.06388 lineto
0.29728 0.06338 lineto
0.29867 0.06264 lineto
0.29993 0.06170 lineto
0.30000 0.06164 lineto
0.30000 0.12500 lineto
0.23670 0.12500 lineto
0.23674 0.12496 lineto
0.23768 0.12370 lineto
0.23842 0.12230 lineto
0.23892 0.12080 lineto
0.23919 0.11924 lineto
0.23921 0.11766 lineto
0.23898 0.11610 lineto
0.23848 0.11460 lineto
0.23722 0.11108 lineto
0.23634 0.10744 lineto
0.23581 0.10374 lineto
0.23563 0.10000 lineto
0.23581 0.09626 lineto
0.23634 0.09256 lineto
0.23722 0.08892 lineto
0.23844 0.08539 lineto
0.23894 0.08389 lineto
0.23917 0.08234 lineto
0.23915 0.08076 lineto
0.23888 0.07921 lineto
0.23838 0.07772 lineto
0.23764 0.07633 lineto
0.23670 0.07507 lineto
0.23558 0.07397 lineto
0.23429 0.07306 lineto
0.23288 0.07236 lineto
0.23138 0.07189 lineto
0.22982 0.07167 lineto
0.22825 0.07168 lineto
0.22669 0.07195 lineto
0.22520 0.07246 lineto
0.22381 0.07319 lineto
0.22255 0.07413 lineto
0.22145 0.07525 lineto
0.22054 0.07654 lineto
0.21987 0.07796 lineto
0.21796 0.08328 lineto
0.21663 0.08877 lineto
0.21583 0.09436 lineto
0.21556 0.10000 lineto
0.21583 0.10564 lineto
0.21663 0.11123 lineto
0.21796 0.11672 lineto
0.21981 0.12206 lineto
0.22050 0.12348 lineto
0.22142 0.12477 lineto
0.22164 0.12500 lineto
0.20000 0.12500 lineto
fill
0.02500 0.20000 moveto
0.12500 0.20000 lineto
0.12500 0.22109 lineto
0.11840 0.21836 lineto
0.10932 0.21618 lineto
0.10000 0.21545 lineto
0.09068 0.21618 lineto
0.08160 0.21836 lineto
0.07296 0.22194 lineto
0.06500 0.22682 lineto
0.05789 0.23289 lineto
0.05182 0.24000 lineto
0.04694 0.24796 lineto
0.04336 0.25660 lineto
0.04118 0.26568 lineto
0.04045 0.27500 lineto
0.04118 0.28432 lineto
0.04336 0.29340 lineto
0.04609 0.30000 lineto
0.02500 0.30000 lineto
fill
0.20000 0.20000 moveto
0.30000 0.20000 lineto
0.30000 0.22109 lineto
0.29340 0.21836 lineto
0.28432 0.21618 lineto
0.27500 0.21545 lineto
0.26568 0.21618 lineto
0.25660 0.21836 lineto
0.24796 0.22194 lineto
0.24000 0.22682 lineto
0.23289 0.23289 lineto
0.22682 0.24000 lineto
0.22194 0.24796 lineto
0.21836 0.25660 lineto
0.21618 0.26568 lineto
0.21545 0.27500 lineto
0.21618 0.28432 lineto
0.21836 0.29340 lineto
0.22109 0.30000 lineto
0.20000 0.30000 lineto
fill
0.498039 0.498039 0.498039 setrgbcolor
0.10000 0.10000 0.03937 c
0.27500 0.10000 0.03937 c
0.10000 0.27500 0.03937 c
0.27500 0.27500 0.03937 c
1 1 1 setrgbcolor
0.10000 0.10000 0.01575 c
0.27500 0.10000 0.01575 c
0.10000 0.27500 0.01575 c
0.27500 0.27500 0.01575 c
% Layer plated-drill group -1 drill 1 mask 0
0.10000 0.10000 0.01575 c
0.27500 0.10000 0.01575 c
0.10000 0.27500 0.01575 c
0.27500 0.27500 0.01575 c
% Layer topsilk group 1 drill 0 mask 0
% Layer bottomsilk group 12 drill 0 mask 0
showpage
%%EndDocument
%%Trailer
cleartomark countdictstack exch sub { end } repeat restore
%%EOF
