G04 start of page 5 for group 10 layer_idx 1 *
G04 Title: thru-hole elements on both sides, bottom_copper *
G04 Creator: <version>
G04 CreationDate: <date>
G04 For: TEST *
G04 Format: Gerber/RS-274X *
G04 PCB-Dimensions: 50000 50000 *
G04 PCB-Coordinate-Origin: lower left *
%MOIN*%
%FSLAX25Y25*%
%LNBOTTOM*%
%ADD22C,0.0394*%
%ADD21C,0.0800*%
%ADD20C,0.0001*%
G54D20*G36*
X6000Y39000D02*X14000D01*
Y31000D01*
X6000D01*
Y39000D01*
G37*
G54D21*X40000Y35000D03*
G54D20*G36*
X6000Y11000D02*X14000D01*
Y19000D01*
X6000D01*
Y11000D01*
G37*
G54D21*X40000Y15000D03*
G54D22*M02*
