G04 start of page 4 for group 11 layer_idx 0 *
G04 Title: board with minimal netlist and some back-annotation changes, bottom mask *
G04 Creator: <version>
G04 CreationDate: <date>
G04 For: TEST *
G04 Format: Gerber/RS-274X *
G04 PCB-Dimensions: 50000 50000 *
G04 PCB-Coordinate-Origin: lower left *
%MOIN*%
%FSLAX25Y25*%
%LNBOTTOMMASK*%
%ADD15C,0.0860*%
%ADD14C,0.0001*%
%LPD*%
G54D14*G36*
X5700Y36800D02*Y28200D01*
X14300D01*
Y36800D01*
X5700D01*
G37*
G54D15*X40000Y32500D03*
X10000Y22500D03*
X40000D03*
M02*
