G04 start of page 2 for group 0 layer_idx 0 *
G04 Title: Arcs with different sizes, normal cases, TODO:group_name *
G04 Creator: <version>
G04 CreationDate: <date>
G04 For:  *
G04 Format: Gerber/RS-274X *
G04 PCB-Dimensions: 50000 50000 *
G04 PCB-Coordinate-Origin: lower left *
%MOIN*%
%FSLAX25Y25*%
%LNTOP*%
%ADD13C,0.0300*%
%ADD12C,0.0200*%
%ADD11C,0.0100*%
G54D11*X7500Y27500D02*G75*G03X20000Y15000I12500J0D01*G01*
G54D12*X7652Y29236D02*G75*G02X17500Y37500I9848J-1736D01*G01*
G54D11*X27500Y22500D02*G75*G03X32500Y22500I2500J0D01*G01*
G75*G03X28750Y24665I-2500J0D01*G01*
G54D13*X20725Y39246D02*G75*G02X36746Y31775I4275J-11746D01*G01*
M02*
