%!PS-Adobe-3.0 EPSF-3.0
%%BoundingBox: 0 0 37.000000 37.000000
%%Pages: 1
save countdictstack mark newpath /showpage {} def /setpagedevice {pop} def
%%EndProlog
%%Page: 1 1
%%BeginDocument: text_scale.eps

72 72 scale
1 dup neg scale
1 dup scale
0.00000 -0.50000 translate
/nclip { -0.01000 -0.01000 moveto -0.01000 0.51000 lineto 0.51000 0.51000 lineto 0.51000 -0.01000 lineto -0.01000 -0.01000 lineto eoclip newpath } def
/t { moveto lineto stroke } bind def
/tc { moveto lineto strokepath nclip } bind def
/r { /y2 exch def /x2 exch def /y1 exch def /x1 exch def
     x1 y1 moveto x1 y2 lineto x2 y2 lineto x2 y1 lineto closepath fill } bind def
/c { 0 360 arc fill } bind def
/cc { 0 360 arc nclip } bind def
/a { gsave setlinewidth translate scale 0 0 1 5 3 roll arc stroke grestore} bind def
% Layer bottom group 10 drill 0 mask 0
% Layer group5 group 5 drill 0 mask 0
% Layer group7 group 7 drill 0 mask 0
% Layer top group 3 drill 0 mask 0
% Layer topsilk group 1 drill 0 mask 0
0.00700 setlinewidth
1 setlinecap
0 0 0 setrgbcolor
0.05000 0.03500 0.05000 0.06500 t
0.05000 0.03500 0.05700 0.02500 t
0.05700 0.02500 0.06800 0.02500 t
0.06800 0.02500 0.07500 0.03500 t
0.07500 0.03500 0.07500 0.06500 t
0.05000 0.04500 0.07500 0.04500 t
0.08700 0.03300 0.09500 0.02500 t
0.09500 0.02500 0.09500 0.06500 t
0.08700 0.06500 0.10200 0.06500 t
0.05000 0.20100 0.05000 0.20400 t
0.05000 0.20100 0.05070 0.20000 t
0.05070 0.20000 0.05180 0.20000 t
0.05180 0.20000 0.05250 0.20100 t
0.05250 0.20100 0.05250 0.20400 t
0.05000 0.20200 0.05250 0.20200 t
0.05370 0.20050 0.05420 0.20000 t
0.05420 0.20000 0.05570 0.20000 t
0.05570 0.20000 0.05620 0.20050 t
0.05620 0.20050 0.05620 0.20150 t
0.05370 0.20400 0.05620 0.20150 t
0.05370 0.20400 0.05620 0.20400 t
0.01280 setlinewidth
0.05000 0.33200 0.05000 0.42800 t
0.05000 0.33200 0.07240 0.30000 t
0.07240 0.30000 0.10760 0.30000 t
0.10760 0.30000 0.13000 0.33200 t
0.13000 0.33200 0.13000 0.42800 t
0.05000 0.36400 0.13000 0.36400 t
0.16840 0.31600 0.18440 0.30000 t
0.18440 0.30000 0.21640 0.30000 t
0.21640 0.30000 0.23240 0.31600 t
0.21640 0.42800 0.23240 0.41200 t
0.18440 0.42800 0.21640 0.42800 t
0.16840 0.41200 0.18440 0.42800 t
0.18440 0.35760 0.21640 0.35760 t
0.23240 0.31600 0.23240 0.34160 t
0.23240 0.37360 0.23240 0.41200 t
0.23240 0.37360 0.21640 0.35760 t
0.23240 0.34160 0.21640 0.35760 t
% Layer bottomsilk group 12 drill 0 mask 0
showpage
%%EndDocument
%%Trailer
cleartomark countdictstack exch sub { end } repeat restore
%%EOF
