G04 start of page 4 for group 1 layer_idx 8 *
G04 Title: pads with different geometry, top_silk *
G04 Creator: <version>
G04 CreationDate: <date>
G04 For: TEST *
G04 Format: Gerber/RS-274X *
G04 PCB-Dimensions: 50000 50000 *
G04 PCB-Coordinate-Origin: lower left *
%MOIN*%
%FSLAX25Y25*%
%LNTOPSILK*%
%ADD15C,0.0070*%
%ADD14C,0.0100*%
%ADD13C,0.0080*%
G54D13*X22638Y43740D02*X27362D01*
X22638Y36260D02*X27362D01*
G54D14*X21000Y21900D02*Y10000D01*
X29000D01*
Y21900D01*
X21000D01*
G54D15*X21850Y35650D02*X23850D01*
X24350Y35150D01*
Y34150D01*
X23850Y33650D02*X24350Y34150D01*
X22350Y33650D02*X23850D01*
X22350Y35650D02*Y31650D01*
X23150Y33650D02*X24350Y31650D01*
X25550Y34850D02*X26350Y35650D01*
Y31650D01*
X25550D02*X27050D01*
X22500Y8500D02*Y5000D01*
X23000Y4500D01*
X24000D01*
X24500Y5000D01*
Y8500D02*Y5000D01*
X25700Y7700D02*X26500Y8500D01*
Y4500D01*
X25700D02*X27200D01*
M02*
