%!PS-Adobe-3.0 EPSF-3.0
%%BoundingBox: 0 0 37.000000 37.000000
%%Pages: 1
save countdictstack mark newpath /showpage {} def /setpagedevice {pop} def
%%EndProlog
%%Page: 1 1
%%BeginDocument: arc_f_clear.eps

72 72 scale
1 dup neg scale
1 dup scale
0.00000 -0.50000 translate
/nclip { -0.01000 -0.01000 moveto -0.01000 0.51000 lineto 0.51000 0.51000 lineto 0.51000 -0.01000 lineto -0.01000 -0.01000 lineto eoclip newpath } def
/t { moveto lineto stroke } bind def
/tc { moveto lineto strokepath nclip } bind def
/r { /y2 exch def /x2 exch def /y1 exch def /x1 exch def
     x1 y1 moveto x1 y2 lineto x2 y2 lineto x2 y1 lineto closepath fill } bind def
/c { 0 360 arc fill } bind def
/cc { 0 360 arc nclip } bind def
/a { gsave setlinewidth translate scale 0 0 1 5 3 roll arc stroke grestore} bind def
% Layer bottomsilk group 12 drill 0 mask 0
% Layer bottom group 10 drill 0 mask 0
% Layer group5 group 5 drill 0 mask 0
% Layer group7 group 7 drill 0 mask 0
% Layer top group 3 drill 0 mask 0
0.00000 setlinewidth
2 setlinecap
0.545098 0.137255 0.137255 setrgbcolor
0.47500 0.15000 moveto
0.47500 0.47500 lineto
0.29999 0.47500 lineto
0.29999 0.32505 lineto
0.30000 0.32505 lineto
0.30436 0.32486 lineto
0.30869 0.32429 lineto
0.31295 0.32334 lineto
0.31712 0.32203 lineto
0.32115 0.32036 lineto
0.32502 0.31834 lineto
0.32871 0.31600 lineto
0.33217 0.31334 lineto
0.33539 0.31039 lineto
0.33834 0.30717 lineto
0.34100 0.30371 lineto
0.34334 0.30002 lineto
0.34536 0.29615 lineto
0.34703 0.29212 lineto
0.34834 0.28795 lineto
0.34929 0.28369 lineto
0.34986 0.27936 lineto
0.35005 0.27500 lineto
0.34986 0.27064 lineto
0.34929 0.26631 lineto
0.34834 0.26205 lineto
0.34703 0.25788 lineto
0.34536 0.25385 lineto
0.34334 0.24998 lineto
0.34100 0.24629 lineto
0.33834 0.24283 lineto
0.33539 0.23961 lineto
0.33217 0.23666 lineto
0.32871 0.23400 lineto
0.32502 0.23166 lineto
0.32115 0.22964 lineto
0.31712 0.22797 lineto
0.31295 0.22666 lineto
0.30869 0.22571 lineto
0.30436 0.22514 lineto
0.30000 0.22495 lineto
0.29999 0.22495 lineto
0.29999 0.15000 lineto
fill
0.29999 0.15000 moveto
0.29999 0.22495 lineto
0.29564 0.22514 lineto
0.29131 0.22571 lineto
0.28705 0.22666 lineto
0.28288 0.22797 lineto
0.27885 0.22964 lineto
0.27667 0.23078 lineto
0.27612 0.23101 lineto
0.27548 0.23140 lineto
0.27498 0.23166 lineto
0.27500 0.23169 lineto
0.27276 0.23306 lineto
0.26977 0.23562 lineto
0.26721 0.23861 lineto
0.26516 0.24196 lineto
0.26365 0.24560 lineto
0.26273 0.24943 lineto
0.26242 0.25335 lineto
0.26243 0.25339 lineto
0.26026 0.25471 lineto
0.25727 0.25727 lineto
0.25471 0.26026 lineto
0.25266 0.26362 lineto
0.25115 0.26725 lineto
0.25023 0.27108 lineto
0.24992 0.27500 lineto
0.25005 0.27668 lineto
0.25014 0.27936 lineto
0.25071 0.28369 lineto
0.25166 0.28795 lineto
0.25297 0.29212 lineto
0.25464 0.29615 lineto
0.25666 0.30002 lineto
0.25900 0.30371 lineto
0.26166 0.30717 lineto
0.26461 0.31039 lineto
0.26783 0.31334 lineto
0.27129 0.31600 lineto
0.27498 0.31834 lineto
0.27885 0.32036 lineto
0.28288 0.32203 lineto
0.28705 0.32334 lineto
0.29131 0.32429 lineto
0.29564 0.32486 lineto
0.29999 0.32505 lineto
0.29999 0.47500 lineto
0.13759 0.47500 lineto
0.13759 0.36151 lineto
0.14865 0.36609 lineto
0.16114 0.37003 lineto
0.17393 0.37286 lineto
0.18691 0.37457 lineto
0.20000 0.37514 lineto
0.20394 0.37486 lineto
0.20778 0.37394 lineto
0.21143 0.37243 lineto
0.21480 0.37037 lineto
0.21780 0.36780 lineto
0.22037 0.36480 lineto
0.22243 0.36143 lineto
0.22394 0.35778 lineto
0.22486 0.35394 lineto
0.22517 0.35000 lineto
0.22486 0.34606 lineto
0.22394 0.34222 lineto
0.22243 0.33857 lineto
0.22037 0.33520 lineto
0.21780 0.33220 lineto
0.21480 0.32963 lineto
0.21143 0.32757 lineto
0.20778 0.32606 lineto
0.20394 0.32514 lineto
0.20000 0.32490 lineto
0.19128 0.32462 lineto
0.18264 0.32348 lineto
0.17412 0.32159 lineto
0.16580 0.31897 lineto
0.15774 0.31563 lineto
0.15000 0.31160 lineto
0.14264 0.30692 lineto
0.13759 0.30304 lineto
0.13759 0.15000 lineto
fill
0.13759 0.15000 moveto
0.13759 0.30304 lineto
0.13572 0.30160 lineto
0.12929 0.29571 lineto
0.12340 0.28928 lineto
0.11808 0.28236 lineto
0.11340 0.27500 lineto
0.10937 0.26726 lineto
0.10603 0.25920 lineto
0.10341 0.25088 lineto
0.10152 0.24236 lineto
0.10038 0.23372 lineto
0.10000 0.22500 lineto
0.09977 0.22108 lineto
0.09885 0.21725 lineto
0.09734 0.21362 lineto
0.09529 0.21026 lineto
0.09273 0.20727 lineto
0.08974 0.20471 lineto
0.08638 0.20266 lineto
0.08275 0.20115 lineto
0.07892 0.20023 lineto
0.07500 0.19992 lineto
0.07108 0.20023 lineto
0.06725 0.20115 lineto
0.06362 0.20266 lineto
0.06026 0.20471 lineto
0.05727 0.20727 lineto
0.05471 0.21026 lineto
0.05266 0.21362 lineto
0.05115 0.21725 lineto
0.05023 0.22108 lineto
0.05000 0.22500 lineto
0.05043 0.23809 lineto
0.05214 0.25107 lineto
0.05497 0.26386 lineto
0.05891 0.27635 lineto
0.06392 0.28845 lineto
0.06997 0.30007 lineto
0.07701 0.31112 lineto
0.08498 0.32151 lineto
0.09383 0.33117 lineto
0.10349 0.34002 lineto
0.11388 0.34799 lineto
0.12493 0.35503 lineto
0.13655 0.36108 lineto
0.13759 0.36151 lineto
0.13759 0.47500 lineto
0.02500 0.47500 lineto
0.02500 0.15000 lineto
fill
0.01000 setlinewidth
1 setlinecap
0 90 -0.12500 0.12500 0.20000 0.22500 0.080000 a
0.02000 setlinewidth
-90 -10 -0.10000 0.10000 0.17500 0.22500 0.200000 a
0.01000 setlinewidth
0 300 -0.02500 0.02500 0.30000 0.27500 0.400000 a
0.03000 setlinewidth
-160 -70 -0.12500 0.12500 0.25000 0.22500 0.240000 a
% Layer topsilk group 1 drill 0 mask 0
showpage
%%EndDocument
%%Trailer
cleartomark countdictstack exch sub { end } repeat restore
%%EOF
