G04 start of page 8 for group 13 layer_idx 12 *
G04 Title: element with pads on both sides, bottom_paste *
G04 Creator: <version>
G04 CreationDate: <date>
G04 For: TEST *
G04 Format: Gerber/RS-274X *
G04 PCB-Dimensions: 50000 50000 *
G04 PCB-Coordinate-Origin: lower left *
%MOIN*%
%FSLAX25Y25*%
%LNBOTTOMPASTE*%
%ADD18C,0.0100*%
G54D18*X27500Y32500D02*Y25000D01*
M02*
