<?xml version="1.0"?>
<svg xmlns="http://www.w3.org/2000/svg" version="1.0" width="1625.6000" height="1625.6000" viewBox="-2.0000 -2.0000 17.7000 17.7000">
<g id="layer_4_copper">
<!--normal-->
 <rect x="0.0000" y="0.0000" width="12.7000" height="12.7000" stroke-width="0.2540" stroke="#00868b" stroke-linecap="round" fill="none"/>
</g>
<g id="layer_3_copper">
</g>
<g id="layer_2_copper">
</g>
<g id="layer_1_copper">
</g>
<g id="layer_0_copper">
<!--normal-->
 <path d="M 1.2700 2.5400 A 1.2700 1.2700 0 0 0 1.2700 2.5400" stroke-width="0.2540" stroke="#8b2323" stroke-linecap="round" fill="none"/>
 <path d="M 6.3500 2.5400 A 1.2700 1.2700 0 0 0 6.3500 2.5400" stroke-width="0.2540" stroke="#8b2323" stroke-linecap="round" fill="none"/>
 <path d="M 8.8900 2.5400 A 1.2700 1.2700 0 0 0 8.8900 2.5400" stroke-width="0.2540" stroke="#8b2323" stroke-linecap="round" fill="none"/>
</g>
<g id="layer_-4079_topsilk">
</g>
</svg>
