<?xml version="1.0"?>
<svg xmlns="http://www.w3.org/2000/svg" version="1.0" width="1625.6000" height="1625.6000" viewBox="-2.0000 -2.0000 17.7000 17.7000">
<g id="layer_4_copper">
<!--normal-->
 <rect x="0.0000" y="0.0000" width="12.7000" height="12.7000" stroke-width="0.2540" stroke="#00868b" stroke-linecap="round" fill="none"/>
</g>
<g id="layer_3_copper">
</g>
<g id="layer_2_copper">
</g>
<g id="layer_1_copper">
</g>
<g id="layer_0_copper">
<!--normal-->
 <polygon points="0.6350,0.6350 3.1750,0.6350 0.6350,3.1750 " stroke-width="0.075" stroke="#8b2323" fill="#8b2323"/>
 <polygon points="0.6350,3.8100 3.8100,0.6350 3.8100,3.8100 " stroke-width="0.075" stroke="#8b2323" fill="#8b2323"/>
 <polygon points="4.4450,3.8100 7.6200,0.6350 10.7950,3.8100 " stroke-width="0.075" stroke="#8b2323" fill="#8b2323"/>
 <polygon points="0.6350,4.4450 7.6200,5.0800 1.2700,8.8900 " stroke-width="0.075" stroke="#8b2323" fill="#8b2323"/>
</g>
<g id="layer_-4079_topsilk">
</g>
</svg>
