[
  { "pkg": "base-devel" },
  { "pkg": [
    "bluez","bluez-utils","pulseaudio-bluetooth","sbc",
    "pulseaudio","aria2","bind-tools","bash","dash","dhcpcd",
    "wpa_supplicant","youtube-dl","mpv","iw","git","git-annex","dos2unix",
    "ffmpeg","fping","htop","ipcalc","jre-openjdk","intel-ucode",
    "jq","linux-firmware","lsof","lynx","lsb-release",
    "mosh","openssh","mtpfs","mtr","mencoder","nmap","os-prober",
    "p7zip","pandoc","pciutils","pass","procps-ng","psmisc",
    "rsync","shellcheck","socat","sox","twolame","sshfs","sshuttle",
    "strace","tar","task","traceroute","tree","units","unrar",
    "vi","vim","wget","curl","xmlstarlet","ranger","yq","bc","whois",
    "geoip","geoip-database-extra","gnupg","ntfs-3g","pulsemixer",
    "openssl","neomutt","isync","msmtp","python-icalendar","nnn","iftop",
    "bmon","iotop","sysstat","atop","tmux","vis","xz","source-highlight",
    "wireless-regdb", "nethogs","iwd","dhcpcd","wpa_supplicant",
    "perl-image-exiftool"
  ]},
  { "aur": [
    "crudini","cht.sh","megatools","speedometer","tumbld-git",
    "archivemount","inxi","pipes.sh","gotop","simple-mtpfs",
    "adbfs-rootless-git","mksh","downgrade"
  ]},
  { "fact": "hostname",
    "mydesktop": [
      { "aur": ["wd719x-firmware","aic94xx-firmware"] }
    ]
  },
  { "class": "targets",
    "devel": [
      { "pkg": ["elixir","rust","ghc","go","jdk-openjdk","r","subversion","erlang","lua"] }
    ],
    "graphical": [
      { "fact": "graphics",
        "optimus": [
          { "pkg": ["nvidia","nvidia-prime","nvtop","waifu2x-converter-cpp-cuda-git"] }
        ]
      },
      { "pkg": ["xorg","xorg-xinit"] },
      "windows manager",
      { "pkg": [
        "bspwm","dmenu",
        "rxvt-unicode","rxvt-unicode-terminfo",
        "scrot","sxhkd","ibus-anthy",
        "mesa","mesa-demos","redshift",
        "picom","xclip"
      ]},
      "fonts",
      { "pkg": [
        "adobe-source-code-pro-fonts",
        "adobe-source-sans-pro-fonts",
        "adobe-source-serif-pro-fonts",
        "noto-fonts",
        "noto-fonts-cjk",
        "noto-fonts-emoji",
        "noto-fonts-extra",
        "ttf-inconsolata",
        "ttf-liberation",
        "ttc-iosevka"
      ]},
      "graphical applications",
      { "pkg": [
        "baobab", "feh", "imagemagick", "sxiv", "leafpad",
        "firefox","firefox-i18n-en-gb","firefox-i18n-fr",
        "chromium",
        "freerdp", "gimp", "mesa-demos",
        "mupdf", "zathura", "zathura-cb", "zathura-djvu", "zathura-pdf-mupdf", "zathura-ps",
        "pavucontrol", "vlc", "graphviz", "xournalpp",
        "thunderbird", "thunderbird-i18n-fr"
      ]},
      { "aur": [
        "cava-git","drawio-desktop-bin","instaloader","makemkv",
        "polybar","ca_multi","tagainijisho-git","jitsi",
        "flashplugin"
      ]},
      { "class": "targets",
        "games": [
          { "pkg": "libretro" },
          { "pkg": [
            "wine-staging","wine-gecko","wine-mono","winetricks",
            "dolphin-emu","mame","flatpak","0ad"
          ]},
          { "aur": ["cuberite","minecraft","osu-lazer"]},
          "OpenRiichi and build dependencies",
          { "aur": ["vala","sdl2_mixer","open-riichi-git"] },
          "OpenTTD",
          { "pkg": ["openttd","openttd-opengfx","openttd-opensfx","timidity++","freepats-general-midi"] },
          { "aur": "openttd-openmsx" }
        ],
        "android": [
          { "aur": ["anbox", "anbox-modules-dkms-git", "snapd","apparmor"] }
        ]
      }
    ],
    "cfgmgt": [
      { "pkg": ["ansible","puppet","openldap","qemu","krb5"] }
    ]
  }
]
