%!PS-Adobe-3.0 EPSF-3.0
%%BoundingBox: 340 278 461 321
%%HiResBoundingBox: 340.5 278.5 460.5 320.5
%.................................
%%Creator: GPL Ghostscript 864 (epswrite)
%%CreationDate: 2009/10/12 20:14:22
%%DocumentData: Clean7Bit
%%LanguageLevel: 2
%%EndComments
%%BeginProlog
% This copyright applies to everything between here and the %%EndProlog:
% Copyright (C) 2009 Artifex Software, Inc.  All rights reserved.
%%BeginResource: procset GS_epswrite_2_0_1001 1.001 0
/GS_epswrite_2_0_1001 80 dict dup begin
/PageSize 2 array def/setpagesize{ PageSize aload pop 3 index eq exch
4 index eq and{ pop pop pop}{ PageSize dup  1
5 -1 roll put 0 4 -1 roll put dup null eq {false} {dup where} ifelse{ exch get exec}
{ pop/setpagedevice where
{ pop 1 dict dup /PageSize PageSize put setpagedevice}
{ /setpage where{ pop PageSize aload pop pageparams 3 {exch pop} repeat
setpage}if}ifelse}ifelse}ifelse} bind def
/!{bind def}bind def/#{load def}!/N/counttomark #
/rG{3{3 -1 roll 255 div}repeat setrgbcolor}!/G{255 div setgray}!/K{0 G}!
/r6{dup 3 -1 roll rG}!/r5{dup 3 1 roll rG}!/r3{dup rG}!
/w/setlinewidth #/J/setlinecap #
/j/setlinejoin #/M/setmiterlimit #/d/setdash #/i/setflat #
/m/moveto #/l/lineto #/c/rcurveto #
/p{N 2 idiv{N -2 roll rlineto}repeat}!
/P{N 0 gt{N -2 roll moveto p}if}!
/h{p closepath}!/H{P closepath}!
/lx{0 rlineto}!/ly{0 exch rlineto}!/v{0 0 6 2 roll c}!/y{2 copy c}!
/re{4 -2 roll m exch dup lx exch ly neg lx h}!
/^{3 index neg 3 index neg}!
/f{P fill}!/f*{P eofill}!/s{H stroke}!/S{P stroke}!
/q/gsave #/Q/grestore #/rf{re fill}!
/Y{P clip newpath}!/Y*{P eoclip newpath}!/rY{re Y}!
/|={pop exch 4 1 roll 1 array astore cvx 3 array astore cvx exch 1 index def exec}!
/|{exch string readstring |=}!
/+{dup type/nametype eq{2 index 7 add -3 bitshift 2 index mul}if}!
/@/currentfile #/${+ @ |}!
/B{{2 copy string{readstring pop}aload pop 4 array astore cvx
3 1 roll}repeat pop pop true}!
/Ix{[1 0 0 1 11 -2 roll exch neg exch neg]exch}!
/,{true exch Ix imagemask}!/If{false exch Ix imagemask}!/I{exch Ix image}!
/Ic{exch Ix false 3 colorimage}!
/F{/Columns counttomark 3 add -2 roll/Rows exch/K -1/BlackIs1 true>>
/CCITTFaxDecode filter}!/FX{<</EndOfBlock false F}!
/X{/ASCII85Decode filter}!/@X{@ X}!/&2{2 index 2 index}!
/@F{@ &2<<F}!/@C{@X &2 FX}!
/$X{+ @X |}!/&4{4 index 4 index}!/$F{+ @ &4<<F |}!/$C{+ @X &4 FX |}!
/IC{3 1 roll 10 dict begin 1{/ImageType/Interpolate/Decode/DataSource
/ImageMatrix/BitsPerComponent/Height/Width}{exch def}forall
currentdict end image}!
/~{@ read {pop} if}!
end def
%%EndResource
/pagesave null def
%%EndProlog
%%Page: 1 1
%%%%BeginPageSetup
GS_epswrite_2_0_1001 begin
/pagesave save store 197 dict begin
0.1 0.1 scale
%%EndPageSetup
gsave mark
Q q
0 0 250000 250000 re
Y
166 196 177 rG
3436.4 3199.93 1133.54 -2.02 P
15.84 0 29.98 2.35 29.98 -31.6 c
-1.39 -373.29 -1190.74 0 0 374.68 p
0 16.74 1.62 32.23 28.61 32.23 c
f
K
4582.52 3205 -1155.05 0 P
-12.39 0 -22.47 -10.08 -22.47 -22.46 c
0 -392.47 p
0 -2.8 2.27 -5.07 5.07 -5.07 c
1189.85 0 p
2.8 0 5.08 2.27 5.08 5.07 c
0 392.47 p
0 12.39 -10.08 22.46 -22.48 22.46 c
h
3427.47 3194.85 1155.05 0 P
6.8 0 12.32 -5.52 12.32 -12.31 c
0 -158.47 0 -272.76 v
-828.25 0 p
-30.26 -54.71 -88.55 -91.85 -155.46 -91.85 c
-66.93 0 -125.21 37.12 -155.46 91.85 c
-40.52 0 p
0 114.29 0 272.76 y
0 6.79 5.53 12.31 12.32 12.31 c
f
255 G
4143.09 2877.52 m
3.16 0 6.04 -0.27 8.65 -0.83 c
2.6 -0.55 4.82 -1.46 6.68 -2.73 c
1.86 -1.26 3.3 -2.95 4.33 -5.05 c
1.02 -2.11 1.53 -4.69 1.53 -7.79 c
0 -3.34 -0.76 -6.11 -2.29 -8.33 c
-1.51 -2.23 -3.77 -4.05 -6.74 -5.48 c
4.1 -1.17 7.16 -3.22 9.18 -6.17 c
2.01 -2.93 3.03 -6.48 3.03 -10.62 c
0 -3.34 -0.65 -6.23 -1.95 -8.67 c
-1.3 -2.44 -3.06 -4.43 -5.25 -5.98 c
-2.2 -1.55 -4.71 -2.7 -7.53 -3.44 c
-2.82 -0.74 -5.71 -1.11 -8.7 -1.11 c
-32.16 0 0 66.21 31.21 0 h
4141.23 2850.74 m
2.6 0 4.73 0.63 6.41 1.86 c
1.68 1.23 2.51 3.23 2.51 6.01 c
0 1.54 -0.28 2.81 -0.83 3.8 c
-0.57 0.99 -1.31 1.76 -2.23 2.32 c
-0.93 0.55 -2 0.95 -3.2 1.15 c
-1.2 0.21 -2.47 0.32 -3.76 0.32 c
-13.65 0 0 -15.45 14.77 0 h
4142.08 2822.64 m
1.43 0 2.78 0.14 4.09 0.42 c
1.29 0.28 2.44 0.75 3.44 1.38 c
1 0.66 1.78 1.54 2.36 2.65 c
0.61 1.11 0.89 2.54 0.89 4.27 c
0 3.39 -0.96 5.82 -2.88 7.28 c
-1.92 1.45 -4.46 2.17 -7.62 2.17 c
-15.9 0 0 -18.16 15.62 0 p f
4170.03 2877.52 16.34 0 15.51 -26.15 15.41 26.15 16.23 0 -24.58 -40.8 0 -25.41 -14.6 0
0 25.78 -24.31 40.43 f
3747.54 3008.94 m
0.05 -75.3 -60.96 -136.36 -136.27 -136.42 c
-75.3 -0.04 -136.39 60.96 -136.43 136.25 c
0 0.05 0 0.11 0 0.17 c
-0.04 75.3 60.97 136.37 136.27 136.41 c
75.31 0.05 136.39 -60.96 136.43 -136.25 c
0 -0.05 0 -0.11 0 -0.16 c
f
K
3722.03 3119.98 m
30.23 -30.23 45.36 -67.25 45.36 -111.04 c
0 -43.8 -14.86 -80.43 -44.57 -109.88 c
-31.54 -31.02 -68.81 -46.54 -111.81 -46.54 c
-42.49 0 -79.11 15.38 -109.87 46.14 c
-30.76 30.75 -46.14 67.51 -46.14 110.27 c
0 42.75 15.38 79.77 46.14 111.04 c
29.97 30.24 66.6 45.36 109.87 45.36 c
43.79 0 80.8 -15.12 111.03 -45.36 c
h
3521.48 3099.65 m
-25.56 -25.82 -38.34 -56.06 -38.34 -90.75 c
0 -34.68 12.65 -64.66 37.95 -89.95 c
25.3 -25.3 55.42 -37.95 90.37 -37.95 c
34.95 0 65.32 12.77 91.14 38.33 c
24.52 23.74 36.78 53.59 36.78 89.57 c
0 35.72 -12.46 66.04 -37.37 90.95 c
-24.9 24.9 -55.09 37.36 -90.55 37.36 c
-35.46 0 -65.46 -12.52 -89.98 -37.55 c
h
3588.75 3024.16 m
-3.91 8.52 -9.75 12.77 -17.55 12.77 c
-13.79 0 -20.68 -9.29 -20.68 -27.84 c
0 -18.55 6.89 -27.82 20.68 -27.82 c
9.1 0 15.61 4.51 19.51 13.57 c
19.11 -10.18 p
-9.11 -16.18 -22.77 -24.27 -40.99 -24.27 c
-14.05 0 -25.31 4.3 -33.77 12.91 c
-8.46 8.61 -12.69 20.5 -12.69 35.64 c
0 14.87 4.36 26.68 13.08 35.43 c
8.72 8.75 19.57 13.11 32.6 13.11 c
19.26 0 33.05 -7.59 41.39 -22.75 c
-20.68 -10.59 h
3678.66 3024.16 m
-3.91 8.52 -9.64 12.77 -17.2 12.77 c
-14.06 0 -21.1 -9.29 -21.1 -27.84 c
0 -18.55 7.04 -27.82 21.1 -27.82 c
9.11 0 15.5 4.51 19.14 13.57 c
19.54 -10.18 p
-9.09 -16.18 -22.74 -24.27 -40.92 -24.27 c
-14.03 0 -25.27 4.3 -33.71 12.91 c
-8.43 8.61 -12.66 20.5 -12.66 35.64 c
0 14.87 4.29 26.68 12.86 35.43 c
8.57 8.75 19.48 13.11 32.73 13.11 c
19.23 0 33 -7.59 41.3 -22.75 c
-21.09 -10.59 p f
255 G
4167.68 3160.21 m
59.3 0 107.38 -48.07 107.38 -107.38 c
0 -59.3 -48.08 -107.38 -107.38 -107.38 c
-59.32 0 -107.4 48.08 -107.4 107.38 c
0 59.31 48.09 107.38 107.4 107.38 c
f
K
4198.75 3083.9 m
0 4.14 -3.36 7.49 -7.48 7.49 c
-47.44 0 p
-4.12 0 -7.48 -3.35 -7.48 -7.49 c
0 -47.43 13.22 0 0 -56.16 35.95 0 ^ 13.23 0 0 47.43 p f
4167.54 3130.08 m
8.96 0 16.23 -7.27 16.23 -16.23 c
0 -8.96 -7.27 -16.22 -16.23 -16.22 c
-8.95 0 -16.22 7.27 -16.22 16.22 c
0 8.96 7.27 16.23 16.22 16.23 c
f
4167.4 3171.14 m
-32.13 0 -59.32 -11.21 -81.57 -33.62 c
-22.83 -23.19 -34.25 -50.63 -34.25 -82.32 c
0 -31.68 11.42 -58.94 34.25 -81.74 c
22.84 -22.8 50.03 -34.2 81.57 -34.2 c
31.93 0 59.61 11.48 83.01 34.49 c
22.07 21.82 33.11 48.98 33.11 81.45 c
0 32.47 -11.23 59.91 -33.67 82.32 c
-22.46 22.42 -49.93 33.63 -82.44 33.63 c
h
4167.7 3150.28 m
26.31 0 48.67 -9.28 67.05 -27.83 c
18.57 -18.35 27.85 -40.77 27.85 -67.25 c
0 -26.66 -9.08 -48.79 -27.28 -66.38 c
-19.17 -18.93 -41.7 -28.41 -67.62 -28.41 c
-25.95 0 -48.3 9.38 -67.05 28.11 c
-18.79 18.75 -28.16 40.97 -28.16 66.67 c
0 25.71 9.49 48.12 28.46 67.25 c
18.18 18.55 40.43 27.83 66.76 27.83 c
f
5 w
4 M
3315 2785 -270 0 S
3405 2695 0 -270 S
3315 3205 -270 0 S
3405 3295 0 270 S
4695 3205 270 0 S
4605 3295 0 270 S
4695 2785 270 0 S
4605 2695 0 -270 S
cleartomark end end pagesave restore
 showpage
%%PageTrailer
%%Trailer
%%Pages: 1
