%!PS-Adobe-3.0 EPSF-3.0
%%BoundingBox: 340 278 461 321
%%HiResBoundingBox: 340.5 278.5 460.5 320.5
%.................................
%%Creator: GPL Ghostscript 864 (epswrite)
%%CreationDate: 2009/10/12 20:15:45
%%DocumentData: Clean7Bit
%%LanguageLevel: 2
%%EndComments
%%BeginProlog
% This copyright applies to everything between here and the %%EndProlog:
% Copyright (C) 2009 Artifex Software, Inc.  All rights reserved.
%%BeginResource: procset GS_epswrite_2_0_1001 1.001 0
/GS_epswrite_2_0_1001 80 dict dup begin
/PageSize 2 array def/setpagesize{ PageSize aload pop 3 index eq exch
4 index eq and{ pop pop pop}{ PageSize dup  1
5 -1 roll put 0 4 -1 roll put dup null eq {false} {dup where} ifelse{ exch get exec}
{ pop/setpagedevice where
{ pop 1 dict dup /PageSize PageSize put setpagedevice}
{ /setpage where{ pop PageSize aload pop pageparams 3 {exch pop} repeat
setpage}if}ifelse}ifelse}ifelse} bind def
/!{bind def}bind def/#{load def}!/N/counttomark #
/rG{3{3 -1 roll 255 div}repeat setrgbcolor}!/G{255 div setgray}!/K{0 G}!
/r6{dup 3 -1 roll rG}!/r5{dup 3 1 roll rG}!/r3{dup rG}!
/w/setlinewidth #/J/setlinecap #
/j/setlinejoin #/M/setmiterlimit #/d/setdash #/i/setflat #
/m/moveto #/l/lineto #/c/rcurveto #
/p{N 2 idiv{N -2 roll rlineto}repeat}!
/P{N 0 gt{N -2 roll moveto p}if}!
/h{p closepath}!/H{P closepath}!
/lx{0 rlineto}!/ly{0 exch rlineto}!/v{0 0 6 2 roll c}!/y{2 copy c}!
/re{4 -2 roll m exch dup lx exch ly neg lx h}!
/^{3 index neg 3 index neg}!
/f{P fill}!/f*{P eofill}!/s{H stroke}!/S{P stroke}!
/q/gsave #/Q/grestore #/rf{re fill}!
/Y{P clip newpath}!/Y*{P eoclip newpath}!/rY{re Y}!
/|={pop exch 4 1 roll 1 array astore cvx 3 array astore cvx exch 1 index def exec}!
/|{exch string readstring |=}!
/+{dup type/nametype eq{2 index 7 add -3 bitshift 2 index mul}if}!
/@/currentfile #/${+ @ |}!
/B{{2 copy string{readstring pop}aload pop 4 array astore cvx
3 1 roll}repeat pop pop true}!
/Ix{[1 0 0 1 11 -2 roll exch neg exch neg]exch}!
/,{true exch Ix imagemask}!/If{false exch Ix imagemask}!/I{exch Ix image}!
/Ic{exch Ix false 3 colorimage}!
/F{/Columns counttomark 3 add -2 roll/Rows exch/K -1/BlackIs1 true>>
/CCITTFaxDecode filter}!/FX{<</EndOfBlock false F}!
/X{/ASCII85Decode filter}!/@X{@ X}!/&2{2 index 2 index}!
/@F{@ &2<<F}!/@C{@X &2 FX}!
/$X{+ @X |}!/&4{4 index 4 index}!/$F{+ @ &4<<F |}!/$C{+ @X &4 FX |}!
/IC{3 1 roll 10 dict begin 1{/ImageType/Interpolate/Decode/DataSource
/ImageMatrix/BitsPerComponent/Height/Width}{exch def}forall
currentdict end image}!
/~{@ read {pop} if}!
end def
%%EndResource
/pagesave null def
%%EndProlog
%%Page: 1 1
%%%%BeginPageSetup
GS_epswrite_2_0_1001 begin
/pagesave save store 197 dict begin
0.1 0.1 scale
%%EndPageSetup
gsave mark
Q q
0 0 250000 250000 re
Y
166 196 177 rG
3439.08 3200.61 1133.54 -2.02 P
15.84 0 30 2.35 30 -31.6 c
-1.39 -373.3 -1190.76 0 0 374.69 p
0 16.74 1.62 32.23 28.61 32.23 c
f
255 G
3750.22 3009.62 m
0.05 -75.3 -60.96 -136.38 -136.26 -136.42 c
-75.3 -0.05 -136.39 60.96 -136.43 136.25 c
0 0.06 0 0.11 0 0.17 c
-0.04 75.3 60.97 136.38 136.27 136.42 c
75.31 0.05 136.39 -60.96 136.43 -136.25 c
0 -0.05 0 -0.11 0 -0.16 c
f
K
3724.71 3120.67 m
30.23 -30.23 45.36 -67.25 45.36 -111.05 c
0 -43.8 -14.86 -80.43 -44.57 -109.89 c
-31.53 -31.02 -68.81 -46.53 -111.82 -46.53 c
-42.48 0 -79.11 15.38 -109.87 46.15 c
-30.76 30.74 -46.14 67.51 -46.14 110.27 c
0 42.75 15.38 79.77 46.14 111.05 c
29.98 30.25 66.6 45.36 109.87 45.36 c
43.8 0 80.8 -15.12 111.04 -45.36 c
h
3524.16 3100.33 m
-25.56 -25.82 -38.34 -56.06 -38.34 -90.75 c
0 -34.68 12.65 -64.67 37.95 -89.96 c
25.3 -25.3 55.42 -37.94 90.37 -37.94 c
34.95 0 65.32 12.77 91.14 38.32 c
24.52 23.74 36.78 53.59 36.78 89.58 c
0 35.72 -12.46 66.03 -37.37 90.94 c
-24.9 24.9 -55.09 37.35 -90.55 37.35 c
-35.47 0 -65.46 -12.52 -89.98 -37.54 c
h
3591.44 3024.84 m
-3.91 8.52 -9.76 12.78 -17.55 12.78 c
-13.79 0 -20.68 -9.28 -20.68 -27.83 c
0 -18.56 6.89 -27.84 20.68 -27.84 c
9.11 0 15.61 4.52 19.51 13.57 c
19.11 -10.17 p
-9.11 -16.18 -22.77 -24.28 -40.99 -24.28 c
-14.05 0 -25.31 4.31 -33.76 12.92 c
-8.47 8.61 -12.69 20.5 -12.69 35.64 c
0 14.88 4.36 26.69 13.07 35.43 c
8.72 8.75 19.58 13.12 32.6 13.12 c
19.26 0 33.05 -7.59 41.38 -22.75 c
-20.68 -10.59 h
3681.34 3024.84 m
-3.91 8.52 -9.64 12.78 -17.2 12.78 c
-14.06 0 -21.1 -9.28 -21.1 -27.83 c
0 -18.56 7.04 -27.84 21.1 -27.84 c
9.12 0 15.5 4.52 19.14 13.57 c
19.54 -10.17 p
-9.09 -16.18 -22.74 -24.28 -40.92 -24.28 c
-14.03 0 -25.27 4.31 -33.71 12.92 c
-8.43 8.61 -12.66 20.5 -12.66 35.64 c
0 14.88 4.29 26.69 12.87 35.43 c
8.57 8.75 19.48 13.12 32.73 13.12 c
19.22 0 32.99 -7.59 41.3 -22.75 c
-21.09 -10.59 p f
4582.54 3205 -1155.07 0 P
-12.39 0 -22.47 -10.07 -22.47 -22.46 c
0 -392.47 p
0 -2.8 2.27 -5.07 5.07 -5.07 c
1189.85 0 p
2.8 0 5.08 2.27 5.08 5.07 c
0 392.47 p
0 12.39 -10.08 22.46 -22.46 22.46 c
h
3427.47 3194.86 1155.07 0 P
6.79 0 12.3 -5.53 12.3 -12.32 c
0 -157.85 0 -272.09 v
-825.57 0 p
-30.26 -54.71 -88.55 -91.86 -155.46 -91.86 c
-66.93 0 -125.21 37.12 -155.46 91.86 c
-43.2 0 p
0 114.24 0 272.09 y
0 6.79 5.53 12.32 12.32 12.32 c
f
255 G
4004.96 2877.53 m
3.16 0 6.03 -0.28 8.64 -0.83 c
2.61 -0.55 4.83 -1.46 6.69 -2.74 c
1.86 -1.26 3.3 -2.95 4.33 -5.05 c
1.02 -2.1 1.53 -4.69 1.53 -7.79 c
0 -3.33 -0.76 -6.11 -2.29 -8.33 c
-1.5 -2.23 -3.76 -4.05 -6.74 -5.48 c
4.1 -1.17 7.16 -3.22 9.18 -6.17 c
2.01 -2.93 3.03 -6.48 3.03 -10.62 c
0 -3.34 -0.64 -6.23 -1.95 -8.67 c
-1.3 -2.44 -3.06 -4.43 -5.25 -5.98 c
-2.2 -1.55 -4.71 -2.7 -7.52 -3.44 c
-2.83 -0.74 -5.72 -1.11 -8.7 -1.11 c
-32.16 0 0 66.22 31.22 0 h
4003.11 2850.74 m
2.6 0 4.74 0.63 6.41 1.86 c
1.68 1.23 2.5 3.23 2.5 6.01 c
0 1.54 -0.28 2.82 -0.83 3.8 c
-0.57 0.99 -1.3 1.76 -2.23 2.32 c
-0.93 0.55 -2 0.95 -3.2 1.16 c
-1.21 0.21 -2.46 0.31 -3.76 0.31 c
-13.65 0 0 -15.45 14.77 0 h
4003.96 2822.64 m
1.43 0 2.79 0.14 4.09 0.42 c
1.29 0.28 2.45 0.75 3.44 1.39 c
1 0.64 1.78 1.52 2.37 2.64 c
0.6 1.11 0.88 2.54 0.88 4.27 c
0 3.39 -0.96 5.82 -2.88 7.28 c
-1.92 1.45 -4.46 2.18 -7.62 2.18 c
-15.9 0 0 -18.18 15.62 0 p f
4031.9 2877.53 16.34 0 15.51 -26.15 15.41 26.15 16.23 0 -24.57 -40.81 0 -25.41 -14.61 0
0 25.78 -24.31 40.44 f
4269.34 2877.53 27.68 -44.42 0.16 0 0 44.42 13.65 0 0 -66.22 -14.56 0 -27.57 44.34
-0.18 0 0 -44.34 -13.67 0 0 66.22 14.49 0 f
4366.11 2859.88 m
-0.86 1.41 -1.95 2.62 -3.25 3.67 c
-1.3 1.05 -2.76 1.88 -4.4 2.46 c
-1.64 0.59 -3.36 0.88 -5.14 0.88 c
-3.28 0 -6.07 -0.63 -8.36 -1.91 c
-2.29 -1.26 -4.14 -2.96 -5.57 -5.09 c
-1.43 -2.14 -2.46 -4.57 -3.12 -7.29 c
-0.65 -2.71 -0.96 -5.53 -0.96 -8.44 c
0 -2.77 0.31 -5.49 0.96 -8.11 c
0.66 -2.64 1.69 -5 3.12 -7.09 c
1.43 -2.11 3.27 -3.79 5.57 -5.06 c
2.29 -1.27 5.08 -1.91 8.36 -1.91 c
4.43 0 7.92 1.36 10.43 4.09 c
2.5 2.72 4.03 6.31 4.59 10.76 c
14.1 0 p
-0.37 -4.14 -1.33 -7.88 -2.87 -11.22 c
-1.54 -3.35 -3.59 -6.19 -6.13 -8.55 c
-2.53 -2.36 -5.5 -4.15 -8.91 -5.39 c
-3.4 -1.25 -7.15 -1.86 -11.21 -1.86 c
-5.08 0 -9.65 0.89 -13.7 2.64 c
-4.05 1.76 -7.47 4.2 -10.27 7.29 c
-2.79 3.09 -4.92 6.73 -6.41 10.9 c
-1.48 4.18 -2.23 8.67 -2.23 13.52 c
0 4.94 0.75 9.53 2.23 13.77 c
1.48 4.25 3.61 7.95 6.41 11.09 c
2.79 3.16 6.21 5.64 10.27 7.42 c
4.05 1.8 8.62 2.7 13.7 2.7 c
3.64 0 7.09 -0.53 10.33 -1.58 c
3.24 -1.05 6.15 -2.58 8.72 -4.6 c
2.57 -2.01 4.69 -4.5 6.36 -7.47 c
1.67 -2.97 2.71 -6.37 3.16 -10.21 c
-14.11 0 p
-0.24 1.67 -0.81 3.2 -1.67 4.59 c
f
4038.59 3160.21 m
59.32 0 107.39 -48.07 107.39 -107.38 c
0 -59.31 -48.07 -107.38 -107.39 -107.38 c
-59.3 0 -107.39 48.07 -107.39 107.38 c
0 59.31 48.08 107.38 107.39 107.38 c
f
K
4069.68 3083.89 m
0 4.14 -3.36 7.5 -7.49 7.5 c
-47.43 0 p
-4.13 0 -7.49 -3.35 -7.49 -7.5 c
0 -47.43 13.22 0 0 -56.16 35.96 0 ^ 13.23 0 0 47.43 p f
4038.48 3130.08 m
8.96 0 16.21 -7.27 16.21 -16.22 c
0 -8.96 -7.25 -16.22 -16.21 -16.22 c
-8.96 0 -16.23 7.26 -16.23 16.22 c
0 8.96 7.27 16.22 16.23 16.22 c
f
4038.32 3171.14 m
-32.11 0 -59.31 -11.2 -81.56 -33.62 c
-22.84 -23.19 -34.25 -50.63 -34.25 -82.32 c
0 -31.69 11.41 -58.95 34.25 -81.75 c
22.84 -22.8 50.03 -34.2 81.56 -34.2 c
31.93 0 59.61 11.49 83.02 34.49 c
22.07 21.83 33.09 48.99 33.09 81.46 c
0 32.47 -11.22 59.91 -33.67 82.32 c
-22.44 22.42 -49.92 33.63 -82.44 33.63 c
h
4038.61 3150.28 m
26.32 0 48.67 -9.28 67.05 -27.83 c
18.59 -18.36 27.87 -40.77 27.87 -67.25 c
0 -26.67 -9.09 -48.8 -27.29 -66.39 c
-19.16 -18.93 -41.7 -28.4 -67.64 -28.4 c
-25.94 0 -48.28 9.38 -67.05 28.11 c
-18.78 18.75 -28.16 40.97 -28.16 66.67 c
0 25.7 9.48 48.12 28.45 67.25 c
18.19 18.55 40.45 27.83 66.76 27.83 c
f
255 G
4422.18 3055.19 m
0.05 -55 -44.52 -99.62 -99.54 -99.66 c
-55.01 -0.04 -99.62 44.52 -99.66 99.52 c
0 0.06 0 0.1 0 0.15 c
-0.04 55.01 44.52 99.62 99.53 99.67 c
55.01 0.04 99.63 -44.52 99.67 -99.52 c
0 -0.05 0 -0.11 0 -0.15 c
f
K
4404.86 3137.55 m
-22.44 22.42 -49.92 33.63 -82.43 33.63 c
-32.13 0 -59.32 -11.2 -81.57 -33.62 c
-22.83 -23.2 -34.24 -50.64 -34.24 -82.34 c
0 -31.7 11.41 -58.95 34.24 -81.75 c
22.83 -22.81 50.02 -34.21 81.57 -34.21 c
31.92 0 59.6 11.49 83.02 34.5 c
22.06 21.84 33.1 49 33.1 81.46 c
0 32.48 -11.22 59.92 -33.68 82.34 c
h
4390.35 2988.82 m
-19.16 -18.93 -41.7 -28.41 -67.64 -28.41 c
-25.93 0 -48.28 9.38 -67.05 28.13 c
-18.77 18.75 -28.15 40.98 -28.15 66.68 c
0 10.88 1.71 21.14 5.11 30.84 c
30.73 -13.6 -2.22 0 0 -13.78 10.88 0 p
0 -1.95 -0.2 -3.89 -0.2 -5.82 c
0 -3.31 -10.68 0 0 -13.78 12.62 0 p
1.75 -10.29 5.64 -18.64 10.88 -25.24 c
10.86 -14.37 28.34 -22.14 47.36 -22.14 c
12.43 0 23.68 3.69 30.29 7.39 c
-4.67 21.54 p
-4.08 -2.13 -13.19 -5.04 -22.13 -5.04 c
-9.71 0 -18.83 2.91 -25.04 9.9 c
-2.92 3.3 -5.06 7.77 -6.41 13.59 c
42.21 0 59.97 -26.55 p
-4.15 -7.36 -9.43 -14.16 -15.87 -20.39 c
h
4314.92 3049.54 -0.25 0.2 0.45 -0.2 -0.2 0 H
4351.04 3058.67 1.74 0 0 13.78 -32.87 0 -13.36 5.91 P
1.15 2.58 2.51 4.89 4.1 6.7 c
6.02 7.39 14.55 10.49 23.88 10.49 c
8.55 0 16.5 -2.52 21.54 -4.66 c
5.44 22.13 p
-6.99 3.1 -17.29 5.82 -29.12 5.82 c
-18.24 0 -33.78 -7.37 -44.84 -19.8 c
-2.46 -2.84 -4.59 -6.02 -6.52 -9.39 c
-38.13 16.88 p
3.7 5.54 8.04 10.87 13.07 15.94 c
18.19 18.56 40.44 27.84 66.76 27.84 c
26.33 0 48.67 -9.28 67.06 -27.84 c
18.58 -18.36 27.86 -40.78 27.86 -67.26 c
0 -8.73 -1 -16.96 -2.95 -24.72 c
-63.65 28.18 p f
5 w
4 M
3315 2785 -270 0 S
3405 2695 0 -270 S
3315 3205 -270 0 S
3405 3295 0 270 S
4695 3205 270 0 S
4605 3295 0 270 S
4695 2785 270 0 S
4605 2695 0 -270 S
cleartomark end end pagesave restore
 showpage
%%PageTrailer
%%Trailer
%%Pages: 1
