%------------------------------------------------------------------%
% Opéra Libre -- graphics.ly                                       %
%                                                                  %
% (c) Valentin Villenave, 2008, 2009                               %
%------------------------------------------------------------------%


%%% This file adds very basic graphic elements to the score. These
%%% drawings were (remotely) inspired by Jochen Gerner, the artist
%%% who drew the original comic book.

%%%%%%%%%%%%%%%%%%%%%%%% Scores Separator %%%%%%%%%%%%%%%%%%%%%%%%%%
Skyline =
\markup \with-dimensions #'(6 . 32) #'(-5 . 4)
\postscript #"
1 -1 scale
0 -4 translate
0.25 setlinewidth
12 0.5 moveto
12 5.5 lineto
10 5.5 lineto
10 4.5 lineto
10 3.5 lineto
9 3.5 lineto
9 4.5 lineto
8 4.5 lineto
8 3.5 lineto
7 3.5 lineto
7 4.5 lineto
6 4.5 lineto
6 3.5 lineto
5 3.5 lineto
5 6.6875 lineto
6.6357499 24 6.84375 moveto
24 3.5 lineto
23 3.5 lineto
23 4.5 lineto
22 4.5 lineto
22 3.5 lineto
21 3.5 lineto
21 4.5 lineto
20 4.5 lineto
20 3.5 lineto
19 3.5 lineto
19 5.5 lineto
18 5.5 lineto
17 5.5 lineto
17 1.5 lineto
17 0.5 lineto
16 0.5 lineto
16 1.5 lineto
15 1.5 lineto
15 0.5 lineto
14 0.5 lineto
14 1.5 lineto
13 1.5 lineto
13 0.5 lineto
12 0.5 lineto
33.21875 8.53125 moveto
32.752266 7.392383 30.7275 6.53125 28.3125 6.53125 curveto
27.034897 6.53125 25.884152 6.761574 25 7.15625 curveto
23.909336 6.743624 22.655323 6.53125 21.3125 6.53125 curveto
19.625293 6.53125 18.065979 6.903601 16.8125 7.53125 curveto
16.642035 7.530622 16.484082 7.53125 16.3125 7.53125 curveto
15.733231 7.53125 15.190726 7.555449 14.625 7.5625 curveto
13.347306 6.889327 11.75375 6.5 10 6.5 curveto
8.70625 6.5 7.4689209 6.70874 6.40625 7.09375 curveto
5.5507866 6.75155 4.4924315 6.53125 3.3125 6.53125 curveto
0.8975 6.53125 -1.1272656 7.392383 -1.59375 8.53125 curveto
stroke"

%%%%%%%%%%%%%%%%%%%%%%%%%%%% Interludes %%%%%%%%%%%%%%%%%%%%%%%%%%%%
Arrosoir = \markup \with-dimensions #'(-5 . 5) #'(-10 . 8)
\postscript #"
-10 10 translate
2 -2 scale
gsave [1 0 0 1 0 0] concat
gsave [1 0 0 1 -8.68609 -16.7864] concat
gsave
<<
/ShadingType 2
/ColorSpace /DeviceRGB
/Coords [1.875 6.484375 2.75 6.484375]
/Extend [true true]
/Domain [0 1]
/Function <<
/FunctionType 3
/Functions
[
<<
/FunctionType 2
/Domain [0 1]
/C0 [1 1 1]
/C1 [0 0 0]
/N 1
>>
<<
/FunctionType 2
/Domain [0 1]
/C0 [0 0 0]
/C1 [0.24313726 0.24313726 0.24313726]
/N 1
>>
<<
/FunctionType 2
/Domain [0 1]
/C0 [0.24313726 0.24313726 0.24313726]
/C1 [1 1 1]
/N 1
>>
]
/Domain [0 1]
/Bounds [ 0.25 0.5 ]
/Encode [ 0 1 0 1 0 1 ]
>>
>>
newpath
11.473852 21.169699 moveto
10.910458 21.282378 lineto
10.848169 22.271692 10.79778 23.519761 10.79778 24.944439 curveto
10.79778 25.430463 10.817674 25.874967 10.825949 26.324754 curveto
11.022798 26.484244 11.267817 26.595059 11.558361 26.66279 curveto
11.570983 26.116759 11.586531 25.549458 11.586531 24.944439 curveto
11.586531 23.470755 11.540009 22.170626 11.473852 21.169699 curveto
closepath
clip
gsave [0.9014304 0 0 0.9014304 9.1075976 18.071032] concat
shfill
grestore
grestore
gsave
<<
/ShadingType 3
/ColorSpace /DeviceRGB
/Coords [8.7031364 6.8299584 0 8.7031364 6.8299584 2.0627947]
/Extend [true true]
/Domain [0 1]
/Function <<
/FunctionType 3
/Functions
[
<<
/FunctionType 2
/Domain [0 1]
/C0 [1 1 1]
/C1 [0.68235296 0.68235296 0.68235296]
/N 1
>>
<<
/FunctionType 2
/Domain [0 1]
/C0 [0.68235296 0.68235296 0.68235296]
/C1 [1 1 1]
/N 1
>>
]
/Domain [0 1]
/Bounds [ 0.049098209 ]
/Encode [ 0 1 0 1 ]
>>
>>
newpath
17.164132 21.02885 moveto
17.164132 21.02885 15.032973 23.096969 14.598687 23.579209 curveto
14.199751 24.022195 13.696002 24.580616 13.993468 24.567733 curveto
17.417659 21.282378 lineto
17.164132 21.02885 lineto
closepath
14.50281 24.112145 moveto
15.295009 22.927065 14.582832 23.641451 13.96444 24.368533 curveto
13.728611 24.610483 13.769683 25.765384 13.699259 26.409263 curveto
13.698066 26.420169 13.699254 26.42648 13.699259 26.437433 curveto
13.898561 26.318132 14.074231 26.15622 14.178144 25.958548 curveto
14.256489 25.770756 14.327305 24.547561 14.50281 24.112145 curveto
closepath
clip
gsave [0.451193 0.440514 -2.4090368 2.4674372 27.928514 2.8476059] concat
shfill
grestore
grestore
0 0 0 setrgbcolor
[] 0 setdash
0.095324747 setlinewidth
0 setlinejoin
0 setlinecap
newpath
17.023283 20.578135 moveto
14.318992 23.282426 lineto
14.318992 20.662644 lineto
10.375234 21.366887 lineto
10.375234 21.366887 10.375234 25.319252 10.375234 25.366984 curveto
10.375234 26.352978 11.259044 26.747299 12.347113 26.747299 curveto
13.435183 26.7473 14.318992 26.352978 14.318992 25.366984 curveto
14.318992 24.83176 lineto
14.264727 24.227777 14.755188 23.904153 15.121829 23.493699 curveto
17.530338 21.08519 lineto
17.023283 20.578135 lineto
closepath
stroke
gsave [0.8945596 -0.1110852 0.1110852 0.8945596 8.7667048 18.475224] concat
gsave
1 1 1 setrgbcolor
newpath
5.8928571 3.2924106 moveto
5.8928571 3.606607 4.8728571 3.861607 3.6160715 3.861607 curveto
2.3592858 3.861607 1.3392859 3.606607 1.3392859 3.2924106 curveto
1.3392859 2.9782142 2.3592858 2.7232142 3.6160715 2.7232142 curveto
4.8728571 2.7232142 5.8928571 2.9782142 5.8928571 3.2924106 curveto
closepath
fill
grestore
0 0 0 setrgbcolor
[] 0 setdash
0.1 setlinewidth
0 setlinejoin
0 setlinecap
newpath
5.8928571 3.2924106 moveto
5.8928571 3.606607 4.8728571 3.861607 3.6160715 3.861607 curveto
2.3592858 3.861607 1.3392859 3.606607 1.3392859 3.2924106 curveto
1.3392859 2.9782142 2.3592858 2.7232142 3.6160715 2.7232142 curveto
4.8728571 2.7232142 5.8928571 2.9782142 5.8928571 3.2924106 curveto
closepath
stroke
grestore
0 0 0 setrgbcolor
[] 0 setdash
0.074754633 setlinewidth
0 setlinejoin
0 setlinecap
newpath
18.12257 19.676654 moveto
17.794796 19.42933 17.28285 19.387589 16.966587 19.676415 curveto
16.966268 19.676654 lineto
16.867396 19.808484 lineto
16.802073 19.965451 16.776352 20.135621 16.768045 20.30436 curveto
16.848206 20.745409 17.166349 21.138398 17.598309 21.274084 curveto
17.713164 21.309333 17.833643 21.359956 17.956309 21.313594 curveto
18.118254 21.284257 18.303114 21.264601 18.419586 21.130529 curveto
18.701719 20.823059 18.671402 20.321742 18.434233 19.99787 curveto
18.358151 19.864387 18.244811 19.76542 18.12257 19.676654 curveto
closepath
stroke
gsave [1 0 0 1 8.68609 16.7864] concat
gsave
0 0 0 setrgbcolor
newpath
8.71875 2.6875 moveto
8.69899 2.7234675 8.6686918 2.7624417 8.6875 2.78125 curveto
8.714369 2.808119 8.7958424 2.797908 8.84375 2.75 curveto
8.8621762 2.7315738 8.8351919 2.7070559 8.84375 2.6875 curveto
8.7979837 2.6863481 8.7638754 2.682028 8.71875 2.6875 curveto
closepath
9.21875 2.78125 moveto
9.1882233 2.8233987 9.1340138 2.8840135 9.15625 2.90625 curveto
9.183119 2.933119 9.2645917 2.922908 9.3125 2.875 curveto
9.3309262 2.8565738 9.3039419 2.8320559 9.3125 2.8125 curveto
9.2833648 2.7965934 9.2494928 2.7942873 9.21875 2.78125 curveto
closepath
9.0625 2.8125 moveto
9.035631 2.785632 8.9854076 2.7958421 8.9375 2.84375 curveto
8.889592 2.891658 8.8793811 2.9418809 8.90625 2.96875 curveto
8.933119 2.995619 8.9833424 2.985408 9.03125 2.9375 curveto
9.079158 2.889592 9.0893679 2.8393691 9.0625 2.8125 curveto
closepath
8.8125 2.875 moveto
8.785631 2.848132 8.7041578 2.8583419 8.65625 2.90625 curveto
8.608342 2.954158 8.5981313 3.035631 8.625 3.0625 curveto
8.651869 3.089369 8.7020917 3.079158 8.75 3.03125 curveto
8.797908 2.983342 8.8393681 2.9018689 8.8125 2.875 curveto
closepath
9.53125 2.9375 moveto
9.504381 2.910632 9.4541577 2.9208419 9.40625 2.96875 curveto
9.358342 3.016658 9.3481312 3.066881 9.375 3.09375 curveto
9.401869 3.120619 9.4520916 3.110408 9.5 3.0625 curveto
9.547908 3.014592 9.558118 2.9643689 9.53125 2.9375 curveto
closepath
8.53125 2.96875 moveto
8.504381 2.941882 8.4229078 2.9520919 8.375 3 curveto
8.327092 3.047908 8.3168813 3.098131 8.34375 3.125 curveto
8.370619 3.151869 8.4208417 3.141658 8.46875 3.09375 curveto
8.516658 3.045842 8.5581182 2.9956189 8.53125 2.96875 curveto
closepath
9.25 3 moveto
9.223131 2.973132 9.1729085 2.9833419 9.125 3.03125 curveto
9.077092 3.079158 9.066881 3.160631 9.09375 3.1875 curveto
9.120619 3.214369 9.1708423 3.172908 9.21875 3.125 curveto
9.266658 3.077092 9.2768678 3.0268689 9.25 3 curveto
closepath
9 3.09375 moveto
8.973131 3.066882 8.9229077 3.0770921 8.875 3.125 curveto
8.827092 3.172908 8.7856313 3.223131 8.8125 3.25 curveto
8.839369 3.276869 8.9208416 3.266658 8.96875 3.21875 curveto
9.016658 3.170842 9.0268681 3.1206189 9 3.09375 curveto
closepath
9.6875 3.125 moveto
9.6591984 3.1280738 9.6232321 3.1267681 9.59375 3.15625 curveto
9.545842 3.204158 9.5356309 3.285631 9.5625 3.3125 curveto
9.589369 3.339369 9.6395923 3.297908 9.6875 3.25 curveto
9.711454 3.226046 9.7118513 3.2120191 9.71875 3.1875 curveto
9.7059831 3.1679508 9.7017983 3.1431146 9.6875 3.125 curveto
closepath
8.71875 3.15625 moveto
8.691881 3.129382 8.6416578 3.1395919 8.59375 3.1875 curveto
8.545842 3.235408 8.5043813 3.285631 8.53125 3.3125 curveto
8.558119 3.339369 8.6395917 3.329158 8.6875 3.28125 curveto
8.735408 3.233342 8.7456181 3.1831189 8.71875 3.15625 curveto
closepath
9.46875 3.1875 moveto
9.441881 3.160632 9.3916582 3.2020921 9.34375 3.25 curveto
9.295842 3.297908 9.2543807 3.348131 9.28125 3.375 curveto
9.308119 3.401869 9.389592 3.391658 9.4375 3.34375 curveto
9.485408 3.295842 9.4956175 3.2143689 9.46875 3.1875 curveto
closepath
8.4375 3.21875 moveto
8.410631 3.191882 8.3604084 3.233342 8.3125 3.28125 curveto
8.264592 3.329158 8.2543809 3.3793811 8.28125 3.40625 curveto
8.308119 3.433119 8.3583422 3.4229081 8.40625 3.375 curveto
8.454158 3.327092 8.4643677 3.245619 8.4375 3.21875 curveto
closepath
9.1875 3.28125 moveto
9.160631 3.254382 9.1104076 3.2645919 9.0625 3.3125 curveto
9.014592 3.360408 9.0043811 3.410631 9.03125 3.4375 curveto
9.058119 3.464369 9.1083425 3.454158 9.15625 3.40625 curveto
9.204158 3.358342 9.214368 3.308119 9.1875 3.28125 curveto
closepath
8.90625 3.34375 moveto
8.879381 3.316882 8.8291577 3.3583419 8.78125 3.40625 curveto
8.733342 3.454158 8.7231312 3.504381 8.75 3.53125 curveto
8.776869 3.558119 8.8270916 3.5479081 8.875 3.5 curveto
8.922908 3.452092 8.9331181 3.370619 8.90625 3.34375 curveto
closepath
9.8125 3.375 moveto
9.764592 3.422908 9.7231309 3.473131 9.75 3.5 curveto
9.7717019 3.5217019 9.833727 3.4974752 9.875 3.46875 curveto
9.8622857 3.4298111 9.8297738 3.4118751 9.8125 3.375 curveto
closepath
9.65625 3.40625 moveto
9.629381 3.379382 9.5791581 3.3895921 9.53125 3.4375 curveto
9.483342 3.485408 9.4731307 3.5356309 9.5 3.5625 curveto
9.526869 3.589369 9.577092 3.579158 9.625 3.53125 curveto
9.672908 3.483342 9.6831185 3.4331191 9.65625 3.40625 curveto
closepath
8.65625 3.4375 moveto
8.629381 3.410632 8.5479084 3.4208419 8.5 3.46875 curveto
8.452092 3.516658 8.4418809 3.566881 8.46875 3.59375 curveto
8.495619 3.620619 8.5458423 3.6104081 8.59375 3.5625 curveto
8.641658 3.514592 8.6831178 3.464369 8.65625 3.4375 curveto
closepath
9.375 3.46875 moveto
9.348131 3.441882 9.2979083 3.4520919 9.25 3.5 curveto
9.202092 3.547908 9.1918809 3.629381 9.21875 3.65625 curveto
9.245619 3.683119 9.2958422 3.672908 9.34375 3.625 curveto
9.391658 3.577092 9.4018677 3.4956189 9.375 3.46875 curveto
closepath
9.125 3.5625 moveto
9.098131 3.535632 9.0166584 3.545842 8.96875 3.59375 curveto
8.920842 3.641658 8.9106309 3.6918811 8.9375 3.71875 curveto
8.964369 3.745619 9.0145923 3.7354081 9.0625 3.6875 curveto
9.110408 3.639592 9.1518678 3.589369 9.125 3.5625 curveto
closepath
9.84375 3.59375 moveto
9.816881 3.566882 9.7666581 3.5770919 9.71875 3.625 curveto
9.670842 3.672908 9.6606306 3.754381 9.6875 3.78125 curveto
9.714369 3.808119 9.7645919 3.766658 9.8125 3.71875 curveto
9.860408 3.670842 9.8706184 3.6206189 9.84375 3.59375 curveto
closepath
8.84375 3.625 moveto
8.816881 3.598132 8.7354083 3.608342 8.6875 3.65625 curveto
8.639592 3.704158 8.6293808 3.7856311 8.65625 3.8125 curveto
8.683119 3.839369 8.7645921 3.8291579 8.8125 3.78125 curveto
8.860408 3.733342 8.8706176 3.651869 8.84375 3.625 curveto
closepath
9.59375 3.6875 moveto
9.566881 3.660632 9.4854083 3.6708421 9.4375 3.71875 curveto
9.389592 3.766658 9.3793808 3.816881 9.40625 3.84375 curveto
9.433119 3.870619 9.5145922 3.860408 9.5625 3.8125 curveto
9.610408 3.764592 9.6206177 3.7143689 9.59375 3.6875 curveto
closepath
9.3125 3.75 moveto
9.285631 3.723132 9.2354083 3.7333419 9.1875 3.78125 curveto
9.139592 3.829158 9.0981309 3.910631 9.125 3.9375 curveto
9.151869 3.964369 9.2333422 3.922908 9.28125 3.875 curveto
9.329158 3.827092 9.3393677 3.776869 9.3125 3.75 curveto
closepath
9.03125 3.84375 moveto
9.004381 3.816882 8.954158 3.827092 8.90625 3.875 curveto
8.858342 3.922908 8.8481306 3.9731309 8.875 4 curveto
8.901869 4.026869 8.9520919 4.0166579 9 3.96875 curveto
9.047908 3.920842 9.0581183 3.8706191 9.03125 3.84375 curveto
closepath
9.78125 3.875 moveto
9.754381 3.848132 9.7041582 3.8583419 9.65625 3.90625 curveto
9.608342 3.954158 9.5981308 4.0043808 9.625 4.03125 curveto
9.651869 4.058119 9.7020921 4.0479078 9.75 4 curveto
9.797908 3.952092 9.8081176 3.901869 9.78125 3.875 curveto
closepath
9.5 3.9375 moveto
9.473131 3.910632 9.4229083 3.952092 9.375 4 curveto
9.327092 4.047908 9.3168808 4.0981311 9.34375 4.125 curveto
9.370619 4.151869 9.4208422 4.1416581 9.46875 4.09375 curveto
9.516658 4.045842 9.5268677 3.964369 9.5 3.9375 curveto
closepath
9.25 4.03125 moveto
9.223131 4.004382 9.141658 4.014592 9.09375 4.0625 curveto
9.045842 4.110408 9.0356305 4.1606309 9.0625 4.1875 curveto
9.089369 4.214369 9.1395919 4.2041579 9.1875 4.15625 curveto
9.235408 4.108342 9.2768683 4.058119 9.25 4.03125 curveto
closepath
9.4375 4.21875 moveto
9.410631 4.191882 9.3291579 4.2020921 9.28125 4.25 curveto
9.233342 4.297908 9.2231314 4.3793809 9.25 4.40625 curveto
9.276869 4.433119 9.3583418 4.4229079 9.40625 4.375 curveto
9.454158 4.327092 9.4643682 4.2456191 9.4375 4.21875 curveto
closepath
fill
grestore
grestore
gsave
1 1 1 setrgbcolor
newpath
16.999305 19.643617 moveto
16.9874 19.653964 16.977552 19.66537 16.966269 19.676654 curveto
16.643872 19.999049 16.71764 20.584326 17.114936 20.981622 curveto
17.512231 21.378919 18.097509 21.452686 18.419905 21.13029 curveto
18.431188 21.119007 18.442595 21.109159 18.452942 21.097253 curveto
18.127313 21.041788 17.795075 20.86887 17.511383 20.585176 curveto
17.227689 20.301482 17.054769 19.969246 16.999305 19.643617 curveto
closepath
fill
grestore
0 0 0 setrgbcolor
[] 0 setdash
0.074754633 setlinewidth
0 setlinejoin
0 setlinecap
newpath
16.999305 19.643617 moveto
16.9874 19.653964 16.977552 19.66537 16.966269 19.676654 curveto
16.643872 19.999049 16.71764 20.584326 17.114936 20.981622 curveto
17.512231 21.378919 18.097509 21.452686 18.419905 21.13029 curveto
18.431188 21.119007 18.442595 21.109159 18.452942 21.097253 curveto
18.127313 21.041788 17.795075 20.86887 17.511383 20.585176 curveto
17.227689 20.301482 17.054769 19.969246 16.999305 19.643617 curveto
closepath
stroke
gsave [0.8934402 -0.1197557 0.1197557 0.8934402 8.6498288 18.509502] concat
gsave
0 0 0 setrgbcolor
newpath
5.1339288 3.2366071 moveto
5.1339288 3.3351785 4.4839287 3.4151785 3.6830359 3.4151785 curveto
2.882143 3.4151785 2.2321429 3.3351785 2.2321429 3.2366071 curveto
2.2321429 3.1380356 2.882143 3.0580356 3.6830359 3.0580356 curveto
4.4839287 3.0580356 5.1339288 3.1380356 5.1339288 3.2366071 curveto
closepath
fill
grestore
0 0 0 setrgbcolor
[] 0 setdash
0.1 setlinewidth
0 setlinejoin
0 setlinecap
newpath
5.1339288 3.2366071 moveto
5.1339288 3.3351785 4.4839287 3.4151785 3.6830359 3.4151785 curveto
2.882143 3.4151785 2.2321429 3.3351785 2.2321429 3.2366071 curveto
2.2321429 3.1380356 2.882143 3.0580356 3.6830359 3.0580356 curveto
4.4839287 3.0580356 5.1339288 3.1380356 5.1339288 3.2366071 curveto
closepath
stroke
grestore
gsave
1 1 1 setrgbcolor
newpath
11.304834 18.944292 moveto
9.899009 18.944292 8.7413915 20.10191 8.7413915 21.507735 curveto
8.7413915 22.593444 9.413239 23.510908 10.375234 23.87399 curveto
10.375477 23.729555 10.374977 23.716557 10.375234 23.564123 curveto
9.59701 23.215481 9.0512582 22.441601 9.0512582 21.535905 curveto
9.0512582 20.299785 10.068714 19.282329 11.304834 19.282329 curveto
12.29373 19.282329 13.096579 19.9383 13.389392 20.831662 curveto
13.487651 20.873246 13.590939 20.869557 13.699259 20.775323 curveto
13.383389 19.72828 12.451663 18.944292 11.304834 18.944292 curveto
closepath
fill
grestore
0 0 0 setrgbcolor
[] 0 setdash
0.1 setlinewidth
0 setlinejoin
0 setlinecap
newpath
11.304834 18.944292 moveto
9.899009 18.944292 8.7413915 20.10191 8.7413915 21.507735 curveto
8.7413915 22.593444 9.413239 23.510908 10.375234 23.87399 curveto
10.375477 23.729555 10.374977 23.716557 10.375234 23.564123 curveto
9.59701 23.215481 9.0512582 22.441601 9.0512582 21.535905 curveto
9.0512582 20.299785 10.068714 19.282329 11.304834 19.282329 curveto
12.29373 19.282329 13.096579 19.9383 13.389392 20.831662 curveto
13.487651 20.873246 13.590939 20.869557 13.699259 20.775323 curveto
13.383389 19.72828 12.451663 18.944292 11.304834 18.944292 curveto
closepath
stroke
grestore
grestore"

%%%%%%%%%%%%%%%%%%%%% Cover and title pages %%%%%%%%%%%%%%%%%%%%%%%%

copyleft = \markup { \sans \rotate #180 © }

Couronne = \markup \with-dimensions #'(0 . 30) #'(-24 . 16)
\postscript #"
0 8 translate
4 -4 scale
0 0 0 setrgbcolor
[] 0 setdash
1 setlinewidth
0 setlinejoin
0 setlinecap
gsave [1 0 0 1 0 0] concat
gsave [0.762069 0 0 0.8272728 -0.2827992 1.3039844] concat
gsave
<<
/ShadingType 2
/ColorSpace /DeviceRGB
/Coords [1.9037488 8.7373095 12.17542 8.7373095]
/Extend [true true]
/Domain [0 1]
/Function <<
/FunctionType 3
/Functions
[
<<
/FunctionType 2
/Domain [0 1]
/C0 [0 0 0]
/C1 [0 0 0]
/N 1
>>
<<
/FunctionType 2
/Domain [0 1]
/C0 [0 0 0]
/C1 [0.24705882 0.24705882 0.24705882]
/N 1
>>
<<
/FunctionType 2
/Domain [0 1]
/C0 [0.24705882 0.24705882 0.24705882]
/C1 [1 1 1]
/N 1
>>
]
/Domain [0 1]
/Bounds [ 0.50570315 0.69581985 ]
/Encode [ 0 1 0 1 0 1 ]
>>
>>
newpath
8.3450432 8.7373095 moveto
10.485497 8.7597382 lineto
8.9752496 8.7820991 lineto
10.674095 8.8043905 lineto
10.132993 8.8266106 lineto
11.294685 8.8487578 lineto
6.0016384 8.8708302 lineto
10.335923 8.8928263 lineto
8.2903299 8.9147443 lineto
11.198678 8.9365825 lineto
9.9185696 8.9583393 lineto
10.148533 8.9800128 lineto
9.7835041 9.0016014 lineto
10.13116 9.0231034 lineto
10.121433 9.0445169 lineto
6.740796 9.0658405 lineto
10.099919 9.0870723 lineto
10.108481 9.0871264 12.179453 9.1011803 12.175414 9.1082106 curveto
12.171376 9.115241 10.0844 9.129166 10.07569 9.1292538 curveto
7.997174 9.1502001 lineto
10.048781 9.1710478 lineto
10.707459 9.1917951 lineto
8.6166047 9.2124406 lineto
10.003473 9.2329823 lineto
9.8323168 9.2534185 lineto
10.332476 9.2737476 lineto
7.8144545 9.2939679 lineto
10.172204 9.3140775 lineto
9.5273148 9.3340751 lineto
10.056599 9.3539586 lineto
8.6539098 9.3737264 lineto
10.113393 9.3933768 lineto
9.9941773 9.4129081 lineto
9.5889868 9.4323186 lineto
9.9495216 9.4516066 lineto
10.868087 9.4707704 lineto
9.146503 9.4898083 lineto
9.8780658 9.5087185 lineto
9.8780658 9.5087185 9.5561874 9.5237838 9.4181301 9.5274994 curveto
8.9880831 9.5390735 7.9841714 9.5461491 7.9841714 9.5461491 curveto
10.072289 9.5646662 lineto
9.5381369 9.5830488 lineto
10.328959 9.6012951 lineto
9.1758221 9.6194036 lineto
9.962034 9.6373725 lineto
10.708073 9.6552001 lineto
9.4358743 9.6728847 lineto
9.8735229 9.6904245 lineto
9.5719971 9.7078179 lineto
8.9713066 9.7250631 lineto
9.2813941 9.7421585 lineto
10.04661 9.7591023 lineto
8.952443 9.7758929 lineto
9.4111257 9.7925285 lineto
6.3327984 9.8090074 lineto
9.3431603 9.8253279 lineto
9.3084206 9.8414883 lineto
8.6414797 9.8574868 lineto
9.2374495 9.8733219 lineto
9.1235589 9.8889917 lineto
9.6512413 9.9044946 lineto
8.644369 9.9349927 lineto
9.0129284 9.9648025 lineto
8.9343388 9.9939104 lineto
8.114348 10.022303 lineto
9.1083149 10.049966 lineto
7.2587298 10.076886 lineto
8.5148938 10.128442 lineto
8.3164228 10.152652 lineto
8.6875196 10.176863 lineto
7.3937319 10.222039 lineto
7.9580232 10.26386 lineto
7.7606705 10.302217 lineto
6.1473586 10.319608 lineto
7.5579337 10.337 lineto
7.0115244 10.430746 6.4084707 10.44489 5.7768097 10.44489 curveto
3.2501656 10.44489 1.9037487 9.6956916 1.9037487 8.7373095 curveto
1.9037487 7.7789273 3.2501656 7.1728218 5.7768097 7.1728218 curveto
6.4084707 7.1728218 7.0032545 7.2767538 7.5579337 7.3093305 curveto
8.3354232 7.3549931 lineto
8.0488838 7.4034138 lineto
8.6878271 7.4168122 lineto
8.7717521 7.4437323 lineto
8.3050785 7.4713953 lineto
9.9699165 7.4997875 lineto
8.6349425 7.5098163 lineto
9.4365859 7.5396262 lineto
9.1645198 7.5701243 lineto
8.0828033 7.5856271 lineto
9.7811278 7.601297 lineto
9.2731821 7.617132 lineto
10.851431 7.6331306 lineto
9.7366798 7.649291 lineto
9.3773969 7.6656115 lineto
9.8771357 7.6820904 lineto
8.5123225 7.698726 lineto
9.4770424 7.7155166 lineto
11.114367 7.7324604 lineto
8.8263257 7.7495558 lineto
11.001094 7.766801 lineto
9.1728204 7.7841944 lineto
8.8248835 7.8017342 lineto
9.8899664 7.8194188 lineto
9.6910963 7.8372464 lineto
8.207557 7.8552153 lineto
10.073554 7.8733238 lineto
10.893057 7.8915701 lineto
9.407832 7.9099527 lineto
10.676673 7.9284698 lineto
9.3042165 7.9471196 lineto
9.8780658 7.9659004 lineto
9.9024747 7.9848106 lineto
10.879026 8.0038485 lineto
9.9495216 8.0230123 lineto
10.301669 8.0423003 lineto
9.0188682 8.0617108 lineto
10.697212 8.0812421 lineto
9.5995973 8.1008926 lineto
11.14209 8.1206605 lineto
10.40569 8.1405439 lineto
7.9928962 8.1605414 lineto
10.442956 8.180651 lineto
10.729891 8.2008713 lineto
9.1832147 8.2212004 lineto
11.115437 8.2416367 lineto
10.087125 8.2621783 lineto
9.1080754 8.2828237 lineto
10.903716 8.3035711 lineto
10.052796 8.3244189 lineto
7.9792286 8.3453651 lineto
10.24924 8.3664083 lineto
10.4992 8.3875467 lineto
9.2572498 8.4087784 lineto
10.414339 8.430102 lineto
10.424066 8.4515156 lineto
8.7168591 8.4730176 lineto
10.580569 8.4946062 lineto
11.557143 8.5162797 lineto
9.5912981 8.5380364 lineto
10.922385 8.5598746 lineto
10.606861 8.5817926 lineto
10.611647 8.6037888 lineto
8.0768557 8.6258613 lineto
10.619042 8.6480084 lineto
10.621643 8.6702285 lineto
8.8733947 8.6925199 lineto
10.485497 8.7148808 lineto
8.3450432 8.7373095 lineto
closepath
clip
shfill
grestore
grestore
gsave [0.018654988 0 0 0.018654988 11.563614 -10.117306] concat
gsave [1 0 0 1 -785.89868 -276.7818] concat
gsave
0.24705882 0.24705882 0.24705882 setrgbcolor
newpath
424.03128 971.17977 moveto
425.5376 999.77295 414.24793 1012.1448 425.0118 1034.7357 curveto
449.02715 1030.3627 464.19459 1005.206 492.47296 981.07073 curveto
466.23772 1090.7125 lineto
385.3852 1251.3739 427.46549 1495.5834 270.57358 1103.7456 curveto
270.43839 1101.1795 lineto
281.05784 1117.7673 205.16112 1055.8594 218.67476 1066.2303 curveto
224.65489 1028.5273 214.05546 977.64126 206.47021 938.12455 curveto
221.90125 971.15109 243.6294 1004.7035 283.25373 1028.0336 curveto
302.95203 998.76927 314.19805 958.46452 312.29673 914.47315 curveto
312.72634 889.26228 lineto
318.44661 935.96258 339.92479 1000.9366 367.42293 1025.1756 curveto
367.52782 1025.1062 367.64489 1025.0673 367.74959 1024.9975 curveto
370.99294 1022.8355 374.1261 1020.4587 377.17118 1017.8752 curveto
380.21627 1015.2918 383.15614 1012.5078 385.98554 1009.5304 curveto
388.81495 1006.5531 391.54819 1003.3741 394.14451 1000.0302 curveto
396.74082 996.68613 399.20418 993.15903 401.55001 989.47582 curveto
403.89584 985.7926 406.10347 981.96036 408.18137 977.96521 curveto
410.25927 973.97006 412.22191 969.81145 414.01447 965.53182 curveto
415.80706 961.25209 417.4374 956.84742 418.92721 952.31046 curveto
420.41703 947.7735 421.75162 943.10032 422.92127 938.33352 curveto
424.09093 933.56668 425.09401 928.70257 425.92608 923.73312 curveto
426.75816 918.76376 427.41468 913.68885 427.89176 908.54426 curveto
427.89675 908.49038 427.90412 908.43642 427.90909 908.38253 curveto
425.68679 924.05712 423.50826 950.88795 424.03128 971.17977 curveto
closepath
fill
grestore
0 0 0 setrgbcolor
[] 0 setdash
1.4530765 setlinewidth
0 setlinejoin
0 setlinecap
newpath
424.03128 971.17977 moveto
425.5376 999.77295 414.24793 1012.1448 425.0118 1034.7357 curveto
449.02715 1030.3627 464.19459 1005.206 492.47296 981.07073 curveto
466.23772 1090.7125 lineto
385.3852 1251.3739 427.46549 1495.5834 270.57358 1103.7456 curveto
270.43839 1101.1795 lineto
281.05784 1117.7673 205.16112 1055.8594 218.67476 1066.2303 curveto
224.65489 1028.5273 214.05546 977.64126 206.47021 938.12455 curveto
221.90125 971.15109 243.6294 1004.7035 283.25373 1028.0336 curveto
302.95203 998.76927 314.19805 958.46452 312.29673 914.47315 curveto
312.72634 889.26228 lineto
318.44661 935.96258 339.92479 1000.9366 367.42293 1025.1756 curveto
367.52782 1025.1062 367.64489 1025.0673 367.74959 1024.9975 curveto
370.99294 1022.8355 374.1261 1020.4587 377.17118 1017.8752 curveto
380.21627 1015.2918 383.15614 1012.5078 385.98554 1009.5304 curveto
388.81495 1006.5531 391.54819 1003.3741 394.14451 1000.0302 curveto
396.74082 996.68613 399.20418 993.15903 401.55001 989.47582 curveto
403.89584 985.7926 406.10347 981.96036 408.18137 977.96521 curveto
410.25927 973.97006 412.22191 969.81145 414.01447 965.53182 curveto
415.80706 961.25209 417.4374 956.84742 418.92721 952.31046 curveto
420.41703 947.7735 421.75162 943.10032 422.92127 938.33352 curveto
424.09093 933.56668 425.09401 928.70257 425.92608 923.73312 curveto
426.75816 918.76376 427.41468 913.68885 427.89176 908.54426 curveto
427.89675 908.49038 427.90412 908.43642 427.90909 908.38253 curveto
425.68679 924.05712 423.50826 950.88795 424.03128 971.17977 curveto
closepath
stroke
gsave
1 1 1 setrgbcolor
newpath
242.50026 858.16551 moveto
248.4373 885.8689 251.73356 916.41838 251.73356 948.53402 curveto
251.73356 989.9299 246.24956 1028.7338 236.69721 1062.168 curveto
212.50565 1057.681 190.5334 1037.5599 173.25051 1006.8602 curveto
173.25051 1007.6497 lineto
200.92657 1054.4237 226.79333 1094.7356 226.79333 1180.9921 curveto
224.62686 1261.7869 lineto
224.62686 1319.2837 281.66948 1351.6147 351.9587 1351.6147 curveto
422.24791 1351.6147 479.29053 1317.259 479.29053 1261.7869 curveto
476.0712 1227.5616 475.03074 1193.4256 475.42183 1159.0064 curveto
475.42183 1078.6691 496.3652 1043.5764 517.69383 982.71246 curveto
517.69383 978.9974 lineto
507.97004 1003.7536 488.14528 1038.4835 475.20697 1054.4843 curveto
461.57555 1016.858 461.59767 956.2785 461.59767 906.04318 curveto
461.59767 889.61194 462.46152 873.60695 464.09943 858.16551 curveto
463.6094 858.16551 lineto
455.43255 932.22214 429.4104 992.66319 395.18498 1019.9093 curveto
373.99246 979.15727 360.653 921.82266 360.23772 858.16551 curveto
358.4839 821.80002 lineto
355.23115 889.65866 337.21624 985.09847 311.05363 1022.1848 curveto
310.94533 1022.0927 310.82647 1022.0454 310.71835 1021.9526 curveto
307.3686 1019.0778 304.1175 1015.8846 300.94343 1012.3864 curveto
297.76935 1008.8882 294.68972 1005.0924 291.71013 1001.009 curveto
288.73054 996.9257 285.83632 992.54389 283.07003 987.91352 curveto
280.30374 983.28314 277.66049 978.37831 275.1263 973.23908 curveto
272.59211 968.09985 270.18798 962.73501 267.90472 957.12507 curveto
265.62147 951.51513 263.44462 945.66042 261.4311 939.61791 curveto
259.41757 933.5754 257.55934 927.34028 255.83438 920.90336 curveto
254.10941 914.46645 252.53216 907.82102 251.11457 901.02786 curveto
249.69696 894.23471 248.44045 887.28842 247.34903 880.17716 curveto
246.2576 873.06591 245.33578 865.78891 244.58936 858.3977 curveto
244.58154 858.32029 244.57135 858.24295 244.56356 858.16551 curveto
242.50026 858.16551 lineto
closepath
fill
grestore
0 0 0 setrgbcolor
[] 0 setdash
1.7464267 setlinewidth
0 setlinejoin
0 setlinecap
newpath
242.50026 858.16551 moveto
248.4373 885.8689 251.73356 916.41838 251.73356 948.53402 curveto
251.73356 989.9299 246.24956 1028.7338 236.69721 1062.168 curveto
212.50565 1057.681 190.5334 1037.5599 173.25051 1006.8602 curveto
173.25051 1007.6497 lineto
200.92657 1054.4237 226.79333 1094.7356 226.79333 1180.9921 curveto
224.62686 1261.7869 lineto
224.62686 1319.2837 281.66948 1351.6147 351.9587 1351.6147 curveto
422.24791 1351.6147 479.29053 1317.259 479.29053 1261.7869 curveto
476.0712 1227.5616 475.03074 1193.4256 475.42183 1159.0064 curveto
475.42183 1078.6691 496.3652 1043.5764 517.69383 982.71246 curveto
517.69383 978.9974 lineto
507.97004 1003.7536 488.14528 1038.4835 475.20697 1054.4843 curveto
461.57555 1016.858 461.59767 956.2785 461.59767 906.04318 curveto
461.59767 889.61194 462.46152 873.60695 464.09943 858.16551 curveto
463.6094 858.16551 lineto
455.43255 932.22214 429.4104 992.66319 395.18498 1019.9093 curveto
373.99246 979.15727 360.653 921.82266 360.23772 858.16551 curveto
358.4839 821.80002 lineto
355.23115 889.65866 337.21624 985.09847 311.05363 1022.1848 curveto
310.94533 1022.0927 310.82647 1022.0454 310.71835 1021.9526 curveto
307.3686 1019.0778 304.1175 1015.8846 300.94343 1012.3864 curveto
297.76935 1008.8882 294.68972 1005.0924 291.71013 1001.009 curveto
288.73054 996.9257 285.83632 992.54389 283.07003 987.91352 curveto
280.30374 983.28314 277.66049 978.37831 275.1263 973.23908 curveto
272.59211 968.09985 270.18798 962.73501 267.90472 957.12507 curveto
265.62147 951.51513 263.44462 945.66042 261.4311 939.61791 curveto
259.41757 933.5754 257.55934 927.34028 255.83438 920.90336 curveto
254.10941 914.46645 252.53216 907.82102 251.11457 901.02786 curveto
249.69696 894.23471 248.44045 887.28842 247.34903 880.17716 curveto
246.2576 873.06591 245.33578 865.78891 244.58936 858.3977 curveto
244.58154 858.32029 244.57135 858.24295 244.56356 858.16551 curveto
242.50026 858.16551 lineto
closepath
stroke
grestore
gsave
<<
/ShadingType 3
/ColorSpace /DeviceRGB
/Coords [-349.51562 913.87695 0 -349.51562 913.87695 19.045088]
/Extend [true true]
/Domain [0 1]
/Function <<
/FunctionType 3
/Functions
[
<<
/FunctionType 2
/Domain [0 1]
/C0 [0.78823531 0.78823531 0.78823531]
/C1 [1 1 1]
/N 1
>>
<<
/FunctionType 2
/Domain [0 1]
/C0 [1 1 1]
/C1 [1 1 1]
/N 1
>>
]
/Domain [0 1]
/Bounds [ 0.69168174 ]
/Encode [ 0 1 0 1 ]
>>
>>
newpath
-349.5 751.34375 moveto
-359.53688 751.34375 -367.68751 860.39864 -367.6875 994.78125 curveto
-367.6875 1018.4038 -367.4382 1041.1783 -366.96875 1062.7812 curveto
-353.24781 1057.261 -341.25337 1049.9641 -331.65625 1041.0312 curveto
-331.44038 1026.0401 -331.34375 1010.6121 -331.34375 994.78125 curveto
-331.34375 860.39864 -339.46312 751.34377 -349.5 751.34375 curveto
closepath
clip
gsave [1 0 0 16.602521 0 -14152.462] concat
shfill
grestore
grestore
0 0 0 setrgbcolor
[] 0 setdash
1.7460001 setlinewidth
0 setlinejoin
0 setlinecap
newpath
-543.39842 581.38371 moveto
-537.46138 609.0871 -534.16512 639.63658 -534.16512 671.75222 curveto
-534.16512 713.1481 -539.64912 751.952 -549.20147 785.3862 curveto
-573.39303 780.8992 -595.36528 760.7781 -612.64817 730.0784 curveto
-612.64817 730.8679 lineto
-584.97211 777.6419 -559.10535 817.9538 -559.10535 904.2103 curveto
-559.10535 944.6911 -558.25552 922.9121 -560.78178 958.6283 curveto
-561.27182 985.0051 lineto
-561.27182 1042.5019 -504.2292 1074.8329 -433.93998 1074.8329 curveto
-363.65077 1074.8329 -306.60815 1040.4772 -306.60815 985.0051 curveto
-309.75595 950.78984 -310.74098 916.62439 -310.47685 882.2246 curveto
-310.47685 801.8873 -289.53348 766.7946 -268.20485 705.93066 curveto
-268.20485 702.2156 lineto
-277.92864 726.9718 -297.7534 761.7017 -310.69171 777.7025 curveto
-324.32313 740.0762 -324.30101 679.4967 -324.30101 629.26138 curveto
-324.30101 612.83014 -323.43716 596.82515 -321.79925 581.38371 curveto
-322.28928 581.38371 lineto
-330.46613 655.44034 -356.48828 715.88139 -390.7137 743.1275 curveto
-411.90622 702.37547 -425.24568 645.04086 -425.66096 581.38371 curveto
-427.41478 545.01822 lineto
-430.66753 612.87686 -448.68244 708.31667 -474.84505 745.403 curveto
-474.95335 745.3109 -475.07221 745.2636 -475.18033 745.1708 curveto
-478.53008 742.296 -481.78118 739.1028 -484.95525 735.6046 curveto
-488.12933 732.1064 -491.20896 728.3106 -494.18855 724.2272 curveto
-497.16814 720.1439 -500.06236 715.76209 -502.82865 711.13172 curveto
-505.59494 706.50134 -508.23819 701.59651 -510.77238 696.45728 curveto
-513.30657 691.31805 -515.7107 685.95321 -517.99396 680.34327 curveto
-520.27721 674.73333 -522.45406 668.87862 -524.46758 662.83611 curveto
-526.48111 656.7936 -528.33934 650.55848 -530.0643 644.12156 curveto
-531.78927 637.68465 -533.36652 631.03922 -534.78411 624.24606 curveto
-536.20172 617.45291 -537.45823 610.50662 -538.54965 603.39536 curveto
-539.64108 596.28411 -540.5629 589.00711 -541.30932 581.6159 curveto
-541.31714 581.53849 -541.32733 581.46115 -541.33512 581.38371 curveto
-543.39842 581.38371 lineto
closepath
stroke
grestore
grestore"

Bilboquet = \markup \with-dimensions #'(0 . 25) #'(-16 . 11)
\postscript #"
0 10 translate
2 -2 scale
0 0 0 setrgbcolor
[] 0 setdash
1 setlinewidth
0 setlinejoin
0 setlinecap
gsave [1 0 0 1 0 0] concat
gsave [0.060500411 0 0 0.060500411 -0.3300129 -20.815598] concat
gsave [1.0001703 -0.026352441 0.019823299 0.7523658 -26.034812 119.92367] concat
gsave
<<
/ShadingType 3
/ColorSpace /DeviceRGB
/Coords [128.92291 521.55566 0 128.92291 521.55566 63.892147]
/Extend [true true]
/Domain [0 1]
/Function <<
/FunctionType 3
/Functions
[
<<
/FunctionType 2
/Domain [0 1]
/C0 [0.28627452 0.28627452 0.28627452]
/C1 [1 1 1]
/N 1
>>
<<
/FunctionType 2
/Domain [0 1]
/C0 [1 1 1]
/C1 [1 1 1]
/N 1
>>
]
/Domain [0 1]
/Bounds [ 0.79865998 ]
/Encode [ 0 1 0 1 ]
>>
>>
newpath
205.06097 522.28467 moveto
205.06097 542.49782 176.43729 558.9027 141.16882 558.9027 curveto
123.53459 558.9027 107.56155 554.80148 95.997075 548.17362 curveto
84.432597 541.54575 84.341635 532.6387 84.341635 522.53213 curveto
84.341635 512.42555 91.497556 503.27105 103.06203 496.64318 curveto
114.62651 490.01532 123.53459 485.66664 141.16882 485.66664 curveto
176.43729 485.66664 205.06097 502.07152 205.06097 522.28467 curveto
closepath
clip
gsave [1.1572069 0.040532579 -0.014893131 0.7514197 -15.896833 124.60396] concat
shfill
grestore
grestore
grestore
gsave [1 0 0 1 2.0203051 1.5152288] concat
gsave
<<
/ShadingType 3
/ColorSpace /DeviceRGB
/Coords [90.661194 506.82156 0 90.661194 506.82156 30.872152]
/Extend [true true]
/Domain [0 1]
/Function <<
/FunctionType 3
/Functions
[
<<
/FunctionType 2
/Domain [0 1]
/C0 [1 1 1]
/C1 [1 1 1]
/N 1
>>
<<
/FunctionType 2
/Domain [0 1]
/C0 [1 1 1]
/C1 [0.50980395 0.50980395 0.50980395]
/N 1
>>
]
/Domain [0 1]
/Bounds [ 0.67154539 ]
/Encode [ 0 1 0 1 ]
>>
>>
newpath
134.26889 509.53146 moveto
134.26889 520.61385 118.46616 529.60825 98.994949 529.60825 curveto
79.523736 529.60825 63.721012 520.61385 63.721012 509.53146 curveto
63.721012 498.44908 79.523736 489.45468 98.994949 489.45468 curveto
118.46616 489.45468 134.26889 498.44908 134.26889 509.53146 curveto
closepath
clip
gsave [1.3926462 0.016360148 -0.008623799 0.7340948 -31.227044 134.22533] concat
shfill
grestore
grestore
0 0 0 setrgbcolor
[] 0 setdash
1.0330508 setlinewidth
0 setlinejoin
0 setlinecap
newpath
134.26889 509.53146 moveto
134.26889 520.61385 118.46616 529.60825 98.994949 529.60825 curveto
79.523736 529.60825 63.721012 520.61385 63.721012 509.53146 curveto
63.721012 498.44908 79.523736 489.45468 98.994949 489.45468 curveto
118.46616 489.45468 134.26889 498.44908 134.26889 509.53146 curveto
closepath
stroke
grestore
gsave
<<
/ShadingType 3
/ColorSpace /DeviceRGB
/Coords [85.113327 492.76846 0 85.113327 492.76846 29.859375]
/Extend [true true]
/Domain [0 1]
/Function <<
/FunctionType 3
/Functions
[
<<
/FunctionType 2
/Domain [0 1]
/C0 [1 1 1]
/C1 [1 1 1]
/N 1
>>
<<
/FunctionType 2
/Domain [0 1]
/C0 [1 1 1]
/C1 [0.50980395 0.50980395 0.50980395]
/N 1
>>
]
/Domain [0 1]
/Bounds [ 0.67154539 ]
/Encode [ 0 1 0 1 ]
>>
>>
newpath
100.375 483.40625 moveto
89.153311 483.40625 79.530132 487.29221 75.5 492.84375 curveto
72.323067 494.87163 70.46875 497.31432 70.46875 499.9375 curveto
70.46875 504.21732 75.580011 507.54907 82.96875 510.3125 curveto
87.840048 512.1344 93.62977 513.9375 100.375 513.9375 curveto
107.12023 513.93749 113.28795 512.04653 118.21875 510.09375 curveto
125.21635 507.32243 130.0625 504.08771 130.0625 499.9375 curveto
130.0625 497.44425 128.36249 495.12187 125.46875 493.15625 curveto
121.5754 487.44193 111.80307 483.40625 100.375 483.40625 curveto
closepath
clip
gsave [1.8539506 0.059661641 -0.022501421 0.6992185 -61.594584 146.01058] concat
shfill
grestore
grestore
0 0 0 setrgbcolor
[] 0 setdash
1.0330508 setlinewidth
0 setlinejoin
0 setlinecap
newpath
100.375 483.40625 moveto
89.153311 483.40625 79.530132 487.29221 75.5 492.84375 curveto
72.323067 494.87163 70.46875 497.31432 70.46875 499.9375 curveto
70.46875 504.21732 75.580011 507.54907 82.96875 510.3125 curveto
87.840048 512.1344 93.62977 513.9375 100.375 513.9375 curveto
107.12023 513.93749 113.28795 512.04653 118.21875 510.09375 curveto
125.21635 507.32243 130.0625 504.08771 130.0625 499.9375 curveto
130.0625 497.44425 128.36249 495.12187 125.46875 493.15625 curveto
121.5754 487.44193 111.80307 483.40625 100.375 483.40625 curveto
closepath
stroke
gsave
0.49803922 0.49803922 0.49803922 setrgbcolor
newpath
130.09547 407.73232 moveto
129.70645 407.77649 129.3906 408.06707 129.31422 408.45107 curveto
128.93988 410.05752 127.52322 416.40853 127.14782 418.03054 curveto
125.64626 424.51859 124.61829 431.91792 127.52282 446.59304 curveto
130.45561 461.41094 142.98702 469.34654 151.5 478.03125 curveto
160.01298 486.71596 169.23363 496.15866 175.5 514.1875 curveto
176.63437 517.45118 176.74045 520.40797 175.96875 523.125 curveto
175.71152 524.03068 175.34882 524.89217 174.90625 525.75 curveto
174.02112 527.46565 172.77488 529.09535 171.1875 530.625 curveto
169.60012 532.15465 167.67268 533.58043 165.46875 534.90625 curveto
161.06089 537.55789 155.52551 539.77631 149.28125 541.53125 curveto
143.03699 543.28619 136.07258 544.59119 128.84375 545.40625 curveto
114.38609 547.03637 98.810646 546.75037 85.46875 544.53125 curveto
82.133276 543.97647 78.937639 543.30023 75.9375 542.5 curveto
69.937222 540.89955 64.714471 538.80788 60.6875 536.28125 curveto
58.674015 535.01793 56.955917 533.66846 55.59375 532.1875 curveto
52.796015 529.14578 50.804278 526.11915 49.5 523.1875 curveto
48.195722 520.25585 47.591498 517.41406 47.53125 514.71875 curveto
47.501126 513.37109 47.606837 512.05189 47.84375 510.78125 curveto
48.317576 508.23998 49.295702 505.86049 50.6875 503.71875 curveto
51.383399 502.64788 52.174652 501.63562 53.0625 500.6875 curveto
53.950348 499.73938 54.946164 498.86774 56 498.0625 curveto
57.053836 497.25726 58.182078 496.51972 59.375 495.875 curveto
60.567922 495.23028 61.819896 494.68533 63.125 494.21875 curveto
69.650518 491.88583 77.40641 491.86992 84.71875 495.3125 curveto
84.749404 495.32463 84.780701 495.33506 84.8125 495.34375 curveto
84.832921 495.35497 84.85377 495.3654 84.875 495.375 curveto
84.936222 495.39201 84.999072 495.40248 85.0625 495.40625 curveto
85.12483 495.41278 85.18767 495.41278 85.25 495.40625 curveto
85.337531 495.3876 85.421791 495.356 85.5 495.3125 curveto
85.531799 495.30381 85.563096 495.29338 85.59375 495.28125 curveto
85.638055 495.25368 85.67988 495.22231 85.71875 495.1875 curveto
85.813155 495.10016 85.887747 494.9936 85.9375 494.875 curveto
85.963167 494.82498 85.984092 494.77267 86 494.71875 curveto
86.017006 494.65753 86.027481 494.59468 86.03125 494.53125 curveto
86.022558 494.49945 86.012126 494.46815 86 494.4375 curveto
85.994223 494.3846 85.983765 494.33231 85.96875 494.28125 curveto
85.954863 494.21665 85.933903 494.15377 85.90625 494.09375 curveto
85.880366 494.03863 85.848955 493.98628 85.8125 493.9375 curveto
85.792703 493.91566 85.771844 493.8948 85.75 493.875 curveto
85.730203 493.85316 85.709344 493.8323 85.6875 493.8125 curveto
85.630483 493.76314 85.56749 493.72115 85.5 493.6875 curveto
83.949057 492.95733 82.357107 492.38682 80.78125 491.9375 curveto
72.901965 489.69091 64.91088 490.82914 58.53125 494.28125 curveto
55.979398 495.66209 53.665707 497.42299 51.75 499.46875 curveto
50.792146 500.49163 49.942926 501.58483 49.1875 502.75 curveto
47.676649 505.08034 46.582596 507.65812 46.0625 510.4375 curveto
45.802452 511.82719 45.685848 513.27807 45.71875 514.75 curveto
45.751652 516.22193 45.959827 517.72106 46.3125 519.25 curveto
47.37052 523.83683 49.912845 528.65688 54.28125 533.40625 curveto
55.774085 535.02927 57.599842 536.50417 59.71875 537.84375 curveto
63.956565 540.52292 69.3384 542.63078 75.46875 544.25 curveto
78.533925 545.05961 81.80213 545.74942 85.1875 546.3125 curveto
88.57287 546.87558 92.081429 547.30843 95.6875 547.625 curveto
102.89964 548.25815 110.45505 548.40462 117.9375 548.0625 curveto
121.67873 547.89144 125.40682 547.59968 129.0625 547.1875 curveto
143.68522 545.53877 157.21097 542.00036 166.40625 536.46875 curveto
171.00389 533.70294 174.51954 530.43248 176.5 526.59375 curveto
176.99511 525.63407 177.40025 524.62042 177.6875 523.59375 curveto
177.97475 522.56708 178.15206 521.52434 178.21875 520.4375 curveto
178.35214 518.26383 178.04368 515.96714 177.21875 513.59375 curveto
177.20746 513.56127 177.19881 513.53243 177.1875 513.5 curveto
170.80467 495.19832 161.28048 485.45193 152.78125 476.78125 curveto
144.26696 468.0952 132.1116 460.59219 129.27282 446.24929 curveto
126.40579 431.76361 127.42192 424.814 128.89782 418.43679 curveto
129.2668 416.84248 130.68387 410.48956 131.06422 408.85732 curveto
131.14016 408.57043 131.06981 408.26454 130.87616 408.03966 curveto
130.68251 407.81478 130.39045 407.6998 130.09547 407.73232 curveto
closepath
eofill
grestore
0 0 0 setrgbcolor
[] 0 setdash
0.5 setlinewidth
0 setlinejoin
1 setlinecap
newpath
130.09547 407.73232 moveto
129.70645 407.77649 129.3906 408.06707 129.31422 408.45107 curveto
128.93988 410.05752 127.52322 416.40853 127.14782 418.03054 curveto
125.64626 424.51859 124.61829 431.91792 127.52282 446.59304 curveto
130.45561 461.41094 142.98702 469.34654 151.5 478.03125 curveto
160.01298 486.71596 169.23363 496.15866 175.5 514.1875 curveto
176.63437 517.45118 176.74045 520.40797 175.96875 523.125 curveto
175.71152 524.03068 175.34882 524.89217 174.90625 525.75 curveto
174.02112 527.46565 172.77488 529.09535 171.1875 530.625 curveto
169.60012 532.15465 167.67268 533.58043 165.46875 534.90625 curveto
161.06089 537.55789 155.52551 539.77631 149.28125 541.53125 curveto
143.03699 543.28619 136.07258 544.59119 128.84375 545.40625 curveto
114.38609 547.03637 98.810646 546.75037 85.46875 544.53125 curveto
82.133276 543.97647 78.937639 543.30023 75.9375 542.5 curveto
69.937222 540.89955 64.714471 538.80788 60.6875 536.28125 curveto
58.674015 535.01793 56.955917 533.66846 55.59375 532.1875 curveto
52.796015 529.14578 50.804278 526.11915 49.5 523.1875 curveto
48.195722 520.25585 47.591498 517.41406 47.53125 514.71875 curveto
47.501126 513.37109 47.606837 512.05189 47.84375 510.78125 curveto
48.317576 508.23998 49.295702 505.86049 50.6875 503.71875 curveto
51.383399 502.64788 52.174652 501.63562 53.0625 500.6875 curveto
53.950348 499.73938 54.946164 498.86774 56 498.0625 curveto
57.053836 497.25726 58.182078 496.51972 59.375 495.875 curveto
60.567922 495.23028 61.819896 494.68533 63.125 494.21875 curveto
69.650518 491.88583 77.40641 491.86992 84.71875 495.3125 curveto
84.749404 495.32463 84.780701 495.33506 84.8125 495.34375 curveto
84.832921 495.35497 84.85377 495.3654 84.875 495.375 curveto
84.936222 495.39201 84.999072 495.40248 85.0625 495.40625 curveto
85.12483 495.41278 85.18767 495.41278 85.25 495.40625 curveto
85.337531 495.3876 85.421791 495.356 85.5 495.3125 curveto
85.531799 495.30381 85.563096 495.29338 85.59375 495.28125 curveto
85.638055 495.25368 85.67988 495.22231 85.71875 495.1875 curveto
85.813155 495.10016 85.887747 494.9936 85.9375 494.875 curveto
85.963167 494.82498 85.984092 494.77267 86 494.71875 curveto
86.017006 494.65753 86.027481 494.59468 86.03125 494.53125 curveto
86.022558 494.49945 86.012126 494.46815 86 494.4375 curveto
85.994223 494.3846 85.983765 494.33231 85.96875 494.28125 curveto
85.954863 494.21665 85.933903 494.15377 85.90625 494.09375 curveto
85.880366 494.03863 85.848955 493.98628 85.8125 493.9375 curveto
85.792703 493.91566 85.771844 493.8948 85.75 493.875 curveto
85.730203 493.85316 85.709344 493.8323 85.6875 493.8125 curveto
85.630483 493.76314 85.56749 493.72115 85.5 493.6875 curveto
83.949057 492.95733 82.357107 492.38682 80.78125 491.9375 curveto
72.901965 489.69091 64.91088 490.82914 58.53125 494.28125 curveto
55.979398 495.66209 53.665707 497.42299 51.75 499.46875 curveto
50.792146 500.49163 49.942926 501.58483 49.1875 502.75 curveto
47.676649 505.08034 46.582596 507.65812 46.0625 510.4375 curveto
45.802452 511.82719 45.685848 513.27807 45.71875 514.75 curveto
45.751652 516.22193 45.959827 517.72106 46.3125 519.25 curveto
47.37052 523.83683 49.912845 528.65688 54.28125 533.40625 curveto
55.774085 535.02927 57.599842 536.50417 59.71875 537.84375 curveto
63.956565 540.52292 69.3384 542.63078 75.46875 544.25 curveto
78.533925 545.05961 81.80213 545.74942 85.1875 546.3125 curveto
88.57287 546.87558 92.081429 547.30843 95.6875 547.625 curveto
102.89964 548.25815 110.45505 548.40462 117.9375 548.0625 curveto
121.67873 547.89144 125.40682 547.59968 129.0625 547.1875 curveto
143.68522 545.53877 157.21097 542.00036 166.40625 536.46875 curveto
171.00389 533.70294 174.51954 530.43248 176.5 526.59375 curveto
176.99511 525.63407 177.40025 524.62042 177.6875 523.59375 curveto
177.97475 522.56708 178.15206 521.52434 178.21875 520.4375 curveto
178.35214 518.26383 178.04368 515.96714 177.21875 513.59375 curveto
177.20746 513.56127 177.19881 513.53243 177.1875 513.5 curveto
170.80467 495.19832 161.28048 485.45193 152.78125 476.78125 curveto
144.26696 468.0952 132.1116 460.59219 129.27282 446.24929 curveto
126.40579 431.76361 127.42192 424.814 128.89782 418.43679 curveto
129.2668 416.84248 130.68387 410.48956 131.06422 408.85732 curveto
131.14016 408.57043 131.06981 408.26454 130.87616 408.03966 curveto
130.68251 407.81478 130.39045 407.6998 130.09547 407.73232 curveto
closepath
stroke
gsave
<<
/ShadingType 3
/ColorSpace /DeviceRGB
/Coords [101.98004 461.05902 0 101.98004 461.05902 14.1875]
/Extend [true true]
/Domain [0 1]
/Function <<
/FunctionType 3
/Functions
[
<<
/FunctionType 2
/Domain [0 1]
/C0 [1 1 1]
/C1 [1 1 1]
/N 1
>>
<<
/FunctionType 2
/Domain [0 1]
/C0 [1 1 1]
/C1 [0.50980395 0.50980395 0.50980395]
/N 1
>>
]
/Domain [0 1]
/Bounds [ 0.67154539 ]
/Encode [ 0 1 0 1 ]
>>
>>
newpath
101.3125 418 moveto
93.85125 418.57525 87.906247 427.95908 87.90625 439.4375 curveto
87.90625 443.60596 88.707396 447.4869 90.0625 450.78125 curveto
88.846966 451.46117 88.124999 452.24524 88.125 453.09375 curveto
88.125 454.42971 88.859871 455.63686 91.614847 456.46875 curveto
91.179804 459.42587 90.927347 462.61792 90.927347 465.96875 curveto
90.927348 473.35684 92.95902 479.75712 93.7059 484.90044 curveto
94.594854 491.02214 lineto
97.779607 493.55935 102.91667 493.62765 108.45241 490.64333 curveto
109.59391 484.90044 lineto
110.60713 479.8029 112.625 473.35684 112.625 465.96875 curveto
112.625 462.48858 112.3738 459.176 111.90625 456.125 curveto
114.07171 455.32023 115.40625 454.25923 115.40625 453.09375 curveto
115.40625 452.35034 114.85655 451.65099 113.90625 451.03125 curveto
115.32388 447.68579 116.15625 443.70933 116.15625 439.4375 curveto
116.15625 427.58881 109.82976 418.00001 102.03125 418 curveto
101.78755 418 101.55319 417.98144 101.3125 418 curveto
closepath
clip
gsave [-0.3470021 5.4270114 -1.301992 -0.083249328 730.3901 -59.615647] concat
shfill
grestore
grestore
0 0 0 setrgbcolor
[] 0 setdash
1.0330508 setlinewidth
0 setlinejoin
0 setlinecap
newpath
101.3125 418 moveto
93.85125 418.57525 87.906247 427.95908 87.90625 439.4375 curveto
87.90625 443.60596 88.707396 447.4869 90.0625 450.78125 curveto
88.846966 451.46117 88.124999 452.24524 88.125 453.09375 curveto
88.125 454.42971 88.859871 455.63686 91.614847 456.46875 curveto
91.179804 459.42587 90.927347 462.61792 90.927347 465.96875 curveto
90.927348 473.35684 92.95902 479.75712 93.7059 484.90044 curveto
94.594854 491.02214 lineto
97.779607 493.55935 102.91667 493.62765 108.45241 490.64333 curveto
109.59391 484.90044 lineto
110.60713 479.8029 112.625 473.35684 112.625 465.96875 curveto
112.625 462.48858 112.3738 459.176 111.90625 456.125 curveto
114.07171 455.32023 115.40625 454.25923 115.40625 453.09375 curveto
115.40625 452.35034 114.85655 451.65099 113.90625 451.03125 curveto
115.32388 447.68579 116.15625 443.70933 116.15625 439.4375 curveto
116.15625 427.58881 109.82976 418.00001 102.03125 418 curveto
101.78755 418 101.55319 417.98144 101.3125 418 curveto
closepath
stroke
gsave [1.0154538 0 0 1.0320582 -0.6421909 -13.867209] concat
gsave
<<
/ShadingType 3
/ColorSpace /DeviceRGB
/Coords [41.882412 423.16397 0 41.882412 423.16397 32.892456]
/Extend [true true]
/Domain [0 1]
/Function <<
/FunctionType 3
/Functions
[
<<
/FunctionType 2
/Domain [0 1]
/C0 [1 1 1]
/C1 [1 1 1]
/N 1
>>
<<
/FunctionType 2
/Domain [0 1]
/C0 [1 1 1]
/C1 [0.50980395 0.50980395 0.50980395]
/N 1
>>
]
/Domain [0 1]
/Bounds [ 0.67154539 ]
/Encode [ 0 1 0 1 ]
>>
>>
newpath
134.35029 398.79349 moveto
134.35029 414.96401 119.64247 428.08791 101.52033 428.08791 curveto
83.398197 428.08791 68.690376 414.96401 68.690376 398.79349 curveto
68.690376 382.62297 83.398197 369.49906 101.52033 369.49906 curveto
119.64247 369.49906 134.35029 382.62297 134.35029 398.79349 curveto
closepath
clip
gsave [1.3596415 0.1982735 -0.174758 1.1601395 105.09697 -98.971793] concat
shfill
grestore
grestore
0 0 0 setrgbcolor
[] 0 setdash
1.0091124 setlinewidth
0 setlinejoin
0 setlinecap
newpath
134.35029 398.79349 moveto
134.35029 414.96401 119.64247 428.08791 101.52033 428.08791 curveto
83.398197 428.08791 68.690376 414.96401 68.690376 398.79349 curveto
68.690376 382.62297 83.398197 369.49906 101.52033 369.49906 curveto
119.64247 369.49906 134.35029 382.62297 134.35029 398.79349 curveto
closepath
stroke
grestore
0 0 0 setrgbcolor
[] 0 setdash
1.0330508 setlinewidth
0 setlinejoin
0 setlinecap
newpath
91.229402 456.30905 moveto
96.631094 457.23234 101.12892 458.39974 111.81126 456.11964 curveto
stroke
0 0 0 setrgbcolor
[] 0 setdash
1.0330508 setlinewidth
0 setlinejoin
0 setlinecap
newpath
90.040326 450.77535 moveto
96.347845 451.85347 101.41052 453.84797 113.88422 451.18551 curveto
stroke
gsave
<<
/ShadingType 3
/ColorSpace /DeviceRGB
/Coords [121.14061 331.13281 0 121.14061 331.13281 33.891918]
/Extend [true true]
/Domain [0 1]
/Function <<
/FunctionType 3
/Functions
[
<<
/FunctionType 2
/Domain [0 1]
/C0 [1 1 1]
/C1 [1 1 1]
/N 1
>>
<<
/FunctionType 2
/Domain [0 1]
/C0 [1 1 1]
/C1 [0.50980395 0.50980395 0.50980395]
/N 1
>>
]
/Domain [0 1]
/Bounds [ 0.64543396 ]
/Encode [ 0 1 0 1 ]
>>
>>
newpath
103.1099 350.5 moveto
97.737753 350.61722 93.581361 352.50942 93.391153 355.125 curveto
93.277236 356.69147 94.629803 358.21852 96.859903 359.375 curveto
84.823366 359.66276 75.825616 362.14234 75.703653 365.59375 curveto
75.653921 367.00109 77.118541 368.38864 79.641153 369.625 curveto
72.660045 371.24553 68.196814 373.76852 68.109903 376.71875 curveto
67.947907 382.21772 82.968007 387.10616 101.64115 387.65625 curveto
120.28044 388.20535 135.54973 384.20239 135.76615 378.71875 curveto
135.84184 376.14932 132.582 373.70867 127.20365 371.78125 curveto
129.84466 370.77056 131.40351 369.51262 131.45365 368.09375 curveto
131.56679 364.89219 124.01295 361.83013 113.3599 360.3125 curveto
115.40391 359.48662 116.69302 358.27909 116.7974 356.84375 curveto
117.01478 353.85452 111.94997 351.03264 105.4849 350.5625 curveto
104.67677 350.50373 103.87735 350.48325 103.1099 350.5 curveto
closepath
clip
gsave [0.7933211 0.3420247 -0.1798853 0.4172407 60.349744 167.91334] concat
shfill
grestore
grestore
0 0 0 setrgbcolor
[] 0 setdash
1.0330508 setlinewidth
0 setlinejoin
0 setlinecap
newpath
103.1099 350.5 moveto
97.737753 350.61722 93.581361 352.50942 93.391153 355.125 curveto
93.277236 356.69147 94.629803 358.21852 96.859903 359.375 curveto
84.823366 359.66276 75.825616 362.14234 75.703653 365.59375 curveto
75.653921 367.00109 77.118541 368.38864 79.641153 369.625 curveto
72.660045 371.24553 68.196814 373.76852 68.109903 376.71875 curveto
67.947907 382.21772 82.968007 387.10616 101.64115 387.65625 curveto
120.28044 388.20535 135.54973 384.20239 135.76615 378.71875 curveto
135.84184 376.14932 132.582 373.70867 127.20365 371.78125 curveto
129.84466 370.77056 131.40351 369.51262 131.45365 368.09375 curveto
131.56679 364.89219 124.01295 361.83013 113.3599 360.3125 curveto
115.40391 359.48662 116.69302 358.27909 116.7974 356.84375 curveto
117.01478 353.85452 111.94997 351.03264 105.4849 350.5625 curveto
104.67677 350.50373 103.87735 350.48325 103.1099 350.5 curveto
closepath
stroke
gsave
0.49803922 0.49803922 0.49803922 setrgbcolor
newpath
109.1099 346.71875 moveto
108.28 346.65391 107.49754 346.78139 106.76615 347.15625 curveto
105.30336 347.90598 104.41111 349.6238 104.26615 352.09375 curveto
104.20062 352.43834 104.34124 352.78962 104.62646 352.9938 curveto
104.91167 353.19798 105.28953 353.21787 105.5946 353.04475 curveto
105.89968 352.87164 106.0764 352.53707 106.0474 352.1875 curveto
106.17153 350.07251 106.81773 349.14 107.57865 348.75 curveto
108.33957 348.36 109.51422 348.44904 110.9224 349.0625 curveto
113.73876 350.28943 117.1033 353.57325 118.57865 356.78125 curveto
119.40503 358.57815 121.65057 362.64008 122.87132 364.71034 curveto
123.12157 365.14181 123.67422 365.28872 124.1057 365.03846 curveto
124.53717 364.78821 124.68407 364.23556 124.43382 363.80409 curveto
123.20487 361.71991 120.96531 357.68741 120.20365 356.03125 curveto
118.50291 352.33317 115.01493 348.87601 111.64115 347.40625 curveto
110.7977 347.03881 109.9398 346.78359 109.1099 346.71875 curveto
closepath
eofill
grestore
0 0 0 setrgbcolor
[] 0 setdash
0.5 setlinewidth
0 setlinejoin
1 setlinecap
newpath
109.1099 346.71875 moveto
108.28 346.65391 107.49754 346.78139 106.76615 347.15625 curveto
105.30336 347.90598 104.41111 349.6238 104.26615 352.09375 curveto
104.20062 352.43834 104.34124 352.78962 104.62646 352.9938 curveto
104.91167 353.19798 105.28953 353.21787 105.5946 353.04475 curveto
105.89968 352.87164 106.0764 352.53707 106.0474 352.1875 curveto
106.17153 350.07251 106.81773 349.14 107.57865 348.75 curveto
108.33957 348.36 109.51422 348.44904 110.9224 349.0625 curveto
113.73876 350.28943 117.1033 353.57325 118.57865 356.78125 curveto
119.40503 358.57815 121.65057 362.64008 122.87132 364.71034 curveto
123.12157 365.14181 123.67422 365.28872 124.1057 365.03846 curveto
124.53717 364.78821 124.68407 364.23556 124.43382 363.80409 curveto
123.20487 361.71991 120.96531 357.68741 120.20365 356.03125 curveto
118.50291 352.33317 115.01493 348.87601 111.64115 347.40625 curveto
110.7977 347.03881 109.9398 346.78359 109.1099 346.71875 curveto
closepath
stroke
gsave
<<
/ShadingType 3
/ColorSpace /DeviceRGB
/Coords [96.467018 351.08652 0 96.467018 351.08652 33.891918]
/Extend [true true]
/Domain [0 1]
/Function <<
/FunctionType 3
/Functions
[
<<
/FunctionType 2
/Domain [0 1]
/C0 [1 1 1]
/C1 [1 1 1]
/N 1
>>
<<
/FunctionType 2
/Domain [0 1]
/C0 [1 1 1]
/C1 [0.50980395 0.50980395 0.50980395]
/N 1
>>
]
/Domain [0 1]
/Bounds [ 0.67154539 ]
/Encode [ 0 1 0 1 ]
>>
>>
newpath
96.859903 359.375 moveto
84.823366 359.66276 75.825616 362.14234 75.703653 365.59375 curveto
75.653921 367.00109 77.118541 368.38864 79.641153 369.625 curveto
72.660045 371.24553 68.196814 373.76852 68.109903 376.71875 curveto
67.947907 382.21772 82.968007 387.10616 101.64115 387.65625 curveto
120.28044 388.20535 135.54973 384.20239 135.76615 378.71875 curveto
135.84184 376.14932 132.582 373.70867 127.20365 371.78125 curveto
129.84466 370.77056 131.40351 369.51262 131.45365 368.09375 curveto
131.56679 364.89219 124.01295 361.83013 113.3599 360.3125 curveto
107.22855 361.26269 102.23363 361.07646 96.859903 359.375 curveto
closepath
clip
gsave [1.7523861 0.061854947 -0.025083148 0.7106199 -64.995353 99.628569] concat
shfill
grestore
grestore
0 0 0 setrgbcolor
[] 0 setdash
1.0330508 setlinewidth
0 setlinejoin
0 setlinecap
newpath
96.859903 359.375 moveto
84.823366 359.66276 75.825616 362.14234 75.703653 365.59375 curveto
75.653921 367.00109 77.118541 368.38864 79.641153 369.625 curveto
72.660045 371.24553 68.196814 373.76852 68.109903 376.71875 curveto
67.947907 382.21772 82.968007 387.10616 101.64115 387.65625 curveto
120.28044 388.20535 135.54973 384.20239 135.76615 378.71875 curveto
135.84184 376.14932 132.582 373.70867 127.20365 371.78125 curveto
129.84466 370.77056 131.40351 369.51262 131.45365 368.09375 curveto
131.56679 364.89219 124.01295 361.83013 113.3599 360.3125 curveto
107.22855 361.26269 102.23363 361.07646 96.859903 359.375 curveto
closepath
stroke
gsave
<<
/ShadingType 3
/ColorSpace /DeviceRGB
/Coords [94.697876 366.16544 0 94.697876 366.16544 33.891918]
/Extend [true true]
/Domain [0 1]
/Function <<
/FunctionType 3
/Functions
[
<<
/FunctionType 2
/Domain [0 1]
/C0 [1 1 1]
/C1 [1 1 1]
/N 1
>>
<<
/FunctionType 2
/Domain [0 1]
/C0 [1 1 1]
/C1 [0.50980395 0.50980395 0.50980395]
/N 1
>>
]
/Domain [0 1]
/Bounds [ 0.67154539 ]
/Encode [ 0 1 0 1 ]
>>
>>
newpath
79.641153 369.625 moveto
72.660045 371.24553 68.196814 373.76852 68.109903 376.71875 curveto
67.947907 382.21772 82.968007 387.10616 101.64115 387.65625 curveto
120.28044 388.20535 135.54973 384.20239 135.76615 378.71875 curveto
135.84184 376.14932 132.582 373.70867 127.20365 371.78125 curveto
111.09695 374.97684 97.768163 374.51063 79.641153 369.625 curveto
closepath
clip
gsave [2.1698509 0.067061428 -0.023921149 0.7739967 -104.63215 77.066248] concat
shfill
grestore
grestore
0 0 0 setrgbcolor
[] 0 setdash
1.0330508 setlinewidth
0 setlinejoin
0 setlinecap
newpath
79.641153 369.625 moveto
72.660045 371.24553 68.196814 373.76852 68.109903 376.71875 curveto
67.947907 382.21772 82.968007 387.10616 101.64115 387.65625 curveto
120.28044 388.20535 135.54973 384.20239 135.76615 378.71875 curveto
135.84184 376.14932 132.582 373.70867 127.20365 371.78125 curveto
111.09695 374.97684 97.768163 374.51063 79.641153 369.625 curveto
closepath
stroke
grestore
grestore"
