\BOOKMARK [0][-]{chapter.1}{OpenMPI Directory Hierarchy}{}
\BOOKMARK [1][-]{section.1.1}{OpenMPI Directories}{chapter.1}
\BOOKMARK [0][-]{chapter.2}{OpenMPI Data Structure Index}{}
\BOOKMARK [1][-]{section.2.1}{OpenMPI Data Structures}{chapter.2}
\BOOKMARK [0][-]{chapter.3}{OpenMPI File Index}{}
\BOOKMARK [1][-]{section.3.1}{OpenMPI File List}{chapter.3}
\BOOKMARK [0][-]{chapter.4}{OpenMPI Page Index}{}
\BOOKMARK [1][-]{section.4.1}{OpenMPI Related Pages}{chapter.4}
\BOOKMARK [0][-]{chapter.5}{OpenMPI Directory Documentation}{}
\BOOKMARK [1][-]{section.5.1}{ompi/mca/io/romio/romio/adio/ad\137hfs/ Directory Reference}{chapter.5}
\BOOKMARK [1][-]{section.5.2}{ompi/mca/io/romio/romio/adio/ad\137nfs/ Directory Reference}{chapter.5}
\BOOKMARK [1][-]{section.5.3}{ompi/mca/io/romio/romio/adio/ad\137ntfs/ Directory Reference}{chapter.5}
\BOOKMARK [1][-]{section.5.4}{ompi/mca/io/romio/romio/adio/ad\137pfs/ Directory Reference}{chapter.5}
\BOOKMARK [1][-]{section.5.5}{ompi/mca/io/romio/romio/adio/ad\137piofs/ Directory Reference}{chapter.5}
\BOOKMARK [1][-]{section.5.6}{ompi/mca/io/romio/romio/adio/ad\137pvfs/ Directory Reference}{chapter.5}
\BOOKMARK [1][-]{section.5.7}{ompi/mca/io/romio/romio/adio/ad\137sfs/ Directory Reference}{chapter.5}
\BOOKMARK [1][-]{section.5.8}{ompi/mca/io/romio/romio/adio/ad\137testfs/ Directory Reference}{chapter.5}
\BOOKMARK [1][-]{section.5.9}{ompi/mca/io/romio/romio/adio/ad\137ufs/ Directory Reference}{chapter.5}
\BOOKMARK [1][-]{section.5.10}{ompi/mca/io/romio/romio/adio/ad\137xfs/ Directory Reference}{chapter.5}
\BOOKMARK [1][-]{section.5.11}{ompi/mca/io/romio/romio/adio/ Directory Reference}{chapter.5}
\BOOKMARK [1][-]{section.5.12}{opal/mca/timer/aix/ Directory Reference}{chapter.5}
\BOOKMARK [1][-]{section.5.13}{ompi/mca/allocator/ Directory Reference}{chapter.5}
\BOOKMARK [1][-]{section.5.14}{opal/include/sys/alpha/ Directory Reference}{chapter.5}
\BOOKMARK [1][-]{section.5.15}{opal/mca/timer/altix/ Directory Reference}{chapter.5}
\BOOKMARK [1][-]{section.5.16}{opal/include/sys/amd64/ Directory Reference}{chapter.5}
\BOOKMARK [1][-]{section.5.17}{orte/mca/gpr/replica/api\137layer/ Directory Reference}{chapter.5}
\BOOKMARK [1][-]{section.5.18}{opal/asm/ Directory Reference}{chapter.5}
\BOOKMARK [1][-]{section.5.19}{ompi/attribute/ Directory Reference}{chapter.5}
\BOOKMARK [1][-]{section.5.20}{orte/mca/soh/base/ Directory Reference}{chapter.5}
\BOOKMARK [1][-]{section.5.21}{orte/mca/sds/base/ Directory Reference}{chapter.5}
\BOOKMARK [1][-]{section.5.22}{orte/mca/schema/base/ Directory Reference}{chapter.5}
\BOOKMARK [1][-]{section.5.23}{orte/mca/rml/base/ Directory Reference}{chapter.5}
\BOOKMARK [1][-]{section.5.24}{orte/mca/rmgr/base/ Directory Reference}{chapter.5}
\BOOKMARK [1][-]{section.5.25}{orte/mca/rmaps/base/ Directory Reference}{chapter.5}
\BOOKMARK [1][-]{section.5.26}{orte/mca/rds/base/ Directory Reference}{chapter.5}
\BOOKMARK [1][-]{section.5.27}{orte/mca/ras/base/ Directory Reference}{chapter.5}
\BOOKMARK [1][-]{section.5.28}{orte/mca/pls/base/ Directory Reference}{chapter.5}
\BOOKMARK [1][-]{section.5.29}{orte/mca/oob/base/ Directory Reference}{chapter.5}
\BOOKMARK [1][-]{section.5.30}{orte/mca/ns/base/ Directory Reference}{chapter.5}
\BOOKMARK [1][-]{section.5.31}{orte/mca/iof/base/ Directory Reference}{chapter.5}
\BOOKMARK [1][-]{section.5.32}{orte/mca/gpr/base/ Directory Reference}{chapter.5}
\BOOKMARK [1][-]{section.5.33}{orte/mca/errmgr/base/ Directory Reference}{chapter.5}
\BOOKMARK [1][-]{section.5.34}{opal/mca/timer/base/ Directory Reference}{chapter.5}
\BOOKMARK [1][-]{section.5.35}{opal/mca/paffinity/base/ Directory Reference}{chapter.5}
\BOOKMARK [1][-]{section.5.36}{opal/mca/memory/base/ Directory Reference}{chapter.5}
\BOOKMARK [1][-]{section.5.37}{opal/mca/maffinity/base/ Directory Reference}{chapter.5}
\BOOKMARK [1][-]{section.5.38}{opal/mca/base/ Directory Reference}{chapter.5}
\BOOKMARK [1][-]{section.5.39}{ompi/mca/topo/base/ Directory Reference}{chapter.5}
\BOOKMARK [1][-]{section.5.40}{ompi/mca/rcache/base/ Directory Reference}{chapter.5}
\BOOKMARK [1][-]{section.5.41}{ompi/mca/ptl/base/ Directory Reference}{chapter.5}
\BOOKMARK [1][-]{section.5.42}{ompi/mca/pml/base/ Directory Reference}{chapter.5}
\BOOKMARK [1][-]{section.5.43}{ompi/mca/mpool/base/ Directory Reference}{chapter.5}
\BOOKMARK [1][-]{section.5.44}{ompi/mca/io/base/ Directory Reference}{chapter.5}
\BOOKMARK [1][-]{section.5.45}{ompi/mca/coll/base/ Directory Reference}{chapter.5}
\BOOKMARK [1][-]{section.5.46}{ompi/mca/btl/base/ Directory Reference}{chapter.5}
\BOOKMARK [1][-]{section.5.47}{ompi/mca/bml/base/ Directory Reference}{chapter.5}
\BOOKMARK [1][-]{section.5.48}{ompi/mca/allocator/base/ Directory Reference}{chapter.5}
\BOOKMARK [1][-]{section.5.49}{ompi/mca/coll/basic/ Directory Reference}{chapter.5}
\BOOKMARK [1][-]{section.5.50}{ompi/mca/allocator/basic/ Directory Reference}{chapter.5}
\BOOKMARK [1][-]{section.5.51}{orte/mca/ras/bjs/ Directory Reference}{chapter.5}
\BOOKMARK [1][-]{section.5.52}{ompi/mca/bml/ Directory Reference}{chapter.5}
\BOOKMARK [1][-]{section.5.53}{orte/mca/soh/bproc/ Directory Reference}{chapter.5}
\BOOKMARK [1][-]{section.5.54}{orte/mca/sds/bproc/ Directory Reference}{chapter.5}
\BOOKMARK [1][-]{section.5.55}{orte/mca/pls/bproc/ Directory Reference}{chapter.5}
\BOOKMARK [1][-]{section.5.56}{orte/mca/pls/bproc\137orted/ Directory Reference}{chapter.5}
\BOOKMARK [1][-]{section.5.57}{ompi/mca/btl/ Directory Reference}{chapter.5}
\BOOKMARK [1][-]{section.5.58}{ompi/mca/allocator/bucket/ Directory Reference}{chapter.5}
\BOOKMARK [1][-]{section.5.59}{ompi/mpi/c/ Directory Reference}{chapter.5}
\BOOKMARK [1][-]{section.5.60}{orte/class/ Directory Reference}{chapter.5}
\BOOKMARK [1][-]{section.5.61}{opal/class/ Directory Reference}{chapter.5}
\BOOKMARK [1][-]{section.5.62}{ompi/class/ Directory Reference}{chapter.5}
\BOOKMARK [1][-]{section.5.63}{orte/mca/sds/cnos/ Directory Reference}{chapter.5}
\BOOKMARK [1][-]{section.5.64}{orte/mca/rml/cnos/ Directory Reference}{chapter.5}
\BOOKMARK [1][-]{section.5.65}{ompi/mca/coll/ Directory Reference}{chapter.5}
\BOOKMARK [1][-]{section.5.66}{ompi/mca/io/romio/romio/adio/common/ Directory Reference}{chapter.5}
\BOOKMARK [1][-]{section.5.67}{ompi/mca/common/ Directory Reference}{chapter.5}
\BOOKMARK [1][-]{section.5.68}{orte/mca/gpr/replica/communications/ Directory Reference}{chapter.5}
\BOOKMARK [1][-]{section.5.69}{ompi/communicator/ Directory Reference}{chapter.5}
\BOOKMARK [1][-]{section.5.70}{ompi/mpi/cxx/ Directory Reference}{chapter.5}
\BOOKMARK [1][-]{section.5.71}{orte/mca/pls/daemon/ Directory Reference}{chapter.5}
\BOOKMARK [1][-]{section.5.72}{opal/mca/timer/darwin/ Directory Reference}{chapter.5}
\BOOKMARK [1][-]{section.5.73}{opal/mca/memory/darwin/ Directory Reference}{chapter.5}
\BOOKMARK [1][-]{section.5.74}{orte/mca/ras/dash\137host/ Directory Reference}{chapter.5}
\BOOKMARK [1][-]{section.5.75}{orte/mca/soh/base/data\137type\137support/ Directory Reference}{chapter.5}
\BOOKMARK [1][-]{section.5.76}{orte/mca/rmgr/base/data\137type\137support/ Directory Reference}{chapter.5}
\BOOKMARK [1][-]{section.5.77}{orte/mca/ns/base/data\137type\137support/ Directory Reference}{chapter.5}
\BOOKMARK [1][-]{section.5.78}{orte/mca/gpr/base/data\137type\137support/ Directory Reference}{chapter.5}
\BOOKMARK [1][-]{section.5.79}{ompi/datatype/ Directory Reference}{chapter.5}
\BOOKMARK [1][-]{section.5.80}{ompi/debuggers/ Directory Reference}{chapter.5}
\BOOKMARK [1][-]{section.5.81}{orte/dps/ Directory Reference}{chapter.5}
\BOOKMARK [1][-]{section.5.82}{orte/mca/sds/env/ Directory Reference}{chapter.5}
\BOOKMARK [1][-]{section.5.83}{ompi/errhandler/ Directory Reference}{chapter.5}
\BOOKMARK [1][-]{section.5.84}{orte/mca/errmgr/ Directory Reference}{chapter.5}
\BOOKMARK [1][-]{section.5.85}{ompi/mpi/f77/ Directory Reference}{chapter.5}
\BOOKMARK [1][-]{section.5.86}{ompi/mpi/f90/ Directory Reference}{chapter.5}
\BOOKMARK [1][-]{section.5.87}{ompi/file/ Directory Reference}{chapter.5}
\BOOKMARK [1][-]{section.5.88}{opal/mca/maffinity/first\137use/ Directory Reference}{chapter.5}
\BOOKMARK [1][-]{section.5.89}{orte/mca/pls/fork/ Directory Reference}{chapter.5}
\BOOKMARK [1][-]{section.5.90}{orte/mca/gpr/replica/functional\137layer/ Directory Reference}{chapter.5}
\BOOKMARK [1][-]{section.5.91}{ompi/win32/generated\137include/ Directory Reference}{chapter.5}
\BOOKMARK [1][-]{section.5.92}{ompi/win32/generated\137source/ Directory Reference}{chapter.5}
\BOOKMARK [1][-]{section.5.93}{opal/mca/memory/ptmalloc2/sysdeps/generic/ Directory Reference}{chapter.5}
\BOOKMARK [1][-]{section.5.94}{ompi/mca/ptl/gm/ Directory Reference}{chapter.5}
\BOOKMARK [1][-]{section.5.95}{ompi/mca/mpool/gm/ Directory Reference}{chapter.5}
\BOOKMARK [1][-]{section.5.96}{ompi/mca/btl/gm/ Directory Reference}{chapter.5}
\BOOKMARK [1][-]{section.5.97}{orte/mca/gpr/ Directory Reference}{chapter.5}
\BOOKMARK [1][-]{section.5.98}{ompi/group/ Directory Reference}{chapter.5}
\BOOKMARK [1][-]{section.5.99}{orte/mca/rds/hostfile/ Directory Reference}{chapter.5}
\BOOKMARK [1][-]{section.5.100}{orte/mca/ras/hostfile/ Directory Reference}{chapter.5}
\BOOKMARK [1][-]{section.5.101}{opal/include/sys/ia32/ Directory Reference}{chapter.5}
\BOOKMARK [1][-]{section.5.102}{opal/include/sys/ia64/ Directory Reference}{chapter.5}
\BOOKMARK [1][-]{section.5.103}{orte/include/ Directory Reference}{chapter.5}
\BOOKMARK [1][-]{section.5.104}{opal/include/ Directory Reference}{chapter.5}
\BOOKMARK [1][-]{section.5.105}{ompi/mca/io/romio/romio/include/ Directory Reference}{chapter.5}
\BOOKMARK [1][-]{section.5.106}{ompi/mca/io/romio/romio/adio/include/ Directory Reference}{chapter.5}
\BOOKMARK [1][-]{section.5.107}{ompi/include/ Directory Reference}{chapter.5}
\BOOKMARK [1][-]{section.5.108}{include/ Directory Reference}{chapter.5}
\BOOKMARK [1][-]{section.5.109}{ompi/info/ Directory Reference}{chapter.5}
\BOOKMARK [1][-]{section.5.110}{ompi/mca/io/ Directory Reference}{chapter.5}
\BOOKMARK [1][-]{section.5.111}{orte/mca/iof/ Directory Reference}{chapter.5}
\BOOKMARK [1][-]{section.5.112}{opal/libltdl/ Directory Reference}{chapter.5}
\BOOKMARK [1][-]{section.5.113}{opal/mca/maffinity/libnuma/ Directory Reference}{chapter.5}
\BOOKMARK [1][-]{section.5.114}{opal/mca/timer/linux/ Directory Reference}{chapter.5}
\BOOKMARK [1][-]{section.5.115}{opal/mca/paffinity/linux/ Directory Reference}{chapter.5}
\BOOKMARK [1][-]{section.5.116}{orte/mca/oob/llc/ Directory Reference}{chapter.5}
\BOOKMARK [1][-]{section.5.117}{ompi/mca/ptl/llc/ Directory Reference}{chapter.5}
\BOOKMARK [1][-]{section.5.118}{ompi/mca/btl/llc/ Directory Reference}{chapter.5}
\BOOKMARK [1][-]{section.5.119}{orte/mca/ras/localhost/ Directory Reference}{chapter.5}
\BOOKMARK [1][-]{section.5.120}{orte/mca/ras/lsf\137bproc/ Directory Reference}{chapter.5}
\BOOKMARK [1][-]{section.5.121}{opal/mca/maffinity/ Directory Reference}{chapter.5}
\BOOKMARK [1][-]{section.5.122}{opal/mca/memory/malloc\137hooks/ Directory Reference}{chapter.5}
\BOOKMARK [1][-]{section.5.123}{opal/mca/memory/malloc\137interpose/ Directory Reference}{chapter.5}
\BOOKMARK [1][-]{section.5.124}{orte/mca/ Directory Reference}{chapter.5}
\BOOKMARK [1][-]{section.5.125}{opal/mca/ Directory Reference}{chapter.5}
\BOOKMARK [1][-]{section.5.126}{ompi/mca/ Directory Reference}{chapter.5}
\BOOKMARK [1][-]{section.5.127}{opal/mca/memory/ Directory Reference}{chapter.5}
\BOOKMARK [1][-]{section.5.128}{opal/memoryhooks/ Directory Reference}{chapter.5}
\BOOKMARK [1][-]{section.5.129}{opal/include/sys/mips/ Directory Reference}{chapter.5}
\BOOKMARK [1][-]{section.5.130}{ompi/mpi/ Directory Reference}{chapter.5}
\BOOKMARK [1][-]{section.5.131}{ompi/mca/io/romio/romio/mpi-io/ Directory Reference}{chapter.5}
\BOOKMARK [1][-]{section.5.132}{ompi/mca/mpool/ Directory Reference}{chapter.5}
\BOOKMARK [1][-]{section.5.133}{ompi/mca/mpool/mvapi/ Directory Reference}{chapter.5}
\BOOKMARK [1][-]{section.5.134}{ompi/mca/btl/mvapi/ Directory Reference}{chapter.5}
\BOOKMARK [1][-]{section.5.135}{ompi/mca/ptl/mx/ Directory Reference}{chapter.5}
\BOOKMARK [1][-]{section.5.136}{ompi/mca/btl/mx/ Directory Reference}{chapter.5}
\BOOKMARK [1][-]{section.5.137}{orte/mca/ns/ Directory Reference}{chapter.5}
\BOOKMARK [1][-]{section.5.138}{orte/mca/gpr/null/ Directory Reference}{chapter.5}
\BOOKMARK [1][-]{section.5.139}{ompi/mca/pml/ob1/ Directory Reference}{chapter.5}
\BOOKMARK [1][-]{section.5.140}{ompi/ Directory Reference}{chapter.5}
\BOOKMARK [1][-]{section.5.141}{ompi/tools/ompi\137info/ Directory Reference}{chapter.5}
\BOOKMARK [1][-]{section.5.142}{orte/mca/rml/oob/ Directory Reference}{chapter.5}
\BOOKMARK [1][-]{section.5.143}{orte/mca/oob/ Directory Reference}{chapter.5}
\BOOKMARK [1][-]{section.5.144}{ompi/op/ Directory Reference}{chapter.5}
\BOOKMARK [1][-]{section.5.145}{opal/ Directory Reference}{chapter.5}
\BOOKMARK [1][-]{section.5.146}{ompi/mca/mpool/openib/ Directory Reference}{chapter.5}
\BOOKMARK [1][-]{section.5.147}{ompi/mca/btl/openib/ Directory Reference}{chapter.5}
\BOOKMARK [1][-]{section.5.148}{orte/ Directory Reference}{chapter.5}
\BOOKMARK [1][-]{section.5.149}{orte/tools/orted/ Directory Reference}{chapter.5}
\BOOKMARK [1][-]{section.5.150}{orte/tools/orteprobe/ Directory Reference}{chapter.5}
\BOOKMARK [1][-]{section.5.151}{orte/tools/orterun/ Directory Reference}{chapter.5}
\BOOKMARK [1][-]{section.5.152}{orte/mca/gpr/base/pack\137api\137cmd/ Directory Reference}{chapter.5}
\BOOKMARK [1][-]{section.5.153}{opal/mca/paffinity/ Directory Reference}{chapter.5}
\BOOKMARK [1][-]{section.5.154}{orte/mca/sds/pipe/ Directory Reference}{chapter.5}
\BOOKMARK [1][-]{section.5.155}{orte/mca/pls/ Directory Reference}{chapter.5}
\BOOKMARK [1][-]{section.5.156}{ompi/mca/pml/ Directory Reference}{chapter.5}
\BOOKMARK [1][-]{section.5.157}{orte/mca/pls/poe/ Directory Reference}{chapter.5}
\BOOKMARK [1][-]{section.5.158}{ompi/mca/btl/portals/ Directory Reference}{chapter.5}
\BOOKMARK [1][-]{section.5.159}{orte/mca/sds/portals\137ullc/ Directory Reference}{chapter.5}
\BOOKMARK [1][-]{section.5.160}{orte/mca/sds/portals\137utcp/ Directory Reference}{chapter.5}
\BOOKMARK [1][-]{section.5.161}{opal/include/sys/powerpc/ Directory Reference}{chapter.5}
\BOOKMARK [1][-]{section.5.162}{ompi/proc/ Directory Reference}{chapter.5}
\BOOKMARK [1][-]{section.5.163}{ompi/mpi/f77/profile/ Directory Reference}{chapter.5}
\BOOKMARK [1][-]{section.5.164}{ompi/mpi/c/profile/ Directory Reference}{chapter.5}
\BOOKMARK [1][-]{section.5.165}{orte/mca/rmgr/proxy/ Directory Reference}{chapter.5}
\BOOKMARK [1][-]{section.5.166}{orte/mca/pls/proxy/ Directory Reference}{chapter.5}
\BOOKMARK [1][-]{section.5.167}{orte/mca/ns/proxy/ Directory Reference}{chapter.5}
\BOOKMARK [1][-]{section.5.168}{orte/mca/iof/proxy/ Directory Reference}{chapter.5}
\BOOKMARK [1][-]{section.5.169}{orte/mca/gpr/proxy/ Directory Reference}{chapter.5}
\BOOKMARK [1][-]{section.5.170}{opal/mca/memory/ptmalloc2/sysdeps/pthread/ Directory Reference}{chapter.5}
\BOOKMARK [1][-]{section.5.171}{ompi/mca/ptl/ Directory Reference}{chapter.5}
\BOOKMARK [1][-]{section.5.172}{opal/mca/memory/ptmalloc2/ Directory Reference}{chapter.5}
\BOOKMARK [1][-]{section.5.173}{ompi/mca/bml/r2/ Directory Reference}{chapter.5}
\BOOKMARK [1][-]{section.5.174}{orte/mca/ras/ Directory Reference}{chapter.5}
\BOOKMARK [1][-]{section.5.175}{ompi/mca/rcache/rb/ Directory Reference}{chapter.5}
\BOOKMARK [1][-]{section.5.176}{ompi/mca/rcache/ Directory Reference}{chapter.5}
\BOOKMARK [1][-]{section.5.177}{orte/mca/rds/ Directory Reference}{chapter.5}
\BOOKMARK [1][-]{section.5.178}{orte/mca/ns/replica/ Directory Reference}{chapter.5}
\BOOKMARK [1][-]{section.5.179}{orte/mca/gpr/replica/ Directory Reference}{chapter.5}
\BOOKMARK [1][-]{section.5.180}{ompi/request/ Directory Reference}{chapter.5}
\BOOKMARK [1][-]{section.5.181}{orte/mca/rds/resfile/ Directory Reference}{chapter.5}
\BOOKMARK [1][-]{section.5.182}{orte/mca/rmaps/ Directory Reference}{chapter.5}
\BOOKMARK [1][-]{section.5.183}{orte/mca/rmgr/ Directory Reference}{chapter.5}
\BOOKMARK [1][-]{section.5.184}{orte/mca/rml/ Directory Reference}{chapter.5}
\BOOKMARK [1][-]{section.5.185}{ompi/mca/io/romio/romio/ Directory Reference}{chapter.5}
\BOOKMARK [1][-]{section.5.186}{ompi/mca/io/romio/ Directory Reference}{chapter.5}
\BOOKMARK [1][-]{section.5.187}{orte/mca/rmaps/round\137robin/ Directory Reference}{chapter.5}
\BOOKMARK [1][-]{section.5.188}{orte/mca/pls/rsh/ Directory Reference}{chapter.5}
\BOOKMARK [1][-]{section.5.189}{orte/runtime/ Directory Reference}{chapter.5}
\BOOKMARK [1][-]{section.5.190}{opal/runtime/ Directory Reference}{chapter.5}
\BOOKMARK [1][-]{section.5.191}{ompi/runtime/ Directory Reference}{chapter.5}
\BOOKMARK [1][-]{section.5.192}{orte/mca/schema/ Directory Reference}{chapter.5}
\BOOKMARK [1][-]{section.5.193}{orte/mca/sds/ Directory Reference}{chapter.5}
\BOOKMARK [1][-]{section.5.194}{orte/mca/sds/seed/ Directory Reference}{chapter.5}
\BOOKMARK [1][-]{section.5.195}{ompi/mca/ptl/self/ Directory Reference}{chapter.5}
\BOOKMARK [1][-]{section.5.196}{ompi/mca/coll/self/ Directory Reference}{chapter.5}
\BOOKMARK [1][-]{section.5.197}{ompi/mca/btl/self/ Directory Reference}{chapter.5}
\BOOKMARK [1][-]{section.5.198}{orte/mca/sds/singleton/ Directory Reference}{chapter.5}
\BOOKMARK [1][-]{section.5.199}{orte/mca/sds/slurm/ Directory Reference}{chapter.5}
\BOOKMARK [1][-]{section.5.200}{orte/mca/ras/slurm/ Directory Reference}{chapter.5}
\BOOKMARK [1][-]{section.5.201}{orte/mca/pls/slurm/ Directory Reference}{chapter.5}
\BOOKMARK [1][-]{section.5.202}{ompi/mca/ptl/sm/ Directory Reference}{chapter.5}
\BOOKMARK [1][-]{section.5.203}{ompi/mca/mpool/sm/ Directory Reference}{chapter.5}
\BOOKMARK [1][-]{section.5.204}{ompi/mca/common/sm/ Directory Reference}{chapter.5}
\BOOKMARK [1][-]{section.5.205}{ompi/mca/coll/sm/ Directory Reference}{chapter.5}
\BOOKMARK [1][-]{section.5.206}{ompi/mca/btl/sm/ Directory Reference}{chapter.5}
\BOOKMARK [1][-]{section.5.207}{orte/mca/soh/ Directory Reference}{chapter.5}
\BOOKMARK [1][-]{section.5.208}{opal/mca/timer/solaris/ Directory Reference}{chapter.5}
\BOOKMARK [1][-]{section.5.209}{opal/mca/paffinity/solaris/ Directory Reference}{chapter.5}
\BOOKMARK [1][-]{section.5.210}{opal/mca/memory/ptmalloc2/sysdeps/solaris/ Directory Reference}{chapter.5}
\BOOKMARK [1][-]{section.5.211}{opal/include/sys/sparc/ Directory Reference}{chapter.5}
\BOOKMARK [1][-]{section.5.212}{opal/include/sys/sparcv9/ Directory Reference}{chapter.5}
\BOOKMARK [1][-]{section.5.213}{opal/mca/memory/ptmalloc2/sysdeps/sproc/ Directory Reference}{chapter.5}
\BOOKMARK [1][-]{section.5.214}{orte/mca/ras/xgrid/src/ Directory Reference}{chapter.5}
\BOOKMARK [1][-]{section.5.215}{orte/mca/pls/xgrid/src/ Directory Reference}{chapter.5}
\BOOKMARK [1][-]{section.5.216}{orte/mca/ns/replica/src/ Directory Reference}{chapter.5}
\BOOKMARK [1][-]{section.5.217}{orte/mca/ns/proxy/src/ Directory Reference}{chapter.5}
\BOOKMARK [1][-]{section.5.218}{ompi/mca/io/romio/src/ Directory Reference}{chapter.5}
\BOOKMARK [1][-]{section.5.219}{orte/mca/iof/svc/ Directory Reference}{chapter.5}
\BOOKMARK [1][-]{section.5.220}{opal/include/sys/ Directory Reference}{chapter.5}
\BOOKMARK [1][-]{section.5.221}{opal/mca/memory/ptmalloc2/sysdeps/ Directory Reference}{chapter.5}
\BOOKMARK [1][-]{section.5.222}{orte/mca/oob/tcp/ Directory Reference}{chapter.5}
\BOOKMARK [1][-]{section.5.223}{ompi/mca/ptl/tcp/ Directory Reference}{chapter.5}
\BOOKMARK [1][-]{section.5.224}{ompi/mca/btl/tcp/ Directory Reference}{chapter.5}
\BOOKMARK [1][-]{section.5.225}{ompi/mca/pml/teg/ Directory Reference}{chapter.5}
\BOOKMARK [1][-]{section.5.226}{ompi/mca/io/romio/romio/test/ Directory Reference}{chapter.5}
\BOOKMARK [1][-]{section.5.227}{opal/threads/ Directory Reference}{chapter.5}
\BOOKMARK [1][-]{section.5.228}{opal/mca/timer/ Directory Reference}{chapter.5}
\BOOKMARK [1][-]{section.5.229}{orte/mca/ras/tm/ Directory Reference}{chapter.5}
\BOOKMARK [1][-]{section.5.230}{orte/mca/pls/tm/ Directory Reference}{chapter.5}
\BOOKMARK [1][-]{section.5.231}{orte/tools/ Directory Reference}{chapter.5}
\BOOKMARK [1][-]{section.5.232}{ompi/tools/ Directory Reference}{chapter.5}
\BOOKMARK [1][-]{section.5.233}{ompi/mca/topo/ Directory Reference}{chapter.5}
\BOOKMARK [1][-]{section.5.234}{orte/mca/gpr/replica/transition\137layer/ Directory Reference}{chapter.5}
\BOOKMARK [1][-]{section.5.235}{ompi/mca/topo/unity/ Directory Reference}{chapter.5}
\BOOKMARK [1][-]{section.5.236}{orte/mca/gpr/base/unpack\137api\137response/ Directory Reference}{chapter.5}
\BOOKMARK [1][-]{section.5.237}{orte/mca/rmgr/urm/ Directory Reference}{chapter.5}
\BOOKMARK [1][-]{section.5.238}{orte/util/ Directory Reference}{chapter.5}
\BOOKMARK [1][-]{section.5.239}{opal/util/ Directory Reference}{chapter.5}
\BOOKMARK [1][-]{section.5.240}{ompi/win/ Directory Reference}{chapter.5}
\BOOKMARK [1][-]{section.5.241}{opal/include/sys/win32/ Directory Reference}{chapter.5}
\BOOKMARK [1][-]{section.5.242}{ompi/win32/ Directory Reference}{chapter.5}
\BOOKMARK [1][-]{section.5.243}{ompi/tools/wrappers/ Directory Reference}{chapter.5}
\BOOKMARK [1][-]{section.5.244}{orte/mca/ras/xgrid/ Directory Reference}{chapter.5}
\BOOKMARK [1][-]{section.5.245}{orte/mca/pls/xgrid/ Directory Reference}{chapter.5}
\BOOKMARK [0][-]{chapter.6}{OpenMPI Data Structure Documentation}{}
\BOOKMARK [1][-]{section.6.1}{mca\137allocator\137base\137component\1371\1370\1370\137t Struct Reference}{chapter.6}
\BOOKMARK [1][-]{section.6.2}{mca\137allocator\137base\137module\137t Struct Reference}{chapter.6}
\BOOKMARK [1][-]{section.6.3}{mca\137allocator\137base\137selected\137module\137t Struct Reference}{chapter.6}
\BOOKMARK [1][-]{section.6.4}{mca\137allocator\137bucket\137bucket\137t Struct Reference}{chapter.6}
\BOOKMARK [1][-]{section.6.5}{mca\137allocator\137bucket\137chunk\137header\137t Struct Reference}{chapter.6}
\BOOKMARK [1][-]{section.6.6}{mca\137allocator\137bucket\137chunk\137header\137t::u Union Reference}{chapter.6}
\BOOKMARK [1][-]{section.6.7}{mca\137allocator\137bucket\137segment\137head\137t Struct Reference}{chapter.6}
\BOOKMARK [1][-]{section.6.8}{mca\137allocator\137bucket\137t Struct Reference}{chapter.6}
\BOOKMARK [1][-]{section.6.9}{mca\137base\137component\137data\1371\1370\1370\137t Struct Reference}{chapter.6}
\BOOKMARK [1][-]{section.6.10}{mca\137base\137component\137t Struct Reference}{chapter.6}
\BOOKMARK [1][-]{section.6.11}{mca\137base\137param\137info\137t Struct Reference}{chapter.6}
\BOOKMARK [1][-]{section.6.12}{mca\137bml\137base\137btl\137array\137t Struct Reference}{chapter.6}
\BOOKMARK [1][-]{section.6.13}{mca\137bml\137base\137component\1371\1370\1370\137t Struct Reference}{chapter.6}
\BOOKMARK [1][-]{section.6.14}{mca\137bml\137base\137endpoint\137t Struct Reference}{chapter.6}
\BOOKMARK [1][-]{section.6.15}{mca\137bml\137base\137module\137t Struct Reference}{chapter.6}
\BOOKMARK [1][-]{section.6.16}{mca\137bml\137r2\137module\137t Struct Reference}{chapter.6}
\BOOKMARK [1][-]{section.6.17}{mca\137btl\137base\137component\1371\1370\1370\137t Struct Reference}{chapter.6}
\BOOKMARK [1][-]{section.6.18}{mca\137btl\137base\137descriptor\137t Struct Reference}{chapter.6}
\BOOKMARK [1][-]{section.6.19}{mca\137btl\137base\137endpoint\137t Struct Reference}{chapter.6}
\BOOKMARK [1][-]{section.6.20}{mca\137btl\137base\137module\137t Struct Reference}{chapter.6}
\BOOKMARK [1][-]{section.6.21}{mca\137btl\137base\137segment\137t Struct Reference}{chapter.6}
\BOOKMARK [1][-]{section.6.22}{mca\137btl\137gm\137addr\137t Struct Reference}{chapter.6}
\BOOKMARK [1][-]{section.6.23}{mca\137btl\137gm\137component\137t Struct Reference}{chapter.6}
\BOOKMARK [1][-]{section.6.24}{mca\137btl\137gm\137frag\137t Struct Reference}{chapter.6}
\BOOKMARK [1][-]{section.6.25}{mca\137btl\137gm\137module\137t Struct Reference}{chapter.6}
\BOOKMARK [1][-]{section.6.26}{mca\137btl\137gm\137proc\137t Struct Reference}{chapter.6}
\BOOKMARK [1][-]{section.6.27}{mca\137btl\137llc\137addr\137t Struct Reference}{chapter.6}
\BOOKMARK [1][-]{section.6.28}{mca\137btl\137llc\137component\137t Struct Reference}{chapter.6}
\BOOKMARK [1][-]{section.6.29}{mca\137btl\137llc\137frag\137t Struct Reference}{chapter.6}
\BOOKMARK [1][-]{section.6.30}{mca\137btl\137llc\137module\137t Struct Reference}{chapter.6}
\BOOKMARK [1][-]{section.6.31}{mca\137btl\137llc\137proc\137t Struct Reference}{chapter.6}
\BOOKMARK [1][-]{section.6.32}{mca\137btl\137mvapi\137component\137t Struct Reference}{chapter.6}
\BOOKMARK [1][-]{section.6.33}{mca\137btl\137mvapi\137frag\137t Struct Reference}{chapter.6}
\BOOKMARK [1][-]{section.6.34}{mca\137btl\137mvapi\137module\137t Struct Reference}{chapter.6}
\BOOKMARK [1][-]{section.6.35}{mca\137btl\137mvapi\137proc\137t Struct Reference}{chapter.6}
\BOOKMARK [1][-]{section.6.36}{mca\137btl\137mx\137addr\137t Struct Reference}{chapter.6}
\BOOKMARK [1][-]{section.6.37}{mca\137btl\137mx\137component\137t Struct Reference}{chapter.6}
\BOOKMARK [1][-]{section.6.38}{mca\137btl\137mx\137frag\137t Struct Reference}{chapter.6}
\BOOKMARK [1][-]{section.6.39}{mca\137btl\137mx\137module\137t Struct Reference}{chapter.6}
\BOOKMARK [1][-]{section.6.40}{mca\137btl\137mx\137proc\137t Struct Reference}{chapter.6}
\BOOKMARK [1][-]{section.6.41}{mca\137btl\137openib\137component\137t Struct Reference}{chapter.6}
\BOOKMARK [1][-]{section.6.42}{mca\137btl\137openib\137frag\137t Struct Reference}{chapter.6}
\BOOKMARK [1][-]{section.6.43}{mca\137btl\137openib\137module\137t Struct Reference}{chapter.6}
\BOOKMARK [1][-]{section.6.44}{mca\137btl\137openib\137proc\137t Struct Reference}{chapter.6}
\BOOKMARK [1][-]{section.6.45}{mca\137btl\137portals\137frag\137t Struct Reference}{chapter.6}
\BOOKMARK [1][-]{section.6.46}{mca\137btl\137self\137component\137t Struct Reference}{chapter.6}
\BOOKMARK [1][-]{section.6.47}{mca\137btl\137self\137frag\137t Struct Reference}{chapter.6}
\BOOKMARK [1][-]{section.6.48}{mca\137btl\137sm\137component\137t Struct Reference}{chapter.6}
\BOOKMARK [1][-]{section.6.49}{mca\137btl\137sm\137frag\137t Struct Reference}{chapter.6}
\BOOKMARK [1][-]{section.6.50}{mca\137btl\137sm\137t Struct Reference}{chapter.6}
\BOOKMARK [1][-]{section.6.51}{mca\137btl\137tcp\137addr\137t Struct Reference}{chapter.6}
\BOOKMARK [1][-]{section.6.52}{mca\137btl\137tcp\137component\137t Struct Reference}{chapter.6}
\BOOKMARK [1][-]{section.6.53}{mca\137btl\137tcp\137frag\137t Struct Reference}{chapter.6}
\BOOKMARK [1][-]{section.6.54}{mca\137btl\137tcp\137module\137t Struct Reference}{chapter.6}
\BOOKMARK [1][-]{section.6.55}{mca\137btl\137tcp\137proc\137t Struct Reference}{chapter.6}
\BOOKMARK [1][-]{section.6.56}{mca\137coll\137base\137comm\137t Struct Reference}{chapter.6}
\BOOKMARK [1][-]{section.6.57}{mca\137coll\137base\137mpool\137index\137t Struct Reference}{chapter.6}
\BOOKMARK [1][-]{section.6.58}{mca\137coll\137sm\137bootstrap\137comm\137key\137t Struct Reference}{chapter.6}
\BOOKMARK [1][-]{section.6.59}{mca\137coll\137sm\137bootstrap\137comm\137setup\137t Struct Reference}{chapter.6}
\BOOKMARK [1][-]{section.6.60}{mca\137coll\137sm\137bootstrap\137header\137extension\137t Struct Reference}{chapter.6}
\BOOKMARK [1][-]{section.6.61}{mca\137coll\137sm\137component\137t Struct Reference}{chapter.6}
\BOOKMARK [1][-]{section.6.62}{mca\137coll\137sm\137in\137use\137flag\137t Struct Reference}{chapter.6}
\BOOKMARK [1][-]{section.6.63}{mca\137coll\137sm\137tree\137node\137t Struct Reference}{chapter.6}
\BOOKMARK [1][-]{section.6.64}{mca\137io\137base\137request\137t Struct Reference}{chapter.6}
\BOOKMARK [1][-]{section.6.65}{mca\137mpool\137base\137component\1371\1370\1370\137t Struct Reference}{chapter.6}
\BOOKMARK [1][-]{section.6.66}{mca\137mpool\137base\137module\137t Struct Reference}{chapter.6}
\BOOKMARK [1][-]{section.6.67}{mca\137oob\1371\1370\1370\137t Struct Reference}{chapter.6}
\BOOKMARK [1][-]{section.6.68}{mca\137oob\137base\137component\1371\1370\1370\137t Struct Reference}{chapter.6}
\BOOKMARK [1][-]{section.6.69}{mca\137oob\137base\137exception\137handler\137t Struct Reference}{chapter.6}
\BOOKMARK [1][-]{section.6.70}{mca\137oob\137base\137info\137t Struct Reference}{chapter.6}
\BOOKMARK [1][-]{section.6.71}{mca\137oob\137llc\137addr\137t Struct Reference}{chapter.6}
\BOOKMARK [1][-]{section.6.72}{mca\137oob\137llc\137component\137t Struct Reference}{chapter.6}
\BOOKMARK [1][-]{section.6.73}{mca\137oob\137llc\137hdr\137t Struct Reference}{chapter.6}
\BOOKMARK [1][-]{section.6.74}{mca\137oob\137llc\137msg\137t Struct Reference}{chapter.6}
\BOOKMARK [1][-]{section.6.75}{mca\137oob\137llc\137peer\137t Struct Reference}{chapter.6}
\BOOKMARK [1][-]{section.6.76}{mca\137oob\137tcp\137addr\137t Struct Reference}{chapter.6}
\BOOKMARK [1][-]{section.6.77}{mca\137oob\137tcp\137component\137t Struct Reference}{chapter.6}
\BOOKMARK [1][-]{section.6.78}{mca\137oob\137tcp\137hdr\137t Struct Reference}{chapter.6}
\BOOKMARK [1][-]{section.6.79}{mca\137oob\137tcp\137msg\137t Struct Reference}{chapter.6}
\BOOKMARK [1][-]{section.6.80}{mca\137oob\137tcp\137peer\137t Struct Reference}{chapter.6}
\BOOKMARK [1][-]{section.6.81}{mca\137oob\137xcast\137t Struct Reference}{chapter.6}
\BOOKMARK [1][-]{section.6.82}{mca\137pml\137base\137component\1371\1370\1370\137t Struct Reference}{chapter.6}
\BOOKMARK [1][-]{section.6.83}{mca\137pml\137base\137modex\137module\137t Struct Reference}{chapter.6}
\BOOKMARK [1][-]{section.6.84}{mca\137pml\137base\137modex\137subscription\137t Struct Reference}{chapter.6}
\BOOKMARK [1][-]{section.6.85}{mca\137pml\137base\137modex\137t Struct Reference}{chapter.6}
\BOOKMARK [1][-]{section.6.86}{mca\137pml\137base\137module\1371\1370\1370\137t Struct Reference}{chapter.6}
\BOOKMARK [1][-]{section.6.87}{mca\137pml\137base\137recv\137request\137t Struct Reference}{chapter.6}
\BOOKMARK [1][-]{section.6.88}{mca\137pml\137base\137request\137t Struct Reference}{chapter.6}
\BOOKMARK [1][-]{section.6.89}{mca\137pml\137base\137send\137request\137t Struct Reference}{chapter.6}
\BOOKMARK [1][-]{section.6.90}{mca\137pml\137comm\137t Struct Reference}{chapter.6}
\BOOKMARK [1][-]{section.6.91}{mca\137pml\137ob1\137ack\137hdr\137t Struct Reference}{chapter.6}
\BOOKMARK [1][-]{section.6.92}{mca\137pml\137ob1\137common\137hdr\137t Struct Reference}{chapter.6}
\BOOKMARK [1][-]{section.6.93}{mca\137pml\137ob1\137fin\137hdr\137t Struct Reference}{chapter.6}
\BOOKMARK [1][-]{section.6.94}{mca\137pml\137ob1\137frag\137hdr\137t Struct Reference}{chapter.6}
\BOOKMARK [1][-]{section.6.95}{mca\137pml\137ob1\137hdr\137t Union Reference}{chapter.6}
\BOOKMARK [1][-]{section.6.96}{mca\137pml\137ob1\137match\137hdr\137t Struct Reference}{chapter.6}
\BOOKMARK [1][-]{section.6.97}{mca\137pml\137ob1\137proc\137t Struct Reference}{chapter.6}
\BOOKMARK [1][-]{section.6.98}{mca\137pml\137ob1\137rdma\137btl\137t Struct Reference}{chapter.6}
\BOOKMARK [1][-]{section.6.99}{mca\137pml\137ob1\137rdma\137hdr\137t Struct Reference}{chapter.6}
\BOOKMARK [1][-]{section.6.100}{mca\137pml\137ob1\137rdma\137reg\137t Struct Reference}{chapter.6}
\BOOKMARK [1][-]{section.6.101}{mca\137pml\137ob1\137rendezvous\137hdr\137t Struct Reference}{chapter.6}
\BOOKMARK [1][-]{section.6.102}{mca\137pml\137ob1\137rget\137hdr\137t Struct Reference}{chapter.6}
\BOOKMARK [1][-]{section.6.103}{mca\137pml\137ob1\137t Struct Reference}{chapter.6}
\BOOKMARK [1][-]{section.6.104}{mca\137pml\137teg\137proc\137t Struct Reference}{chapter.6}
\BOOKMARK [1][-]{section.6.105}{mca\137pml\137teg\137t Struct Reference}{chapter.6}
\BOOKMARK [1][-]{section.6.106}{mca\137ptl\137array\137t Struct Reference}{chapter.6}
\BOOKMARK [1][-]{section.6.107}{mca\137ptl\137base\137ack\137header\137t Struct Reference}{chapter.6}
\BOOKMARK [1][-]{section.6.108}{mca\137ptl\137base\137common\137header\137t Struct Reference}{chapter.6}
\BOOKMARK [1][-]{section.6.109}{mca\137ptl\137base\137component\1371\1370\1370\137t Struct Reference}{chapter.6}
\BOOKMARK [1][-]{section.6.110}{mca\137ptl\137base\137frag\137header\137t Struct Reference}{chapter.6}
\BOOKMARK [1][-]{section.6.111}{mca\137ptl\137base\137frag\137t Struct Reference}{chapter.6}
\BOOKMARK [1][-]{section.6.112}{mca\137ptl\137base\137header\137t Union Reference}{chapter.6}
\BOOKMARK [1][-]{section.6.113}{mca\137ptl\137base\137match\137header\137t Struct Reference}{chapter.6}
\BOOKMARK [1][-]{section.6.114}{mca\137ptl\137base\137module\137t Struct Reference}{chapter.6}
\BOOKMARK [1][-]{section.6.115}{mca\137ptl\137base\137peer\137t Struct Reference}{chapter.6}
\BOOKMARK [1][-]{section.6.116}{mca\137ptl\137base\137recv\137frag\137t Struct Reference}{chapter.6}
\BOOKMARK [1][-]{section.6.117}{mca\137ptl\137base\137recv\137request\137t Struct Reference}{chapter.6}
\BOOKMARK [1][-]{section.6.118}{mca\137ptl\137base\137rendezvous\137header\137t Struct Reference}{chapter.6}
\BOOKMARK [1][-]{section.6.119}{mca\137ptl\137base\137send\137frag\137t Struct Reference}{chapter.6}
\BOOKMARK [1][-]{section.6.120}{mca\137ptl\137base\137send\137request\137t Struct Reference}{chapter.6}
\BOOKMARK [1][-]{section.6.121}{mca\137ptl\137gm\137addr\137t Struct Reference}{chapter.6}
\BOOKMARK [1][-]{section.6.122}{mca\137ptl\137gm\137component\137t Struct Reference}{chapter.6}
\BOOKMARK [1][-]{section.6.123}{mca\137ptl\137gm\137module\137t Struct Reference}{chapter.6}
\BOOKMARK [1][-]{section.6.124}{mca\137ptl\137gm\137peer\137t Struct Reference}{chapter.6}
\BOOKMARK [1][-]{section.6.125}{mca\137ptl\137gm\137send\137frag\137t Struct Reference}{chapter.6}
\BOOKMARK [1][-]{section.6.126}{mca\137ptl\137llc\137addr\137t Struct Reference}{chapter.6}
\BOOKMARK [1][-]{section.6.127}{mca\137ptl\137llc\137component\137t Struct Reference}{chapter.6}
\BOOKMARK [1][-]{section.6.128}{mca\137ptl\137llc\137module\137t Struct Reference}{chapter.6}
\BOOKMARK [1][-]{section.6.129}{mca\137ptl\137llc\137proc\137t Struct Reference}{chapter.6}
\BOOKMARK [1][-]{section.6.130}{mca\137ptl\137llc\137recv\137frag\137t Struct Reference}{chapter.6}
\BOOKMARK [1][-]{section.6.131}{mca\137ptl\137llc\137send\137frag\137t Struct Reference}{chapter.6}
\BOOKMARK [1][-]{section.6.132}{mca\137ptl\137llc\137send\137request\137t Struct Reference}{chapter.6}
\BOOKMARK [1][-]{section.6.133}{mca\137ptl\137mx\137component\137t Struct Reference}{chapter.6}
\BOOKMARK [1][-]{section.6.134}{mca\137ptl\137mx\137module\137t Struct Reference}{chapter.6}
\BOOKMARK [1][-]{section.6.135}{mca\137ptl\137mx\137proc\137t Struct Reference}{chapter.6}
\BOOKMARK [1][-]{section.6.136}{mca\137ptl\137mx\137recv\137frag\137t Struct Reference}{chapter.6}
\BOOKMARK [1][-]{section.6.137}{mca\137ptl\137mx\137send\137frag\137t Struct Reference}{chapter.6}
\BOOKMARK [1][-]{section.6.138}{mca\137ptl\137proc\137t Struct Reference}{chapter.6}
\BOOKMARK [1][-]{section.6.139}{mca\137ptl\137self\137component\137t Struct Reference}{chapter.6}
\BOOKMARK [1][-]{section.6.140}{mca\137ptl\137self\137send\137request\137t Struct Reference}{chapter.6}
\BOOKMARK [1][-]{section.6.141}{mca\137ptl\137sm\137component\137t Struct Reference}{chapter.6}
\BOOKMARK [1][-]{section.6.142}{mca\137ptl\137sm\137frag\137t Struct Reference}{chapter.6}
\BOOKMARK [1][-]{section.6.143}{mca\137ptl\137sm\137recv\137frag\137t Struct Reference}{chapter.6}
\BOOKMARK [1][-]{section.6.144}{mca\137ptl\137sm\137send\137frag\137t Struct Reference}{chapter.6}
\BOOKMARK [1][-]{section.6.145}{mca\137ptl\137sm\137send\137request\137t Struct Reference}{chapter.6}
\BOOKMARK [1][-]{section.6.146}{mca\137ptl\137sm\137t Struct Reference}{chapter.6}
\BOOKMARK [1][-]{section.6.147}{mca\137ptl\137tcp\137addr\137t Struct Reference}{chapter.6}
\BOOKMARK [1][-]{section.6.148}{mca\137ptl\137tcp\137component\137t Struct Reference}{chapter.6}
\BOOKMARK [1][-]{section.6.149}{mca\137ptl\137tcp\137module\137t Struct Reference}{chapter.6}
\BOOKMARK [1][-]{section.6.150}{mca\137ptl\137tcp\137proc\137t Struct Reference}{chapter.6}
\BOOKMARK [1][-]{section.6.151}{mca\137ptl\137tcp\137recv\137frag\137t Struct Reference}{chapter.6}
\BOOKMARK [1][-]{section.6.152}{mca\137ptl\137tcp\137send\137frag\137t Struct Reference}{chapter.6}
\BOOKMARK [1][-]{section.6.153}{mca\137ptl\137tcp\137send\137request\137t Struct Reference}{chapter.6}
\BOOKMARK [1][-]{section.6.154}{mca\137rcache\137base\137component\1371\1370\1370\137t Struct Reference}{chapter.6}
\BOOKMARK [1][-]{section.6.155}{mca\137rcache\137base\137module\137t Struct Reference}{chapter.6}
\BOOKMARK [1][-]{section.6.156}{mca\137rcache\137rb\137tree\137item\137t Struct Reference}{chapter.6}
\BOOKMARK [1][-]{section.6.157}{mca\137rcache\137rb\137tree\137key\137t Struct Reference}{chapter.6}
\BOOKMARK [1][-]{section.6.158}{ompi\137attribute\137fortran\137ptr\137t Union Reference}{chapter.6}
\BOOKMARK [1][-]{section.6.159}{ompi\137errclass\137t Struct Reference}{chapter.6}
\BOOKMARK [1][-]{section.6.160}{ompi\137errcode\137intern\137t Struct Reference}{chapter.6}
\BOOKMARK [1][-]{section.6.161}{ompi\137errhandler\137t Struct Reference}{chapter.6}
\BOOKMARK [1][-]{section.6.162}{ompi\137file\137t Struct Reference}{chapter.6}
\BOOKMARK [1][-]{section.6.163}{ompi\137group\137t Struct Reference}{chapter.6}
\BOOKMARK [1][-]{section.6.164}{ompi\137mpi\137errcode\137t Struct Reference}{chapter.6}
\BOOKMARK [1][-]{section.6.165}{ompi\137op\137t Struct Reference}{chapter.6}
\BOOKMARK [1][-]{section.6.166}{ompi\137pointer\137array\137t Struct Reference}{chapter.6}
\BOOKMARK [1][-]{section.6.167}{ompi\137rb\137tree\137node\137t Struct Reference}{chapter.6}
\BOOKMARK [1][-]{section.6.168}{ompi\137rb\137tree\137t Struct Reference}{chapter.6}
\BOOKMARK [1][-]{section.6.169}{ompi\137request\137t Struct Reference}{chapter.6}
\BOOKMARK [1][-]{section.6.170}{opal\137atomic\137lock\137t Struct Reference}{chapter.6}
\BOOKMARK [1][-]{section.6.171}{opal\137class\137t Struct Reference}{chapter.6}
\BOOKMARK [1][-]{section.6.172}{opal\137cmd\137line\137init\137t Struct Reference}{chapter.6}
\BOOKMARK [1][-]{section.6.173}{opal\137maffinity\137base\137component\1371\1370\1370\137t Struct Reference}{chapter.6}
\BOOKMARK [1][-]{section.6.174}{opal\137maffinity\137base\137module\1371\1370\1370\137t Struct Reference}{chapter.6}
\BOOKMARK [1][-]{section.6.175}{opal\137maffinity\137base\137segment\137t Struct Reference}{chapter.6}
\BOOKMARK [1][-]{section.6.176}{opal\137memory\137base\137component\1371\1370\1370\137t Struct Reference}{chapter.6}
\BOOKMARK [1][-]{section.6.177}{opal\137object\137t Struct Reference}{chapter.6}
\BOOKMARK [1][-]{section.6.178}{opal\137output\137stream\137t Struct Reference}{chapter.6}
\BOOKMARK [1][-]{section.6.179}{opal\137paffinity\137base\137component\1371\1370\1370\137t Struct Reference}{chapter.6}
\BOOKMARK [1][-]{section.6.180}{opal\137paffinity\137base\137module\1371\1370\1370\137t Struct Reference}{chapter.6}
\BOOKMARK [1][-]{section.6.181}{opal\137timer\137base\137component\1371\1370\1370\137t Struct Reference}{chapter.6}
\BOOKMARK [1][-]{section.6.182}{orte\137app\137context\137map\137t Struct Reference}{chapter.6}
\BOOKMARK [1][-]{section.6.183}{orte\137app\137context\137t Struct Reference}{chapter.6}
\BOOKMARK [1][-]{section.6.184}{orte\137buffer\137t Struct Reference}{chapter.6}
\BOOKMARK [1][-]{section.6.185}{orte\137dps\137t Struct Reference}{chapter.6}
\BOOKMARK [1][-]{section.6.186}{orte\137dps\137type\137info\137t Struct Reference}{chapter.6}
\BOOKMARK [1][-]{section.6.187}{orte\137gpr\137notify\137data\137t Struct Reference}{chapter.6}
\BOOKMARK [1][-]{section.6.188}{orte\137gpr\137replica\137container\137t Struct Reference}{chapter.6}
\BOOKMARK [1][-]{section.6.189}{orte\137gpr\137replica\137list\137t Struct Reference}{chapter.6}
\BOOKMARK [1][-]{section.6.190}{orte\137gpr\137replica\137segment\137t Struct Reference}{chapter.6}
\BOOKMARK [1][-]{section.6.191}{orte\137gpr\137replica\137write\137invalidate\137t Struct Reference}{chapter.6}
\BOOKMARK [1][-]{section.6.192}{orte\137gpr\137subscription\137t Struct Reference}{chapter.6}
\BOOKMARK [1][-]{section.6.193}{orte\137gpr\137trigger\137t Struct Reference}{chapter.6}
\BOOKMARK [1][-]{section.6.194}{orte\137gpr\137value\137t Struct Reference}{chapter.6}
\BOOKMARK [1][-]{section.6.195}{orte\137iof\137base\137common\137header\137t Struct Reference}{chapter.6}
\BOOKMARK [1][-]{section.6.196}{orte\137iof\137base\137endpoint\137t Struct Reference}{chapter.6}
\BOOKMARK [1][-]{section.6.197}{orte\137iof\137base\137frag\137t Struct Reference}{chapter.6}
\BOOKMARK [1][-]{section.6.198}{orte\137iof\137base\137header\137t Union Reference}{chapter.6}
\BOOKMARK [1][-]{section.6.199}{orte\137iof\137base\137module\1371\1370\1370\137t Struct Reference}{chapter.6}
\BOOKMARK [1][-]{section.6.200}{orte\137iof\137base\137msg\137header\137t Struct Reference}{chapter.6}
\BOOKMARK [1][-]{section.6.201}{orte\137iof\137base\137pub\137header\137t Struct Reference}{chapter.6}
\BOOKMARK [1][-]{section.6.202}{orte\137iof\137base\137sub\137header\137t Struct Reference}{chapter.6}
\BOOKMARK [1][-]{section.6.203}{orte\137iof\137proxy\137component\137t Struct Reference}{chapter.6}
\BOOKMARK [1][-]{section.6.204}{orte\137iof\137svc\137component\137t Struct Reference}{chapter.6}
\BOOKMARK [1][-]{section.6.205}{orte\137iof\137svc\137fwd\137t Struct Reference}{chapter.6}
\BOOKMARK [1][-]{section.6.206}{orte\137iof\137svc\137pub\137t Struct Reference}{chapter.6}
\BOOKMARK [1][-]{section.6.207}{orte\137name\137services\137namelist\137t Struct Reference}{chapter.6}
\BOOKMARK [1][-]{section.6.208}{orte\137pls\137base\137cmp\137t Struct Reference}{chapter.6}
\BOOKMARK [1][-]{section.6.209}{orte\137pls\137base\137component\1371\1370\1370\137t Struct Reference}{chapter.6}
\BOOKMARK [1][-]{section.6.210}{orte\137pls\137base\137module\1371\1370\1370\137t Struct Reference}{chapter.6}
\BOOKMARK [1][-]{section.6.211}{orte\137pls\137base\137t Struct Reference}{chapter.6}
\BOOKMARK [1][-]{section.6.212}{orte\137pls\137bproc\137component\137t Struct Reference}{chapter.6}
\BOOKMARK [1][-]{section.6.213}{orte\137pls\137bproc\137orted\137component\137t Struct Reference}{chapter.6}
\BOOKMARK [1][-]{section.6.214}{orte\137pls\137fork\137component\137t Struct Reference}{chapter.6}
\BOOKMARK [1][-]{section.6.215}{orte\137pls\137poe\137component\137t Struct Reference}{chapter.6}
\BOOKMARK [1][-]{section.6.216}{orte\137pls\137rsh\137component\137t Struct Reference}{chapter.6}
\BOOKMARK [1][-]{section.6.217}{orte\137pls\137xgrid\137component\137t Struct Reference}{chapter.6}
\BOOKMARK [1][-]{section.6.218}{orte\137pointer\137array\137t Struct Reference}{chapter.6}
\BOOKMARK [1][-]{section.6.219}{orte\137proc\137info\137t Struct Reference}{chapter.6}
\BOOKMARK [1][-]{section.6.220}{orte\137ras\137base\137component\1371\1370\1370\137t Struct Reference}{chapter.6}
\BOOKMARK [1][-]{section.6.221}{orte\137ras\137base\137module\1371\1370\1370\137t Struct Reference}{chapter.6}
\BOOKMARK [1][-]{section.6.222}{orte\137ras\137bjs\137component\137t Struct Reference}{chapter.6}
\BOOKMARK [1][-]{section.6.223}{orte\137ras\137dash\137host\137component\137t Struct Reference}{chapter.6}
\BOOKMARK [1][-]{section.6.224}{orte\137ras\137hostfile\137component\137t Struct Reference}{chapter.6}
\BOOKMARK [1][-]{section.6.225}{orte\137ras\137localhost\137component\137t Struct Reference}{chapter.6}
\BOOKMARK [1][-]{section.6.226}{orte\137ras\137lsf\137bproc\137component\137t Struct Reference}{chapter.6}
\BOOKMARK [1][-]{section.6.227}{orte\137ras\137node\137t Struct Reference}{chapter.6}
\BOOKMARK [1][-]{section.6.228}{orte\137rds\137hostfile\137component\137t Struct Reference}{chapter.6}
\BOOKMARK [1][-]{section.6.229}{orte\137rds\137resfile\137component\137t Struct Reference}{chapter.6}
\BOOKMARK [1][-]{section.6.230}{orte\137rmaps\137base\137cmp\137t Struct Reference}{chapter.6}
\BOOKMARK [1][-]{section.6.231}{orte\137rmaps\137base\137component\1371\1370\1370\137t Struct Reference}{chapter.6}
\BOOKMARK [1][-]{section.6.232}{orte\137rmaps\137base\137node\137t Struct Reference}{chapter.6}
\BOOKMARK [1][-]{section.6.233}{orte\137rmaps\137base\137t Struct Reference}{chapter.6}
\BOOKMARK [1][-]{section.6.234}{orte\137rmaps\137round\137robin\137component\137t Struct Reference}{chapter.6}
\BOOKMARK [1][-]{section.6.235}{orte\137rmgr\137proxy\137component\137t Struct Reference}{chapter.6}
\BOOKMARK [1][-]{section.6.236}{orte\137rmgr\137urm\137component\137t Struct Reference}{chapter.6}
\BOOKMARK [1][-]{section.6.237}{orte\137rml\137component\1371\1370\1370\137t Struct Reference}{chapter.6}
\BOOKMARK [1][-]{section.6.238}{orte\137rml\137module\137t Struct Reference}{chapter.6}
\BOOKMARK [1][-]{section.6.239}{orte\137sys\137info\137t Struct Reference}{chapter.6}
\BOOKMARK [0][-]{chapter.7}{OpenMPI File Documentation}{}
\BOOKMARK [1][-]{section.7.1}{ompi/attribute/attribute.c File Reference}{chapter.7}
\BOOKMARK [1][-]{section.7.2}{ompi/attribute/attribute.h File Reference}{chapter.7}
\BOOKMARK [1][-]{section.7.3}{ompi/attribute/attribute\137predefined.c File Reference}{chapter.7}
\BOOKMARK [1][-]{section.7.4}{ompi/class/ompi\137bitmap.h File Reference}{chapter.7}
\BOOKMARK [1][-]{section.7.5}{ompi/class/ompi\137circular\137buffer\137fifo.h File Reference}{chapter.7}
\BOOKMARK [1][-]{section.7.6}{ompi/class/ompi\137fifo.h File Reference}{chapter.7}
\BOOKMARK [1][-]{section.7.7}{ompi/class/ompi\137pointer\137array.h File Reference}{chapter.7}
\BOOKMARK [1][-]{section.7.8}{ompi/class/ompi\137rb\137tree.h File Reference}{chapter.7}
\BOOKMARK [1][-]{section.7.9}{ompi/debuggers/debuggers.h File Reference}{chapter.7}
\BOOKMARK [1][-]{section.7.10}{ompi/errhandler/errclass.h File Reference}{chapter.7}
\BOOKMARK [1][-]{section.7.11}{ompi/errhandler/errcode-internal.h File Reference}{chapter.7}
\BOOKMARK [1][-]{section.7.12}{ompi/errhandler/errcode.h File Reference}{chapter.7}
\BOOKMARK [1][-]{section.7.13}{ompi/errhandler/errhandler.h File Reference}{chapter.7}
\BOOKMARK [1][-]{section.7.14}{ompi/group/group.h File Reference}{chapter.7}
\BOOKMARK [1][-]{section.7.15}{ompi/mca/allocator/allocator.h File Reference}{chapter.7}
\BOOKMARK [1][-]{section.7.16}{ompi/mca/allocator/basic/allocator\137basic.h File Reference}{chapter.7}
\BOOKMARK [1][-]{section.7.17}{ompi/mca/allocator/bucket/allocator\137bucket\137alloc.h File Reference}{chapter.7}
\BOOKMARK [1][-]{section.7.18}{ompi/mca/bml/bml.h File Reference}{chapter.7}
\BOOKMARK [1][-]{section.7.19}{ompi/mca/bml/r2/bml\137r2.h File Reference}{chapter.7}
\BOOKMARK [1][-]{section.7.20}{ompi/mca/bml/r2/bml\137r2\137btl.h File Reference}{chapter.7}
\BOOKMARK [1][-]{section.7.21}{ompi/mca/btl/btl.h File Reference}{chapter.7}
\BOOKMARK [1][-]{section.7.22}{ompi/mca/btl/gm/btl\137gm.h File Reference}{chapter.7}
\BOOKMARK [1][-]{section.7.23}{ompi/mca/btl/llc/btl\137llc.h File Reference}{chapter.7}
\BOOKMARK [1][-]{section.7.24}{ompi/mca/btl/llc/btl\137llc\137addr.h File Reference}{chapter.7}
\BOOKMARK [1][-]{section.7.25}{ompi/mca/btl/mvapi/btl\137mvapi.h File Reference}{chapter.7}
\BOOKMARK [1][-]{section.7.26}{ompi/mca/btl/mx/btl\137mx.h File Reference}{chapter.7}
\BOOKMARK [1][-]{section.7.27}{ompi/mca/btl/openib/btl\137openib.h File Reference}{chapter.7}
\BOOKMARK [1][-]{section.7.28}{ompi/mca/btl/self/btl\137self.h File Reference}{chapter.7}
\BOOKMARK [1][-]{section.7.29}{ompi/mca/btl/self/btl\137self\137frag.h File Reference}{chapter.7}
\BOOKMARK [1][-]{section.7.30}{ompi/mca/btl/sm/btl\137sm.c File Reference}{chapter.7}
\BOOKMARK [1][-]{section.7.31}{ompi/mca/btl/sm/btl\137sm.h File Reference}{chapter.7}
\BOOKMARK [1][-]{section.7.32}{ompi/mca/btl/sm/btl\137sm\137endpoint.h File Reference}{chapter.7}
\BOOKMARK [1][-]{section.7.33}{ompi/mca/btl/sm/btl\137sm\137frag.h File Reference}{chapter.7}
\BOOKMARK [1][-]{section.7.34}{ompi/mca/btl/tcp/btl\137tcp.h File Reference}{chapter.7}
\BOOKMARK [1][-]{section.7.35}{ompi/mca/btl/tcp/btl\137tcp\137addr.h File Reference}{chapter.7}
\BOOKMARK [1][-]{section.7.36}{ompi/mca/coll/sm/coll\137sm.h File Reference}{chapter.7}
\BOOKMARK [1][-]{section.7.37}{ompi/mca/coll/sm/coll\137sm\137allreduce.c File Reference}{chapter.7}
\BOOKMARK [1][-]{section.7.38}{ompi/mca/coll/sm/coll\137sm\137barrier.c File Reference}{chapter.7}
\BOOKMARK [1][-]{section.7.39}{ompi/mca/coll/sm/coll\137sm\137bcast.c File Reference}{chapter.7}
\BOOKMARK [1][-]{section.7.40}{ompi/mca/coll/sm/coll\137sm\137component.c File Reference}{chapter.7}
\BOOKMARK [1][-]{section.7.41}{ompi/mca/coll/sm/coll\137sm\137module.c File Reference}{chapter.7}
\BOOKMARK [1][-]{section.7.42}{ompi/mca/io/base/io\137base\137request.h File Reference}{chapter.7}
\BOOKMARK [1][-]{section.7.43}{ompi/mca/mpool/base/mpool\137base\137mem\137cb.c File Reference}{chapter.7}
\BOOKMARK [1][-]{section.7.44}{ompi/mca/mpool/base/mpool\137base\137mem\137cb.h File Reference}{chapter.7}
\BOOKMARK [1][-]{section.7.45}{ompi/mca/mpool/gm/mpool\137gm.h File Reference}{chapter.7}
\BOOKMARK [1][-]{section.7.46}{ompi/mca/mpool/mpool.h File Reference}{chapter.7}
\BOOKMARK [1][-]{section.7.47}{ompi/mca/mpool/mvapi/mpool\137mvapi.h File Reference}{chapter.7}
\BOOKMARK [1][-]{section.7.48}{ompi/mca/mpool/openib/mpool\137openib.h File Reference}{chapter.7}
\BOOKMARK [1][-]{section.7.49}{ompi/mca/mpool/sm/mpool\137sm.h File Reference}{chapter.7}
\BOOKMARK [1][-]{section.7.50}{ompi/mca/pml/base/pml\137base\137module\137exchange.h File Reference}{chapter.7}
\BOOKMARK [1][-]{section.7.51}{ompi/mca/pml/base/pml\137base\137recvreq.h File Reference}{chapter.7}
\BOOKMARK [1][-]{section.7.52}{ompi/mca/pml/base/pml\137base\137request.h File Reference}{chapter.7}
\BOOKMARK [1][-]{section.7.53}{ompi/mca/pml/base/pml\137base\137sendreq.h File Reference}{chapter.7}
\BOOKMARK [1][-]{section.7.54}{ompi/mca/pml/ob1/pml\137ob1.h File Reference}{chapter.7}
\BOOKMARK [1][-]{section.7.55}{ompi/mca/pml/ob1/pml\137ob1\137comm.h File Reference}{chapter.7}
\BOOKMARK [1][-]{section.7.56}{ompi/mca/pml/ob1/pml\137ob1\137component.h File Reference}{chapter.7}
\BOOKMARK [1][-]{section.7.57}{ompi/mca/pml/ob1/pml\137ob1\137endpoint.h File Reference}{chapter.7}
\BOOKMARK [1][-]{section.7.58}{ompi/mca/pml/ob1/pml\137ob1\137hdr.h File Reference}{chapter.7}
\BOOKMARK [1][-]{section.7.59}{ompi/mca/pml/ob1/pml\137ob1\137proc.h File Reference}{chapter.7}
\BOOKMARK [1][-]{section.7.60}{ompi/mca/pml/ob1/pml\137ob1\137rdma.h File Reference}{chapter.7}
\BOOKMARK [1][-]{section.7.61}{ompi/mca/pml/ob1/pml\137ob1\137rdmafrag.h File Reference}{chapter.7}
\BOOKMARK [1][-]{section.7.62}{ompi/mca/pml/ob1/pml\137ob1\137recvfrag.c File Reference}{chapter.7}
\BOOKMARK [1][-]{section.7.63}{ompi/mca/pml/ob1/pml\137ob1\137recvfrag.h File Reference}{chapter.7}
\BOOKMARK [1][-]{section.7.64}{ompi/mca/pml/ob1/pml\137ob1\137recvreq.h File Reference}{chapter.7}
\BOOKMARK [1][-]{section.7.65}{ompi/mca/pml/ob1/pml\137ob1\137sendreq.h File Reference}{chapter.7}
\BOOKMARK [1][-]{section.7.66}{ompi/mca/pml/pml.h File Reference}{chapter.7}
\BOOKMARK [1][-]{section.7.67}{ompi/mca/pml/teg/pml\137ptl\137array.h File Reference}{chapter.7}
\BOOKMARK [1][-]{section.7.68}{ompi/mca/pml/teg/pml\137teg.h File Reference}{chapter.7}
\BOOKMARK [1][-]{section.7.69}{ompi/mca/pml/teg/pml\137teg\137component.h File Reference}{chapter.7}
\BOOKMARK [1][-]{section.7.70}{ompi/mca/pml/teg/pml\137teg\137proc.h File Reference}{chapter.7}
\BOOKMARK [1][-]{section.7.71}{ompi/mca/pml/teg/pml\137teg\137recvfrag.c File Reference}{chapter.7}
\BOOKMARK [1][-]{section.7.72}{ompi/mca/pml/teg/pml\137teg\137recvfrag.h File Reference}{chapter.7}
\BOOKMARK [1][-]{section.7.73}{ompi/mca/pml/teg/pml\137teg\137recvreq.h File Reference}{chapter.7}
\BOOKMARK [1][-]{section.7.74}{ompi/mca/pml/teg/pml\137teg\137sendreq.h File Reference}{chapter.7}
\BOOKMARK [1][-]{section.7.75}{ompi/mca/ptl/base/ptl\137base\137comm.h File Reference}{chapter.7}
\BOOKMARK [1][-]{section.7.76}{ompi/mca/ptl/base/ptl\137base\137fragment.h File Reference}{chapter.7}
\BOOKMARK [1][-]{section.7.77}{ompi/mca/ptl/base/ptl\137base\137header.h File Reference}{chapter.7}
\BOOKMARK [1][-]{section.7.78}{ompi/mca/ptl/base/ptl\137base\137match.c File Reference}{chapter.7}
\BOOKMARK [1][-]{section.7.79}{ompi/mca/ptl/base/ptl\137base\137match.h File Reference}{chapter.7}
\BOOKMARK [1][-]{section.7.80}{ompi/mca/ptl/base/ptl\137base\137recvfrag.h File Reference}{chapter.7}
\BOOKMARK [1][-]{section.7.81}{ompi/mca/ptl/base/ptl\137base\137recvreq.h File Reference}{chapter.7}
\BOOKMARK [1][-]{section.7.82}{ompi/mca/ptl/base/ptl\137base\137sendfrag.h File Reference}{chapter.7}
\BOOKMARK [1][-]{section.7.83}{ompi/mca/ptl/base/ptl\137base\137sendreq.h File Reference}{chapter.7}
\BOOKMARK [1][-]{section.7.84}{ompi/mca/ptl/gm/ptl\137gm.h File Reference}{chapter.7}
\BOOKMARK [1][-]{section.7.85}{ompi/mca/ptl/gm/ptl\137gm\137peer.h File Reference}{chapter.7}
\BOOKMARK [1][-]{section.7.86}{ompi/mca/ptl/gm/ptl\137gm\137proc.h File Reference}{chapter.7}
\BOOKMARK [1][-]{section.7.87}{ompi/mca/ptl/gm/ptl\137gm\137sendfrag.h File Reference}{chapter.7}
\BOOKMARK [1][-]{section.7.88}{ompi/mca/ptl/llc/ptl\137llc.h File Reference}{chapter.7}
\BOOKMARK [1][-]{section.7.89}{ompi/mca/ptl/llc/ptl\137llc\137addr.h File Reference}{chapter.7}
\BOOKMARK [1][-]{section.7.90}{ompi/mca/ptl/llc/ptl\137llc\137peer.h File Reference}{chapter.7}
\BOOKMARK [1][-]{section.7.91}{ompi/mca/ptl/llc/ptl\137llc\137proc.h File Reference}{chapter.7}
\BOOKMARK [1][-]{section.7.92}{ompi/mca/ptl/llc/ptl\137llc\137recvfrag.h File Reference}{chapter.7}
\BOOKMARK [1][-]{section.7.93}{ompi/mca/ptl/llc/ptl\137llc\137sendfrag.h File Reference}{chapter.7}
\BOOKMARK [1][-]{section.7.94}{ompi/mca/ptl/llc/ptl\137llc\137sendreq.h File Reference}{chapter.7}
\BOOKMARK [1][-]{section.7.95}{ompi/mca/ptl/mx/ptl\137mx.h File Reference}{chapter.7}
\BOOKMARK [1][-]{section.7.96}{ompi/mca/ptl/mx/ptl\137mx\137module.h File Reference}{chapter.7}
\BOOKMARK [1][-]{section.7.97}{ompi/mca/ptl/mx/ptl\137mx\137peer.h File Reference}{chapter.7}
\BOOKMARK [1][-]{section.7.98}{ompi/mca/ptl/mx/ptl\137mx\137proc.h File Reference}{chapter.7}
\BOOKMARK [1][-]{section.7.99}{ompi/mca/ptl/mx/ptl\137mx\137recvfrag.h File Reference}{chapter.7}
\BOOKMARK [1][-]{section.7.100}{ompi/mca/ptl/mx/ptl\137mx\137sendfrag.h File Reference}{chapter.7}
\BOOKMARK [1][-]{section.7.101}{ompi/mca/ptl/ptl.h File Reference}{chapter.7}
\BOOKMARK [1][-]{section.7.102}{ompi/mca/ptl/self/ptl\137self.h File Reference}{chapter.7}
\BOOKMARK [1][-]{section.7.103}{ompi/mca/ptl/sm/ptl\137sm.h File Reference}{chapter.7}
\BOOKMARK [1][-]{section.7.104}{ompi/mca/ptl/sm/ptl\137sm\137address.h File Reference}{chapter.7}
\BOOKMARK [1][-]{section.7.105}{ompi/mca/ptl/sm/ptl\137sm\137frag.h File Reference}{chapter.7}
\BOOKMARK [1][-]{section.7.106}{ompi/mca/ptl/sm/ptl\137sm\137peer.h File Reference}{chapter.7}
\BOOKMARK [1][-]{section.7.107}{ompi/mca/ptl/sm/ptl\137sm\137recvfrag.h File Reference}{chapter.7}
\BOOKMARK [1][-]{section.7.108}{ompi/mca/ptl/sm/ptl\137sm\137sendfrag.h File Reference}{chapter.7}
\BOOKMARK [1][-]{section.7.109}{ompi/mca/ptl/sm/ptl\137sm\137sendreq.h File Reference}{chapter.7}
\BOOKMARK [1][-]{section.7.110}{ompi/mca/ptl/tcp/ptl\137tcp.h File Reference}{chapter.7}
\BOOKMARK [1][-]{section.7.111}{ompi/mca/ptl/tcp/ptl\137tcp\137addr.h File Reference}{chapter.7}
\BOOKMARK [1][-]{section.7.112}{ompi/mca/ptl/tcp/ptl\137tcp\137peer.h File Reference}{chapter.7}
\BOOKMARK [1][-]{section.7.113}{ompi/mca/ptl/tcp/ptl\137tcp\137proc.h File Reference}{chapter.7}
\BOOKMARK [1][-]{section.7.114}{ompi/mca/ptl/tcp/ptl\137tcp\137recvfrag.h File Reference}{chapter.7}
\BOOKMARK [1][-]{section.7.115}{ompi/mca/ptl/tcp/ptl\137tcp\137sendfrag.h File Reference}{chapter.7}
\BOOKMARK [1][-]{section.7.116}{ompi/mca/ptl/tcp/ptl\137tcp\137sendreq.h File Reference}{chapter.7}
\BOOKMARK [1][-]{section.7.117}{ompi/mca/rcache/rb/rcache\137rb.h File Reference}{chapter.7}
\BOOKMARK [1][-]{section.7.118}{ompi/mca/rcache/rb/rcache\137rb\137mru.c File Reference}{chapter.7}
\BOOKMARK [1][-]{section.7.119}{ompi/mca/rcache/rb/rcache\137rb\137mru.h File Reference}{chapter.7}
\BOOKMARK [1][-]{section.7.120}{ompi/mca/rcache/rb/rcache\137rb\137tree.c File Reference}{chapter.7}
\BOOKMARK [1][-]{section.7.121}{ompi/mca/rcache/rb/rcache\137rb\137tree.h File Reference}{chapter.7}
\BOOKMARK [1][-]{section.7.122}{ompi/mca/rcache/rcache.h File Reference}{chapter.7}
\BOOKMARK [1][-]{section.7.123}{ompi/op/op.h File Reference}{chapter.7}
\BOOKMARK [1][-]{section.7.124}{ompi/request/request.h File Reference}{chapter.7}
\BOOKMARK [1][-]{section.7.125}{ompi/runtime/mpiruntime.h File Reference}{chapter.7}
\BOOKMARK [1][-]{section.7.126}{ompi/tools/wrappers/ompi\137wrap.h File Reference}{chapter.7}
\BOOKMARK [1][-]{section.7.127}{opal/class/opal\137hash\137table.h File Reference}{chapter.7}
\BOOKMARK [1][-]{section.7.128}{opal/class/opal\137list.h File Reference}{chapter.7}
\BOOKMARK [1][-]{section.7.129}{opal/class/opal\137object.c File Reference}{chapter.7}
\BOOKMARK [1][-]{section.7.130}{opal/class/opal\137object.h File Reference}{chapter.7}
\BOOKMARK [1][-]{section.7.131}{opal/include/sys/atomic.h File Reference}{chapter.7}
\BOOKMARK [1][-]{section.7.132}{opal/include/sys/timer.h File Reference}{chapter.7}
\BOOKMARK [1][-]{section.7.133}{opal/mca/timer/timer.h File Reference}{chapter.7}
\BOOKMARK [1][-]{section.7.134}{opal/include/sys/cache.h File Reference}{chapter.7}
\BOOKMARK [1][-]{section.7.135}{orte/mca/errmgr/base/base.h File Reference}{chapter.7}
\BOOKMARK [1][-]{section.7.136}{orte/mca/gpr/base/base.h File Reference}{chapter.7}
\BOOKMARK [1][-]{section.7.137}{orte/mca/iof/base/base.h File Reference}{chapter.7}
\BOOKMARK [1][-]{section.7.138}{orte/mca/ns/base/base.h File Reference}{chapter.7}
\BOOKMARK [1][-]{section.7.139}{orte/mca/oob/base/base.h File Reference}{chapter.7}
\BOOKMARK [1][-]{section.7.140}{orte/mca/pls/base/base.h File Reference}{chapter.7}
\BOOKMARK [1][-]{section.7.141}{orte/mca/ras/base/base.h File Reference}{chapter.7}
\BOOKMARK [1][-]{section.7.142}{orte/mca/rds/base/base.h File Reference}{chapter.7}
\BOOKMARK [1][-]{section.7.143}{orte/mca/rmaps/base/base.h File Reference}{chapter.7}
\BOOKMARK [1][-]{section.7.144}{orte/mca/rmgr/base/base.h File Reference}{chapter.7}
\BOOKMARK [1][-]{section.7.145}{orte/mca/schema/base/base.h File Reference}{chapter.7}
\BOOKMARK [1][-]{section.7.146}{orte/mca/sds/base/base.h File Reference}{chapter.7}
\BOOKMARK [1][-]{section.7.147}{orte/mca/soh/base/base.h File Reference}{chapter.7}
\BOOKMARK [1][-]{section.7.148}{ompi/mca/allocator/base/base.h File Reference}{chapter.7}
\BOOKMARK [1][-]{section.7.149}{ompi/mca/btl/base/base.h File Reference}{chapter.7}
\BOOKMARK [1][-]{section.7.150}{ompi/mca/coll/base/base.h File Reference}{chapter.7}
\BOOKMARK [1][-]{section.7.151}{ompi/mca/io/base/base.h File Reference}{chapter.7}
\BOOKMARK [1][-]{section.7.152}{ompi/mca/mpool/base/base.h File Reference}{chapter.7}
\BOOKMARK [1][-]{section.7.153}{ompi/mca/ptl/base/base.h File Reference}{chapter.7}
\BOOKMARK [1][-]{section.7.154}{ompi/mca/rcache/base/base.h File Reference}{chapter.7}
\BOOKMARK [1][-]{section.7.155}{opal/mca/base/mca\137base\137msgbuf.h File Reference}{chapter.7}
\BOOKMARK [1][-]{section.7.156}{opal/mca/base/mca\137base\137msgbuf\137internal.h File Reference}{chapter.7}
\BOOKMARK [1][-]{section.7.157}{opal/mca/base/mca\137base\137param.h File Reference}{chapter.7}
\BOOKMARK [1][-]{section.7.158}{opal/mca/base/mca\137base\137param\137internal.h File Reference}{chapter.7}
\BOOKMARK [1][-]{section.7.159}{opal/mca/maffinity/base/internal.h File Reference}{chapter.7}
\BOOKMARK [1][-]{section.7.160}{opal/mca/paffinity/base/internal.h File Reference}{chapter.7}
\BOOKMARK [1][-]{section.7.161}{opal/mca/maffinity/first\137use/maffinity\137first\137use.h File Reference}{chapter.7}
\BOOKMARK [1][-]{section.7.162}{opal/mca/maffinity/libnuma/maffinity\137libnuma.h File Reference}{chapter.7}
\BOOKMARK [1][-]{section.7.163}{opal/mca/maffinity/maffinity.h File Reference}{chapter.7}
\BOOKMARK [1][-]{section.7.164}{opal/mca/maffinity/maffinity\137types.h File Reference}{chapter.7}
\BOOKMARK [1][-]{section.7.165}{opal/mca/mca.h File Reference}{chapter.7}
\BOOKMARK [1][-]{section.7.166}{opal/memoryhooks/memory.h File Reference}{chapter.7}
\BOOKMARK [1][-]{section.7.167}{opal/util/malloc.h File Reference}{chapter.7}
\BOOKMARK [1][-]{section.7.168}{opal/mca/paffinity/linux/paffinity\137linux.h File Reference}{chapter.7}
\BOOKMARK [1][-]{section.7.169}{opal/mca/paffinity/paffinity.h File Reference}{chapter.7}
\BOOKMARK [1][-]{section.7.170}{opal/runtime/opal.h File Reference}{chapter.7}
\BOOKMARK [1][-]{section.7.171}{opal/runtime/opal\137finalize.c File Reference}{chapter.7}
\BOOKMARK [1][-]{section.7.172}{opal/runtime/opal\137init.c File Reference}{chapter.7}
\BOOKMARK [1][-]{section.7.173}{opal/runtime/opal\137progress.h File Reference}{chapter.7}
\BOOKMARK [1][-]{section.7.174}{opal/threads/mutex.h File Reference}{chapter.7}
\BOOKMARK [1][-]{section.7.175}{opal/threads/mutex\137unix.h File Reference}{chapter.7}
\BOOKMARK [1][-]{section.7.176}{opal/threads/mutex\137windows.h File Reference}{chapter.7}
\BOOKMARK [1][-]{section.7.177}{opal/util/argv.h File Reference}{chapter.7}
\BOOKMARK [1][-]{section.7.178}{opal/util/basename.h File Reference}{chapter.7}
\BOOKMARK [1][-]{section.7.179}{opal/util/cmd\137line.h File Reference}{chapter.7}
\BOOKMARK [1][-]{section.7.180}{opal/util/convert.h File Reference}{chapter.7}
\BOOKMARK [1][-]{section.7.181}{opal/util/daemon\137init.h File Reference}{chapter.7}
\BOOKMARK [1][-]{section.7.182}{opal/util/numtostr.h File Reference}{chapter.7}
\BOOKMARK [1][-]{section.7.183}{opal/util/opal\137environ.h File Reference}{chapter.7}
\BOOKMARK [1][-]{section.7.184}{opal/util/os\137create\137dirpath.h File Reference}{chapter.7}
\BOOKMARK [1][-]{section.7.185}{opal/util/os\137path.h File Reference}{chapter.7}
\BOOKMARK [1][-]{section.7.186}{opal/util/output.h File Reference}{chapter.7}
\BOOKMARK [1][-]{section.7.187}{opal/util/printf.h File Reference}{chapter.7}
\BOOKMARK [1][-]{section.7.188}{opal/util/show\137help.h File Reference}{chapter.7}
\BOOKMARK [1][-]{section.7.189}{orte/class/orte\137bitmap.h File Reference}{chapter.7}
\BOOKMARK [1][-]{section.7.190}{orte/class/orte\137pointer\137array.h File Reference}{chapter.7}
\BOOKMARK [1][-]{section.7.191}{orte/class/orte\137proc\137table.h File Reference}{chapter.7}
\BOOKMARK [1][-]{section.7.192}{orte/dps/dps.h File Reference}{chapter.7}
\BOOKMARK [1][-]{section.7.193}{orte/dps/dps\137load\137unload.c File Reference}{chapter.7}
\BOOKMARK [1][-]{section.7.194}{orte/dps/dps\137types.h File Reference}{chapter.7}
\BOOKMARK [1][-]{section.7.195}{orte/dps/orte\137dps\137open\137close.c File Reference}{chapter.7}
\BOOKMARK [1][-]{section.7.196}{orte/include/orte\137types.h File Reference}{chapter.7}
\BOOKMARK [1][-]{section.7.197}{orte/mca/errmgr/errmgr.h File Reference}{chapter.7}
\BOOKMARK [1][-]{section.7.198}{orte/mca/gpr/base/gpr\137base\137simplified\137put.c File Reference}{chapter.7}
\BOOKMARK [1][-]{section.7.199}{orte/mca/gpr/base/gpr\137base\137simplified\137subscribe.c File Reference}{chapter.7}
\BOOKMARK [1][-]{section.7.200}{orte/mca/gpr/base/pack\137api\137cmd/gpr\137base\137pack\137arithmetic\137ops.c File Reference}{chapter.7}
\BOOKMARK [1][-]{section.7.201}{orte/mca/gpr/base/pack\137api\137cmd/gpr\137base\137pack\137cleanup.c File Reference}{chapter.7}
\BOOKMARK [1][-]{section.7.202}{orte/mca/gpr/base/pack\137api\137cmd/gpr\137base\137pack\137del\137index.c File Reference}{chapter.7}
\BOOKMARK [1][-]{section.7.203}{orte/mca/gpr/base/pack\137api\137cmd/gpr\137base\137pack\137dump.c File Reference}{chapter.7}
\BOOKMARK [1][-]{section.7.204}{orte/mca/gpr/base/pack\137api\137cmd/gpr\137base\137pack\137put\137get.c File Reference}{chapter.7}
\BOOKMARK [1][-]{section.7.205}{orte/mca/gpr/base/pack\137api\137cmd/gpr\137base\137pack\137subscribe.c File Reference}{chapter.7}
\BOOKMARK [1][-]{section.7.206}{orte/mca/gpr/base/unpack\137api\137response/gpr\137base\137dump\137notify.c File Reference}{chapter.7}
\BOOKMARK [1][-]{section.7.207}{orte/mca/gpr/base/unpack\137api\137response/gpr\137base\137print\137dump.c File Reference}{chapter.7}
\BOOKMARK [1][-]{section.7.208}{orte/mca/gpr/base/unpack\137api\137response/gpr\137base\137unpack\137arithmetic\137ops.c File Reference}{chapter.7}
\BOOKMARK [1][-]{section.7.209}{orte/mca/gpr/base/unpack\137api\137response/gpr\137base\137unpack\137cleanup.c File Reference}{chapter.7}
\BOOKMARK [1][-]{section.7.210}{orte/mca/gpr/base/unpack\137api\137response/gpr\137base\137unpack\137del\137index.c File Reference}{chapter.7}
\BOOKMARK [1][-]{section.7.211}{orte/mca/gpr/base/unpack\137api\137response/gpr\137base\137unpack\137put\137get.c File Reference}{chapter.7}
\BOOKMARK [1][-]{section.7.212}{orte/mca/gpr/base/unpack\137api\137response/gpr\137base\137unpack\137subscribe.c File Reference}{chapter.7}
\BOOKMARK [1][-]{section.7.213}{orte/mca/gpr/gpr\137types.h File Reference}{chapter.7}
\BOOKMARK [1][-]{section.7.214}{orte/mca/gpr/proxy/gpr\137proxy\137arithmetic\137ops.c File Reference}{chapter.7}
\BOOKMARK [1][-]{section.7.215}{orte/mca/gpr/proxy/gpr\137proxy\137cleanup.c File Reference}{chapter.7}
\BOOKMARK [1][-]{section.7.216}{orte/mca/gpr/proxy/gpr\137proxy\137component.c File Reference}{chapter.7}
\BOOKMARK [1][-]{section.7.217}{orte/mca/gpr/proxy/gpr\137proxy\137compound\137cmd.c File Reference}{chapter.7}
\BOOKMARK [1][-]{section.7.218}{orte/mca/gpr/proxy/gpr\137proxy\137del\137index.c File Reference}{chapter.7}
\BOOKMARK [1][-]{section.7.219}{orte/mca/gpr/proxy/gpr\137proxy\137deliver\137notify\137msg.c File Reference}{chapter.7}
\BOOKMARK [1][-]{section.7.220}{orte/mca/gpr/proxy/gpr\137proxy\137dump.c File Reference}{chapter.7}
\BOOKMARK [1][-]{section.7.221}{orte/mca/gpr/proxy/gpr\137proxy\137dump\137local\137trigs\137subs.c File Reference}{chapter.7}
\BOOKMARK [1][-]{section.7.222}{orte/mca/gpr/proxy/gpr\137proxy\137general\137operations.c File Reference}{chapter.7}
\BOOKMARK [1][-]{section.7.223}{orte/mca/gpr/proxy/gpr\137proxy\137internals.c File Reference}{chapter.7}
\BOOKMARK [1][-]{section.7.224}{orte/mca/gpr/proxy/gpr\137proxy\137put\137get.c File Reference}{chapter.7}
\BOOKMARK [1][-]{section.7.225}{orte/mca/gpr/proxy/gpr\137proxy\137subscribe.c File Reference}{chapter.7}
\BOOKMARK [1][-]{section.7.226}{orte/mca/gpr/replica/api\137layer/gpr\137replica\137api.h File Reference}{chapter.7}
\BOOKMARK [1][-]{section.7.227}{orte/mca/gpr/replica/api\137layer/gpr\137replica\137arithmetic\137ops\137api.c File Reference}{chapter.7}
\BOOKMARK [1][-]{section.7.228}{orte/mca/gpr/replica/api\137layer/gpr\137replica\137cleanup\137api.c File Reference}{chapter.7}
\BOOKMARK [1][-]{section.7.229}{orte/mca/gpr/replica/api\137layer/gpr\137replica\137compound\137cmd\137api.c File Reference}{chapter.7}
\BOOKMARK [1][-]{section.7.230}{orte/mca/gpr/replica/api\137layer/gpr\137replica\137del\137index\137api.c File Reference}{chapter.7}
\BOOKMARK [1][-]{section.7.231}{orte/mca/gpr/replica/api\137layer/gpr\137replica\137deliver\137notify\137msg\137api.c File Reference}{chapter.7}
\BOOKMARK [1][-]{section.7.232}{orte/mca/gpr/replica/api\137layer/gpr\137replica\137dump\137api.c File Reference}{chapter.7}
\BOOKMARK [1][-]{section.7.233}{orte/mca/gpr/replica/api\137layer/gpr\137replica\137dump\137local\137trigs\137subs\137api.c File Reference}{chapter.7}
\BOOKMARK [1][-]{section.7.234}{orte/mca/gpr/replica/api\137layer/gpr\137replica\137put\137get\137api.c File Reference}{chapter.7}
\BOOKMARK [1][-]{section.7.235}{orte/mca/gpr/replica/api\137layer/gpr\137replica\137segment\137ops\137api.c File Reference}{chapter.7}
\BOOKMARK [1][-]{section.7.236}{orte/mca/gpr/replica/api\137layer/gpr\137replica\137subscribe\137api.c File Reference}{chapter.7}
\BOOKMARK [1][-]{section.7.237}{orte/mca/gpr/replica/communications/gpr\137replica\137arithmetic\137ops\137cm.c File Reference}{chapter.7}
\BOOKMARK [1][-]{section.7.238}{orte/mca/gpr/replica/communications/gpr\137replica\137cleanup\137cm.c File Reference}{chapter.7}
\BOOKMARK [1][-]{section.7.239}{orte/mca/gpr/replica/communications/gpr\137replica\137cmd\137processor.c File Reference}{chapter.7}
\BOOKMARK [1][-]{section.7.240}{orte/mca/gpr/replica/communications/gpr\137replica\137comm.h File Reference}{chapter.7}
\BOOKMARK [1][-]{section.7.241}{orte/mca/gpr/replica/communications/gpr\137replica\137compound\137cmd\137cm.c File Reference}{chapter.7}
\BOOKMARK [1][-]{section.7.242}{orte/mca/gpr/replica/communications/gpr\137replica\137del\137index\137cm.c File Reference}{chapter.7}
\BOOKMARK [1][-]{section.7.243}{orte/mca/gpr/replica/communications/gpr\137replica\137dump\137cm.c File Reference}{chapter.7}
\BOOKMARK [1][-]{section.7.244}{orte/mca/gpr/replica/communications/gpr\137replica\137put\137get\137cm.c File Reference}{chapter.7}
\BOOKMARK [1][-]{section.7.245}{orte/mca/gpr/replica/communications/gpr\137replica\137recv\137proxy\137msgs.c File Reference}{chapter.7}
\BOOKMARK [1][-]{section.7.246}{orte/mca/gpr/replica/communications/gpr\137replica\137remote\137msg.c File Reference}{chapter.7}
\BOOKMARK [1][-]{section.7.247}{orte/mca/gpr/replica/communications/gpr\137replica\137subscribe\137cm.c File Reference}{chapter.7}
\BOOKMARK [1][-]{section.7.248}{orte/mca/gpr/replica/functional\137layer/gpr\137replica\137arithmetic\137ops\137fn.c File Reference}{chapter.7}
\BOOKMARK [1][-]{section.7.249}{orte/mca/gpr/replica/functional\137layer/gpr\137replica\137cleanup\137fn.c File Reference}{chapter.7}
\BOOKMARK [1][-]{section.7.250}{orte/mca/gpr/replica/functional\137layer/gpr\137replica\137del\137index\137fn.c File Reference}{chapter.7}
\BOOKMARK [1][-]{section.7.251}{orte/mca/gpr/replica/functional\137layer/gpr\137replica\137dict\137fn.c File Reference}{chapter.7}
\BOOKMARK [1][-]{section.7.252}{orte/mca/gpr/replica/functional\137layer/gpr\137replica\137dump\137fn.c File Reference}{chapter.7}
\BOOKMARK [1][-]{section.7.253}{orte/mca/gpr/replica/functional\137layer/gpr\137replica\137fn.h File Reference}{chapter.7}
\BOOKMARK [1][-]{section.7.254}{orte/mca/gpr/replica/functional\137layer/gpr\137replica\137local\137trig\137ops\137fn.c File Reference}{chapter.7}
\BOOKMARK [1][-]{section.7.255}{orte/mca/gpr/replica/functional\137layer/gpr\137replica\137messaging\137fn.c File Reference}{chapter.7}
\BOOKMARK [1][-]{section.7.256}{orte/mca/gpr/replica/functional\137layer/gpr\137replica\137put\137get\137fn.c File Reference}{chapter.7}
\BOOKMARK [1][-]{section.7.257}{orte/mca/gpr/replica/functional\137layer/gpr\137replica\137segment\137fn.c File Reference}{chapter.7}
\BOOKMARK [1][-]{section.7.258}{orte/mca/gpr/replica/functional\137layer/gpr\137replica\137subscribe\137fn.c File Reference}{chapter.7}
\BOOKMARK [1][-]{section.7.259}{orte/mca/gpr/replica/functional\137layer/gpr\137replica\137trig\137ops\137fn.c File Reference}{chapter.7}
\BOOKMARK [1][-]{section.7.260}{orte/mca/gpr/replica/gpr\137replica.h File Reference}{chapter.7}
\BOOKMARK [1][-]{section.7.261}{orte/mca/gpr/replica/gpr\137replica\137class\137instances.h File Reference}{chapter.7}
\BOOKMARK [1][-]{section.7.262}{orte/mca/gpr/replica/gpr\137replica\137component.c File Reference}{chapter.7}
\BOOKMARK [1][-]{section.7.263}{orte/mca/gpr/replica/transition\137layer/gpr\137replica\137dict\137tl.c File Reference}{chapter.7}
\BOOKMARK [1][-]{section.7.264}{orte/mca/gpr/replica/transition\137layer/gpr\137replica\137segment\137tl.c File Reference}{chapter.7}
\BOOKMARK [1][-]{section.7.265}{orte/mca/gpr/replica/transition\137layer/gpr\137replica\137tl.h File Reference}{chapter.7}
\BOOKMARK [1][-]{section.7.266}{orte/mca/iof/iof.h File Reference}{chapter.7}
\BOOKMARK [1][-]{section.7.267}{orte/mca/iof/proxy/iof\137proxy.h File Reference}{chapter.7}
\BOOKMARK [1][-]{section.7.268}{orte/mca/iof/proxy/iof\137proxy\137svc.h File Reference}{chapter.7}
\BOOKMARK [1][-]{section.7.269}{orte/mca/iof/svc/iof\137svc.h File Reference}{chapter.7}
\BOOKMARK [1][-]{section.7.270}{orte/mca/iof/svc/iof\137svc\137proxy.h File Reference}{chapter.7}
\BOOKMARK [1][-]{section.7.271}{orte/mca/ns/base/ns\137base\137local\137fns.c File Reference}{chapter.7}
\BOOKMARK [1][-]{section.7.272}{orte/mca/ns/ns.h File Reference}{chapter.7}
\BOOKMARK [1][-]{section.7.273}{orte/mca/ns/ns\137types.h File Reference}{chapter.7}
\BOOKMARK [1][-]{section.7.274}{orte/mca/ns/proxy/src/ns\137proxy.c File Reference}{chapter.7}
\BOOKMARK [1][-]{section.7.275}{orte/mca/ns/proxy/src/ns\137proxy\137component.c File Reference}{chapter.7}
\BOOKMARK [1][-]{section.7.276}{orte/mca/ns/replica/src/ns\137replica.c File Reference}{chapter.7}
\BOOKMARK [1][-]{section.7.277}{orte/mca/ns/replica/src/ns\137replica\137component.c File Reference}{chapter.7}
\BOOKMARK [1][-]{section.7.278}{orte/mca/oob/llc/oob\137llc.h File Reference}{chapter.7}
\BOOKMARK [1][-]{section.7.279}{orte/mca/oob/llc/oob\137llc\137addr.h File Reference}{chapter.7}
\BOOKMARK [1][-]{section.7.280}{orte/mca/oob/llc/oob\137llc\137hdr.h File Reference}{chapter.7}
\BOOKMARK [1][-]{section.7.281}{orte/mca/oob/llc/oob\137llc\137msg.h File Reference}{chapter.7}
\BOOKMARK [1][-]{section.7.282}{orte/mca/oob/llc/oob\137llc\137peer.h File Reference}{chapter.7}
\BOOKMARK [1][-]{section.7.283}{orte/mca/oob/oob.h File Reference}{chapter.7}
\BOOKMARK [1][-]{section.7.284}{orte/mca/oob/oob\137types.h File Reference}{chapter.7}
\BOOKMARK [1][-]{section.7.285}{orte/mca/oob/tcp/oob\137tcp.h File Reference}{chapter.7}
\BOOKMARK [1][-]{section.7.286}{orte/mca/oob/tcp/oob\137tcp\137addr.h File Reference}{chapter.7}
\BOOKMARK [1][-]{section.7.287}{orte/mca/oob/tcp/oob\137tcp\137hdr.h File Reference}{chapter.7}
\BOOKMARK [1][-]{section.7.288}{orte/mca/oob/tcp/oob\137tcp\137msg.h File Reference}{chapter.7}
\BOOKMARK [1][-]{section.7.289}{orte/mca/oob/tcp/oob\137tcp\137peer.h File Reference}{chapter.7}
\BOOKMARK [1][-]{section.7.290}{orte/mca/pls/bproc/pls\137bproc.c File Reference}{chapter.7}
\BOOKMARK [1][-]{section.7.291}{orte/mca/pls/bproc/pls\137bproc.h File Reference}{chapter.7}
\BOOKMARK [1][-]{section.7.292}{orte/mca/pls/bproc/pls\137bproc\137component.c File Reference}{chapter.7}
\BOOKMARK [1][-]{section.7.293}{orte/mca/pls/bproc\137orted/pls\137bproc\137orted.c File Reference}{chapter.7}
\BOOKMARK [1][-]{section.7.294}{orte/mca/pls/bproc\137orted/pls\137bproc\137orted.h File Reference}{chapter.7}
\BOOKMARK [1][-]{section.7.295}{orte/mca/pls/bproc\137orted/pls\137bproc\137orted\137component.c File Reference}{chapter.7}
\BOOKMARK [1][-]{section.7.296}{orte/mca/pls/pls.h File Reference}{chapter.7}
\BOOKMARK [1][-]{section.7.297}{orte/mca/pls/rsh/pls\137rsh.h File Reference}{chapter.7}
\BOOKMARK [1][-]{section.7.298}{orte/mca/ras/base/ras\137base\137node.h File Reference}{chapter.7}
\BOOKMARK [1][-]{section.7.299}{orte/mca/ras/bjs/ras\137bjs.h File Reference}{chapter.7}
\BOOKMARK [1][-]{section.7.300}{orte/mca/ras/dash\137host/ras\137dash\137host.h File Reference}{chapter.7}
\BOOKMARK [1][-]{section.7.301}{orte/mca/ras/hostfile/ras\137hostfile.h File Reference}{chapter.7}
\BOOKMARK [1][-]{section.7.302}{orte/mca/ras/localhost/ras\137localhost.h File Reference}{chapter.7}
\BOOKMARK [1][-]{section.7.303}{orte/mca/ras/lsf\137bproc/ras\137lsf\137bproc.h File Reference}{chapter.7}
\BOOKMARK [1][-]{section.7.304}{orte/mca/ras/ras.h File Reference}{chapter.7}
\BOOKMARK [1][-]{section.7.305}{orte/mca/ras/slurm/ras\137slurm.h File Reference}{chapter.7}
\BOOKMARK [1][-]{section.7.306}{orte/mca/ras/tm/ras\137tm.h File Reference}{chapter.7}
\BOOKMARK [1][-]{section.7.307}{orte/mca/ras/xgrid/src/ras\137xgrid.h File Reference}{chapter.7}
\BOOKMARK [1][-]{section.7.308}{orte/mca/rds/base/rds\137base\137registry\137fns.c File Reference}{chapter.7}
\BOOKMARK [1][-]{section.7.309}{orte/mca/rds/hostfile/rds\137hostfile.h File Reference}{chapter.7}
\BOOKMARK [1][-]{section.7.310}{orte/mca/rds/rds.h File Reference}{chapter.7}
\BOOKMARK [1][-]{section.7.311}{orte/mca/rds/resfile/rds\137resfile.h File Reference}{chapter.7}
\BOOKMARK [1][-]{section.7.312}{orte/mca/rmaps/base/rmaps\137base\137map.h File Reference}{chapter.7}
\BOOKMARK [1][-]{section.7.313}{orte/mca/rmaps/rmaps.h File Reference}{chapter.7}
\BOOKMARK [1][-]{section.7.314}{orte/mca/rmaps/round\137robin/rmaps\137rr.h File Reference}{chapter.7}
\BOOKMARK [1][-]{section.7.315}{orte/mca/rmgr/base/rmgr\137base\137stage\137gate.c File Reference}{chapter.7}
\BOOKMARK [1][-]{section.7.316}{orte/mca/rmgr/base/rmgr\137base\137stubs.c File Reference}{chapter.7}
\BOOKMARK [1][-]{section.7.317}{orte/mca/rmgr/proxy/rmgr\137proxy.h File Reference}{chapter.7}
\BOOKMARK [1][-]{section.7.318}{orte/mca/rmgr/rmgr.h File Reference}{chapter.7}
\BOOKMARK [1][-]{section.7.319}{orte/mca/rmgr/urm/rmgr\137urm.h File Reference}{chapter.7}
\BOOKMARK [1][-]{section.7.320}{orte/mca/rml/cnos/rml\137cnos.h File Reference}{chapter.7}
\BOOKMARK [1][-]{section.7.321}{orte/mca/rml/oob/rml\137oob.h File Reference}{chapter.7}
\BOOKMARK [1][-]{section.7.322}{orte/mca/rml/rml.h File Reference}{chapter.7}
\BOOKMARK [1][-]{section.7.323}{orte/mca/rml/rml\137types.h File Reference}{chapter.7}
\BOOKMARK [1][-]{section.7.324}{orte/mca/schema/base/schema\137base\137fns.c File Reference}{chapter.7}
\BOOKMARK [1][-]{section.7.325}{orte/mca/sds/sds.h File Reference}{chapter.7}
\BOOKMARK [1][-]{section.7.326}{orte/mca/soh/base/soh\137base\137get\137job\137soh.c File Reference}{chapter.7}
\BOOKMARK [1][-]{section.7.327}{orte/mca/soh/base/soh\137base\137get\137proc\137soh.c File Reference}{chapter.7}
\BOOKMARK [1][-]{section.7.328}{orte/mca/soh/base/soh\137base\137local\137functions.c File Reference}{chapter.7}
\BOOKMARK [1][-]{section.7.329}{orte/mca/soh/base/soh\137base\137set\137job\137soh.c File Reference}{chapter.7}
\BOOKMARK [1][-]{section.7.330}{orte/mca/soh/base/soh\137base\137set\137proc\137soh.c File Reference}{chapter.7}
\BOOKMARK [1][-]{section.7.331}{orte/mca/soh/bproc/soh\137bproc.h File Reference}{chapter.7}
\BOOKMARK [1][-]{section.7.332}{orte/mca/soh/soh.h File Reference}{chapter.7}
\BOOKMARK [1][-]{section.7.333}{orte/runtime/orte\137finalize.c File Reference}{chapter.7}
\BOOKMARK [1][-]{section.7.334}{orte/runtime/orte\137init.c File Reference}{chapter.7}
\BOOKMARK [1][-]{section.7.335}{orte/runtime/orte\137init\137stage1.c File Reference}{chapter.7}
\BOOKMARK [1][-]{section.7.336}{orte/runtime/orte\137init\137stage2.c File Reference}{chapter.7}
\BOOKMARK [1][-]{section.7.337}{orte/runtime/orte\137monitor.c File Reference}{chapter.7}
\BOOKMARK [1][-]{section.7.338}{orte/runtime/orte\137restart.c File Reference}{chapter.7}
\BOOKMARK [1][-]{section.7.339}{orte/runtime/orte\137setup\137hnp.c File Reference}{chapter.7}
\BOOKMARK [1][-]{section.7.340}{orte/runtime/orte\137setup\137hnp.h File Reference}{chapter.7}
\BOOKMARK [1][-]{section.7.341}{orte/runtime/orte\137system\137finalize.c File Reference}{chapter.7}
\BOOKMARK [1][-]{section.7.342}{orte/runtime/orte\137system\137init.c File Reference}{chapter.7}
\BOOKMARK [1][-]{section.7.343}{orte/runtime/orte\137universe\137exists.c File Reference}{chapter.7}
\BOOKMARK [1][-]{section.7.344}{orte/runtime/orte\137wait.h File Reference}{chapter.7}
\BOOKMARK [1][-]{section.7.345}{orte/runtime/runtime.h File Reference}{chapter.7}
\BOOKMARK [1][-]{section.7.346}{orte/runtime/runtime\137internal.h File Reference}{chapter.7}
\BOOKMARK [1][-]{section.7.347}{orte/runtime/runtime\137types.h File Reference}{chapter.7}
\BOOKMARK [1][-]{section.7.348}{orte/util/proc\137info.h File Reference}{chapter.7}
\BOOKMARK [1][-]{section.7.349}{orte/util/session\137dir.h File Reference}{chapter.7}
\BOOKMARK [1][-]{section.7.350}{orte/util/sys\137info.h File Reference}{chapter.7}
\BOOKMARK [1][-]{section.7.351}{orte/util/univ\137info.h File Reference}{chapter.7}
\BOOKMARK [0][-]{chapter.8}{OpenMPI Page Documentation}{}
\BOOKMARK [1][-]{section.8.1}{Deprecated List}{chapter.8}
