mkdir: %_DEST%\inc%_EXT%\external
mkdir: %_DEST%\inc%_EXT%\external\jpeg

..\%__SRC%\slb\jpeglib.lib %_DEST%\lib%_EXT%\jpeglib.lib
..\%__SRC%\lib\libjpeglib.a %_DEST%\lib%_EXT%\libjpeglib.a

..\%__SRC%\inc\jerror.h %_DEST%\inc%_EXT%\external\jerror.h
..\%__SRC%\inc\jpeglib.h %_DEST%\inc%_EXT%\external\jpeglib.h
..\%__SRC%\inc\jconfig.h %_DEST%\inc%_EXT%\external\jconfig.h
..\%__SRC%\inc\jmorecfg.h %_DEST%\inc%_EXT%\external\jmorecfg.h
