mkdir: %_DEST%\xml%_EXT%\registry
mkdir: %_DEST%\xml%_EXT%\registry\schema
mkdir: %_DEST%\xml%_EXT%\registry\schema\org
mkdir: %_DEST%\xml%_EXT%\registry\schema\org\openoffice
mkdir: %_DEST%\xml%_EXT%\registry\schema\org\openoffice\Office
mkdir: %_DEST%\xml%_EXT%\registry\schema\org\openoffice\Office\UI
mkdir: %_DEST%\xml%_EXT%\registry\schema\org\openoffice\Office\DataAccess
mkdir: %_DEST%\xml%_EXT%\registry\schema\org\openoffice\Office\OOoImprovement
mkdir: %_DEST%\xml%_EXT%\registry\schema\org\openoffice\ucb
mkdir: %_DEST%\xml%_EXT%\registry\schema\org\openoffice\TypeDetection

..\%__SRC%\misc\registry\schema\org\openoffice\*.xcs %_DEST%\xml%_EXT%\registry\schema\org\openoffice
..\%__SRC%\misc\registry\schema\org\openoffice\Office\*.xcs %_DEST%\xml%_EXT%\registry\schema\org\openoffice\Office
..\%__SRC%\misc\registry\schema\org\openoffice\Office\UI\*.xcs %_DEST%\xml%_EXT%\registry\schema\org\openoffice\Office\UI
..\%__SRC%\misc\registry\schema\org\openoffice\Office\DataAccess\*.xcs %_DEST%\xml%_EXT%\registry\schema\org\openoffice\Office\DataAccess
..\%__SRC%\misc\registry\schema\org\openoffice\Office\OOoImprovement\*.xcs %_DEST%\xml%_EXT%\registry\schema\org\openoffice\Office\OOoImprovement
..\%__SRC%\misc\registry\schema\org\openoffice\ucb\*.xcs %_DEST%\xml%_EXT%\registry\schema\org\openoffice\ucb
..\%__SRC%\misc\registry\schema\org\openoffice\TypeDetection\*.xcs %_DEST%\xml%_EXT%\registry\schema\org\openoffice\TypeDetection

mkdir: %_DEST%\xml%_EXT%\registry\data
mkdir: %_DEST%\xml%_EXT%\registry\data\org
mkdir: %_DEST%\xml%_EXT%\registry\data\org\openoffice
mkdir: %_DEST%\xml%_EXT%\registry\data\org\openoffice\Office
mkdir: %_DEST%\xml%_EXT%\registry\data\org\openoffice\Office\UI
mkdir: %_DEST%\xml%_EXT%\registry\data\org\openoffice\Office\DataAccess
mkdir: %_DEST%\xml%_EXT%\registry\data\org\openoffice\Office\OOoImprovement
mkdir: %_DEST%\xml%_EXT%\registry\data\org\openoffice\ucb
mkdir: %_DEST%\xml%_EXT%\registry\data\org\openoffice\TypeDetection

..\registry\schema\oo-ldap-attr.map %_DEST%\xml%_EXT%\registry\schema\oo-ldap-attr.map
..\registry\schema\oo-ad-ldap-attr.map %_DEST%\xml%_EXT%\registry\schema\oo-ad-ldap-attr.map

..\%__SRC%\misc\registry\data\org\openoffice\*.xcu.sample %_DEST%\xml%_EXT%\registry\data\org\openoffice\*.xcu.sample

..\%__SRC%\misc\registry\data\org\openoffice\*.xcu %_DEST%\xml%_EXT%\registry\data\org\openoffice
..\%__SRC%\misc\registry\data\org\openoffice\Office\*.xcu %_DEST%\xml%_EXT%\registry\data\org\openoffice\Office
..\%__SRC%\misc\registry\data\org\openoffice\Office\UI\*.xcu %_DEST%\xml%_EXT%\registry\data\org\openoffice\Office\UI
..\%__SRC%\misc\registry\data\org\openoffice\Office\DataAccess\*.xcu %_DEST%\xml%_EXT%\registry\data\org\openoffice\Office\DataAccess
..\%__SRC%\misc\registry\data\org\openoffice\ucb\*.xcu %_DEST%\xml%_EXT%\registry\data\org\openoffice\ucb
..\%__SRC%\misc\registry\data\org\openoffice\TypeDetection\*.xcu %_DEST%\xml%_EXT%\registry\data\org\openoffice\TypeDetection

mkdir: %_DEST%\xml%_EXT%\registry\spool
mkdir: %_DEST%\xml%_EXT%\registry\spool\org
mkdir: %_DEST%\xml%_EXT%\registry\spool\org\openoffice
mkdir: %_DEST%\xml%_EXT%\registry\spool\org\openoffice\Office
mkdir: %_DEST%\xml%_EXT%\registry\spool\org\openoffice\Office\UI
mkdir: %_DEST%\xml%_EXT%\registry\spool\org\openoffice\ucb
mkdir: %_DEST%\xml%_EXT%\registry\spool\org\openoffice\TypeDetection

..\%__SRC%\misc\registry\spool\*.xcu %_DEST%\xml%_EXT%\registry\spool
..\%__SRC%\misc\registry\spool\org\openoffice\*.xcu %_DEST%\xml%_EXT%\registry\spool\org\openoffice
..\%__SRC%\misc\registry\spool\org\openoffice\Office\*.xcu %_DEST%\xml%_EXT%\registry\spool\org\openoffice\Office
..\%__SRC%\misc\registry\spool\org\openoffice\Office\UI\*.xcu %_DEST%\xml%_EXT%\registry\spool\org\openoffice\Office\UI
..\%__SRC%\misc\registry\spool\org\openoffice\ucb\*.xcu %_DEST%\xml%_EXT%\registry\spool\org\openoffice\ucb
..\%__SRC%\misc\registry\spool\org\openoffice\TypeDetection\*.xcu %_DEST%\xml%_EXT%\registry\spool\org\openoffice\TypeDetection

mkdir: %_DEST%\pck%_EXT%

..\%__SRC%\misc\*.properties %_DEST%\pck%_EXT%
..\%__SRC%\misc\*.ldif %_DEST%\pck%_EXT%
..\%__SRC%\misc\*.ldf %_DEST%\pck%_EXT%
..\%__SRC%\misc\*.conf %_DEST%\pck%_EXT%
..\%__SRC%\misc\*.map %_DEST%\pck%_EXT%

..\%__SRC%\bin\*.zip %_DEST%\pck%_EXT%

mkdir: %_DEST%\xml%_EXT%\processing

..\util\*.xsl %_DEST%\xml%_EXT%\processing
..\registry\*.dtd %_DEST%\xml%_EXT%\registry

