mkdir: %COMMON_DEST%\bin%_EXT%\hid
..\%COMMON_OUTDIR%\misc\*.hid %COMMON_DEST%\bin%_EXT%\hid\*.hid
..\%__SRC%\bin\*.dll %_DEST%\bin%_EXT%\*.dll
..\%__SRC%\class\*.jar %_DEST%\bin%_EXT%\*.jar
..\%__SRC%\lib\lib*.so %_DEST%\lib%_EXT%
..\%__SRC%\lib\*.dylib %_DEST%\lib%_EXT%\*.dylib
..\%__SRC%\lib\*.sl %_DEST%\lib%_EXT%\*.sl
..\%__SRC%\bin\*.bin %_DEST%\bin%_EXT%\*.bin
..\%__SRC%\bin\*.res %_DEST%\bin%_EXT%\*.res
