jv   jvmaccess\workbench\java                           nmake - all jv_workbench_java NULL
jv   jvmaccess\workbench                                nmake - all jv_workbench jv_util NULL
#does not work: jv   jvmaccess\workbench\javainfo                       nmake - all jv_workbench_javainfo NULL
