********** ~File
~New
~Open...
Recent Doc~uments

~Wizards

~Close
~Save
Save ~As...
Sa~ve All

Re~load
V~ersions...

Expor~t...
Export as P~DF...
Sen~d

Propert~ies...
Digital Signatu~res...
~Templates

~Print...
P~rinter Settings...

E~xit
********** ~Edit
Can't ~Undo
Can't ~Restore

Cu~t
~Copy
~Paste
Paste ~Special...
Select ~All

~Find & Replace...
~Navigator

Duplicat~e...

Poi~nts
~Glue Points

Cross-fa~ding...
F~ields...
D~elete Slide

Lin~ks...
P~lug-in
I~mageMap
~Object
H~yperlink...
********** ~View
~Normal
~Master

~Color/Grayscale

~Page Pane
~Toolbars
Status ~Bar
Input M~ethod Status
~Ruler
Gr~id
~Guides

~Zoom...
********** ~Insert
Slid~e
D~uplicate Slide
~Layer...
~Insert Snap Point/Line...
Fiel~ds
S~pecial Character...
Formatting ~Mark
~Hyperlink

Pict~ure
Mo~vie and Sound
~Object
Sp~readsheet
~Chart...
Float~ing Frame

~File...
********** F~ormat
~Default Formatting

C~haracter...
P~aragraph...
~Bullets and Numbering...
~Page...

~Change Case

Position and Si~ze...
L~ine...
A~rea...
Te~xt...

~Layer...
St~yles and Formatting
********** ~Tools
~Spellcheck...
~Language

~AutoCorrect...

~Gallery
~Eyedropper
Media Pla~yer

~Macros
~Extension Manager...
~XML Filter Settings...
~Customize...
~Options...
********** ~Modify
~Rotate
~Flip
~Convert

~Arrange
Alignmen~t
~Distribution...

~Name Object...

~Group
~Ungroup
~Enter Group
E~xit group

Comb~ine
~Split
~Shapes

C~onnect
~Break
********** ~Window
~New Window
~Close Window

~Untitled1 - StarOffice Writer
Untitled2 - ~StarOffice Draw
********** ~Help
StarOffice ~Help
What's ~This?

~Support
~Registration...

Check for ~Updates...

A~bout StarOffice
