mkdir: %COMMON_DEST%\bin%_EXT%\hid
mkdir: %_DEST%\bin%_EXT%\so
mkdir: %_DEST%\bin%_EXT%\c01
mkdir: %_DEST%\bin%_EXT%\c05
mkdir: %_DEST%\bin%_EXT%\c08
mkdir: %_DEST%\bin%_EXT%\odf4ms

..\%COMMON_OUTDIR%\misc\*.hid %COMMON_DEST%\bin%_EXT%\hid\*.hid
..\%__SRC%\bin\soffice.bin %_DEST%\bin%_EXT%\soffice.bin
..\%__SRC%\bin\officeloader.exe %_DEST%\bin%_EXT%\soffice.exe
..\%__SRC%\bin\soffice %_DEST%\bin%_EXT%\soffice.bin
..\%__SRC%\bin\soffice_mac %_DEST%\bin%_EXT%\soffice
..\%__SRC%\bin\oosplash %_DEST%\bin%_EXT%\oosplash.bin
..\%__SRC%\bin\so\soffice.bin %_DEST%\bin%_EXT%\so\soffice.bin
..\%__SRC%\bin\so\officeloader.exe %_DEST%\bin%_EXT%\so\soffice.exe
..\%__SRC%\bin\so\soffice %_DEST%\bin%_EXT%\so\soffice.bin
..\%__SRC%\bin\so\soffice_mac %_DEST%\bin%_EXT%\so\soffice
..\%__SRC%\bin\sofficea*.dll %_DEST%\bin%_EXT%\sofficea*.dll
..\%__SRC%\lib\isofficeapp.lib %_DEST%\lib%_EXT%\isofficeapp.lib
..\%__SRC%\lib\libsofficeapp.dylib %_DEST%\lib%_EXT%\libsofficeapp.dylib
..\%__SRC%\lib\libsofficeapp.so %_DEST%\lib%_EXT%\libsofficeapp.so

..\%__SRC%\bin\soffice_oo.exe %_DEST%\bin%_EXT%\soffice_oo.exe
..\%__SRC%\bin\soffice_oo %_DEST%\bin%_EXT%\soffice_oo.bin
..\%__SRC%\bin\so\soffice_so.exe %_DEST%\bin%_EXT%\so\soffice_so.exe
..\%__SRC%\bin\so\soffice_so %_DEST%\bin%_EXT%\so\soffice_so.bin

..\%__SRC%\bin\scalc.exe %_DEST%\bin%_EXT%\scalc.exe
..\%__SRC%\bin\sdraw.exe %_DEST%\bin%_EXT%\sdraw.exe
..\%__SRC%\bin\simpress.exe %_DEST%\bin%_EXT%\simpress.exe
..\%__SRC%\bin\smath.exe %_DEST%\bin%_EXT%\smath.exe
..\%__SRC%\bin\swriter.exe %_DEST%\bin%_EXT%\swriter.exe
..\%__SRC%\bin\sbase.exe %_DEST%\bin%_EXT%\sbase.exe
..\%__SRC%\bin\sweb.exe %_DEST%\bin%_EXT%\sweb.exe
..\%__SRC%\bin\quickstart.exe %_DEST%\bin%_EXT%\quickstart.exe
..\%__SRC%\bin\so\scalc.exe %_DEST%\bin%_EXT%\so\scalc.exe
..\%__SRC%\bin\so\sdraw.exe %_DEST%\bin%_EXT%\so\sdraw.exe
..\%__SRC%\bin\so\simpress.exe %_DEST%\bin%_EXT%\so\simpress.exe
..\%__SRC%\bin\so\smath.exe %_DEST%\bin%_EXT%\so\smath.exe
..\%__SRC%\bin\so\swriter.exe %_DEST%\bin%_EXT%\so\swriter.exe
..\%__SRC%\bin\so\sbase.exe %_DEST%\bin%_EXT%\so\sbase.exe
..\%__SRC%\bin\so\sweb.exe %_DEST%\bin%_EXT%\so\sweb.exe

..\%__SRC%\misc\soffice.exe.manifest %_DEST%\bin%_EXT%\soffice.exe.manifest
..\%__SRC%\misc\soffice.bin.manifest %_DEST%\bin%_EXT%\soffice.bin.manifest
..\%__SRC%\bin\wrp*.dll %_DEST%\bin%_EXT%\wrp*.dll
..\%__SRC%\bin\spl*.dll %_DEST%\bin%_EXT%\spl*.dll
..\%__SRC%\bin\socomp.dll %_DEST%\bin%_EXT%\socomp.dll
..\%__SRC%\obj\officeloader.obj %_DEST%\lib%_EXT%\officeloader.obj
..\%__SRC%\obj\extendloaderenvironment.obj %_DEST%\lib%_EXT%\extendloaderenvironment.obj
..\%__SRC%\obj\copyright_ascii_sun.obj %_DEST%\lib%_EXT%\copyright_ascii_sun.obj
..\%__SRC%\obj\main.obj %_DEST%\lib%_EXT%\main.obj
..\%__SRC%\lib\libwrp*.so %_DEST%\lib%_EXT%\libwrp*.so
..\%__SRC%\lib\libwrp*.dylib %_DEST%\lib%_EXT%\libwrp*.dylib
..\%__SRC%\lib\libspl*.so %_DEST%\lib%_EXT%\libspl*.so
..\%__SRC%\lib\libspl*.dylib %_DEST%\lib%_EXT%\libspl*.dylib
..\%__SRC%\lib\libsocomp.so %_DEST%\lib%_EXT%\libsocomp.so
..\%__SRC%\lib\libsocomp.dylib %_DEST%\lib%_EXT%\libsocomp.dylib
..\%__SRC%\bin\offacc*.dll %_DEST%\bin%_EXT%\offacc*.dll
..\%__SRC%\lib\liboffacc*.so %_DEST%\lib%_EXT%\liboffacc*.so
..\%__SRC%\lib\liboffacc*.dylib %_DEST%\lib%_EXT%\liboffacc*.dylib
..\%__SRC%\bin\migratio*.dll %_DEST%\bin%_EXT%\migratio*.dll
..\%__SRC%\lib\migrationoo2.uno.so %_DEST%\lib%_EXT%\migrationoo2.uno.so
..\%__SRC%\lib\migrationoo2.uno.dylib %_DEST%\lib%_EXT%\migrationoo2.uno.dylib

..\%__SRC%\bin\sweb %_DEST%\bin%_EXT%\sweb.bin

..\%__SRC%\bin\loader2.ex? %_DEST%\bin%_EXT%\loader2.ex?

..\%__SRC%\bin\depl*.dll %_DEST%\bin%_EXT%\depl*.dll
..\%__SRC%\lib\deployment*.uno.so %_DEST%\lib%_EXT%\deployment*.uno.so
..\%__SRC%\lib\deployment*.uno.dylib %_DEST%\lib%_EXT%\deployment*.uno.dylib
..\%__SRC%\bin\deploymentmisc*.dll %_DEST%\bin%_EXT%\deploymentmisc*.dll
..\%__SRC%\lib\libdeploymentmisc*.so %_DEST%\lib%_EXT%\libdeploymentmisc*.so
..\%__SRC%\lib\libdeploymentmisc*.dylib %_DEST%\lib%_EXT%\libdeploymentmisc*.dylib
..\%__SRC%\bin\guiloader.exe %_DEST%\bin%_EXT%\unopkg.exe
..\%__SRC%\bin\so\guiloader.exe %_DEST%\bin%_EXT%\so\unopkg.exe
..\%__SRC%\bin\unopkg %_DEST%\bin%_EXT%\unopkg.bin
..\%__SRC%\bin\so\unopkg %_DEST%\bin%_EXT%\so\unopkg.bin
..\%__SRC%\bin\unopkg.exe %_DEST%\bin%_EXT%\unopkg.bin
..\%__SRC%\bin\so\unopkg.exe %_DEST%\bin%_EXT%\so\unopkg.bin
..\%__SRC%\misc\unopkg.sh %_DEST%\bin%_EXT%\unopkg
..\%__SRC%\bin\unopkga*.dll %_DEST%\bin%_EXT%\unopkga*.dll
..\%__SRC%\lib\libunopkgapp.dylib %_DEST%\lib%_EXT%\libunopkgapp.dylib
..\%__SRC%\lib\libunopkgapp.so %_DEST%\lib%_EXT%\libunopkgapp.so
..\%__SRC%\bin\rebasegui.exe %_DEST%\bin%_EXT%\rebasegui.exe
..\%__SRC%\bin\rebaseoo.exe %_DEST%\bin%_EXT%\rebaseoo.exe

..\%__SRC%\bin\pagein %_DEST%\bin%_EXT%\pagein
..\%__SRC%\misc\pagein-* %_DEST%\bin%_EXT%\pagein-*

..\%__SRC%\bin\unoinfo.exe %_DEST%\bin%_EXT%\unoinfo.exe
..\%__SRC%\misc\unoinfo.sh %_DEST%\bin%_EXT%\unoinfo

..\%__SRC%\bin\*.res %_DEST%\bin%_EXT%\*.res

..\%__SRC%\misc\soffice.sh %_DEST%\bin%_EXT%\soffice
..\%__SRC%\misc\sbase.sh %_DEST%\bin%_EXT%\sbase
..\%__SRC%\misc\scalc.sh %_DEST%\bin%_EXT%\scalc
..\%__SRC%\misc\sdraw.sh %_DEST%\bin%_EXT%\sdraw
..\%__SRC%\misc\simpress.sh %_DEST%\bin%_EXT%\simpress
..\%__SRC%\misc\smaster.sh %_DEST%\bin%_EXT%\smaster
..\%__SRC%\misc\smath.sh %_DEST%\bin%_EXT%\smath
..\%__SRC%\misc\sweb.sh %_DEST%\bin%_EXT%\sweb
..\%__SRC%\misc\swriter.sh %_DEST%\bin%_EXT%\swriter
..\%__SRC%\misc\nswrapper.sh %_DEST%\bin%_EXT%\nswrapper
..\%__SRC%\misc\mozwrapper.sh %_DEST%\bin%_EXT%\mozwrapper

mkdir: %COMMON_DEST%\pck%_EXT%\openoffice_dev
mkdir: %COMMON_DEST%\pck%_EXT%\openoffice_dev_nologo
mkdir: %COMMON_DEST%\pck%_EXT%\openoffice_nologo
mkdir: %COMMON_DEST%\pck%_EXT%\broffice_dev
mkdir: %COMMON_DEST%\pck%_EXT%\broffice
mkdir: %COMMON_DEST%\pck%_EXT%\broffice_dev_nologo
mkdir: %COMMON_DEST%\pck%_EXT%\broffice_nologo
..\%__SRC%\bin\intro\intro.zip %COMMON_DEST%\pck%_EXT%\intro.zip
..\%__SRC%\bin\dev\intro.zip %COMMON_DEST%\pck%_EXT%\openoffice_dev\intro.zip
..\%__SRC%\bin\dev_nologo\intro.zip %COMMON_DEST%\pck%_EXT%\openoffice_dev_nologo\intro.zip
..\%__SRC%\bin\nologo\intro.zip %COMMON_DEST%\pck%_EXT%\openoffice_nologo\intro.zip
..\%__SRC%\bin\dev_broffice\intro.zip %COMMON_DEST%\pck%_EXT%\broffice_dev\intro.zip
..\%__SRC%\bin\broffice\intro.zip %COMMON_DEST%\pck%_EXT%\broffice\intro.zip
..\%__SRC%\bin\nologo_dev_broffice\intro.zip %COMMON_DEST%\pck%_EXT%\broffice_dev_nologo\intro.zip
..\%__SRC%\bin\nologo_broffice\intro.zip %COMMON_DEST%\pck%_EXT%\broffice_nologo\intro.zip

..\%__SRC%\bin\guiloader.exe %_DEST%\bin%_EXT%\testtool.exe

..\%__SRC%\bin\guistdio.exe %_DEST%\bin%_EXT%\guistdio.com
..\%__SRC%\bin\guistdio.exe %_DEST%\bin%_EXT%\crashrep.com
..\%__SRC%\bin\unopkgio.exe %_DEST%\bin%_EXT%\unopkg.com

..\scripts\ure-link %_DEST%\bin%_EXT%\ure-link
..\scripts\basis-link %_DEST%\bin%_EXT%\basis-link
..\scripts\basis-link %_DEST%\bin%_EXT%\c01\basis-link
..\scripts\basis-link %_DEST%\bin%_EXT%\c05\basis-link
..\scripts\basis-link %_DEST%\bin%_EXT%\c08\basis-link
..\scripts\so-basis-link %_DEST%\bin%_EXT%\so\basis-link
..\scripts\odf-basis-link %_DEST%\bin%_EXT%\odf4ms\basis-link

mkdir: %_DEST%\xml%_EXT%\registry\spool
mkdir: %_DEST%\xml%_EXT%\registry\spool\org
mkdir: %_DEST%\xml%_EXT%\registry\spool\org\openoffice
mkdir: %_DEST%\xml%_EXT%\registry\spool\org\openoffice\Office
mkdir: %_DEST%\xml%_EXT%\registry\spool\org\openoffice\Office\Jobs

..\%__SRC%\class\*.jar %_DEST%\bin%_EXT%\*.jar
..\%__SRC%\misc\registry\spool\org\openoffice\Office\Jobs\*.xcu %_DEST%\xml%_EXT%\registry\spool\org\openoffice\Office\Jobs
