cu   cppu\qa                                            nmake - all cu_qa NULL

# older tests:
cu   cppu\test\AffineBridge                             nmake - all cu_test_AffineBridge cu_util NULL
#depends on cppuhelper: cu   cppu\test                                          nmake - all cu_test cu_util NULL
cu   cppu\test\AntiEnvGuard                             nmake - all cu_test_AntiEnvGuard cu_util NULL
cu   cppu\test\EnvDcp                                   nmake - all cu_test_EnvDcp cu_util NULL
cu   cppu\test\EnvGuard                                 nmake - all cu_test_EnvGuard cu_util NULL
cu   cppu\test\EnvStack                                 nmake - all cu_test_EnvStack cu_util NULL
cu   cppu\test\EnvStack_tester                          nmake - all cu_test_EnvStack_tester cu_util cu_util NULL
#depends on cppuhelper: cu   cppu\test\FreeReference                            nmake - all cu_test_FreeReference cu_test_ObjectFactory cu_util NULL
#depends on cppuhelper: cu   cppu\test\Map                                      nmake - all cu_test_Map cu_util NULL
#depends on cppuhelper: cu   cppu\test\ObjectFactory                            nmake - all cu_test_ObjectFactory cu_util NULL
#depends on cppuhelper: cu   cppu\test\Shield                                   nmake - all cu_test_Shield cu_util NULL
cu   cppu\test\UnsafeBridge                             nmake - all cu_test_UnsafeBridge cu_util NULL
#depends on cppuhelper: cu   cppu\test\alignment                                nmake - all cu_test_alignment cu_util NULL
#depends on cppuhelper: cu   cppu\test\cascade_mapping                          nmake - all cu_test_cascade_mapping cu_util NULL
cu   cppu\test\env_substs                               nmake - all cu_test_env_substs cu_util NULL
#depends on cppuhelper: cu   cppu\test\env_tester                               nmake - all cu_test_env_tester cu_util NULL
#depends on cppuhelper: cu   cppu\test\mapping_tester                           nmake - all cu_test_mapping_tester cu_util NULL
cu   cppu\test\purpenvhelper                            nmake - all cu_test_purpenvhelper cu_util NULL
cu   cppu\test\purpose_envs                             nmake - all cu_test_purpose_envs cu_util NULL
