fm	forms	:    l10n svx sfx2 ucb configmgr fileaccess QADEVOOO:qadevOOo NULL
fm  forms                                   usr1    -   all fm_mkofrm NULL
fm	forms\inc								nmake	-	all	fm_inc NULL
fm	forms\source\inc						get		-	all	fm_sinc NULL
fm	forms\source\component					nmake	-	all	fm_component fm_inc NULL
fm  forms\source\solar\component            nmake   -   all fm_solar_component fm_inc NULL
fm  forms\source\solar\control              nmake   -   all fm_solar_control fm_inc NULL
fm  forms\source\helper                     nmake   -   all fm_helper fm_inc NULL
fm	forms\source\misc						nmake	-	all	fm_misc fm_inc NULL
fm	forms\source\xforms\submission			nmake	-	all	fm_xforms_submit fm_inc NULL
fm	forms\source\xforms\xpathlib			nmake	-	all	fm_xforms_xpathlib fm_inc NULL
fm	forms\source\xforms	    				nmake	-	all	fm_xforms fm_xforms_submit fm_xforms_xpathlib fm_inc NULL
fm	forms\source\resource					nmake	-	all	fm_resource fm_inc NULL
fm  forms\source\richtext                   nmake   -   all fm_richtext fm_inc NULL
fm  forms\source\runtime                    nmake   -   all frm_runtime NULL
fm  forms\util                              nmake   -   all fm_util fm_component fm_solar_component fm_solar_control fm_helper fm_misc fm_resource fm_richtext frm_runtime fm_xforms NULL
