#does not build: tc   scripting\workben                                  nmake - all tc_workben tc1_scriptingutil NULL
#does not build: tc   scripting\workben\ifc\scripting                    nmake - all tc_workben_ifc_scripting tc1_scriptingutil NULL
#does not build: tc   scripting\workben\mod\_scripting                   nmake - all tc_workben_mod__scripting tc1_scriptingutil NULL
