#does not build: ti   toolkit\qa\complex\toolkit\interface_tests         nmake - all ti_qa_complex_toolkit_interface_tests NULL
#does not build: ti   toolkit\qa\complex\toolkit                         nmake - all ti_qa_complex_toolkit NULL
#does not build: ti   toolkit\qa\unoapi                                  nmake - all ti_qa_unoapi NULL

# older tests:
ti   toolkit\test\accessibility\ov                      nmake - all ti_test_accessibility_ov ti_util NULL
ti   toolkit\test\accessibility                         nmake - all ti_test_accessibility ti_util NULL
ti   toolkit\test\accessibility\tools                   nmake - all ti_test_accessibility_tools ti_util NULL
#depends on svtools: ti   toolkit\workben                                    nmake - all ti_workben ti_util NULL
