/*************************************************************************
 *
 * DO NOT ALTER OR REMOVE COPYRIGHT NOTICES OR THIS FILE HEADER.
 * 
 * Copyright 2008 by Sun Microsystems, Inc.
 *
 * OpenOffice.org - a multi-platform office productivity suite
 *
 * $RCSfile: convertbig5hkscs.tab,v $
 * $Revision: 1.6 $
 *
 * This file is part of OpenOffice.org.
 *
 * OpenOffice.org is free software: you can redistribute it and/or modify
 * it under the terms of the GNU Lesser General Public License version 3
 * only, as published by the Free Software Foundation.
 *
 * OpenOffice.org is distributed in the hope that it will be useful,
 * but WITHOUT ANY WARRANTY; without even the implied warranty of
 * MERCHANTABILITY or FITNESS FOR A PARTICULAR PURPOSE.  See the
 * GNU Lesser General Public License version 3 for more details
 * (a copy is included in the LICENSE file that accompanied this code).
 *
 * You should have received a copy of the GNU Lesser General Public License
 * version 3 along with OpenOffice.org.  If not, see
 * <http://www.openoffice.org/license.html>
 * for a copy of the LGPLv3 License.
 *
 ************************************************************************/

#ifndef INCLUDED_RTL_TEXTENC_CONTEXT_H
#include "context.h"
#endif
#ifndef INCLUDED_RTL_TEXTENC_CONVERTBIG5HKSCS_H
#include "convertbig5hkscs.h"
#endif

#ifndef _RTL_TENCINFO_H
#include "rtl/tencinfo.h"
#endif
#ifndef _RTL_TEXTENC_H
#include "rtl/textenc.h"
#endif

#include "generate/big5hkscs2001.tab"

static ImplBig5HkscsConverterData const aImplBig5HkscsConvertData
    = { aImplBig5Hkscs2001ToUnicodeData,
        aImplBig5Hkscs2001ToUnicodeRowOffsets,
        aBIG5UniLeadTab, /* from tcvttcn6.tab */
        aImplUnicodeToBig5Hkscs2001Data,
        aImplUnicodeToBig5Hkscs2001PageOffsets,
        aImplUnicodeToBig5Hkscs2001PlaneOffsets,
        aBIG5DBCSHighTab, /* from tcvttcn6.tab */
        aImplMS950DBCSEUDCTab, /* from tcvttcn6.tab */
        DBCS_EUDC_MS950_COUNT }; /* from tcvttcn6.tab */

static ImplTextEncodingData const aImplBig5HkscsTextEncodingData
    = { { &aImplBig5HkscsConvertData,
          &ImplConvertBig5HkscsToUnicode,
          &ImplConvertUnicodeToBig5Hkscs,
          &ImplCreateBig5HkscsToUnicodeContext,
          &ImplDestroyContext,
          &ImplResetBig5HkscsToUnicodeContext,
          &ImplCreateUnicodeToTextContext,
          &ImplDestroyContext,
          &ImplResetUnicodeToTextContext },
        1,
        2,
        2,
        136,
        "euc-tw",
        "Big5-HKSCS",
        RTL_TEXTENCODING_INFO_MULTIBYTE | RTL_TEXTENCODING_INFO_MIME };
    /* SCRIPT_CHINESE_TRADITIONAL */
