..\%__SRC%\lib\idrawinglayer.lib %_DEST%\lib%_EXT%\idrawinglayer.lib
..\%__SRC%\bin\drawingl*.dll %_DEST%\bin%_EXT%\drawingl*.dll
..\%__SRC%\lib\libdrawinglayer?????.* %_DEST%\lib%_EXT%\libdrawinglayer?????.*
..\%__SRC%\lib\*.a %_DEST%\lib%_EXT%\*.a
..\%__SRC%\lib\*.dylib %_DEST%\lib%_EXT%\*.dylib

mkdir: %_DEST%\inc%_EXT%\drawinglayer

mkdir: %_DEST%\inc%_EXT%\drawinglayer\primitive2d
..\inc\drawinglayer\primitive2d\drawinglayer_primitivetypes2d.hxx %_DEST%\inc%_EXT%\drawinglayer\primitive2d\drawinglayer_primitivetypes2d.hxx
..\inc\drawinglayer\primitive2d\alphaprimitive2d.hxx %_DEST%\inc%_EXT%\drawinglayer\primitive2d\alphaprimitive2d.hxx
..\inc\drawinglayer\primitive2d\animatedprimitive2d.hxx %_DEST%\inc%_EXT%\drawinglayer\primitive2d\animatedprimitive2d.hxx
..\inc\drawinglayer\primitive2d\backgroundcolorprimitive2d.hxx %_DEST%\inc%_EXT%\drawinglayer\primitive2d\backgroundcolorprimitive2d.hxx
..\inc\drawinglayer\primitive2d\baseprimitive2d.hxx %_DEST%\inc%_EXT%\drawinglayer\primitive2d\baseprimitive2d.hxx
..\inc\drawinglayer\primitive2d\bitmapprimitive2d.hxx %_DEST%\inc%_EXT%\drawinglayer\primitive2d\bitmapprimitive2d.hxx
..\inc\drawinglayer\primitive2d\borderlineprimitive2d.hxx %_DEST%\inc%_EXT%\drawinglayer\primitive2d\borderlineprimitive2d.hxx
..\inc\drawinglayer\primitive2d\chartprimitive2d.hxx %_DEST%\inc%_EXT%\drawinglayer\primitive2d\chartprimitive2d.hxx
..\inc\drawinglayer\primitive2d\controlprimitive2d.hxx %_DEST%\inc%_EXT%\drawinglayer\primitive2d\controlprimitive2d.hxx
..\inc\drawinglayer\primitive2d\embedded3dprimitive2d.hxx %_DEST%\inc%_EXT%\drawinglayer\primitive2d\embedded3dprimitive2d.hxx
..\inc\drawinglayer\primitive2d\fillbitmapprimitive2d.hxx %_DEST%\inc%_EXT%\drawinglayer\primitive2d\fillbitmapprimitive2d.hxx
..\inc\drawinglayer\primitive2d\fillgradientprimitive2d.hxx %_DEST%\inc%_EXT%\drawinglayer\primitive2d\fillgradientprimitive2d.hxx
..\inc\drawinglayer\primitive2d\fillhatchprimitive2d.hxx %_DEST%\inc%_EXT%\drawinglayer\primitive2d\fillhatchprimitive2d.hxx
..\inc\drawinglayer\primitive2d\graphicprimitive2d.hxx %_DEST%\inc%_EXT%\drawinglayer\primitive2d\graphicprimitive2d.hxx
..\inc\drawinglayer\primitive2d\gridprimitive2d.hxx %_DEST%\inc%_EXT%\drawinglayer\primitive2d\gridprimitive2d.hxx
..\inc\drawinglayer\primitive2d\groupprimitive2d.hxx %_DEST%\inc%_EXT%\drawinglayer\primitive2d\groupprimitive2d.hxx
..\inc\drawinglayer\primitive2d\helplineprimitive2d.hxx %_DEST%\inc%_EXT%\drawinglayer\primitive2d\helplineprimitive2d.hxx
..\inc\drawinglayer\primitive2d\hittestprimitive2d.hxx %_DEST%\inc%_EXT%\drawinglayer\primitive2d\hittestprimitive2d.hxx
..\inc\drawinglayer\primitive2d\invertprimitive2d.hxx %_DEST%\inc%_EXT%\drawinglayer\primitive2d\invertprimitive2d.hxx
..\inc\drawinglayer\primitive2d\markerarrayprimitive2d.hxx %_DEST%\inc%_EXT%\drawinglayer\primitive2d\markerarrayprimitive2d.hxx
..\inc\drawinglayer\primitive2d\maskprimitive2d.hxx %_DEST%\inc%_EXT%\drawinglayer\primitive2d\maskprimitive2d.hxx
..\inc\drawinglayer\primitive2d\mediaprimitive2d.hxx %_DEST%\inc%_EXT%\drawinglayer\primitive2d\mediaprimitive2d.hxx
..\inc\drawinglayer\primitive2d\metafileprimitive2d.hxx %_DEST%\inc%_EXT%\drawinglayer\primitive2d\metafileprimitive2d.hxx
..\inc\drawinglayer\primitive2d\modifiedcolorprimitive2d.hxx %_DEST%\inc%_EXT%\drawinglayer\primitive2d\modifiedcolorprimitive2d.hxx
..\inc\drawinglayer\primitive2d\pagepreviewprimitive2d.hxx %_DEST%\inc%_EXT%\drawinglayer\primitive2d\pagepreviewprimitive2d.hxx
..\inc\drawinglayer\primitive2d\pointarrayprimitive2d.hxx %_DEST%\inc%_EXT%\drawinglayer\primitive2d\pointarrayprimitive2d.hxx
..\inc\drawinglayer\primitive2d\polygonprimitive2d.hxx %_DEST%\inc%_EXT%\drawinglayer\primitive2d\polygonprimitive2d.hxx
..\inc\drawinglayer\primitive2d\polypolygonprimitive2d.hxx %_DEST%\inc%_EXT%\drawinglayer\primitive2d\polypolygonprimitive2d.hxx
..\inc\drawinglayer\primitive2d\primitivetools2d.hxx %_DEST%\inc%_EXT%\drawinglayer\primitive2d\primitivetools2d.hxx
..\inc\drawinglayer\primitive2d\sceneprimitive2d.hxx %_DEST%\inc%_EXT%\drawinglayer\primitive2d\sceneprimitive2d.hxx
..\inc\drawinglayer\primitive2d\shadowprimitive2d.hxx %_DEST%\inc%_EXT%\drawinglayer\primitive2d\shadowprimitive2d.hxx
..\inc\drawinglayer\primitive2d\structuretagprimitive2d.hxx %_DEST%\inc%_EXT%\drawinglayer\primitive2d\structuretagprimitive2d.hxx
..\inc\drawinglayer\primitive2d\texteffectprimitive2d.hxx %_DEST%\inc%_EXT%\drawinglayer\primitive2d\texteffectprimitive2d.hxx
..\inc\drawinglayer\primitive2d\textlayoutdevice.hxx %_DEST%\inc%_EXT%\drawinglayer\primitive2d\textlayoutdevice.hxx
..\inc\drawinglayer\primitive2d\textprimitive2d.hxx %_DEST%\inc%_EXT%\drawinglayer\primitive2d\textprimitive2d.hxx
..\inc\drawinglayer\primitive2d\textdecoratedprimitive2d.hxx %_DEST%\inc%_EXT%\drawinglayer\primitive2d\textdecoratedprimitive2d.hxx
..\inc\drawinglayer\primitive2d\texthierarchyprimitive2d.hxx %_DEST%\inc%_EXT%\drawinglayer\primitive2d\texthierarchyprimitive2d.hxx
..\inc\drawinglayer\primitive2d\transformprimitive2d.hxx %_DEST%\inc%_EXT%\drawinglayer\primitive2d\transformprimitive2d.hxx
..\inc\drawinglayer\primitive2d\unifiedalphaprimitive2d.hxx %_DEST%\inc%_EXT%\drawinglayer\primitive2d\unifiedalphaprimitive2d.hxx
..\inc\drawinglayer\primitive2d\wrongspellprimitive2d.hxx %_DEST%\inc%_EXT%\drawinglayer\primitive2d\wrongspellprimitive2d.hxx

mkdir: %_DEST%\inc%_EXT%\drawinglayer\primitive3d
..\inc\drawinglayer\primitive3d\drawinglayer_primitivetypes3d.hxx %_DEST%\inc%_EXT%\drawinglayer\primitive3d\drawinglayer_primitivetypes3d.hxx
..\inc\drawinglayer\primitive3d\baseprimitive3d.hxx %_DEST%\inc%_EXT%\drawinglayer\primitive3d\baseprimitive3d.hxx
..\inc\drawinglayer\primitive3d\groupprimitive3d.hxx %_DEST%\inc%_EXT%\drawinglayer\primitive3d\groupprimitive3d.hxx
..\inc\drawinglayer\primitive3d\hatchtextureprimitive3d.hxx %_DEST%\inc%_EXT%\drawinglayer\primitive3d\hatchtextureprimitive3d.hxx
..\inc\drawinglayer\primitive3d\hittestprimitive3d.hxx %_DEST%\inc%_EXT%\drawinglayer\primitive3d\hittestprimitive3d.hxx
..\inc\drawinglayer\primitive3d\modifiedcolorprimitive3d.hxx %_DEST%\inc%_EXT%\drawinglayer\primitive3d\modifiedcolorprimitive3d.hxx
..\inc\drawinglayer\primitive3d\polygonprimitive3d.hxx %_DEST%\inc%_EXT%\drawinglayer\primitive3d\polygonprimitive3d.hxx
..\inc\drawinglayer\primitive3d\polygontubeprimitive3d.hxx %_DEST%\inc%_EXT%\drawinglayer\primitive3d\polygontubeprimitive3d.hxx
..\inc\drawinglayer\primitive3d\polypolygonprimitive3d.hxx %_DEST%\inc%_EXT%\drawinglayer\primitive3d\polypolygonprimitive3d.hxx
..\inc\drawinglayer\primitive3d\sdrcubeprimitive3d.hxx %_DEST%\inc%_EXT%\drawinglayer\primitive3d\sdrcubeprimitive3d.hxx
..\inc\drawinglayer\primitive3d\sdrdecompositiontools3d.hxx %_DEST%\inc%_EXT%\drawinglayer\primitive3d\sdrdecompositiontools3d.hxx
..\inc\drawinglayer\primitive3d\sdrextrudelathetools3d.hxx %_DEST%\inc%_EXT%\drawinglayer\primitive3d\sdrextrudelathetools3d.hxx
..\inc\drawinglayer\primitive3d\sdrextrudeprimitive3d.hxx %_DEST%\inc%_EXT%\drawinglayer\primitive3d\sdrextrudeprimitive3d.hxx
..\inc\drawinglayer\primitive3d\sdrlatheprimitive3d.hxx %_DEST%\inc%_EXT%\drawinglayer\primitive3d\sdrlatheprimitive3d.hxx
..\inc\drawinglayer\primitive3d\sdrpolypolygonprimitive3d.hxx %_DEST%\inc%_EXT%\drawinglayer\primitive3d\sdrpolypolygonprimitive3d.hxx
..\inc\drawinglayer\primitive3d\sdrprimitive3d.hxx %_DEST%\inc%_EXT%\drawinglayer\primitive3d\sdrprimitive3d.hxx
..\inc\drawinglayer\primitive3d\sdrsphereprimitive3d.hxx %_DEST%\inc%_EXT%\drawinglayer\primitive3d\sdrsphereprimitive3d.hxx
..\inc\drawinglayer\primitive3d\shadowprimitive3d.hxx %_DEST%\inc%_EXT%\drawinglayer\primitive3d\shadowprimitive3d.hxx
..\inc\drawinglayer\primitive3d\textureprimitive3d.hxx %_DEST%\inc%_EXT%\drawinglayer\primitive3d\textureprimitive3d.hxx
..\inc\drawinglayer\primitive3d\transformprimitive3d.hxx %_DEST%\inc%_EXT%\drawinglayer\primitive3d\transformprimitive3d.hxx

mkdir: %_DEST%\inc%_EXT%\drawinglayer\animation
..\inc\drawinglayer\animation\animationtiming.hxx %_DEST%\inc%_EXT%\drawinglayer\animation\animationtiming.hxx

mkdir: %_DEST%\inc%_EXT%\drawinglayer\geometry
..\inc\drawinglayer\geometry\viewinformation2d.hxx %_DEST%\inc%_EXT%\drawinglayer\geometry\viewinformation2d.hxx
..\inc\drawinglayer\geometry\viewinformation3d.hxx %_DEST%\inc%_EXT%\drawinglayer\geometry\viewinformation3d.hxx

mkdir: %_DEST%\inc%_EXT%\drawinglayer\processor2d
..\inc\drawinglayer\processor2d\baseprocessor2d.hxx %_DEST%\inc%_EXT%\drawinglayer\processor2d\baseprocessor2d.hxx
..\inc\drawinglayer\processor2d\vclprocessor2d.hxx %_DEST%\inc%_EXT%\drawinglayer\processor2d\vclprocessor2d.hxx
..\inc\drawinglayer\processor2d\vclpixelprocessor2d.hxx %_DEST%\inc%_EXT%\drawinglayer\processor2d\vclpixelprocessor2d.hxx
..\inc\drawinglayer\processor2d\vclmetafileprocessor2d.hxx %_DEST%\inc%_EXT%\drawinglayer\processor2d\vclmetafileprocessor2d.hxx
..\inc\drawinglayer\processor2d\canvasprocessor.hxx %_DEST%\inc%_EXT%\drawinglayer\processor2d\canvasprocessor.hxx
..\inc\drawinglayer\processor2d\contourextractor2d.hxx %_DEST%\inc%_EXT%\drawinglayer\processor2d\contourextractor2d.hxx
..\inc\drawinglayer\processor2d\linegeometryextractor2d.hxx %_DEST%\inc%_EXT%\drawinglayer\processor2d\linegeometryextractor2d.hxx
..\inc\drawinglayer\processor2d\hittestprocessor2d.hxx %_DEST%\inc%_EXT%\drawinglayer\processor2d\hittestprocessor2d.hxx
..\inc\drawinglayer\processor2d\textaspolygonextractor2d.hxx %_DEST%\inc%_EXT%\drawinglayer\processor2d\textaspolygonextractor2d.hxx

mkdir: %_DEST%\inc%_EXT%\drawinglayer\processor3d
..\inc\drawinglayer\processor3d\baseprocessor3d.hxx %_DEST%\inc%_EXT%\drawinglayer\processor3d\baseprocessor3d.hxx
..\inc\drawinglayer\processor3d\zbufferprocessor3d.hxx %_DEST%\inc%_EXT%\drawinglayer\processor3d\zbufferprocessor3d.hxx
..\inc\drawinglayer\processor3d\tbufferprocessor3d.hxx %_DEST%\inc%_EXT%\drawinglayer\processor3d\tbufferprocessor3d.hxx

mkdir: %_DEST%\inc%_EXT%\drawinglayer\attribute
..\inc\drawinglayer\attribute\fillattribute.hxx %_DEST%\inc%_EXT%\drawinglayer\attribute\fillattribute.hxx
..\inc\drawinglayer\attribute\fillbitmapattribute.hxx %_DEST%\inc%_EXT%\drawinglayer\attribute\fillbitmapattribute.hxx
..\inc\drawinglayer\attribute\materialattribute3d.hxx %_DEST%\inc%_EXT%\drawinglayer\attribute\materialattribute3d.hxx
..\inc\drawinglayer\attribute\sdrallattribute3d.hxx %_DEST%\inc%_EXT%\drawinglayer\attribute\sdrallattribute3d.hxx
..\inc\drawinglayer\attribute\sdrattribute.hxx %_DEST%\inc%_EXT%\drawinglayer\attribute\sdrattribute.hxx
..\inc\drawinglayer\attribute\sdrattribute3d.hxx %_DEST%\inc%_EXT%\drawinglayer\attribute\sdrattribute3d.hxx
..\inc\drawinglayer\attribute\sdrfillbitmapattribute.hxx %_DEST%\inc%_EXT%\drawinglayer\attribute\sdrfillbitmapattribute.hxx
..\inc\drawinglayer\attribute\strokeattribute.hxx %_DEST%\inc%_EXT%\drawinglayer\attribute\strokeattribute.hxx
..\inc\drawinglayer\attribute\lineattribute.hxx %_DEST%\inc%_EXT%\drawinglayer\attribute\lineattribute.hxx
..\inc\drawinglayer\attribute\linestartendattribute.hxx %_DEST%\inc%_EXT%\drawinglayer\attribute\linestartendattribute.hxx

mkdir: %_DEST%\inc%_EXT%\drawinglayer\texture
..\inc\drawinglayer\texture\texture.hxx %_DEST%\inc%_EXT%\drawinglayer\texture\texture.hxx
