<?xml version="1.0" encoding="UTF-8" standalone="no"?>
<!-- Created with Inkscape (http://www.inkscape.org/) -->

<svg
   xmlns:dc="http://purl.org/dc/elements/1.1/"
   xmlns:cc="http://creativecommons.org/ns#"
   xmlns:rdf="http://www.w3.org/1999/02/22-rdf-syntax-ns#"
   xmlns:svg="http://www.w3.org/2000/svg"
   xmlns="http://www.w3.org/2000/svg"
   xmlns:sodipodi="http://sodipodi.sourceforge.net/DTD/sodipodi-0.dtd"
   xmlns:inkscape="http://www.inkscape.org/namespaces/inkscape"
   width="186mm"
   height="187mm"
   viewBox="0 0 659.05505 662.59824"
   id="svg2"
   version="1.1"
   inkscape:version="0.92.0 r15299"
   sodipodi:docname="myrtana.svg">
  <defs
     id="defs4" />
  <sodipodi:namedview
     id="base"
     pagecolor="#ffffff"
     bordercolor="#666666"
     borderopacity="1.0"
     inkscape:pageopacity="0.0"
     inkscape:pageshadow="2"
     inkscape:zoom="0.70000001"
     inkscape:cx="273.15162"
     inkscape:cy="577.64611"
     inkscape:document-units="px"
     inkscape:current-layer="layer1"
     showgrid="false"
     inkscape:window-width="1920"
     inkscape:window-height="1016"
     inkscape:window-x="0"
     inkscape:window-y="27"
     inkscape:window-maximized="1" />
  <metadata
     id="metadata7">
    <rdf:RDF>
      <cc:Work
         rdf:about="">
        <dc:format>image/svg+xml</dc:format>
        <dc:type
           rdf:resource="http://purl.org/dc/dcmitype/StillImage" />
        <dc:title></dc:title>
      </cc:Work>
    </rdf:RDF>
  </metadata>
  <g
     inkscape:label="Vrstva 1"
     inkscape:groupmode="layer"
     id="layer1"
     transform="translate(0,-389.76401)">
    <circle
       style="fill:#ff0000;stroke:#000000;stroke-width:1.5;stroke-miterlimit:4;stroke-dasharray:none;stroke-opacity:1"
       id="path3336"
       cx="330.35715"
       cy="721.91577"
       r="330" />
    <path
       style="fill:none;fill-rule:evenodd;stroke:#ffffff;stroke-width:5.5;stroke-linecap:butt;stroke-linejoin:miter;stroke-miterlimit:4;stroke-dasharray:none;stroke-opacity:1"
       d="m 310.35714,392.63006 c -1.49553,1.83224 -53.30216,7.02045 -64.10451,50.22989 -1.52593,6.10372 -8.50869,40.07832 -11.03784,43.26173 -39.05771,49.16144 99.44001,-78.00732 127.51033,-94.27342 56.49779,-32.73916 -64.12238,102.02959 -112.03728,138.00802 -35.63798,26.75992 -88.12493,21.62748 -98.45983,31.36434 -190.07044,179.07183 3.12913,441.40948 3.12913,441.40948"
       id="path3340"
       inkscape:connector-curvature="0"
       sodipodi:nodetypes="csssssc" />
    <path
       style="fill:none;fill-rule:evenodd;stroke:#ffffff;stroke-width:5.5;stroke-linecap:butt;stroke-linejoin:miter;stroke-miterlimit:4;stroke-dasharray:none;stroke-opacity:1"
       d="m 576.07142,500.4872 c 16.57894,20.67673 32.77301,43.27782 41.42858,103.57143 -18.94399,-20.58019 -10.42878,-30.3851 -57.85715,-62.14286 -29.14639,-1.64016 -48.64442,-75.64302 -72.85714,-114.28571 -3.10422,33.11319 -9.95992,56.36901 -0.71429,82.14286 11.01395,30.70334 25.85551,47.53088 62.85714,75 190,170.71428 -112.14285,445.71428 -112.14285,445.71428"
       id="path4150"
       inkscape:connector-curvature="0"
       sodipodi:nodetypes="ccccacc" />
    <path
       style="fill:none;fill-rule:evenodd;stroke:#ffffff;stroke-width:5.5;stroke-linecap:butt;stroke-linejoin:miter;stroke-miterlimit:4;stroke-dasharray:none;stroke-opacity:1"
       d="m 68.214284,774.77291 c 37.414876,67.13869 89.555126,108.79472 147.498846,130.93761 17.92346,6.84935 36.40221,11.83165 55.17218,15.12356 78.67315,13.79785 162.46265,-2.10112 231.92424,-34.68702 55.30342,-25.944 49.73524,-102.21096 103.97616,-122.08843"
       id="path4152"
       inkscape:connector-curvature="0"
       sodipodi:nodetypes="csssc" />
    <path
       style="fill:none;fill-rule:evenodd;stroke:#ffffff;stroke-width:5.5;stroke-linecap:butt;stroke-linejoin:miter;stroke-miterlimit:4;stroke-dasharray:none;stroke-opacity:1"
       d="m 71.071424,766.91577 c 206.462956,60.56112 337.117106,46.25818 437.661756,23.74611 40.6484,-9.10123 44.70596,-31.49499 95.90967,-32.31754"
       id="path4154"
       inkscape:connector-curvature="0"
       sodipodi:nodetypes="csc" />
    <path
       style="opacity:1;fill:#ff0000;fill-opacity:1;fill-rule:evenodd;stroke:#ffffff;stroke-width:5.5;stroke-linecap:butt;stroke-linejoin:miter;stroke-miterlimit:4;stroke-dasharray:none;stroke-opacity:1"
       d="m 319.13162,624.65037 -45,3.57143 -27.14286,-14.28572 -32.85714,12.14286 -15,30 -58.77448,85.83683 -7.85715,64.28572 43.57143,58.57143 66.42857,15 65.71429,2.85714 78.57143,-10.71429 74.28571,-16.42857 40,-32.14285 25.71429,-58.57143 c 0,0 61.26372,-70.40267 61.978,-73.25981 0.71429,-2.85715 -20,-57.14286 -20,-57.14286 l -52.14285,-38.57143 -31.42858,-21.42857 -77.85714,12.14286 -12.85714,61.42857 17.14286,28.57143 40.71428,12.85714 53.57143,-6.42857 5,-40.71429 -27.85714,-38.57143 -43.57143,16.42857 25.71428,20.71429 -12.14285,20 -27.14286,-7.85714 -4.28571,-48.57143 41.42857,-15.71429 45.71428,12.85715 29.28572,37.85714 7.85714,39.28571 -59.83515,93.9741 -35.71428,50 -92.14286,4.28571 -30.71429,-33.57142 -37.14285,-6.42858 -55,18.57143 -30.71429,17.85715 -23.57143,-41.42858 5.71429,-37.14285 35.91733,-46.55112 12.85715,-31.42857 25.71428,-2.85715 27.86157,-0.42214 19.28129,-0.29214 10.71429,-7.85714 5,-22.85715"
       id="path4156"
       inkscape:connector-curvature="0"
       sodipodi:nodetypes="ccccccccccccccsccccccccccccccccccccccccccccccccccc" />
    <path
       style="fill:none;fill-rule:evenodd;stroke:#ffffff;stroke-width:5.5;stroke-linecap:butt;stroke-linejoin:miter;stroke-miterlimit:4;stroke-dasharray:none;stroke-opacity:1"
       d="m 211.07142,634.77291 19.28572,-10"
       id="path4158"
       inkscape:connector-curvature="0" />
    <path
       style="opacity:1;fill:#ff0000;fill-opacity:1;stroke:#ffffff;stroke-width:5.5;stroke-miterlimit:4;stroke-dasharray:none;stroke-opacity:1"
       d="M 229.64285,804.77291 212.5,784.05863 l 12.14285,-20 21.42857,-6.42857 8.57143,6.42857 -10.71428,8.57143 -14.28572,4.28571 1.42857,14.28572 8.57143,4.28571 2.85715,5"
       id="path4162"
       inkscape:connector-curvature="0" />
    <path
       style="opacity:1;fill:#ff0000;fill-opacity:1;stroke:#ffffff;stroke-width:5.5;stroke-miterlimit:4;stroke-dasharray:none;stroke-opacity:1"
       d="m 353.21428,817.63006 -7.14286,-41.42857 13.57143,-18.57143 28.57143,-5 9.28572,9.28571 -15,7.85714 -17.85715,2.85715 2.85715,15 10,16.42857 -1.42858,12.14286 2.14286,3.57142"
       id="path4164"
       inkscape:connector-curvature="0" />
    <path
       style="opacity:1;fill:#ff0000;fill-opacity:1;stroke:#ffffff;stroke-width:5.5;stroke-miterlimit:4;stroke-dasharray:none;stroke-opacity:1"
       d="M 228.92857,846.91577 335.35714,760.4872 v 28.57143 l 25.71428,4.28571 -25,17.85715 50,0.71428 -31.42857,14.28572 30,16.42857 -153.57143,9.28571"
       id="path4166"
       inkscape:connector-curvature="0" />
    <g
       id="g4178"
       transform="translate(-19.424938,232.30919)">
      <path
         style="opacity:1;fill:#ff0000;fill-opacity:1;stroke:#ffffff;stroke-width:5.5;stroke-miterlimit:4;stroke-dasharray:none;stroke-opacity:1"
         d="m 326.42773,319.50586 15,18.57031 z m 17.14454,21.42773 0.71289,5 -15,24.28516 0.94531,1.1543 -47.37305,-26.86719 -10,32.85547 30,15 c 0,0 -17.14229,25.71429 -14.28515,25 2.85714,-0.71428 23.57059,15 26.42773,15 2.85714,0 30,-35.71289 30,-35.71289 l -13.68359,-23.94727 17.25586,21.08985 16.42773,-20 -20.60156,-31.58985 z M 390,353.07617 l -24.28516,18.57227 -8.57226,27.85742 30,27.14258 18.57226,-21.42969 -31.42968,-25.71289 35,-10.71484 z"
         id="path4168"
         inkscape:connector-curvature="0" />
    </g>
  </g>
</svg>
