{
  "betaManifestVersion": 1,
  "version": "version 2.0",
  "entries": [
              { "url" : "lib/offline/offlinemoodle.js" },
              { "url" : "go_offline.html" },
              { "url" : "testpage.html" },
              { "url" : "go_offline.js" },
              { "url" : "gears_init.js" },
              { "url" : "lib/javascript-static.js" },
              { "url" : "lib/javascript-mod.php" },
              { "url" : "lib/overlib/overlib.js" },
              { "url" : "lib/overlib/overlib_cssstyle.js" },
              { "url" : "lib/cookies.js" },
              { "url" : "lib/ufo.js" },
              { "url" : "lib/dropdown.js" },
              { "url" : "pix/help.gif" },
              { "url" : "pix/i/users.gif" },
              { "url" : "mod/assignment/icon.gif" },
              { "url" : "mod/chat/icon.gif" },
              { "url" : "mod/choice/icon.gif" },
              { "url" : "mod/forum/icon.gif" },
              { "url" : "mod/glossary/icon.gif" },
              { "url" : "mod/lesson/icon.gif" },
              { "url" : "mod/quiz/icon.gif" },
              { "url" : "mod/resource/icon.gif" },
              { "url" : "mod/scorm/icon.gif" },
              { "url" : "mod/survey/icon.gif" },
              { "url" : "mod/wiki/icon.gif" },
              { "url" : "pix/help.gif" },
              { "url" : "pix/i/edit.gif" },
              { "url" : "pix/i/settings.gif" },
              { "url" : "pix/i/roles.gif" },
              { "url" : "pix/i/grades.gif" },
              { "url" : "pix/i/backup.gif" },
              { "url" : "pix/i/restore.gif" },
              { "url" : "pix/i/restore.gif" },
              { "url" : "pix/i/return.gif" },
              { "url" : "pix/i/stats.gif" },
              { "url" : "pix/i/questions.gif" },
              { "url" : "pix/i/files.gif" },
              { "url" : "pix/i/user.gif" },
              { "url" : "pix/i/user.gif" },
              { "url" : "pix/i/course.gif" },
              { "url" : "pix/i/course.gif" },
              { "url" : "pix/spacer.gif" },
              { "url" : "mod/forum/icon.gif" },
              { "url" : "pix/spacer.gif" },
              { "url" : "mod/resource/icon.gif" },
              { "url" : "pix/spacer.gif" },
              { "url" : "mod/resource/icon.gif" },
              { "url" : "pix/spacer.gif" },
              { "url" : "mod/resource/icon.gif" },
              { "url" : "pix/spacer.gif" },
              { "url" : "mod/resource/icon.gif" },
              { "url" : "pix/spacer.gif" },
              { "url" : "mod/resource/icon.gif" },
              { "url" : "pix/spacer.gif" },
              { "url" : "mod/resource/icon.gif" },
              { "url" : "pix/spacer.gif" },
              { "url" : "mod/resource/icon.gif" },
              { "url" : "pix/spacer.gif" },
              { "url" : "mod/resource/icon.gif" },
              { "url" : "pix/i/one.gif" },
              { "url" : "pix/spacer.gif" },
              { "url" : "mod/assignment/icon.gif" },
              { "url" : "pix/spacer.gif" },
              { "url" : "mod/assignment/icon.gif" },
              { "url" : "pix/spacer.gif" },
              { "url" : "mod/assignment/icon.gif" },
              { "url" : "pix/i/one.gif" },
              { "url" : "pix/spacer.gif" },
              { "url" : "mod/chat/icon.gif" },
              { "url" : "pix/spacer.gif" },
              { "url" : "mod/chat/icon.gif" },
              { "url" : "pix/i/one.gif" },
              { "url" : "pix/spacer.gif" },
              { "url" : "mod/choice/icon.gif" },
              { "url" : "pix/spacer.gif" },
              { "url" : "mod/choice/icon.gif" },
              { "url" : "pix/spacer.gif" },
              { "url" : "mod/choice/icon.gif" },
              { "url" : "pix/spacer.gif" },
              { "url" : "mod/choice/icon.gif" },
              { "url" : "pix/i/one.gif" },
              { "url" : "pix/spacer.gif" },
              { "url" : "mod/forum/icon.gif" },
              { "url" : "pix/spacer.gif" },
              { "url" : "pix/spacer.gif" },
              { "url" : "pix/i/one.gif" },
              { "url" : "pix/spacer.gif" },
              { "url" : "mod/glossary/icon.gif" },
              { "url" : "pix/spacer.gif" },
              { "url" : "mod/glossary/icon.gif" },
              { "url" : "pix/spacer.gif" },
              { "url" : "mod/glossary/icon.gif" },
              { "url" : "pix/i/one.gif" },
              { "url" : "pix/i/one.gif" },
              { "url" : "pix/spacer.gif" },
              { "url" : "mod/lesson/icon.gif" },
              { "url" : "pix/i/one.gif" },
              { "url" : "pix/spacer.gif" },
              { "url" : "mod/quiz/icon.gif" },
              { "url" : "pix/spacer.gif" },
              { "url" : "mod/quiz/icon.gif" },
              { "url" : "pix/spacer.gif" },
              { "url" : "mod/quiz/icon.gif" },
              { "url" : "pix/i/one.gif" },
              { "url" : "pix/spacer.gif" },
              { "url" : "mod/resource/icon.gif" },
              { "url" : "pix/spacer.gif" },
              { "url" : "mod/resource/icon.gif" },
              { "url" : "pix/spacer.gif" },
              { "url" : "mod/resource/icon.gif" },
              { "url" : "pix/spacer.gif" },
              { "url" : "mod/resource/icon.gif" },
              { "url" : "pix/spacer.gif" },
              { "url" : "pix/f/web.gif" },
              { "url" : "pix/spacer.gif" },
              { "url" : "pix/f/html.gif" },
              { "url" : "pix/spacer.gif" },
              { "url" : "pix/f/web.gif" },
              { "url" : "pix/spacer.gif" },
              { "url" : "pix/f/folder.gif" },
              { "url" : "pix/spacer.gif" },
              { "url" : "mod/resource/icon.gif" },
              { "url" : "pix/spacer.gif" },
              { "url" : "pix/f/image.gif" },
              { "url" : "pix/spacer.gif" },
              { "url" : "pix/f/audio.gif" },
              { "url" : "pix/spacer.gif" },
              { "url" : "pix/f/flash.gif" },
              { "url" : "pix/spacer.gif" },
              { "url" : "pix/f/avi.gif" },
              { "url" : "pix/spacer.gif" },
              { "url" : "pix/f/powerpoint.gif" },
              { "url" : "pix/spacer.gif" },
              { "url" : "pix/f/pdf.gif" },
              { "url" : "pix/i/one.gif" },
              { "url" : "pix/spacer.gif" },
              { "url" : "mod/scorm/icon.gif" },
              { "url" : "pix/spacer.gif" },
              { "url" : "mod/scorm/icon.gif" },
              { "url" : "pix/i/one.gif" },
              { "url" : "pix/spacer.gif" },
              { "url" : "mod/survey/icon.gif" },
              { "url" : "pix/spacer.gif" },
              { "url" : "mod/survey/icon.gif" },
              { "url" : "pix/spacer.gif" },
              { "url" : "mod/survey/icon.gif" },
              { "url" : "pix/i/one.gif" },
              { "url" : "pix/spacer.gif" },
              { "url" : "mod/wiki/icon.gif" },
              { "url" : "pix/i/one.gif" },
              { "url" : "mod/chat/icon.gif" },
              { "url" : "pix/docs.gif" },
              { "url" : "theme/standard/styles.php" },
              { "url" : "theme/standardwhite/styles.php" },
              { "url" : "theme/standardwhite/favicon.ico" },
              { "url" : "user/view.php?id=2&amp;course=3" },
              { "url" : "" },
              { "url" : "help.php?module=moodle&amp;file=switchrole.html&amp;forcelang=" },
              { "url" : "mod/assignment/index.php?id=3" },
              { "url" : "mod/chat/index.php?id=3" },
              { "url" : "mod/choice/index.php?id=3" },
              { "url" : "mod/forum/index.php?id=3" },
              { "url" : "mod/glossary/index.php?id=3" },
              { "url" : "mod/lesson/index.php?id=3" },
              { "url" : "mod/quiz/index.php?id=3" },
              { "url" : "mod/resource/index.php?id=3" },
              { "url" : "mod/scorm/index.php?id=3" },
              { "url" : "mod/survey/index.php?id=3" },
              { "url" : "mod/wiki/index.php?id=3" },
              { "url" : "mod/forum/search.php?id=3" },
              { "url" : "help.php?module=moodle&amp;file=search.html&amp;forcelang=" },
              { "url" : "question/edit.php?courseid=3" },
              { "url" : "user/view.php?id=2&amp;course=3" },
              { "url" : "course/view.php?id=3" },
              { "url" : "course/index.php" },
              { "url" : "mod/forum/view.php?id=2" },
              { "url" : "mod/resource/view.php?id=3" },
              { "url" : "mod/resource/view.php?id=4" },
              { "url" : "mod/resource/view.php?id=5" },
              { "url" : "mod/resource/view.php?id=6" },
              { "url" : "mod/resource/view.php?id=8" },
              { "url" : "mod/resource/view.php?id=9" },
              { "url" : "mod/resource/view.php?id=10" },
              { "url" : "mod/resource/view.php?id=11" },
              { "url" : "mod/assignment/view.php?id=13" },
              { "url" : "mod/assignment/view.php?id=14" },
              { "url" : "mod/assignment/view.php?id=15" },
              { "url" : "mod/chat/view.php?id=17" },
              { "url" : "mod/chat/view.php?id=18" },
              { "url" : "mod/choice/view.php?id=20" },
              { "url" : "mod/choice/view.php?id=21" },
              { "url" : "mod/choice/view.php?id=22" },
              { "url" : "mod/choice/view.php?id=23" },
              { "url" : "mod/forum/view.php?id=25" },
              { "url" : "mod/forum/view.php?id=26" },
              { "url" : "mod/forum/view.php?id=27" },
              { "url" : "mod/glossary/view.php?id=29" },
              { "url" : "mod/glossary/view.php?id=30" },
              { "url" : "mod/glossary/view.php?id=31" },
              { "url" : "mod/lesson/view.php?id=37" },
              { "url" : "mod/lesson/view.php?id=37&pageid=1" },
              { "url" : "mod/lesson/view.php?id=37&pageid=2" },
              { "url" : "mod/lesson/view.php?id=37&pageid=3" },
              { "url" : "mod/lesson/view.php?id=37&pageid=4" },
              { "url" : "mod/lesson/view.php?id=37&pageid=5" },
              { "url" : "mod/lesson/view.php?id=37&pageid=6" },
              { "url" : "mod/lesson/view.php?id=37&pageid=7" },
              { "url" : "mod/lesson/view.php?id=37&pageid=8" },
              { "url" : "mod/lesson/view.php?id=37&pageid=9" },
              { "url" : "mod/lesson/view.php?id=37&pageid=10" },
              { "url" : "mod/lesson/view.php?id=37&pageid=11" },
              { "url" : "mod/lesson/view.php?id=37&pageid=13" },
              { "url" : "mod/lesson/view.php?id=37&pageid=14" },
              { "url" : "mod/lesson/view.php?id=37&pageid=15" },
              { "url" : "mod/lesson/view.php?id=37&pageid=16" },
              { "url" : "mod/lesson/view.php?id=37&pageid=17" },
              { "url" : "mod/lesson/view.php?id=37&pageid=18" },
              { "url" : "mod/lesson/view.php?id=37&pageid=19" },
              { "url" : "mod/lesson/view.php?id=37&pageid=20" },
              { "url" : "mod/lesson/view.php?id=37&pageid=22" },
              { "url" : "mod/lesson/view.php?id=37&pageid=23" },
              { "url" : "mod/lesson/view.php?id=37&pageid=24" },
              { "url" : "mod/lesson/view.php?id=37&pageid=26" },
              { "url" : "mod/lesson/view.php?id=37&pageid=28" },
              { "url" : "mod/lesson/view.php?id=37&pageid=29" },
              { "url" : "mod/quiz/view.php?id=39" },
              { "url" : "mod/quiz/view.php?id=40" },
              { "url" : "mod/quiz/view.php?id=41" },
              { "url" : "mod/resource/view.php?id=43" },
              { "url" : "mod/resource/view.php?id=44" },
              { "url" : "mod/resource/view.php?id=45" },
              { "url" : "mod/resource/view.php?id=46" },
              { "url" : "mod/resource/view.php?id=47" },
              { "url" : "mod/resource/view.php?id=48" },
              { "url" : "mod/resource/view.php?id=49" },
              { "url" : "mod/resource/view.php?id=50" },
              { "url" : "mod/resource/view.php?id=51" },
              { "url" : "mod/resource/view.php?id=53" },
              { "url" : "mod/resource/view.php?id=54" },
              { "url" : "mod/resource/view.php?id=55" },
              { "url" : "mod/resource/view.php?id=56" },
              { "url" : "mod/resource/view.php?id=57" },
              { "url" : "mod/resource/view.php?id=58" },
              { "url" : "mod/scorm/view.php?id=60" },
              { "url" : "mod/scorm/view.php?id=61" },
              { "url" : "mod/survey/view.php?id=63" },
              { "url" : "mod/survey/view.php?id=64" },
              { "url" : "mod/survey/view.php?id=65" },
              { "url" : "mod/wiki/view.php?id=67" },
              { "url" : "mod/forum/discuss.php?d=4" },
              { "url" : "mod/forum/view.php?f=2" },
              { "url" : "mod/chat/view.php?id=17" },
              { "url" : "calendar/view.php?view=day&amp;course=3&amp;cal_d=28&amp;cal_m=7&amp;cal_y=2008" },
              { "url" : "calendar/view.php?view=upcoming&amp;course=3" },
              { "url" : "user/view.php?id=2&amp;course=3" },
              { "url" : "" },
              { "url" : "moodledata/3/Media_examples/Washington.mov" },
              { "url" : "moodledata/3/Media_examples/mitsy.wmv" },
              { "url" : "moodledata/3/Media_examples/Moodle_Logos/moodle-logo.jpg" },
              { "url" : "moodledata/3/Media_examples/Moodle_Logos/moodle-logo-trans.png" },
              { "url" : "moodledata/3/Media_examples/Moodle_Logos/moodle-logo-med.gif" },
              { "url" : "moodledata/3/Media_examples/Moodle_Logos/moodle-logo-small.gif" },
              { "url" : "moodledata/3/Media_examples/bonjour.mp3" },
              { "url" : "moodledata/3/Media_examples/muffins_from_space.swf" },
              { "url" : "moodledata/3/Media_examples/world-tour.mp3" },
              { "url" : "moodledata/3/Media_examples/testfile.html" },
              { "url" : "moodledata/3/Media_examples/Test.ppt" },
              { "url" : "moodledata/3/Media_examples/WQ3.pdf" }
   ]
}
