\relax 
\select@language{english}
\@writefile{toc}{\select@language{english}}
\@writefile{lof}{\select@language{english}}
\@writefile{lot}{\select@language{english}}
\@writefile{toc}{\contentsline {chapter}{\numberline {1}User Documentation}{3}}
\@writefile{lof}{\addvspace {10\p@ }}
\@writefile{lot}{\addvspace {10\p@ }}
\@writefile{toc}{\contentsline {section}{\numberline {1.1}Introduction}{3}}
\@writefile{toc}{\contentsline {section}{\numberline {1.2}Installation}{3}}
\@writefile{toc}{\contentsline {section}{\numberline {1.3}Usage}{4}}
\@writefile{toc}{\contentsline {subsection}{\numberline {1.3.1}Invocation}{4}}
\@writefile{toc}{\contentsline {subsection}{\numberline {1.3.2}Navigation}{4}}
\@writefile{toc}{\contentsline {paragraph}{Image view}{4}}
\@writefile{toc}{\contentsline {paragraph}{Thumbnail view}{4}}
\@writefile{toc}{\contentsline {subsection}{\numberline {1.3.3}Photo Album}{4}}
\@writefile{toc}{\contentsline {section}{\numberline {1.4}Licensing information}{5}}
