\relax 
\select@language{english}
\@writefile{toc}{\select@language{english}}
\@writefile{lof}{\select@language{english}}
\@writefile{lot}{\select@language{english}}
\@writefile{toc}{\contentsline {chapter}{\numberline {1}Introduction}{3}}
\@writefile{lof}{\addvspace {10\p@ }}
\@writefile{lot}{\addvspace {10\p@ }}
\@writefile{toc}{\contentsline {chapter}{\numberline {2}Analysis}{4}}
\@writefile{lof}{\addvspace {10\p@ }}
\@writefile{lot}{\addvspace {10\p@ }}
\@writefile{toc}{\contentsline {section}{\numberline {2.1}Design goals}{5}}
\@writefile{toc}{\contentsline {chapter}{\numberline {3}Design and implementation}{6}}
\@writefile{lof}{\addvspace {10\p@ }}
\@writefile{lot}{\addvspace {10\p@ }}
\@writefile{toc}{\contentsline {section}{\numberline {3.1}Threading data structures}{6}}
\@writefile{toc}{\contentsline {subsection}{\numberline {3.1.1}Mutexed job queues}{6}}
\@writefile{toc}{\contentsline {subsection}{\numberline {3.1.2}Mutexed State Object}{7}}
\@writefile{toc}{\contentsline {section}{\numberline {3.2}Working thread}{7}}
\@writefile{toc}{\contentsline {section}{\numberline {3.3}Image Data Structures}{7}}
\@writefile{toc}{\contentsline {subsection}{\numberline {3.3.1}Slides concept}{7}}
\@writefile{toc}{\contentsline {subsection}{\numberline {3.3.2}ImageData}{8}}
\@writefile{toc}{\contentsline {section}{\numberline {3.4}Main Object}{8}}
\@writefile{toc}{\contentsline {subsection}{\numberline {3.4.1}glut\_idle\_func}{9}}
\@writefile{toc}{\contentsline {subsection}{\numberline {3.4.2}glut\_reshape}{9}}
\@writefile{toc}{\contentsline {subsection}{\numberline {3.4.3}glut\_keyboard actions}{9}}
\@writefile{toc}{\contentsline {subsection}{\numberline {3.4.4}glut\_draw}{9}}
\@writefile{toc}{\contentsline {section}{\numberline {3.5}Faces}{9}}
\@writefile{toc}{\contentsline {chapter}{\numberline {4}Aging and image loading policies}{10}}
\@writefile{lof}{\addvspace {10\p@ }}
\@writefile{lot}{\addvspace {10\p@ }}
\@writefile{toc}{\contentsline {section}{\numberline {4.1}Aging}{10}}
\@writefile{toc}{\contentsline {section}{\numberline {4.2}Image loading policy}{10}}
\@writefile{toc}{\contentsline {chapter}{\numberline {5}Input parser}{11}}
\@writefile{lof}{\addvspace {10\p@ }}
\@writefile{lot}{\addvspace {10\p@ }}
\@writefile{toc}{\contentsline {section}{\numberline {5.1}Slide Block}{11}}
\@writefile{toc}{\contentsline {section}{\numberline {5.2}Options Block}{12}}
\@writefile{toc}{\contentsline {chapter}{\numberline {6}Future work}{14}}
\@writefile{lof}{\addvspace {10\p@ }}
\@writefile{lot}{\addvspace {10\p@ }}
\@writefile{toc}{\contentsline {chapter}{\numberline {A}Object Hiearchy}{15}}
\@writefile{lof}{\addvspace {10\p@ }}
\@writefile{lot}{\addvspace {10\p@ }}
\@writefile{toc}{\contentsline {chapter}{\numberline {B}Class Member Hiearchy}{16}}
\@writefile{lof}{\addvspace {10\p@ }}
\@writefile{lot}{\addvspace {10\p@ }}
