\select@language {english}
\contentsline {chapter}{\numberline {1}Introduction}{3}
\contentsline {chapter}{\numberline {2}Analysis}{4}
\contentsline {section}{\numberline {2.1}Design goals}{5}
\contentsline {chapter}{\numberline {3}Design and implementation}{6}
\contentsline {section}{\numberline {3.1}Threading data structures}{6}
\contentsline {subsection}{\numberline {3.1.1}Mutexed job queues}{6}
\contentsline {subsection}{\numberline {3.1.2}Mutexed State Object}{7}
\contentsline {section}{\numberline {3.2}Working thread}{7}
\contentsline {section}{\numberline {3.3}Image Data Structures}{7}
\contentsline {subsection}{\numberline {3.3.1}Slides concept}{7}
\contentsline {subsection}{\numberline {3.3.2}ImageData}{8}
\contentsline {section}{\numberline {3.4}Main Object}{8}
\contentsline {subsection}{\numberline {3.4.1}glut\_idle\_func}{9}
\contentsline {subsection}{\numberline {3.4.2}glut\_reshape}{9}
\contentsline {subsection}{\numberline {3.4.3}glut\_keyboard actions}{9}
\contentsline {subsection}{\numberline {3.4.4}glut\_draw}{9}
\contentsline {section}{\numberline {3.5}Faces}{9}
\contentsline {chapter}{\numberline {4}Aging and image loading policies}{10}
\contentsline {section}{\numberline {4.1}Aging}{10}
\contentsline {section}{\numberline {4.2}Image loading policy}{10}
\contentsline {chapter}{\numberline {5}Input parser}{11}
\contentsline {section}{\numberline {5.1}Slide Block}{11}
\contentsline {section}{\numberline {5.2}Options Block}{12}
\contentsline {chapter}{\numberline {6}Future work}{14}
\contentsline {chapter}{\numberline {A}Object Hiearchy}{15}
\contentsline {chapter}{\numberline {B}Class Member Hiearchy}{16}
