%!PS-Adobe-2.0 EPSF-2.0
%%Title: /home/hellboy/prj/obr2/doc/doc_src/obr.dia
%%Creator: Dia v0.97
%%CreationDate: Sun Dec 13 14:41:09 2009
%%For: hellboy
%%Orientation: Portrait
%%Magnification: 1.0000
%%BoundingBox: 0 0 1732 942
%%BeginSetup
%%EndSetup
%%EndComments
%%BeginProlog
[ /.notdef /.notdef /.notdef /.notdef /.notdef /.notdef /.notdef /.notdef /.notdef /.notdef
/.notdef /.notdef /.notdef /.notdef /.notdef /.notdef /.notdef /.notdef /.notdef /.notdef
/.notdef /.notdef /.notdef /.notdef /.notdef /.notdef /.notdef /.notdef /.notdef /.notdef
/.notdef /.notdef /space /exclam /quotedbl /numbersign /dollar /percent /ampersand /quoteright
/parenleft /parenright /asterisk /plus /comma /hyphen /period /slash /zero /one
/two /three /four /five /six /seven /eight /nine /colon /semicolon
/less /equal /greater /question /at /A /B /C /D /E
/F /G /H /I /J /K /L /M /N /O
/P /Q /R /S /T /U /V /W /X /Y
/Z /bracketleft /backslash /bracketright /asciicircum /underscore /quoteleft /a /b /c
/d /e /f /g /h /i /j /k /l /m
/n /o /p /q /r /s /t /u /v /w
/x /y /z /braceleft /bar /braceright /asciitilde /.notdef /.notdef /.notdef
/.notdef /.notdef /.notdef /.notdef /.notdef /.notdef /.notdef /.notdef /.notdef /.notdef
/.notdef /.notdef /.notdef /.notdef /.notdef /.notdef /.notdef /.notdef /.notdef /.notdef
/.notdef /.notdef /.notdef /.notdef /.notdef /.notdef /.notdef /.notdef /.notdef /.notdef
/space /exclamdown /cent /sterling /currency /yen /brokenbar /section /dieresis /copyright
/ordfeminine /guillemotleft /logicalnot /hyphen /registered /macron /degree /plusminus /twosuperior /threesuperior
/acute /mu /paragraph /periodcentered /cedilla /onesuperior /ordmasculine /guillemotright /onequarter /onehalf
/threequarters /questiondown /Agrave /Aacute /Acircumflex /Atilde /Adieresis /Aring /AE /Ccedilla
/Egrave /Eacute /Ecircumflex /Edieresis /Igrave /Iacute /Icircumflex /Idieresis /Eth /Ntilde
/Ograve /Oacute /Ocircumflex /Otilde /Odieresis /multiply /Oslash /Ugrave /Uacute /Ucircumflex
/Udieresis /Yacute /Thorn /germandbls /agrave /aacute /acircumflex /atilde /adieresis /aring
/ae /ccedilla /egrave /eacute /ecircumflex /edieresis /igrave /iacute /icircumflex /idieresis
/eth /ntilde /ograve /oacute /ocircumflex /otilde /odieresis /divide /oslash /ugrave
/uacute /ucircumflex /udieresis /yacute /thorn /ydieresis] /isolatin1encoding exch def
/cp {closepath} bind def
/c {curveto} bind def
/f {fill} bind def
/a {arc} bind def
/ef {eofill} bind def
/ex {exch} bind def
/gr {grestore} bind def
/gs {gsave} bind def
/sa {save} bind def
/rs {restore} bind def
/l {lineto} bind def
/m {moveto} bind def
/rm {rmoveto} bind def
/n {newpath} bind def
/s {stroke} bind def
/sh {show} bind def
/slc {setlinecap} bind def
/slj {setlinejoin} bind def
/slw {setlinewidth} bind def
/srgb {setrgbcolor} bind def
/rot {rotate} bind def
/sc {scale} bind def
/sd {setdash} bind def
/ff {findfont} bind def
/sf {setfont} bind def
/scf {scalefont} bind def
/sw {stringwidth pop} bind def
/tr {translate} bind def

/ellipsedict 8 dict def
ellipsedict /mtrx matrix put
/ellipse
{ ellipsedict begin
   /endangle exch def
   /startangle exch def
   /yrad exch def
   /xrad exch def
   /y exch def
   /x exch def   /savematrix mtrx currentmatrix def
   x y tr xrad yrad sc
   0 0 1 startangle endangle arc
   savematrix setmatrix
   end
} def

/mergeprocs {
dup length
3 -1 roll
dup
length
dup
5 1 roll
3 -1 roll
add
array cvx
dup
3 -1 roll
0 exch
putinterval
dup
4 2 roll
putinterval
} bind def
/Times-Roman-latin1
    /Times-Roman findfont
    dup length dict begin
	{1 index /FID ne {def} {pop pop} ifelse} forall
	/Encoding isolatin1encoding def
    currentdict end
definefont pop
/Times-Italic-latin1
    /Times-Italic findfont
    dup length dict begin
	{1 index /FID ne {def} {pop pop} ifelse} forall
	/Encoding isolatin1encoding def
    currentdict end
definefont pop
/Times-Bold-latin1
    /Times-Bold findfont
    dup length dict begin
	{1 index /FID ne {def} {pop pop} ifelse} forall
	/Encoding isolatin1encoding def
    currentdict end
definefont pop
/Times-BoldItalic-latin1
    /Times-BoldItalic findfont
    dup length dict begin
	{1 index /FID ne {def} {pop pop} ifelse} forall
	/Encoding isolatin1encoding def
    currentdict end
definefont pop
/AvantGarde-Gothic-latin1
    /AvantGarde-Gothic findfont
    dup length dict begin
	{1 index /FID ne {def} {pop pop} ifelse} forall
	/Encoding isolatin1encoding def
    currentdict end
definefont pop
/AvantGarde-BookOblique-latin1
    /AvantGarde-BookOblique findfont
    dup length dict begin
	{1 index /FID ne {def} {pop pop} ifelse} forall
	/Encoding isolatin1encoding def
    currentdict end
definefont pop
/AvantGarde-Demi-latin1
    /AvantGarde-Demi findfont
    dup length dict begin
	{1 index /FID ne {def} {pop pop} ifelse} forall
	/Encoding isolatin1encoding def
    currentdict end
definefont pop
/AvantGarde-DemiOblique-latin1
    /AvantGarde-DemiOblique findfont
    dup length dict begin
	{1 index /FID ne {def} {pop pop} ifelse} forall
	/Encoding isolatin1encoding def
    currentdict end
definefont pop
/Bookman-Light-latin1
    /Bookman-Light findfont
    dup length dict begin
	{1 index /FID ne {def} {pop pop} ifelse} forall
	/Encoding isolatin1encoding def
    currentdict end
definefont pop
/Bookman-LightItalic-latin1
    /Bookman-LightItalic findfont
    dup length dict begin
	{1 index /FID ne {def} {pop pop} ifelse} forall
	/Encoding isolatin1encoding def
    currentdict end
definefont pop
/Bookman-Demi-latin1
    /Bookman-Demi findfont
    dup length dict begin
	{1 index /FID ne {def} {pop pop} ifelse} forall
	/Encoding isolatin1encoding def
    currentdict end
definefont pop
/Bookman-DemiItalic-latin1
    /Bookman-DemiItalic findfont
    dup length dict begin
	{1 index /FID ne {def} {pop pop} ifelse} forall
	/Encoding isolatin1encoding def
    currentdict end
definefont pop
/Courier-latin1
    /Courier findfont
    dup length dict begin
	{1 index /FID ne {def} {pop pop} ifelse} forall
	/Encoding isolatin1encoding def
    currentdict end
definefont pop
/Courier-Oblique-latin1
    /Courier-Oblique findfont
    dup length dict begin
	{1 index /FID ne {def} {pop pop} ifelse} forall
	/Encoding isolatin1encoding def
    currentdict end
definefont pop
/Courier-Bold-latin1
    /Courier-Bold findfont
    dup length dict begin
	{1 index /FID ne {def} {pop pop} ifelse} forall
	/Encoding isolatin1encoding def
    currentdict end
definefont pop
/Courier-BoldOblique-latin1
    /Courier-BoldOblique findfont
    dup length dict begin
	{1 index /FID ne {def} {pop pop} ifelse} forall
	/Encoding isolatin1encoding def
    currentdict end
definefont pop
/Helvetica-latin1
    /Helvetica findfont
    dup length dict begin
	{1 index /FID ne {def} {pop pop} ifelse} forall
	/Encoding isolatin1encoding def
    currentdict end
definefont pop
/Helvetica-Oblique-latin1
    /Helvetica-Oblique findfont
    dup length dict begin
	{1 index /FID ne {def} {pop pop} ifelse} forall
	/Encoding isolatin1encoding def
    currentdict end
definefont pop
/Helvetica-Bold-latin1
    /Helvetica-Bold findfont
    dup length dict begin
	{1 index /FID ne {def} {pop pop} ifelse} forall
	/Encoding isolatin1encoding def
    currentdict end
definefont pop
/Helvetica-BoldOblique-latin1
    /Helvetica-BoldOblique findfont
    dup length dict begin
	{1 index /FID ne {def} {pop pop} ifelse} forall
	/Encoding isolatin1encoding def
    currentdict end
definefont pop
/Helvetica-Narrow-latin1
    /Helvetica-Narrow findfont
    dup length dict begin
	{1 index /FID ne {def} {pop pop} ifelse} forall
	/Encoding isolatin1encoding def
    currentdict end
definefont pop
/Helvetica-Narrow-Oblique-latin1
    /Helvetica-Narrow-Oblique findfont
    dup length dict begin
	{1 index /FID ne {def} {pop pop} ifelse} forall
	/Encoding isolatin1encoding def
    currentdict end
definefont pop
/Helvetica-Narrow-Bold-latin1
    /Helvetica-Narrow-Bold findfont
    dup length dict begin
	{1 index /FID ne {def} {pop pop} ifelse} forall
	/Encoding isolatin1encoding def
    currentdict end
definefont pop
/Helvetica-Narrow-BoldOblique-latin1
    /Helvetica-Narrow-BoldOblique findfont
    dup length dict begin
	{1 index /FID ne {def} {pop pop} ifelse} forall
	/Encoding isolatin1encoding def
    currentdict end
definefont pop
/NewCenturySchlbk-Roman-latin1
    /NewCenturySchlbk-Roman findfont
    dup length dict begin
	{1 index /FID ne {def} {pop pop} ifelse} forall
	/Encoding isolatin1encoding def
    currentdict end
definefont pop
/NewCenturySchlbk-Italic-latin1
    /NewCenturySchlbk-Italic findfont
    dup length dict begin
	{1 index /FID ne {def} {pop pop} ifelse} forall
	/Encoding isolatin1encoding def
    currentdict end
definefont pop
/NewCenturySchlbk-Bold-latin1
    /NewCenturySchlbk-Bold findfont
    dup length dict begin
	{1 index /FID ne {def} {pop pop} ifelse} forall
	/Encoding isolatin1encoding def
    currentdict end
definefont pop
/NewCenturySchlbk-BoldItalic-latin1
    /NewCenturySchlbk-BoldItalic findfont
    dup length dict begin
	{1 index /FID ne {def} {pop pop} ifelse} forall
	/Encoding isolatin1encoding def
    currentdict end
definefont pop
/Palatino-Roman-latin1
    /Palatino-Roman findfont
    dup length dict begin
	{1 index /FID ne {def} {pop pop} ifelse} forall
	/Encoding isolatin1encoding def
    currentdict end
definefont pop
/Palatino-Italic-latin1
    /Palatino-Italic findfont
    dup length dict begin
	{1 index /FID ne {def} {pop pop} ifelse} forall
	/Encoding isolatin1encoding def
    currentdict end
definefont pop
/Palatino-Bold-latin1
    /Palatino-Bold findfont
    dup length dict begin
	{1 index /FID ne {def} {pop pop} ifelse} forall
	/Encoding isolatin1encoding def
    currentdict end
definefont pop
/Palatino-BoldItalic-latin1
    /Palatino-BoldItalic findfont
    dup length dict begin
	{1 index /FID ne {def} {pop pop} ifelse} forall
	/Encoding isolatin1encoding def
    currentdict end
definefont pop
/Symbol-latin1
    /Symbol findfont
definefont pop
/ZapfChancery-MediumItalic-latin1
    /ZapfChancery-MediumItalic findfont
    dup length dict begin
	{1 index /FID ne {def} {pop pop} ifelse} forall
	/Encoding isolatin1encoding def
    currentdict end
definefont pop
/ZapfDingbats-latin1
    /ZapfDingbats findfont
    dup length dict begin
	{1 index /FID ne {def} {pop pop} ifelse} forall
	/Encoding isolatin1encoding def
    currentdict end
definefont pop
28.346000 -28.346000 scale
14.050000 -32.050000 translate
%%EndProlog


0.100000 slw
[1.000000 0.200000 0.200000 0.200000 0.200000 0.200000] 0 sd
[0.500000 0.100000 0.100000 0.100000 0.100000 0.100000] 0 sd
0 slj
0.000000 0.000000 0.000000 srgb
n 18.000000 -1.100000 m 18.000000 31.900000 l 47.000000 31.900000 l 47.000000 -1.100000 l cp s
0.100000 slw
[] 0 sd
[] 0 sd
0 slj
n 7.000000 21.000000 m 7.000000 32.000000 l 17.000000 32.000000 l 17.000000 21.000000 l cp s
0.100000 slw
[] 0 sd
[] 0 sd
0 slc
n 25.737793 3.048828 m 25.133395 5.466422 l s
0 slj
n 24.890859 5.405788 m 25.012127 5.951493 l 25.375930 5.527056 l ef
0.100000 slw
[] 0 sd
0 slj
n 24.890859 5.405788 m 25.012127 5.951493 l 25.375930 5.527056 l cp s
0.100000 slw
[] 0 sd
[] 0 sd
0 slj
n 24.000000 1.000000 m 24.000000 3.000000 l 28.000000 3.000000 l 28.000000 1.000000 l cp s
/Helvetica-latin1 ff 0.740833 scf sf
(Start) 25.000000 1.788333 m
 gs 1 -1 sc sh gr
0.100000 slw
[] 0 sd
[] 0 sd
0 slj
1.000000 1.000000 1.000000 srgb
n 19.000000 6.000000 m 19.000000 9.000000 l 32.000000 9.000000 l 32.000000 6.000000 l f
0.000000 0.000000 0.000000 srgb
n 19.000000 6.000000 m 19.000000 9.000000 l 32.000000 9.000000 l 32.000000 6.000000 l cp s
/Helvetica-latin1 ff 0.740833 scf sf
(input_parser.h) 23.000000 6.788333 m
 gs 1 -1 sc sh gr
/Helvetica-latin1 ff 0.560000 scf sf
(Parses input read from stdin) 21.000000 7.840000 m
 gs 1 -1 sc sh gr
0.100000 slw
[0.200000] 0 sd
[0.200000] 0 sd
0 slc
n 16.000000 5.000000 m 18.577478 7.147899 l s
0 slj
n 18.417432 7.339954 m 18.961589 7.467991 l 18.737524 6.955843 l ef
0.100000 slw
[] 0 sd
0 slj
n 18.417432 7.339954 m 18.961589 7.467991 l 18.737524 6.955843 l cp s
0.100000 slw
[0.200000] 0 sd
[0.200000] 0 sd
0 slj
n 12.000000 3.000000 m 12.000000 5.000000 l 16.000000 5.000000 l 16.000000 3.000000 l cp s
/Helvetica-latin1 ff 0.740833 scf sf
(Stdin) 13.000000 3.788333 m
 gs 1 -1 sc sh gr
0.100000 slw
[1.000000] 0 sd
[0.500000] 0 sd
0 slc
n 19.000000 9.000000 m 17.388909 7.388909 l s
0 slj
n 17.565685 7.212132 m 17.035355 7.035355 l 17.212132 7.565685 l ef
0.100000 slw
[] 0 sd
0 slj
n 17.565685 7.212132 m 17.035355 7.035355 l 17.212132 7.565685 l cp s
0.100000 slw
[] 0 sd
[] 0 sd
0 slj
n 36.000000 16.000000 m 36.000000 29.000000 l 46.000000 29.000000 l 46.000000 16.000000 l cp s
/Helvetica-latin1 ff 0.740833 scf sf
(main_obj.h) 39.000000 16.788333 m
 gs 1 -1 sc sh gr
/Helvetica-latin1 ff 0.987778 scf sf
(Main thread \(1\)) 29.000000 0.717778 m
 gs 1 -1 sc sh gr
0.100000 slw
[1.000000 0.200000 0.200000 0.200000 0.200000 0.200000] 0 sd
[0.500000 0.100000 0.100000 0.100000 0.100000 0.100000] 0 sd
0 slj
n -8.000000 8.000000 m -8.000000 15.000000 l 4.000000 15.000000 l 4.000000 8.000000 l cp s
/Helvetica-latin1 ff 0.987778 scf sf
(Thread worker \(2\)) -7.000000 9.717778 m
 gs 1 -1 sc sh gr
0.100000 slw
[0.500000] 0 sd
[0.500000] 0 sd
0 slc
n 4.048828 8.097534 m 5.520633 7.269644 l s
0 slj
n 5.643199 7.487538 m 5.956421 7.024513 l 5.398068 7.051750 l ef
0.100000 slw
[] 0 sd
0 slj
n 5.643199 7.487538 m 5.956421 7.024513 l 5.398068 7.051750 l cp s
0.100000 slw
[0.500000] 0 sd
[0.500000] 0 sd
0 slc
n 7.000000 13.000000 m 4.491935 11.745967 l s
0 slj
n 4.603738 11.522361 m 4.044721 11.522361 l 4.380132 11.969574 l ef
0.100000 slw
[] 0 sd
0 slj
n 4.603738 11.522361 m 4.044721 11.522361 l 4.380132 11.969574 l cp s
0.100000 slw
[0.500000] 0 sd
[0.500000] 0 sd
0 slc
n 2.915833 15.050323 m 6.554126 17.677980 l s
0 slj
n 6.407754 17.880650 m 6.959466 17.970725 l 6.700499 17.475310 l ef
0.100000 slw
[] 0 sd
0 slj
n 6.407754 17.880650 m 6.959466 17.970725 l 6.700499 17.475310 l cp s
0.100000 slw
[0.500000] 0 sd
[0.500000] 0 sd
0 slc
n 20.000000 25.000000 m 16.173925 13.521776 l s
0 slj
n 16.411096 13.442719 m 16.015811 13.047434 l 15.936754 13.600833 l ef
0.100000 slw
[] 0 sd
0 slj
n 16.411096 13.442719 m 16.015811 13.047434 l 15.936754 13.600833 l cp s
0.100000 slw
[0.500000] 0 sd
[0.500000] 0 sd
0 slc
n 16.000000 18.000000 m 19.786569 26.993101 l s
0 slj
n 19.556160 27.090115 m 19.980597 27.453918 l 20.016977 26.896086 l ef
0.100000 slw
[] 0 sd
0 slj
n 19.556160 27.090115 m 19.980597 27.453918 l 20.016977 26.896086 l cp s
0.100000 slw
[0.100000] 0 sd
[0.200000] 0 sd
0 slj
n -14.000000 11.000000 m -14.000000 13.000000 l -10.000000 13.000000 l -10.000000 11.000000 l cp s
/Helvetica-latin1 ff 0.740833 scf sf
(Imlib2) -13.000000 11.788333 m
 gs 1 -1 sc sh gr
/Helvetica-latin1 ff 0.560000 scf sf
(Load image data from the disk ) -7.000000 11.840000 m
 gs 1 -1 sc sh gr
(using Imlib2 library) -7.000000 12.640000 m
 gs 1 -1 sc sh gr
0.100000 slw
[0.200000] 0 sd
[0.200000] 0 sd
0 slc
n -9.451071 11.965692 m -8.048828 11.878052 l s
0 slj
n -9.466666 11.716179 m -9.950097 11.996881 l -9.435477 12.215205 l ef
0.100000 slw
[] 0 sd
0 slj
n -9.466666 11.716179 m -9.950097 11.996881 l -9.435477 12.215205 l cp s
0.100000 slw
[0.200000] 0 sd
[0.200000] 0 sd
0 slc
n 4.206816 23.901129 m 8.000000 25.500000 l s
0 slj
n 4.303920 23.670758 m 3.746074 23.706921 l 4.109712 24.131500 l ef
0.100000 slw
[] 0 sd
0 slj
n 4.303920 23.670758 m 3.746074 23.706921 l 4.109712 24.131500 l cp s
0.100000 slw
[0.200000] 0 sd
[0.200000] 0 sd
0 slj
n 32.000000 11.000000 m 32.000000 13.000000 l 37.000000 13.000000 l 37.000000 11.000000 l cp s
/Helvetica-latin1 ff 0.740833 scf sf
(OpenGL) 33.000000 11.788333 m
 gs 1 -1 sc sh gr
0.100000 slw
[0.200000] 0 sd
[0.200000] 0 sd
0 slj
n 22.000000 10.000000 m 22.000000 13.000000 l 30.000000 13.000000 l 30.000000 10.000000 l cp s
/Helvetica-latin1 ff 0.740833 scf sf
(FTgl) 28.000000 11.788333 m
 gs 1 -1 sc sh gr
0.100000 slw
[1.000000] 0 sd
[1.000000] 0 sd
0 slc
n 32.500000 15.400000 m 32.500000 15.400000 l s
0.100000 slw
[0.200000] 0 sd
[0.200000] 0 sd
0 slc
n 31.466422 11.866605 m 30.000000 11.500000 l s
0 slj
n 31.405788 12.109141 m 31.951493 11.987873 l 31.527056 11.624070 l ef
0.100000 slw
[] 0 sd
0 slj
n 31.405788 12.109141 m 31.951493 11.987873 l 31.527056 11.624070 l cp s
0.100000 slw
[0.200000] 0 sd
[0.200000] 0 sd
0 slj
1.000000 1.000000 1.000000 srgb
n 36.000000 6.000000 m 36.000000 8.000000 l 40.000000 8.000000 l 40.000000 6.000000 l f
0.000000 0.000000 0.000000 srgb
n 36.000000 6.000000 m 36.000000 8.000000 l 40.000000 8.000000 l 40.000000 6.000000 l cp s
0.100000 slw
[0.200000] 0 sd
[0.200000] 0 sd
0 slc
n 36.000000 8.000000 m 34.745967 10.508065 l s
0 slj
n 34.522361 10.396262 m 34.522361 10.955279 l 34.969574 10.619868 l ef
0.100000 slw
[] 0 sd
0 slj
n 34.522361 10.396262 m 34.522361 10.955279 l 34.969574 10.619868 l cp s
/Helvetica-latin1 ff 0.740833 scf sf
(GLUT) 37.000000 6.788333 m
 gs 1 -1 sc sh gr
0.100000 slw
[] 0 sd
[] 0 sd
0 slc
n 38.000000 8.000000 m 37.054727 17.452730 l s
0 slj
n 36.805968 17.427854 m 37.004975 17.950248 l 37.303486 17.477605 l ef
0.100000 slw
[] 0 sd
0 slj
n 36.805968 17.427854 m 37.004975 17.950248 l 37.303486 17.477605 l cp s
0.100000 slw
[] 0 sd
[] 0 sd
0 slc
n 40.000000 8.000000 m 44.826075 22.478224 l s
0 slj
n 44.588904 22.557281 m 44.984189 22.952566 l 45.063246 22.399167 l ef
0.100000 slw
[] 0 sd
0 slj
n 44.588904 22.557281 m 44.984189 22.952566 l 45.063246 22.399167 l cp s
/Helvetica-latin1 ff 0.560000 scf sf
0.100000 slw
[] 0 sd
[] 0 sd
0 slc
n 38.000000 8.000000 m 41.207032 25.409601 l s
0 slj
n 40.961169 25.454892 m 41.297613 25.901328 l 41.452895 25.364311 l ef
0.100000 slw
[] 0 sd
0 slj
n 40.961169 25.454892 m 41.297613 25.901328 l 41.452895 25.364311 l cp s
0.100000 slw
[] 0 sd
[] 0 sd
0 slc
n 26.000000 3.000000 m 35.473196 5.841959 l s
0 slj
n 35.401359 6.081415 m 35.952109 5.985633 l 35.545033 5.602502 l ef
0.100000 slw
[] 0 sd
0 slj
n 35.401359 6.081415 m 35.952109 5.985633 l 35.545033 5.602502 l cp s
0.100000 slw
[] 0 sd
[] 0 sd
0 slj
n 37.000000 18.000000 m 37.000000 22.000000 l 45.000000 22.000000 l 45.000000 18.000000 l cp s
/Helvetica-latin1 ff 0.740833 scf sf
(Draw, Reshape) 38.000000 18.788333 m
 gs 1 -1 sc sh gr
0.100000 slw
[] 0 sd
[] 0 sd
0 slj
n 37.000000 23.000000 m 37.000000 25.000000 l 45.000000 25.000000 l 45.000000 23.000000 l cp s
/Helvetica-latin1 ff 0.740833 scf sf
(Idle Function) 38.000000 23.788333 m
 gs 1 -1 sc sh gr
0.100000 slw
[] 0 sd
[] 0 sd
0 slj
n 38.000000 26.000000 m 38.000000 28.000000 l 45.000000 28.000000 l 45.000000 26.000000 l cp s
/Helvetica-latin1 ff 0.740833 scf sf
(Keyboard) 39.000000 26.788333 m
 gs 1 -1 sc sh gr
0.100000 slw
[] 0 sd
[] 0 sd
0 slc
n 27.500000 14.050000 m 29.492910 13.212978 l s
0 slj
n 29.589718 13.443473 m 29.953901 13.019362 l 29.396102 12.982482 l ef
0.100000 slw
[] 0 sd
0 slj
n 29.589718 13.443473 m 29.953901 13.019362 l 29.396102 12.982482 l cp s
0.100000 slw
[] 0 sd
[] 0 sd
0 slc
n 32.000000 14.050000 m 33.992910 13.212978 l s
0 slj
n 34.089718 13.443473 m 34.453901 13.019362 l 33.896102 12.982482 l ef
0.100000 slw
[] 0 sd
0 slj
n 34.089718 13.443473 m 34.453901 13.019362 l 33.896102 12.982482 l cp s
0.100000 slw
[] 0 sd
[] 0 sd
0 slc
n 32.600000 21.250000 m 36.264941 13.497240 l s
0 slj
n 36.490959 13.604085 m 36.478631 13.045204 l 36.038923 13.390395 l ef
0.100000 slw
[] 0 sd
0 slj
n 36.490959 13.604085 m 36.478631 13.045204 l 36.038923 13.390395 l cp s
0.100000 slw
[1.000000] 0 sd
[1.000000] 0 sd
0 slc
n 41.000000 20.000000 m 41.000000 20.000000 l s
0.100000 slw
[] 0 sd
[] 0 sd
0 slc
n 37.000000 20.000000 m 32.410848 15.915655 l s
0 slj
n 32.577055 15.728906 m 32.037350 15.583241 l 32.244642 16.102404 l ef
0.100000 slw
[] 0 sd
0 slj
n 32.577055 15.728906 m 32.037350 15.583241 l 32.244642 16.102404 l cp s
0.100000 slw
[] 0 sd
[] 0 sd
0 slc
n 37.000000 20.000000 m 33.066399 22.458501 l s
0 slj
n 32.933899 22.246501 m 32.642400 22.723500 l 33.198899 22.670500 l ef
0.100000 slw
[] 0 sd
0 slj
n 32.933899 22.246501 m 32.642400 22.723500 l 33.198899 22.670500 l cp s
0.100000 slw
[] 0 sd
[] 0 sd
0 slj
n 20.000000 25.000000 m 20.000000 30.000000 l 32.000000 30.000000 l 32.000000 25.000000 l cp s
/Helvetica-latin1 ff 0.740833 scf sf
(Job Manager) 23.000000 25.788333 m
 gs 1 -1 sc sh gr
0.100000 slw
[] 0 sd
[] 0 sd
0 slc
n 27.600000 24.250000 m 27.343582 24.570522 l s
0 slj
n 27.148365 24.414348 m 27.031235 24.960957 l 27.538799 24.726696 l ef
0.100000 slw
[] 0 sd
0 slj
n 27.148365 24.414348 m 27.031235 24.960957 l 27.538799 24.726696 l cp s
0.100000 slw
[] 0 sd
[] 0 sd
0 slc
n 37.000000 24.000000 m 32.539319 24.892136 l s
0 slj
n 32.490290 24.646991 m 32.049029 24.990194 l 32.588348 25.137281 l ef
0.100000 slw
[] 0 sd
0 slj
n 32.490290 24.646991 m 32.049029 24.990194 l 32.588348 25.137281 l cp s
/Helvetica-latin1 ff 0.560000 scf sf
(Orders unloaded images) 22.000000 27.840000 m
 gs 1 -1 sc sh gr
(and provides transparent api ) 22.000000 28.640000 m
 gs 1 -1 sc sh gr
0.100000 slw
[1.000000] 0 sd
[0.500000] 0 sd
0 slj
1.000000 1.000000 1.000000 srgb
n 6.000000 7.000000 m 6.000000 10.000000 l 17.000000 10.000000 l 17.000000 7.000000 l f
0.000000 0.000000 0.000000 srgb
n 6.000000 7.000000 m 6.000000 10.000000 l 17.000000 10.000000 l 17.000000 7.000000 l cp s
/Helvetica-latin1 ff 0.740833 scf sf
(options.h) 10.000000 7.788333 m
 gs 1 -1 sc sh gr
/Helvetica-latin1 ff 0.560000 scf sf
(Global mutexed options structure) 6.000000 8.840000 m
 gs 1 -1 sc sh gr
0.100000 slw
[0.500000] 0 sd
[0.500000] 0 sd
0 slj
1.000000 1.000000 1.000000 srgb
n 7.000000 11.000000 m 7.000000 15.000000 l 16.000000 15.000000 l 16.000000 11.000000 l f
0.000000 0.000000 0.000000 srgb
n 7.000000 11.000000 m 7.000000 15.000000 l 16.000000 15.000000 l 16.000000 11.000000 l cp s
/Helvetica-latin1 ff 0.740833 scf sf
(job_queue) 9.000000 11.788333 m
 gs 1 -1 sc sh gr
/Helvetica-latin1 ff 0.560000 scf sf
(Mutexed queue to) 8.000000 12.840000 m
 gs 1 -1 sc sh gr
(assign jobs to thread 2) 8.000000 13.640000 m
 gs 1 -1 sc sh gr
/Helvetica-latin1 ff 0.560000 scf sf
(Vector of slides) 10.000000 22.840000 m
 gs 1 -1 sc sh gr
0.100000 slw
[0.500000] 0 sd
[0.500000] 0 sd
0 slj
1.000000 1.000000 1.000000 srgb
n 7.000000 16.000000 m 7.000000 20.000000 l 16.000000 20.000000 l 16.000000 16.000000 l f
0.000000 0.000000 0.000000 srgb
n 7.000000 16.000000 m 7.000000 20.000000 l 16.000000 20.000000 l 16.000000 16.000000 l cp s
/Helvetica-latin1 ff 0.740833 scf sf
(result_queue) 9.000000 16.788333 m
 gs 1 -1 sc sh gr
/Helvetica-latin1 ff 0.560000 scf sf
(Mutexed queue with) 8.000000 17.840000 m
 gs 1 -1 sc sh gr
(results of thread 2 work) 8.000000 18.640000 m
 gs 1 -1 sc sh gr
/Helvetica-latin1 ff 0.740833 scf sf
(slides) 11.000000 21.788333 m
 gs 1 -1 sc sh gr
0.100000 slw
[0.500000] 0 sd
[0.500000] 0 sd
0 slj
n 8.000000 24.000000 m 8.000000 27.000000 l 16.000000 27.000000 l 16.000000 24.000000 l cp s
0.100000 slw
[0.100000] 0 sd
[0.200000] 0 sd
0 slc
n 12.000000 28.000000 m 12.000000 31.000000 l s
0.100000 slw
[] 0 sd
[] 0 sd
0 slc
0 slj
0.100000 slw
0 slc
0 slj
[] 0 sd
1.000000 1.000000 1.000000 srgb
n 1.000000 22.000000 m 3.025000 22.000000 l 3.700000 22.675000 l 3.700000 25.375000 l 1.000000 25.375000 l ef
0.000000 0.000000 0.000000 srgb
n 1.000000 22.000000 m 3.025000 22.000000 l 3.700000 22.675000 l 3.700000 25.375000 l 1.000000 25.375000 l cp s
0 slc
0 slj
[] 0 sd
n 3.025000 22.000000 m 3.025000 22.675000 l 3.700000 22.675000 l 3.700000 22.675000 l s
0.100000 slw
[0.200000] 0 sd
[0.200000] 0 sd
0 slc
n 0.534330 22.116247 m -10.000000 13.000000 l s
0 slj
n 0.370736 22.305289 m 0.912414 22.443435 l 0.697924 21.927205 l ef
0.100000 slw
[] 0 sd
0 slj
n 0.370736 22.305289 m 0.912414 22.443435 l 0.697924 21.927205 l cp s
/Helvetica-latin1 ff 0.560000 scf sf
(Flags, image name,) 9.000000 24.840000 m
 gs 1 -1 sc sh gr
(histogram, thumbnail) 9.000000 25.640000 m
 gs 1 -1 sc sh gr
0.100000 slw
[] 0 sd
[] 0 sd
0 slc
n 23.000000 15.550000 m 16.350867 23.576453 l s
0 slj
n 16.158346 23.416968 m 16.031897 23.961496 l 16.543389 23.735938 l ef
0.100000 slw
[] 0 sd
0 slj
n 16.158346 23.416968 m 16.031897 23.961496 l 16.543389 23.735938 l cp s
0.100000 slw
[] 0 sd
[] 0 sd
0 slc
n 22.600000 22.750000 m 16.507692 25.288462 l s
0 slj
n 16.411538 25.057692 m 16.046154 25.480769 l 16.603846 25.519231 l ef
0.100000 slw
[] 0 sd
0 slj
n 16.411538 25.057692 m 16.046154 25.480769 l 16.603846 25.519231 l cp s
0.100000 slw
[0.200000] 0 sd
[0.200000] 0 sd
0 slj
n 22.000000 11.000000 m 22.000000 13.000000 l 27.000000 13.000000 l 27.000000 11.000000 l cp s
/Helvetica-latin1 ff 0.740833 scf sf
(Freetype) 23.000000 11.788333 m
 gs 1 -1 sc sh gr
0.100000 slw
[] 0 sd
[] 0 sd
0 slj
n 22.600000 21.250000 m 22.600000 24.250000 l 32.600000 24.250000 l 32.600000 21.250000 l cp s
/Helvetica-latin1 ff 0.740833 scf sf
(Thumbnail Face) 23.600000 22.038333 m
 gs 1 -1 sc sh gr
/Helvetica-latin1 ff 0.560000 scf sf
(Draws thumbnails using gl) 23.600000 23.090000 m
 gs 1 -1 sc sh gr
0.100000 slw
[] 0 sd
[] 0 sd
0 slj
n 23.000000 14.050000 m 23.000000 17.050000 l 32.000000 17.050000 l 32.000000 14.050000 l cp s
/Helvetica-latin1 ff 0.740833 scf sf
(Image Face) 25.000000 14.838333 m
 gs 1 -1 sc sh gr
/Helvetica-latin1 ff 0.560000 scf sf
(Draws image using gl) 24.000000 15.890000 m
 gs 1 -1 sc sh gr
0.100000 slw
[] 0 sd
[] 0 sd
0 slc
n 32.255000 19.125000 m 34.310722 13.516405 l s
0 slj
n 34.545451 13.602440 m 34.482793 13.046946 l 34.075992 13.430369 l ef
0.100000 slw
[] 0 sd
0 slj
n 34.545451 13.602440 m 34.482793 13.046946 l 34.075992 13.430369 l cp s
0.100000 slw
[] 0 sd
[] 0 sd
0 slc
n 37.000000 20.000000 m 32.795881 19.224741 l s
0 slj
n 32.841217 18.978886 m 32.304171 19.134067 l 32.750544 19.470596 l ef
0.100000 slw
[] 0 sd
0 slj
n 32.841217 18.978886 m 32.304171 19.134067 l 32.750544 19.470596 l cp s
0.100000 slw
[] 0 sd
[] 0 sd
0 slj
n 23.255000 17.625000 m 23.255000 20.625000 l 32.255000 20.625000 l 32.255000 17.625000 l cp s
/Helvetica-latin1 ff 0.740833 scf sf
(Info Face) 25.255000 18.413333 m
 gs 1 -1 sc sh gr
/Helvetica-latin1 ff 0.560000 scf sf
(Draws info using gl) 24.255000 19.465000 m
 gs 1 -1 sc sh gr
0.100000 slw
[] 0 sd
[] 0 sd
0 slc
n 27.755000 17.625000 m 29.759826 13.494790 l s
0 slj
n 29.984731 13.603959 m 29.978166 13.044981 l 29.534922 13.385620 l ef
0.100000 slw
[] 0 sd
0 slj
n 29.984731 13.603959 m 29.978166 13.044981 l 29.534922 13.385620 l cp s
showpage
