<?xml version="1.0" encoding="UTF-8" standalone="no"?>
<!-- Created with Inkscape (http://www.inkscape.org/) -->

<svg
   xmlns:dc="http://purl.org/dc/elements/1.1/"
   xmlns:cc="http://creativecommons.org/ns#"
   xmlns:rdf="http://www.w3.org/1999/02/22-rdf-syntax-ns#"
   xmlns:svg="http://www.w3.org/2000/svg"
   xmlns="http://www.w3.org/2000/svg"
   xmlns:sodipodi="http://sodipodi.sourceforge.net/DTD/sodipodi-0.dtd"
   xmlns:inkscape="http://www.inkscape.org/namespaces/inkscape"
   width="744.09448819"
   height="1052.3622047"
   id="svg2"
   version="1.1"
   inkscape:version="0.47 r22583"
   sodipodi:docname="Netspecters.svg"
   inkscape:export-filename="/home/love_paraplegic/Netspecters.png"
   inkscape:export-xdpi="90"
   inkscape:export-ydpi="90">
  <defs
     id="defs4">
    <inkscape:perspective
       sodipodi:type="inkscape:persp3d"
       inkscape:vp_x="0 : 526.18109 : 1"
       inkscape:vp_y="0 : 1000 : 0"
       inkscape:vp_z="744.09448 : 526.18109 : 1"
       inkscape:persp3d-origin="372.04724 : 350.78739 : 1"
       id="perspective10" />
    <filter
       id="filter4065"
       inkscape:label="Fancy blur"
       inkscape:menu="Blurs"
       inkscape:menu-tooltip="Smooth colorized contour which allows desaturation and hue rotation"
       color-interpolation-filters="sRGB">
      <feGaussianBlur
         id="feGaussianBlur4067"
         stdDeviation="5"
         result="result1" />
      <feComposite
         id="feComposite4069"
         in2="result1"
         operator="arithmetic"
         k2="2"
         in="result1" />
    </filter>
  </defs>
  <sodipodi:namedview
     id="base"
     pagecolor="#ffffff"
     bordercolor="#666666"
     borderopacity="1.0"
     inkscape:pageopacity="0.0"
     inkscape:pageshadow="2"
     inkscape:zoom="1"
     inkscape:cx="405.41035"
     inkscape:cy="375.88922"
     inkscape:document-units="px"
     inkscape:current-layer="layer1"
     showgrid="true"
     inkscape:snap-grids="false"
     showguides="true"
     inkscape:guide-bbox="true"
     inkscape:window-width="1280"
     inkscape:window-height="974"
     inkscape:window-x="-1"
     inkscape:window-y="0"
     inkscape:window-maximized="1"
     inkscape:snap-to-guides="true">
    <inkscape:grid
       type="xygrid"
       id="grid2816" />
  </sodipodi:namedview>
  <metadata
     id="metadata7">
    <rdf:RDF>
      <cc:Work
         rdf:about="">
        <dc:format>image/svg+xml</dc:format>
        <dc:type
           rdf:resource="http://purl.org/dc/dcmitype/StillImage" />
      </cc:Work>
    </rdf:RDF>
  </metadata>
  <g
     inkscape:label="Layer 1"
     inkscape:groupmode="layer"
     id="layer1">
    <rect
       style="fill:#000000;fill-opacity:1"
       id="rect2929"
       width="360"
       height="1050"
       x="-745.15961"
       y="-1053.3835"
       inkscape:export-filename="/home/love_paraplegic/path2964.png"
       inkscape:export-xdpi="5.9971442"
       inkscape:export-ydpi="5.9971442"
       transform="scale(-1,-1)" />
    <path
       style="fill:#f9f9f9;stroke:#000000;stroke-width:1px;stroke-linecap:butt;stroke-linejoin:miter;stroke-opacity:1"
       d="m 385.15961,1003.3835 c 0,0 118.60297,-150.56816 120,-239.99996 1.49089,-95.4405 -120,-260.00001 -120,-260.00001 0,0 -126.24329,-164.75225 -120,-259.99999 4.8995,-74.74695 120,-190.000021 120,-190.000021"
       id="path2844"
       sodipodi:nodetypes="cscsc"
       inkscape:export-filename="/home/love_paraplegic/path2964.png"
       inkscape:export-xdpi="5.9971442"
       inkscape:export-ydpi="5.9971442" />
    <path
       sodipodi:type="arc"
       style="fill:#000000;fill-opacity:1"
       id="path2856"
       sodipodi:cx="360"
       sodipodi:cy="292.36218"
       sodipodi:rx="60"
       sodipodi:ry="60"
       d="m 420,292.36218 a 60,60 0 1 1 -120,0 60,60 0 1 1 120,0 z"
       inkscape:export-filename="/home/love_paraplegic/path2964.png"
       inkscape:export-xdpi="5.9971442"
       inkscape:export-ydpi="5.9971442"
       transform="matrix(-1,0,0,-1,745.15961,1055.7457)" />
    <path
       sodipodi:type="arc"
       style="fill:#ffffff;fill-opacity:1"
       id="path2862"
       sodipodi:cx="360"
       sodipodi:cy="812.36218"
       sodipodi:rx="60"
       sodipodi:ry="60"
       d="m 420,812.36218 a 60,60 0 1 1 -120,0 60,60 0 1 1 120,0 z"
       inkscape:export-filename="/home/love_paraplegic/path2964.png"
       inkscape:export-xdpi="5.9971442"
       inkscape:export-ydpi="5.9971442"
       transform="matrix(-1,0,0,-1,745.15961,1055.7457)" />
    <path
       style="fill:none;stroke:#000000;stroke-width:1px;stroke-linecap:butt;stroke-linejoin:miter;stroke-opacity:1"
       d="m 385.15961,1003.3835 c 0,0 60,-158.85896 60,-239.99996 0,-150 -180,-340 -180,-520"
       id="path2921"
       sodipodi:nodetypes="css"
       inkscape:export-filename="/home/love_paraplegic/path2964.png"
       inkscape:export-xdpi="5.9971442"
       inkscape:export-ydpi="5.9971442" />
    <path
       style="fill:none;stroke:#000000;stroke-width:1px;stroke-linecap:butt;stroke-linejoin:miter;stroke-opacity:1"
       d="M 385.0323,53.727316 385.15961,3.3835552"
       id="path2927"
       inkscape:export-filename="/home/love_paraplegic/path2964.png"
       inkscape:export-xdpi="5.9971442"
       inkscape:export-ydpi="5.9971442"
       sodipodi:nodetypes="cc" />
    <path
       sodipodi:nodetypes="cc"
       id="path2933"
       d="m 265.15961,243.38354 c 0,250 65,517.14285 120,759.99996"
       style="fill:none;stroke:#000000;stroke-width:1px;stroke-linecap:butt;stroke-linejoin:miter;stroke-opacity:1"
       inkscape:export-filename="/home/love_paraplegic/path2964.png"
       inkscape:export-xdpi="5.9971442"
       inkscape:export-ydpi="5.9971442" />
    <path
       style="fill:#00ffff;fill-opacity:1"
       d="m 390.1695,511.64995 c 37.03557,52.43974 71.11299,111.56617 90.25907,156.60509 11.80507,27.77003 18.94873,50.90281 22.22337,71.96427 0.47338,3.04465 0.97035,7.02232 1.10438,8.8393 l 0.24368,3.30357 -29.28454,0 -29.28455,0 -0.25073,-4.19644 c -0.4847,-8.11225 -2.28113,-20.65109 -4.48995,-31.33928 -7.44814,-36.04057 -23.38419,-78.27254 -50.59351,-134.07739 l -4.77422,-9.79168 0.0911,-33.95626 0.0911,-33.95625 4.66484,6.60507 0,0 z"
       id="path2954"
       inkscape:export-filename="/home/love_paraplegic/path2964.png"
       inkscape:export-xdpi="5.9971442"
       inkscape:export-ydpi="5.9971442" />
    <path
       style="fill:#00ffff;fill-opacity:1"
       d="m 282.84478,330.13004 c 7.57742,19.07099 19.2795,43.37024 31.68982,65.80357 17.22092,31.12913 44.56582,73.56237 65.9307,102.30986 l 4.50364,6.05986 0,33.91038 c 0,18.6507 -0.058,33.84341 -0.12883,33.76155 -0.45696,-0.52781 -53.13539,-105.93125 -56.83499,-113.72022 -19.90611,-41.90948 -32.94989,-73.7787 -42.97552,-105 -2.36135,-7.35359 -7.20352,-24.04128 -7.20352,-24.82568 0,-0.19409 0.94563,-0.3529 2.10138,-0.3529 l 2.10138,0 0.81594,2.05358 z"
       id="path2956"
       inkscape:export-filename="/home/love_paraplegic/path2964.png"
       inkscape:export-xdpi="5.9971442"
       inkscape:export-ydpi="5.9971442" />
    <path
       style="fill:#00ffff;fill-opacity:1;stroke:#00ffff;stroke-opacity:1"
       d="m 503.7672,762.81841 c 0,38.52339 -23.85641,96.47827 -68.68303,166.85318 -16.30311,25.59482 -44.22701,65.80289 -45.05062,64.8691 -0.10641,-0.12064 5.11688,-16.12925 11.60732,-35.57469 17.49157,-52.40494 28.94484,-93.48165 36.35696,-130.39279 5.01117,-24.95483 7.08213,-40.92266 7.8827,-60.77857 l 0.62111,-15.40483 28.63278,0 28.63278,0 0,10.4286 z"
       id="path2958"
       inkscape:export-filename="/home/love_paraplegic/path2964.png"
       inkscape:export-xdpi="5.9971442"
       inkscape:export-ydpi="5.9971442" />
    <path
       style="fill:#00ffff;fill-opacity:1"
       d="m 269.6223,289.21739 c 0.80388,3.60641 3.09941,11.69393 5.13448,18.08961 1.76188,5.53711 4.72574,13.89821 6.85456,19.33682 l 0.49425,1.26269 -1.72248,0.0899 c -2.49703,0.13037 -2.5204,0.13676 -2.56744,0.7036 -0.0784,0.94481 -3.59611,-13.74494 -5.33037,-22.25926 -1.39358,-6.84178 -3.33577,-17.99687 -3.20283,-18.39568 0.0259,-0.0777 0.1788,0.44989 0.33983,1.17229 l 0,0 z"
       id="path2964"
       inkscape:export-xdpi="5.9971442"
       inkscape:export-ydpi="5.9971442" />
    <path
       style="fill:#000000;fill-opacity:1"
       d=""
       id="path3016" />
    <path
       style="fill:#000000;fill-opacity:1"
       d=""
       id="path3022" />
    <path
       style="fill:#000000;fill-opacity:1"
       d=""
       id="path3076" />
    <path
       style="fill:#ffffff;fill-opacity:1;stroke:#000000;stroke-opacity:1"
       d="m 386.90404,301.7856 c 31.98127,-0.7507 59.22331,-30.12071 56.5,-62.25 -1.11246,-33.81131 -36.53771,-61.36127 -69.75,-53.3125 -36.2609,5.6217 -58.1857,49.60912 -40.6875,81.9375 9.66495,20.20515 30.65439,35.5631 53.9375,33.625 z"
       id="path3203" />
    <path
       style="fill:#000000;fill-opacity:1;stroke:#000000;stroke-width:0.50000000000000000;stroke-opacity:1"
       d="m 384.98872,501.92256 c 0.86834,-18.25166 -0.0597,-37.89107 0.13219,-56.17187 0.0525,-47.33851 0.0107,-94.67709 0.0241,-142.01563 -7.94822,-1.18754 -16.34593,-1.77861 -23.71875,-5.40625 -17.70603,-7.73037 -31.45571,-24.11206 -34.96875,-43.23438 -5.61747,-25.72295 8.19003,-54.09446 32.01134,-65.28283 8.25848,-4.17341 17.58288,-5.90401 26.67616,-6.71716 -0.13259,-42.37396 0.32085,-84.757514 -0.40625,-127.124994 -0.41624,-1.17383 -1.82053,1.25297 -2.46875,1.54687 -28.36096,29.50991 -54.69096,61.138244 -77.55791,95.103974 -16.50198,25.19461 -31.97099,52.05705 -37.89521,81.91164 -1.21413,11.71505 -0.76569,23.60341 0.40522,35.30871 4.4439,31.10248 16.41922,60.5058 29.67076,88.78256 23.08424,48.04069 51.88442,93.16081 82.9569,136.37235 1.57622,1.6479 2.3663,4.94808 4.26399,5.92701 l 0.87496,1 z"
       id="path4055"
       sodipodi:nodetypes="cccccccccccccccc" />
    <path
       style="fill:#000080;fill-opacity:1;stroke:#000080"
       d="m 270.86003,321.08354 c -4.12421,17.80971 0.82413,37.26811 1.3125,55.5625 11.35917,119.54442 30.23274,238.39174 54.8125,355.875 3.1384,6.5529 8.44047,-6.42134 11.80823,-7.7689 11.12575,-13.13158 27.39218,-20.45164 44.58802,-21.8319 -0.60623,-42.98272 1.36872,-87.36892 -0.72353,-130.00286 -35.85607,-75.25051 -78.46509,-148.15168 -102.32658,-228.45015 -3.05061,-6.95735 -2.89221,-19.36522 -9.47114,-23.38369 z"
       id="path4099"
       sodipodi:nodetypes="cccccccc" />
    <path
       style="fill:#000080;fill-opacity:1;stroke:#000080"
       d="m 383.32349,573.21486 c -4.26153,32.57884 -1,76 -1.20507,108.68031 l 1.91218,21.26944 10.86243,0.84467 c 19.57747,2.09115 44.43046,20.85723 48.84467,45.50368 0.92628,-15.76565 -10.33602,-57.74803 -15.54798,-73.02513 -10.94344,-32.05794 -26.6439,-67.81323 -41.34995,-96.64536 -0.62999,-1.14769 -3.1714,-7.64164 -3.51628,-6.62761 z"
       id="path4101"
       sodipodi:nodetypes="cccccccc" />
    <path
       style="fill:#000080;fill-opacity:1;stroke:none"
       d="m 442.88424,782.39736 c -2.23778,2.03281 -2.28468,5.67782 -4.0625,8.1875 -8.52997,16.51702 -24.78766,28.96234 -43.27154,31.92618 -3.38195,0.76106 -6.96059,0.73924 -10.32221,0.91757 0.12886,57.02539 -0.30135,114.05527 0.32886,171.0776 0.28795,0.52323 -0.39515,3.89878 0.65551,3.17239 5.90535,-14.07096 10.27239,-28.79118 15.28178,-43.22158 15.94832,-48.81237 30.82765,-98.22721 39.08967,-149.00106 0.98166,-7.58436 2.62184,-15.22191 2.76918,-22.83985 -0.0848,-0.1676 -0.27734,-0.29218 -0.46875,-0.21875 z"
       id="path4103" />
    <path
       style="fill:#000080;fill-opacity:1;stroke:none"
       d="m 341.54049,805.39736 c 0.47476,5.58931 2.45205,11.17377 3.44496,16.75963 12.77295,57.0105 25.35233,114.08248 38.60191,170.97473 0.93786,1.21149 0.88335,-1.83382 0.9375,-2.34375 0.81625,-36.11077 0.30038,-72.24079 0.45313,-108.35936 -0.0833,-19.69107 0.16669,-39.52023 -0.125,-59.125 -15.44766,0.28909 -30.57593,-6.27644 -41.67188,-16.84375 -0.51795,-0.30938 -1.00348,-1.08229 -1.64062,-1.0625 z"
       id="path4105" />
  </g>
</svg>
