/*	$NetBSD: shl.x,v 1.6 2002/03/02 22:26:25 uch Exp $	*/

OUTPUT_FORMAT("elf32-shl-nbsd")
OUTPUT_ARCH(sh)
ENTRY(start)

MEMORY
{
  ram : o = 0x8c001000, l = 16M
}
SECTIONS
{
  .text :
  {
    ftext = . ;
    *(.text)
    *(.rodata)
    *(.strings)
  } > ram
  etext = . ;
  PROVIDE (etext = .);
  . = ALIGN(8);
  .data :
  {
    fdata = . ;
    PROVIDE (fdata = .);
    *(.data)
    CONSTRUCTORS
  } > ram
  edata = . ;
  PROVIDE (edata = .);
  . = ALIGN(8);
  .bss :
  {
    fbss = . ;
    PROVIDE (fbss = .);
    *(.bss)
    *(COMMON)
  } > ram
  . = ALIGN(4);
  end = . ;
  PROVIDE (end = .);

  /* Stabs debugging sections.  */
  .stab 0 : { *(.stab) }
  .stabstr 0 : { *(.stabstr) }
  .stab.excl 0 : { *(.stab.excl) }
  .stab.exclstr 0 : { *(.stab.exclstr) }
  .stab.index 0 : { *(.stab.index) }
  .stab.indexstr 0 : { *(.stab.indexstr) }
  .comment 0 : { *(.comment) }
  /* DWARF debug sections.
     Symbols in the DWARF debugging section are relative to the beginning
     of the section so we begin .debug at 0.  */
  /* DWARF 1 */
  .debug          0 : { *(.debug) }
  .line           0 : { *(.line) }
  /* GNU DWARF 1 extensions */
  .debug_srcinfo  0 : { *(.debug_srcinfo) }
  .debug_sfnames  0 : { *(.debug_sfnames) }
  /* DWARF 1.1 and DWARF 2 */
  .debug_aranges  0 : { *(.debug_aranges) }
  .debug_pubnames 0 : { *(.debug_pubnames) }
  /* DWARF 2 */
  .debug_info     0 : { *(.debug_info) }
  .debug_abbrev   0 : { *(.debug_abbrev) }
  .debug_line     0 : { *(.debug_line) }
  .debug_frame    0 : { *(.debug_frame) }
  .debug_str      0 : { *(.debug_str) }
  .debug_loc      0 : { *(.debug_loc) }
  .debug_macinfo  0 : { *(.debug_macinfo) }
  /* SGI/MIPS DWARF 2 extensions */
  .debug_weaknames 0 : { *(.debug_weaknames) }
  .debug_funcnames 0 : { *(.debug_funcnames) }
  .debug_typenames 0 : { *(.debug_typenames) }
  .debug_varnames  0 : { *(.debug_varnames) }
  /* These must appear regardless of  .  */
}

