# Exported from Wings 3D 0.97.03
newmtl above
Ns 100.000
d 1.00000
illum 2
Kd 1.00000 0.00000e+0 0.00000e+0
Ka 1.00000 0.00000e+0 0.00000e+0
Ks 1.00000 1.00000 1.00000

newmtl below
Ns 100.000
d 1.00000
illum 2
Kd 0.00000e+0 0.00000e+0 0.00000e+0
Ka 0.00000e+0 0.00000e+0 0.00000e+0
Ks 1.00000 1.00000 1.00000

newmtl cristal
Ns 10.0000
d 0.800000
illum 2
Kd 0.00000e+0 0.00000e+0 1.00000
Ka 0.00000e+0 0.00000e+0 1.00000
Ks 0.00000e+0 1.00000 1.00000

