# Exported from Wings 3D 0.98.36
mtllib n1.mtl
o sphere1_cut2
#45 vertices, 55 faces
v 0.51782550 0.60200516 -1.12837339
v 1.01449157 0.53967037 8.3929995e-3
v 1.22263463 0.75437910 2.07378593
v 0.50541473 0.75437910 2.79100583
v -1.7363199e-3 1.41318423 3.11989036
v -0.50888737 0.75437910 2.79100583
v -1.22610727 0.75437910 2.07378593
v -1.01796421 0.53967037 8.3929995e-3
v -0.52129814 0.60200516 -1.12837339
v -1.7363199e-3 3.6855203e-3 -5.03513405
v 0.51782550 3.6855203e-3 -4.20984187
v 0.95828874 3.6855203e-3 -3.22884379
v 1.87600797 3.6855203e-3 -1.12837339
v 2.42349486 3.6855203e-3 2.50372783
v 0.93535663 3.6855203e-3 3.82897740
v -1.7363199e-3 3.6855203e-3 4.01537677
v -0.93882927 3.6855203e-3 3.82897740
v -2.42696750 3.6855203e-3 2.50372783
v -1.87948061 3.6855203e-3 -1.12837339
v -0.96176138 3.6855203e-3 -3.22884379
v -0.52129814 3.6855203e-3 -4.20984187
v -1.7363199e-3 1.07339633 1.34930038
v -1.7363199e-3 0.91388771 2.12059241
v 0.25183921 0.75437910 2.84144513
v -0.25531185 0.75437910 2.84144513
v -1.7363199e-3 1.17470565 3.75200738
v -0.30516042 -0.21794930 -1.22310477
v -1.7363199e-3 -0.21794930 -1.70507540
v 0.30168778 -0.21794930 -1.22310477
v 0.55891831 -0.21794930 -0.65020189
v 1.09486635 -0.21794930 0.57647282
v 1.42832895 -0.21794930 2.02343430
v 1.31947171 -0.21794930 2.69761993
v 1.00947253 -0.21794930 3.16156650
v 0.54552597 -0.21794930 3.47156568
v -1.7363199e-3 -0.21794930 3.58042292
v -0.54899860 -0.21794930 3.47156568
v -1.01294517 -0.21794930 3.16156650
v -1.32294435 -0.21794930 2.69761993
v -1.43180159 -0.21794930 2.02343430
v -1.09833899 -0.21794930 0.57647282
v -0.56239095 -0.21794930 -0.65020189
v -1.7363199e-3 0.37903231 -3.22781409
v 0.30975413 0.37903231 -2.93807173
v -0.31322677 0.37903231 -2.93807173
vn 0.39473644 0.91059288 -0.12248979
vn 0.35408294 0.93091113 8.9608803e-2
vn 0.17790361 0.92320985 0.34063746
vn -0.17790361 0.92320985 0.34063746
vn -0.35408294 0.93091113 8.9608803e-2
vn -0.39473644 0.91059288 -0.12248979
vn -1.6091320e-17 0.99996618 8.2238948e-3
vn -4.9224612e-2 -0.99845190 -2.5898858e-2
vn -1.0219642e-16 -0.99902214 -4.4212611e-2
vn 6.1537752e-2 -0.99757948 -3.2377249e-2
vn 4.7474658e-2 -0.99865112 -2.1026205e-2
vn 9.0181792e-2 -0.99565947 -2.3010045e-2
vn 5.4135306e-2 -0.99850718 -7.2650176e-3
vn 8.0741062e-2 -0.99581124 4.2905197e-2
vn 0.13396692 -0.98041441 0.14436219
vn 7.2283194e-2 -0.98593142 0.15071289
vn 3.5752886e-18 -0.97248048 0.23298436
vn -9.0508354e-2 -0.97785257 0.18871296
vn -0.13396692 -0.98041441 0.14436219
vn -6.9114619e-2 -0.99693244 3.6726992e-2
vn -5.4135306e-2 -0.99850718 -7.2650176e-3
vn -6.0083832e-2 -0.99807560 -1.5330497e-2
vn -7.1236156e-2 -0.99696038 -3.1550012e-2
vn 0.24209035 0.95839789 -0.15121422
vn 0.24209035 0.95839789 -0.15121422
vn 0.24209035 0.95839789 -0.15121422
vn 0.24209035 0.95839789 -0.15121422
vn 0.24209035 0.95839789 -0.15121422
vn 0.92505948 0.37667630 -4.8784585e-2
vn -0.92505948 0.37667630 -4.8784585e-2
vn -0.92505948 0.37667630 -4.8784585e-2
vn 0.92505948 0.37667630 -4.8784585e-2
vn -0.24209035 0.95839789 -0.15121422
vn -0.24209035 0.95839789 -0.15121422
vn -0.24209035 0.95839789 -0.15121422
vn -0.24209035 0.95839789 -0.15121422
vn -0.24209035 0.95839789 -0.15121422
vn -5.7840174e-16 0.97591472 -0.21815237
vn -1.5350265e-16 -0.99779249 -6.6408907e-2
vn -1.5350265e-16 -0.99779249 -6.6408907e-2
vn -5.7840174e-16 0.97591472 -0.21815237
vn 0.35905753 0.91352530 -0.19117851
vn 0.12278755 -0.99032806 -6.4602994e-2
vn 0.12278755 -0.99032806 -6.4602994e-2
vn 0.35905753 0.91352530 -0.19117851
vn 0.41653826 0.89417610 -0.16414928
vn 0.41653826 0.89417610 -0.16414928
vn 0.14203932 -0.98786000 -6.2908256e-2
vn 0.14203932 -0.98786000 -6.2908256e-2
vn 0.45103737 0.88327556 -0.12802179
vn 0.17965283 -0.98266152 -4.5838741e-2
vn 0.17965283 -0.98266152 -4.5838741e-2
vn 0.45103737 0.88327556 -0.12802179
vn 0.91302852 -0.14389756 0.38167055
vn 0.91302852 -0.14389756 0.38167055
vn 0.91302852 -0.14389756 0.38167055
vn 0.91302852 -0.14389756 0.38167055
vn 0.44389480 -8.3393238e-2 0.89218999
vn 0.44389480 -8.3393238e-2 0.89218999
vn 0.44389480 -8.3393238e-2 0.89218999
vn 0.44389480 -8.3393238e-2 0.89218999
vn 0.10984111 0.82643852 0.55220857
vn -0.96815368 5.4934471e-2 0.24425531
vn 0.96815368 5.4934471e-2 0.24425531
vn -0.10984111 0.82643852 0.55220857
vn 6.9671323e-18 -0.89099430 0.45401450
vn 6.9671323e-18 -0.89099430 0.45401450
vn -0.44389480 -8.3393238e-2 0.89218999
vn -0.44389480 -8.3393238e-2 0.89218999
vn -0.44389480 -8.3393238e-2 0.89218999
vn -0.44389480 -8.3393238e-2 0.89218999
vn -0.91302852 -0.14389756 0.38167055
vn -0.91302852 -0.14389756 0.38167055
vn -0.91302852 -0.14389756 0.38167055
vn -0.91302852 -0.14389756 0.38167055
vn -0.45103737 0.88327556 -0.12802179
vn -0.17965283 -0.98266152 -4.5838741e-2
vn -0.17965283 -0.98266152 -4.5838741e-2
vn -0.45103737 0.88327556 -0.12802179
vn -0.41653826 0.89417610 -0.16414928
vn -0.14203932 -0.98786000 -6.2908256e-2
vn -0.14203932 -0.98786000 -6.2908256e-2
vn -0.41653826 0.89417610 -0.16414928
vn -0.35905753 0.91352530 -0.19117851
vn -0.12278755 -0.99032806 -6.4602994e-2
vn -0.12278755 -0.99032806 -6.4602994e-2
vn -0.35905753 0.91352530 -0.19117851
vn 1.0764009e-16 0.97927781 0.20252154
vn 0.87789284 0.42836327 -0.21403055
vn -0.87789284 0.42836327 -0.21403055
vn 1.0764009e-16 0.97927781 0.20252154
vn 7.6497765e-2 0.91991637 0.38458023
vn 0.96032006 0.27418692 5.1057964e-2
vn 0.96032006 0.27418692 5.1057964e-2
vn 7.6497765e-2 0.91991637 0.38458023
vn 0.96032006 0.27418692 5.1057964e-2
vn -7.6497765e-2 0.91991637 0.38458023
vn -0.96032006 0.27418692 5.1057964e-2
vn -0.96032006 0.27418692 5.1057964e-2
vn -7.6497765e-2 0.91991637 0.38458023
vn -0.96032006 0.27418692 5.1057964e-2
vn -0.96537809 0.18583791 0.18305574
vn 0.96537809 0.18583791 0.18305574
vn -0.96537809 0.18583791 0.18305574
vn 0.96537809 0.18583791 0.18305574
vn -5.7840174e-16 0.97591472 -0.21815237
vn -5.7840174e-16 0.97591472 -0.21815237
vn 0.0000000e+0 1.00000000 -3.0753426e-16
vn 0.35905753 0.91352530 -0.19117851
vn 0.35905753 0.91352530 -0.19117851
vn -1.4680823e-16 0.99812199 -6.1257675e-2
vn -1.4680823e-16 0.99812199 -6.1257675e-2
vn -0.35905753 0.91352530 -0.19117851
vn -0.35905753 0.91352530 -0.19117851
vn -1.4680823e-16 0.99812199 -6.1257675e-2
vn -1.4680823e-16 0.99812199 -6.1257675e-2
g sphere1_cut2_crystal
usemtl crystal
f 1//28 9//37 22//7
f 9//36 1//27 44//112 45//116
f 10//39 28//9 27//8 21//85
f 11//43 29//10 28//9 10//40
f 12//48 30//11 29//10 11//44
f 13//51 31//12 30//11 12//49
f 14//54 33//14 32//13 31//12 13//52
f 16//66 36//17 35//16 15//59
f 17//69 37//18 36//17 16//67
f 19//77 41//22 40//21 39//20 18//72
f 20//81 42//23 41//22 19//78
f 21//86 27//8 42//23 20//82
f 27//8 30//11 42//23
f 28//9 29//10 27//8
f 30//11 27//8 29//10
f 31//12 41//22 30//11
f 32//13 41//22 31//12
f 33//14 14//55 15//60 35//16 34//15
f 33//14 40//21 32//13
f 34//15 35//16 33//14
f 35//16 39//20 33//14
f 36//17 39//20 35//16
f 37//18 17//70 18//73 39//20 38//19
f 37//18 39//20 36//17
f 38//19 39//20 37//18
f 40//21 33//14 39//20
f 41//22 32//13 40//21
f 42//23 30//11 41//22
f 43//108 45//115 44//111
g sphere1_cut2_main
usemtl main
f 1//24 22//7 2//1
f 2//1 3//2 14//56 13//53
f 2//1 13//50 12//47 1//26
f 3//2 4//3 15//61 14//57
f 4//3 22//7 23//91 24//95
f 6//4 7//5 18//75 17//71
f 7//5 6//4 22//7
f 7//5 8//6 19//79 18//74
f 8//6 22//7 9//33
f 9//34 20//80 19//76 8//6
f 9//35 45//114 21//87 20//83
f 10//41 43//107 44//110 11//45
f 12//46 11//42 44//109 1//25
f 17//68 16//65 25//100 6//4
f 21//84 45//113 43//106 10//38
f 22//7 3//2 2//1
f 22//7 4//3 3//2
f 22//7 6//4 25//97 23//88
f 22//7 8//6 7//5
f 24//92 16//62 15//58 4//3
g sphere1_cut2_under
usemtl under
f 5//30 23//90 25//99
f 5//29 24//93 23//89
f 16//63 26//102 25//98
f 24//94 26//103 16//64
f 25//101 26//104 5//31
f 26//105 24//96 5//32
