# Exported from Wings 3D 0.99.00b
newmtl above
Ns 100.0
d 1.0
illum 2
Kd 1.0 0.0 0.0
Ka 1.0 0.0 0.0
Ks 1.0 1.0 1.0
Ke 0.0 0.0 0.0

newmtl below
Ns 100.0
d 1.0
illum 2
Kd 0.39215686274509803 0.39215686274509803 0.39215686274509803
Ka 0.39215686274509803 0.39215686274509803 0.39215686274509803
Ks 1.0 1.0 1.0
Ke 0.0 0.0 0.0

newmtl cristal
Ns 10.0
d 0.5
illum 2
Kd 0.0 0.0 1.0
Ka 0.0 0.0 1.0
Ks 0.0 1.0 1.0
Ke 0.0 0.0 0.0

