# Exported from Wings 3D 0.97.03
newmtl cristal
Ns 10.0000
d 0.600000
illum 2
Kd 0.00000e+0 0.00000e+0 1.00000
Ka 0.00000e+0 0.00000e+0 1.00000
Ks 1.00000 1.00000 0.00000e+0

newmtl fondo
Ns 100.000
d 1.00000
illum 2
Kd 0.00000e+0 7.84314e-2 0.196078
Ka 0.00000e+0 7.84314e-2 0.196078
Ks 0.00000e+0 1.00000 1.00000

newmtl nave
Ns 100.000
d 1.00000
illum 2
Kd 1.00000 0.00000e+0 0.00000e+0
Ka 1.00000 0.00000e+0 0.00000e+0
Ks 1.00000 1.00000 0.00000e+0

newmtl oscuro
Ns 100.000
d 1.00000
illum 2
Kd 0.392157 0.00000e+0 0.00000e+0
Ka 0.392157 0.00000e+0 0.00000e+0
Ks 1.00000 1.00000 0.00000e+0

