# Exported from Wings 3D 0.97.03
newmtl base
Ns 100.000
d 1.00000
illum 2
Kd 0.00000e+0 0.392157 0.00000e+0
Ka 1.00000 1.00000 1.00000
Ks 0.00000e+0 1.00000 0.00000e+0

newmtl cristal
Ns 100.000
d 0.500000
illum 2
Kd 0.00000e+0 1.00000 1.00000
Ka 0.00000e+0 1.00000 1.00000
Ks 1.00000 1.00000 0.00000e+0

newmtl fondo
Ns 50.0000
d 1.00000
illum 2
Kd 0.196078 0.196078 0.196078
Ka 0.784314 0.784314 0.196078
Ks 1.00000 1.00000 1.00000

newmtl hilight
Ns 100.000
d 1.00000
illum 2
Kd 1.00000 0.00000e+0 0.00000e+0
Ka 1.00000 1.00000 1.00000
Ks 1.00000 1.00000 1.00000

