# Exported from Wings 3D 0.99.00b
mtllib n2.mtl
o cylinder1_cut2
#216 vertices, 211 faces
v 1.61925635 -0.19023105 0.53025260
v 1.64095483 -0.25666041 0.49202298
v 1.69491828 -0.31148476 0.38214692
v 1.77293127 -0.34635759 0.21735205
v 1.86311701 -0.35596983 2.2726893e-2
v 1.95174556 -0.33885810 -0.17209863
v 2.02532402 -0.29762752 -0.33746410
v 2.07265073 -0.23855506 -0.44819413
v 2.08652063 -0.17063396 -0.48743107
v 2.06482215 -0.10420461 -0.44920145
v 2.01085870 -4.9380261e-2 -0.33932539
v 1.93284571 -1.4507430e-2 -0.17453052
v 1.84265996 -4.8951884e-3 2.0094634e-2
v 1.75403142 -2.2006912e-2 0.21492016
v 1.68045296 -6.3237497e-2 0.38028563
v 1.63312625 -0.12230996 0.49101566
v 3.14176011 0.64246416 0.91131082
v 3.14967217 0.65307201 0.89732104
v 3.15834018 0.66635117 0.85211371
v 3.17008008 0.73231570 0.54808538
v 3.16187172 0.75177033 0.50317099
v 3.15092627 0.76511877 0.48911279
v 3.13985809 0.76665265 0.50694621
v 3.13105843 0.75361482 0.55276648
v 3.12452451 0.69627585 0.69711214
v 3.12990672 0.64654115 0.84454170
v 3.13514808 0.63887615 0.89242860
v 2.92497476 0.30379654 0.93545369
v 3.07695760 0.45680597 0.97483759
v 2.93711207 0.30355723 0.90747050
v 3.09198546 0.45590855 0.95082711
v 2.95397148 0.32305130 0.83090484
v 3.11361179 0.47377968 0.88101539
v 2.99086484 0.39169928 0.57930369
v 3.16066884 0.53556457 0.65424268
v 3.01361022 0.45825610 0.32340524
v 3.18879400 0.59126408 0.41869361
v 3.01501784 0.48522878 0.24473526
v 3.19055193 0.61602718 0.34337282
v 3.00925006 0.50697168 0.21816144
v 3.18244678 0.63603243 0.31715054
v 2.99724205 0.52040214 0.24827972
v 3.16575048 0.64719972 0.34526749
v 2.98081469 0.52055057 0.33030594
v 3.14419203 0.64643365 0.42272648
v 2.96238783 0.50306691 0.45074772
v 2.94465134 0.46746376 0.58993107
v 3.10435177 0.60722283 0.65803581
v 2.93023067 0.41903317 0.72586334
v 2.92134435 0.36806116 0.83823015
v 3.07497286 0.51844344 0.87873871
v 2.91945576 0.32651674 0.91131781
v 3.07096142 0.47876514 0.94917494
v 3.13828418 0.63950009 0.90582016
v 3.07396826 0.46776018 0.96198143
v 0.48529112 -0.23591784 0.43764566
v 9.8279060e-2 -0.15730741 0.34351711
v 0.49233135 -0.19017875 0.35311009
v 0.11018369 -2.9723649e-2 0.10923719
v 0.52012601 -8.9745337e-2 0.11028132
v 0.13075345 7.2537972e-2 -0.24213369
v 0.56440674 -2.0580186e-2 -0.25376895
v 0.15685795 0.25917549 -0.65705573
v 0.60596337 6.9181170e-3 -0.56802735
v 0.18452049 0.27802424 -1.07238938
v 0.64838091 -1.1421140e-2 -0.87659989
v 0.20952650 0.18709546 -1.42497399
v 0.68585634 -7.2886654e-2 -1.13844954
v 0.22806710 4.6058810e-2 -1.66119970
v 0.71270485 -0.16823613 -1.31375971
v 0.23731926 -0.12375293 -1.74513979
v 0.72485135 -0.28304618 -1.37586643
v 0.23587507 -0.29653987 -1.66400944
v 0.72320530 -0.28992562 -1.34090520
v 0.22395561 -0.44594615 -1.43011652
v 0.70291082 -0.34852499 -1.16687417
v 0.20337712 -0.54908853 -1.07900426
v 0.66979737 -0.38898436 -0.90581728
v 0.17727434 -0.49009132 -0.66406735
v 0.62888724 -0.40507730 -0.59743694
v 0.14962251 -0.46258818 -0.24845643
v 0.58323267 -0.29430576 -0.25928529
v 0.12463070 -0.37078469 0.10451170
v 0.53450781 -0.25831642 0.10617323
v 0.10609992 -0.25178028 0.34100506
v 0.50010389 -0.30266247 0.35093223
v -0.41059757 -0.35249918 0.22175493
v -0.41829742 -0.10030415 0.23048460
v -0.41695079 2.4108477e-2 7.0804126e-2
v -0.41221855 0.21458431 -0.25767872
v -0.40481790 0.35825451 -0.65507858
v -0.39587932 0.53066438 -1.04028172
v -0.38676998 0.47727346 -1.38810123
v -0.37888168 0.13090598 -2.22232333
v -0.37341739 -0.23858291 -2.86298627
v -0.37120810 -0.51600815 -1.84751668
v -0.37258698 -0.65381194 -1.44938745
v -0.37733957 -0.67290836 -1.14018667
v -0.38473784 -0.62195351 -0.78896486
v -0.39365323 -0.51460690 -0.43362201
v -0.40273113 -0.40766360 -0.15341846
v -2.45573638 -0.25312594 0.44992617
v -2.47385214 -0.32016980 0.41091173
v -2.52172764 -0.37656596 0.29902821
v -2.59207427 -0.41372863 0.13130887
v -2.67418239 -0.42600012 -6.6712548e-2
v -2.75555179 -0.41151220 -0.26488908
v -2.82379470 -0.37247054 -0.43305014
v -2.86852177 -0.31481886 -0.54559474
v -2.88292371 -0.24733413 -0.58538897
v -2.86480795 -0.18029027 -0.54637453
v -2.81693244 -0.12389410 -0.43449102
v -2.74658581 -8.6731434e-2 -0.26677168
v -2.66447769 -7.4459948e-2 -6.8750257e-2
v -2.58310830 -8.8947863e-2 0.12942627
v -2.51486538 -0.12798953 0.29758734
v -2.47013831 -0.18564120 0.41013193
v -4.01703436 0.53197279 0.77019636
v -4.02471256 0.54234002 0.75589926
v -4.03199822 0.55537294 0.71037745
v -4.03377985 0.62112877 0.40608258
v -4.02441233 0.64085467 0.36151465
v -4.01333850 0.65454297 0.34789050
v -4.00303414 0.65640672 0.36614521
v -3.99564858 0.64361870 0.41228453
v -3.99304111 0.58642082 0.55681038
v -4.00269092 0.53645411 0.70394363
v -4.00957597 0.52860195 0.75159149
v -3.79102412 0.20013943 0.80306763
v -3.94908850 0.34836349 0.83633987
v -3.80203632 0.19954283 0.77462812
v -3.96312385 0.34701750 0.81175649
v -3.81645935 0.21855407 0.69744581
v -3.98252386 0.36425541 0.74113606
v -3.84551130 0.28618423 0.44454475
v -4.02249328 0.42469710 0.51264788
v -3.86019918 0.35216329 0.18790842
v -4.04302101 0.47964568 0.27613977
v -3.85933758 0.37912754 0.10922767
v -4.04257308 0.50438857 0.20079315
v -3.85320079 0.40105419 8.2888513e-2
v -4.03406209 0.52465027 0.17489841
v -3.84280878 0.41483037 0.11344834
v -4.01883900 0.53631022 0.20364455
v -3.82963837 0.41543563 0.19605800
v -4.00033576 0.53616248 0.28189324
v -3.81544056 0.39845550 0.31714288
v -3.80211170 0.36333183 0.45693858
v -3.96860682 0.49805629 0.51861334
v -3.79157069 0.31528651 0.59336290
v -3.78555023 0.26454458 0.70602356
v -3.94522149 0.41009127 0.74035634
v -3.78526200 0.22303375 0.77915412
v -3.94276617 0.37051278 0.81092004
v -1.31813369 -0.26375253 0.40209647
v -0.93032295 -0.17318322 0.32324126
v -1.32324547 -0.21820101 0.31732136
v -0.93691805 -4.5884988e-2 8.8596672e-2
v -1.34453631 -0.11852520 7.3525017e-2
v -0.94677296 5.5907048e-2 -0.26337394
v -1.37655192 -5.0537630e-2 -0.29202921
v -0.96225473 0.24190270 -0.67911573
v -1.40652319 -2.4143314e-2 -0.60769757
v -0.97410019 0.26014168 -1.09522816
v -1.43616427 -4.3594749e-2 -0.91769054
v -0.98237816 0.16869918 -1.44846886
v -1.46137986 -0.10602786 -1.18077595
v -0.98723749 2.7301369e-2 -1.68515584
v -1.47834615 -0.20205359 -1.35694980
v -0.98793229 -0.14266389 -1.76929200
v -1.48448865 -0.31714591 -1.41941703
v -0.98435602 -0.31537335 -1.68806269
v -1.48400988 -0.32399256 -1.38441392
v -0.97705764 -0.46448301 -1.45379095
v -1.46878980 -0.38204379 -1.20968283
v -0.96715666 -0.56715496 -1.10207787
v -1.44475517 -0.42162112 -0.94749943
v -0.95925487 -0.50763292 -0.68647066
v -1.41554983 -0.43663187 -0.63773697
v -0.94886096 -0.47954256 -0.27010978
v -1.38669265 -0.32471029 -0.29811654
v -0.94063926 -0.38722644 8.3513052e-2
v -1.35353792 -0.28745718 6.8955990e-2
v -0.93512061 -0.26785084 0.32048048
v -1.32745242 -0.33086962 0.31490736
v 3.14569443 0.73544603 0.79249882
v 3.14936562 0.73704769 0.78638061
v 3.15338758 0.74222339 0.76660991
v 3.15883489 0.77703097 0.63364804
v 3.15502621 0.78217312 0.61400546
v 3.14994752 0.78378262 0.60785734
v 3.14481189 0.78174091 0.61565649
v 3.14072885 0.77649504 0.63569525
v 3.13769711 0.75996920 0.69882249
v 3.14019445 0.74309029 0.76329842
v 3.14262644 0.73760782 0.78424098
v -4.01672796 0.62487365 0.65135254
v -4.01326727 0.62700368 0.64321601
v -4.01007261 0.63245879 0.62237799
v -4.00559510 0.64930377 0.55803164
v -4.00680496 0.66585024 0.49482560
v -4.01023186 0.67113263 0.47464731
v -4.01501309 0.67322258 0.46666391
v -4.02015134 0.67166278 0.47262221
v -4.02449787 0.66656029 0.49211328
v -4.02770671 0.64919028 0.55846515
v -4.02367120 0.63172219 0.62519171
v -4.02029065 0.62651049 0.64509994
v 3.14782098 0.77161432 0.70017808
v -4.01587052 0.66104811 0.55900823
v 0.20952650 0.18709546 -1.42497399
v 0.22806710 4.6058810e-2 -1.66119970
v -0.38676998 0.47727346 -1.38810123
v -0.37888168 0.13090598 -2.22232333
v -0.98237816 0.16869918 -1.44846886
v -0.98723749 2.7301369e-2 -1.68515584
vn -0.18280703 -3.3061230e-2 0.98259277
vn 8.5471407e-2 -0.87749287 0.47191196
vn 0.18001979 -0.97315764 0.14337739
vn 0.10120602 -0.98357359 0.14946681
vn 0.26717480 -0.96084522 7.3444421e-2
vn 0.26758232 -0.96121910 -6.6764821e-2
vn 0.42104942 -0.89243304 -0.16211310
vn 0.54339053 -0.72755360 -0.41879887
vn 0.54659441 1.2203614e-2 -0.83730856
vn 0.12443281 0.78785165 -0.60316354
vn -8.9982212e-2 0.95072829 -0.29667984
vn -0.16410044 0.97871239 -0.12326035
vn -0.20180125 0.97938631 8.8718118e-3
vn -0.22693771 0.96529406 0.12925424
vn -0.25157344 0.92572457 0.28239126
vn -0.27304393 0.78862209 0.55092850
vn 0.85800294 0.23550671 0.45647294
vn 0.98471718 5.7391121e-2 0.16443337
vn 0.98915072 0.14332735 3.2220006e-2
vn 0.91827068 0.38945231 -7.1455349e-2
vn -0.75589686 0.60107041 -0.25948854
vn -0.96665098 0.24334388 -7.9810054e-2
vn -0.97638042 0.21459227 2.5128254e-2
vn -0.94755102 0.29515671 0.12259517
vn -0.89186356 0.37790235 0.24853410
vn -0.16529913 -0.15097159 0.97461981
vn 0.45360946 -0.81358425 0.36375696
vn 0.83772266 -0.47298553 0.27295684
vn 0.55446342 -0.82777625 8.5771726e-2
vn 0.88586264 -0.46054594 5.6078717e-2
vn 0.60106728 -0.79903012 -1.6400650e-2
vn 0.83302911 -0.55204954 -3.6108325e-2
vn 0.64502895 -0.75408011 -0.12369659
vn 0.92155875 -0.38232064 -6.7530678e-2
vn 0.70024067 -0.60745397 -0.37505024
vn 0.94494128 -0.19329331 -0.26405240
vn 0.44211462 0.20596847 -0.87299007
vn -0.28548790 0.84249294 -0.45683947
vn -0.67263326 0.63578739 -0.37860122
vn -0.47517434 0.86520087 -0.16011493
vn -0.85907786 0.50012349 -0.10891153
vn -0.47512170 0.87750870 -6.5098727e-2
vn -0.53938111 0.83968584 6.3211644e-2
vn -0.86230330 0.50319295 5.6831885e-2
vn -0.50373604 0.85092481 0.14891931
vn -0.56386163 0.78070268 0.26937593
vn -0.82586407 0.52882935 0.19567332
vn -0.56560401 0.64602452 0.51258601
vn -0.77858405 0.50532772 0.37208973
vn -0.82376546 0.42642563 0.37359288
vn -0.75042713 0.45872605 0.47584612
vn -1.3116833e-2 0.86709673 0.49796707
vn 0.10865208 0.90686285 0.40717870
vn 2.4649820e-2 0.94752565 0.31872798
vn 0.21122117 0.92034187 0.32917542
vn 0.10242652 0.97334204 0.20521713
vn 0.33197628 0.91175593 0.24185301
vn 0.21336374 0.97214034 9.7051958e-2
vn 0.44608686 0.89495974 -7.3195607e-3
vn 0.30709066 0.94764696 -8.7524675e-2
vn 0.37981335 0.88069391 -0.28305488
vn 0.49841324 0.65521456 -0.56769545
vn 0.58092447 -8.3692365e-2 -0.80964334
vn 0.43944952 -0.76205056 -0.47556604
vn 0.37777394 -0.75686858 -0.53332617
vn 0.33222335 -0.89873362 -0.28619141
vn 0.26469625 -0.92579749 -0.26987942
vn 0.26484161 -0.96377872 -3.1456373e-2
vn 0.19514336 -0.97761589 -7.8652712e-2
vn 0.20101368 -0.96789510 0.15090583
vn 0.11956060 -0.98689933 0.10832807
vn 0.16150437 -0.96210421 0.21970849
vn 0.10149085 -0.97843046 0.17992619
vn 9.3058356e-2 -0.96753097 0.23499779
vn 7.4994010e-2 -0.98914676 0.12635102
vn -2.6214488e-2 -0.91729548 0.39734343
vn -2.3413432e-2 0.88219988 0.47029266
vn -2.2531225e-2 0.92082348 0.38932823
vn -2.0595113e-2 0.94995770 0.31169891
vn 0.14488437 -2.8003525e-2 0.98905223
vn -7.6887269e-2 -0.87999877 0.46871154
vn -0.15542195 -0.97833497 0.13676515
vn -7.6625499e-2 -0.98631831 0.14596139
vn -0.24009228 -0.96867456 6.3445151e-2
vn -0.23496359 -0.96897557 -7.6671028e-2
vn -0.38660378 -0.90489865 -0.17803359
vn -0.50376479 -0.74371576 -0.43944044
vn -0.51329668 -4.1551204e-3 -0.85820118
vn -0.12481737 0.78400464 -0.60807677
vn 7.2229118e-2 0.95323191 -0.29348232
vn 0.13855857 0.98338373 -0.11729432
vn 0.17098544 0.98514003 1.6220199e-2
vn 0.19178215 0.97175673 0.13750806
vn 0.21157421 0.93287296 0.29152084
vn 0.22666712 0.79633481 0.56077882
vn -0.87698725 0.22114409 0.42660127
vn -0.99044595 4.5979225e-2 0.13001047
vn -0.99143465 0.13059700 -1.3291425e-3
vn -0.92279049 0.37188169 -0.10080535
vn 0.75629354 0.61114006 -0.23351212
vn 0.96621322 0.25315584 -4.8416275e-2
vn 0.97250404 0.22580508 5.6990929e-2
vn 0.93824235 0.30864668 0.15632823
vn 0.87045498 0.39385311 0.29527591
vn 0.13137510 -0.14641119 0.98046129
vn -0.44227442 -0.82741164 0.34609725
vn -0.83283620 -0.49876952 0.24002671
vn -0.53161178 -0.84453912 6.4362965e-2
vn -0.87275476 -0.48768906 2.1412775e-2
vn -0.57501852 -0.81718225 -3.9583704e-2
vn -0.81353248 -0.57746315 -6.8565418e-2
vn -0.61608440 -0.77354458 -0.14855571
vn -0.90594922 -0.41052705 -0.10355459
vn -0.66584709 -0.62853865 -0.40197862
vn -0.92739099 -0.22219155 -0.30095989
vn -0.41351946 0.19276231 -0.88985636
vn 0.27713907 0.85117673 -0.44574894
vn 0.66709361 0.65646521 -0.35219247
vn 0.45419658 0.87954511 -0.14179513
vn 0.84686417 0.52645361 -7.5283922e-2
vn 0.45002074 0.89178768 -4.6862280e-2
vn 0.51031110 0.85588716 8.3903222e-2
vn 0.84346070 0.52952032 9.0455978e-2
vn 0.47098715 0.86596903 0.16813310
vn 0.52845779 0.79756192 0.29090778
vn 0.80080598 0.55393595 0.22773831
vn 0.52478714 0.66284428 0.53407482
vn 0.74218369 0.52830024 0.41238600
vn -3.3268589e-2 0.86678570 0.49756984
vn -0.15305777 0.90281341 0.40187220
vn -6.6407200e-2 0.94612025 0.31693306
vn -0.25293301 0.91315411 0.31964740
vn -0.14041062 0.96959401 0.20043032
vn -0.36898574 0.90126595 0.22708855
vn -0.24691015 0.96503631 8.7979019e-2
vn -0.47102515 0.88171570 -2.6696932e-2
vn -0.33249184 0.93777542 -0.10013215
vn -0.39535419 0.86872970 -0.29833501
vn -0.49563494 0.63987207 -0.58729017
vn -0.54571539 -0.10108132 -0.83185172
vn -0.39894564 -0.77679778 -0.48726541
vn -0.33293902 -0.76783798 -0.54733577
vn -0.29290617 -0.90875829 -0.29726142
vn -0.22517129 -0.93335828 -0.27953571
vn -0.23297251 -0.97161659 -4.1048781e-2
vn -0.16164118 -0.98312263 -8.5685664e-2
vn -0.17637735 -0.97380793 0.14348920
vn -9.3233651e-2 -0.99018367 0.10413346
vn -0.14012160 -0.96677108 0.21382144
vn -7.8268723e-2 -0.98120494 0.17638276
vn -7.2365028e-2 -0.97006420 0.23181620
vn -4.9363655e-2 -0.99106614 0.12389968
vn 3.8824548e-2 -0.91629165 0.39862548
vn 0.53690351 0.72147203 0.43727877
vn 0.82364621 0.51714989 0.23272926
vn 0.83497807 0.54205012 9.4832909e-2
vn 0.71799391 0.69602270 -6.0946548e-3
vn -0.60099494 0.79913837 -1.3525692e-2
vn -0.84594919 0.53119919 4.6876332e-2
vn -0.84553873 0.51656316 0.13500651
vn -0.89990026 0.40083126 0.17179586
vn -0.85202577 0.46743760 0.23569931
vn 0.83940191 0.47218264 0.26916166
vn 0.89359934 0.40134157 0.20101037
vn 0.84328787 0.51339718 0.15902484
vn 0.84926126 0.52346709 6.8829659e-2
vn 0.60369461 0.79721158 2.5538301e-3
vn -0.72132796 0.69218518 -2.3783459e-2
vn -0.93076608 0.36561362 -1.0884391e-3
vn -0.95627696 0.28153567 7.9196222e-2
vn -0.92150337 0.34302024 0.18212262
vn -0.54888194 0.72316553 0.41923767
vn -0.82627925 0.41862402 0.37685082
vn 0.65273149 0.38634332 0.65167511
vn 0.65273149 0.38634332 0.65167511
vn -0.82627925 0.41862402 0.37685082
vn -0.46128055 0.81254540 -0.35635688
vn 0.84681782 0.51753482 -0.12270814
vn 0.84681782 0.51753482 -0.12270814
vn -0.46128055 0.81254540 -0.35635688
vn 3.3722145e-2 4.5985151e-2 0.99837277
vn 3.3722145e-2 4.5985151e-2 0.99837277
vn 3.3722145e-2 4.5985151e-2 0.99837277
vn 3.3722145e-2 4.5985151e-2 0.99837277
vn 0.29330783 0.56769769 -0.76921379
vn 0.29330783 0.56769769 -0.76921379
vn 0.29330783 0.56769769 -0.76921379
vn 0.29330783 0.56769769 -0.76921379
vn -8.3822518e-2 5.2731224e-2 0.99508452
vn -8.3822518e-2 5.2731224e-2 0.99508452
vn -8.3822518e-2 5.2731224e-2 0.99508452
vn -8.3822518e-2 5.2731224e-2 0.99508452
vn -0.24489531 -4.6024831e-2 0.96845650
vn 5.6836426e-2 0.87242186 0.48543766
vn 5.6836426e-2 0.87242186 0.48543766
vn -0.23120892 -4.3696863e-2 0.97192233
vn 5.6836426e-2 0.87242186 0.48543766
vn -0.23120892 -4.3696863e-2 0.97192233
vn 0.52186038 0.82317385 -0.22371087
vn 0.52186038 0.82317385 -0.22371087
vn 0.52186038 0.82317385 -0.22371087
vn 7.6323467e-3 0.56191039 -0.82716290
vn 7.6323467e-3 0.56191039 -0.82716290
vn 0.62815816 0.59478505 -0.50164536
vn 0.62815816 0.59478505 -0.50164536
vn 0.62815816 0.59478505 -0.50164536
vn -1.1559723e-2 0.98299845 -0.18324959
vn -1.1559723e-2 0.98299845 -0.18324959
vn 0.71686061 -7.5054441e-2 -0.69316498
vn 0.71686061 -7.5054441e-2 -0.69316498
vn 0.71686061 -7.5054441e-2 -0.69316498
vn 0.71686061 -7.5054441e-2 -0.69316498
vn -5.9231230e-3 -0.93627358 0.35122171
vn -0.23120892 -4.3696863e-2 0.97192233
vn -5.9231230e-3 -0.93627358 0.35122171
vn -5.9231230e-3 -0.93627358 0.35122171
vn -0.23120892 -4.3696863e-2 0.97192233
vn -1.8494926e-2 -3.6945164e-2 0.99914613
vn 2.7371474e-2 -0.96109780 0.27484871
vn -1.8494926e-2 -3.6945164e-2 0.99914613
vn -8.4999661e-3 -0.96164596 0.27416200
vn -1.8494926e-2 -3.6945164e-2 0.99914613
vn -2.3836633e-2 0.84215411 0.53870982
vn -1.8494926e-2 -3.6945164e-2 0.99914613
vn -2.3836633e-2 0.84215411 0.53870982
vn -1.4011420e-2 0.99948460 2.8882943e-2
vn -1.4011420e-2 0.99948460 2.8882943e-2
vn -1.4011420e-2 0.99948460 2.8882943e-2
vn -1.4011420e-2 0.99948460 2.8882943e-2
vn 0.40508701 0.89916611 -0.16554401
vn -0.42026837 0.88853554 -0.18406271
vn 1.6980115e-2 0.16030066 -0.98692217
vn 0.61941741 0.63575054 -0.46059018
vn -0.62745841 0.62264732 -0.46755348
vn -1.8542061e-2 0.98543086 0.16906274
vn 0.61941741 0.63575054 -0.46059018
vn 0.55093300 -0.77188349 -0.31728332
vn -0.62745841 0.62264732 -0.46755348
vn -0.51983876 -0.79124606 -0.32202070
vn 0.46085287 -0.81557973 -0.34992049
vn 0.46085287 -0.81557973 -0.34992049
vn -0.42521046 -0.83163528 -0.35718178
vn -0.42521046 -0.83163528 -0.35718178
vn 0.32433338 -0.90546071 -0.27376770
vn 0.32433338 -0.90546071 -0.27376770
vn -0.28539864 -0.91558979 -0.28327187
vn -0.28539864 -0.91558979 -0.28327187
vn 0.23860397 -0.97107923 -8.5603047e-3
vn 0.23860397 -0.97107923 -8.5603047e-3
vn -0.20686903 -0.97822268 -1.6899586e-2
vn -0.20686903 -0.97822268 -1.6899586e-2
vn 0.15323076 -0.97479297 0.16216964
vn 0.15323076 -0.97479297 0.16216964
vn -0.12840812 -0.97927028 0.15665592
vn -0.12840812 -0.97927028 0.15665592
vn 3.4897711e-2 -0.97065994 0.23791053
vn 3.4897711e-2 -0.97065994 0.23791053
vn -1.3968240e-2 -0.97139598 0.23705431
vn -1.3968240e-2 -0.97139598 0.23705431
vn -8.1890189e-3 -0.95814931 0.28615179
vn -8.1890189e-3 -0.95814931 0.28615179
vn 2.6439224e-2 -0.95756873 0.28698972
vn 2.6439224e-2 -0.95756873 0.28698972
vn 0.81308396 0.43653353 0.38514018
vn -0.68277961 0.37139753 0.62918668
vn 0.81308396 0.43653353 0.38514018
vn -0.68277961 0.37139753 0.62918668
vn 0.45874415 0.82135523 -0.33901237
vn -0.85416102 0.49811877 -0.14928712
vn 0.45874415 0.82135523 -0.33901237
vn -0.85416102 0.49811877 -0.14928712
vn -6.1202515e-2 4.9459971e-2 0.99689917
vn -6.1202515e-2 4.9459971e-2 0.99689917
vn -6.1202515e-2 4.9459971e-2 0.99689917
vn -6.1202515e-2 4.9459971e-2 0.99689917
vn -0.28014694 0.55884678 -0.78051775
vn -0.28014694 0.55884678 -0.78051775
vn -0.28014694 0.55884678 -0.78051775
vn -0.28014694 0.55884678 -0.78051775
vn 4.2885057e-2 5.4686873e-2 0.99758219
vn 4.2885057e-2 5.4686873e-2 0.99758219
vn 4.2885057e-2 5.4686873e-2 0.99758219
vn 4.2885057e-2 5.4686873e-2 0.99758219
vn 0.20785175 -3.9036972e-2 0.97738107
vn -0.10295037 0.86994706 0.48227931
vn -0.10295037 0.86994706 0.48227931
vn 0.19455971 -3.5044847e-2 0.98026444
vn -0.10295037 0.86994706 0.48227931
vn 0.19455971 -3.5044847e-2 0.98026444
vn -0.53604712 0.80774045 -0.24537494
vn -0.53604712 0.80774045 -0.24537494
vn -0.53604712 0.80774045 -0.24537494
vn 7.6323467e-3 0.56191039 -0.82716290
vn 7.6323467e-3 0.56191039 -0.82716290
vn -0.62867921 0.57768441 -0.52061807
vn -0.62867921 0.57768441 -0.52061807
vn -0.62867921 0.57768441 -0.52061807
vn -1.1559723e-2 0.98299845 -0.18324959
vn -1.1559723e-2 0.98299845 -0.18324959
vn -0.69391196 -9.6196648e-2 -0.71360521
vn -0.69391196 -9.6196648e-2 -0.71360521
vn -0.69391196 -9.6196648e-2 -0.71360521
vn -0.69391196 -9.6196648e-2 -0.71360521
vn 2.0966963e-2 -0.93585596 0.35175846
vn 0.19455971 -3.5044847e-2 0.98026444
vn 2.0966963e-2 -0.93585596 0.35175846
vn 2.0966963e-2 -0.93585596 0.35175846
vn 0.19455971 -3.5044847e-2 0.98026444
vn 0.30604786 0.82589180 0.47353715
vn -0.77304045 0.57313775 0.27188525
vn -0.77304045 0.57313775 0.27188525
vn 0.30604786 0.82589180 0.47353715
vn 0.55294103 0.83309666 1.4358629e-2
vn -0.42623646 0.90460625 -3.1640214e-3
vn 0.55294103 0.83309666 1.4358629e-2
vn -0.42623646 0.90460625 -3.1640214e-3
vn 0.75680974 0.57882445 0.30364664
vn -0.32060967 0.82642064 0.46285890
vn -0.32060967 0.82642064 0.46285890
vn 0.75680974 0.57882445 0.30364664
vn 0.42516246 0.90507356 8.8732288e-3
vn 0.42516246 0.90507356 8.8732288e-3
vn -0.55949109 0.82883578 9.8596343e-4
vn -0.55949109 0.82883578 9.8596343e-4
vn 0.52088680 0.82222243 0.22940624
vn -0.61487866 0.76569885 0.18875781
vn -0.61487866 0.76569885 0.18875781
vn 0.52088680 0.82222243 0.22940624
vn 0.52088680 0.82222243 0.22940624
vn 0.60870574 0.76563180 0.20805114
vn -0.53585998 0.81718475 0.21228086
vn 0.60870574 0.76563180 0.20805114
vn -0.53585998 0.81718475 0.21228086
vn -0.53585998 0.81718475 0.21228086
vn -0.53585998 0.81718475 0.21228086
vn 0.41896235 0.83022918 -0.36768202
vn -7.6323467e-3 -0.56191039 0.82716290
vn -7.6323467e-3 -0.56191039 0.82716290
vn 0.41896235 0.83022918 -0.36768202
vn 1.1559723e-2 -0.98299845 0.18324959
vn 1.1559723e-2 -0.98299845 0.18324959
vn -5.9712200e-3 0.91194957 -0.41025884
vn -5.9712200e-3 0.91194957 -0.41025884
vn -1.6980115e-2 -0.16030066 0.98692217
vn -5.9712200e-3 0.91194957 -0.41025884
vn -5.9712200e-3 0.91194957 -0.41025884
vn 1.8542061e-2 -0.98543086 -0.16906274
vn -0.42977587 0.82125720 -0.37527232
vn -7.6323467e-3 -0.56191039 0.82716290
vn -7.6323467e-3 -0.56191039 0.82716290
vn -0.42977587 0.82125720 -0.37527232
vn 1.1559723e-2 -0.98299845 0.18324959
vn 1.1559723e-2 -0.98299845 0.18324959
g cylinder1_cut2_above
usemtl above
f 1//1 16//16 58//52 56//191
f 9//9 10//10 42//38 40//37
f 10//10 9//9 72//63 70//62
f 10//10 11//11 44//40 42//38
f 11//11 10//10 70//62 68//61
f 11//11 12//12 46//42 44//40
f 12//12 11//11 68//61 66//60
f 12//12 13//13 47//43 46//42
f 13//13 12//12 66//60 64//58
f 13//13 14//14 49//45 47//43
f 14//14 13//13 64//58 62//56
f 14//14 15//15 50//46 49//45
f 15//15 14//14 62//56 60//54
f 15//15 16//16 52//48 50//46
f 16//16 15//15 60//54 58//52
f 17//176 186//310 196//162 27//25 54//50
f 22//177 41//187 43//39 23//21
f 23//21 43//39 45//41 24//22
f 23//21 192//158 191//314 22//180
f 24//22 45//41 48//44 25//23
f 24//22 193//159 192//158 23//21
f 25//23 48//44 51//47 26//24
f 25//23 194//160 193//159 24//22
f 26//24 51//47 53//49 27//25
f 26//24 195//161 194//160 25//23
f 27//25 196//162 195//161 26//24
f 28//26 52//48 16//16 1//1
f 29//182 55//51 53//49 52//48 28//26
f 40//37 42//38 43//39 41//186
f 42//38 44//40 45//41 43//39
f 44//40 46//42 47//43 48//44 45//41
f 47//43 49//45 50//46 51//47 48//44
f 50//46 52//48 53//49 51//47
f 53//49 55//51 54//50 27//25
f 54//50 55//51 29//183 17//173
f 56//193 57//198 85//217
f 57//194 56//190 58//52
f 58//52 60//54 59//53 57//195
f 59//53 89//77 88//223 57//197
f 60//54 62//56 61//55 59//53
f 61//55 90//78 89//77 59//53
f 62//56 64//58 63//57 61//55
f 63//57 91//79 90//78 61//55
f 64//58 66//60 65//59 63//57
f 65//59 92//226 91//79 63//57
f 66//60 68//61 67//199 65//59
f 67//201 93//230 92//227 65//59
f 68//61 70//62 69//204 67//200
f 70//62 72//63 71//209 69//205
f 71//211 95//236 94//233 69//206
f 85//214 57//196 88//222 87//218
f 88//224 156//287 184//305 87//220
f 89//77 158//130 156//288 88//225
f 90//78 160//132 158//130 89//77
f 91//79 162//134 160//132 90//78
f 92//228 164//136 162//134 91//79
f 93//231 166//292 164//136 92//229
f 95//238 170//302 168//297 94//234
f 102//80 117//95 153//127 129//105
f 118//264 130//274 154//128 128//104
f 123//268 124//100 144//118 142//278
f 123//270 203//322 202//167 124//100
f 124//100 125//101 146//120 144//118
f 124//100 202//167 201//166 125//101
f 125//101 126//102 149//123 146//120
f 125//101 201//166 200//165 126//102
f 126//102 127//103 152//126 149//123
f 126//102 200//165 199//164 127//103
f 127//103 128//104 154//128 152//126
f 127//103 199//164 198//163 128//104
f 128//104 198//163 197//317 118//266
f 129//105 153//127 154//128 130//273
f 141//116 143//117 111//89 110//88
f 142//277 144//118 143//117 141//116
f 143//117 145//119 112//90 111//89
f 144//118 146//120 145//119 143//117
f 145//119 147//121 113//91 112//90
f 146//120 149//123 148//122 147//121 145//119
f 147//121 148//122 114//92 113//91
f 148//122 150//124 115//93 114//92
f 149//123 152//126 151//125 150//124 148//122
f 150//124 151//125 116//94 115//93
f 151//125 153//127 117//95 116//94
f 152//126 154//128 153//127 151//125
f 155//282 157//129 117//95 102//80
f 156//286 158//130 159//131 157//129
f 157//129 155//281 156//285
f 157//129 159//131 116//94 117//95
f 158//130 160//132 161//133 159//131
f 159//131 161//133 115//93 116//94
f 160//132 162//134 163//135 161//133
f 161//133 163//135 114//92 115//93
f 162//134 164//136 165//137 163//135
f 163//135 165//137 113//91 114//92
f 164//136 166//290 167//138 165//137
f 165//137 167//138 112//90 113//91
f 166//291 168//295 169//139 167//138
f 167//138 169//139 111//89 112//90
f 168//296 170//300 171//140 169//139
f 169//139 171//140 110//88 111//89
f 184//308 156//289 155//284
f 192//158 193//159 194//160 209//327 191//316
f 195//161 196//162 186//311 209//326 194//160
f 198//163 199//164 200//165 210//332 197//320
f 201//166 202//167 203//321 210//330 200//165
g cylinder1_cut2_below
usemtl below
f 1//1 2//2 30//27 28//26
f 2//2 3//3 32//29 30//27
f 3//3 2//2 86//76 84//75
f 3//3 4//4 5//5 34//31 32//29
f 4//4 3//3 84//75 82//73
f 5//5 4//4 82//73 80//71
f 5//5 6//6 7//7 36//33 34//31
f 6//6 5//5 80//71 78//69
f 7//7 6//6 78//69 76//67
f 7//7 8//8 38//35 36//33
f 8//8 7//7 76//67 74//65
f 8//8 9//9 40//37 38//35
f 9//9 8//8 74//65 72//63
f 18//17 31//28 33//30 19//18
f 18//17 187//154 186//309 17//175
f 19//18 33//30 35//32 37//34 20//19
f 19//18 188//155 187//154 18//17
f 20//19 37//34 39//36 21//20
f 20//19 189//156 188//155 19//18
f 21//20 39//36 41//188 22//178
f 21//20 190//157 189//156 20//19
f 22//179 191//313 190//157 21//20
f 29//184 31//28 18//17 17//174
f 30//27 32//29 33//30 31//28
f 31//28 29//181 28//26 30//27
f 32//29 34//31 35//32 33//30
f 34//31 36//33 37//34 35//32
f 36//33 38//35 39//36 37//34
f 38//35 40//37 41//185 39//36
f 56//189 86//76 2//2 1//1
f 67//202 166//293 93//232
f 69//208 168//299 166//294 67//203
f 72//63 74//65 73//64 71//210
f 73//64 96//240 95//237 71//212
f 74//65 76//67 75//66 73//64
f 75//66 97//244 96//241 73//64
f 76//67 78//69 77//68 75//66
f 77//68 98//248 97//245 75//66
f 78//69 80//71 79//70 77//68
f 79//70 99//252 98//249 77//68
f 80//71 82//73 81//72 79//70
f 81//72 100//256 99//253 79//70
f 82//73 84//75 83//74 81//72
f 83//74 101//260 100//257 81//72
f 84//75 86//76 85//213 83//74
f 85//215 87//219 101//261 83//74
f 86//76 56//192 85//216
f 87//221 184//306 182//151 101//263
f 94//235 168//298 69//207
f 96//242 172//141 170//303 95//239
f 97//246 174//143 172//141 96//243
f 98//250 176//145 174//143 97//247
f 99//254 178//147 176//145 98//251
f 100//258 180//149 178//147 99//255
f 101//262 182//151 180//149 100//259
f 102//80 103//81 185//153 155//280
f 118//265 119//96 132//107 130//275
f 118//267 197//318 208//172 119//96
f 119//96 120//97 134//109 132//107
f 119//96 208//172 207//171 120//97
f 120//97 121//98 138//113 136//111 134//109
f 121//98 120//97 207//171 205//169
f 121//98 122//99 140//115 138//113
f 121//98 205//169 204//168 122//99
f 122//99 123//269 142//279 140//115
f 122//99 204//168 203//323 123//271
f 129//105 131//106 103//81 102//80
f 131//106 129//105 130//272 132//107
f 131//106 133//108 104//82 103//81
f 132//107 134//109 133//108 131//106
f 133//108 135//110 106//84 105//83 104//82
f 134//109 136//111 135//110 133//108
f 135//110 137//112 108//86 107//85 106//84
f 136//111 138//113 137//112 135//110
f 137//112 139//114 109//87 108//86
f 138//113 140//115 139//114 137//112
f 139//114 141//116 110//88 109//87
f 140//115 142//276 141//116 139//114
f 170//301 172//141 173//142 171//140
f 171//140 173//142 109//87 110//88
f 172//141 174//143 175//144 173//142
f 173//142 175//144 108//86 109//87
f 174//143 176//145 177//146 175//144
f 175//144 177//146 107//85 108//86
f 176//145 178//147 179//148 177//146
f 177//146 179//148 106//84 107//85
f 178//147 180//149 181//150 179//148
f 179//148 181//150 105//83 106//84
f 180//149 182//151 183//152 181//150
f 181//150 183//152 104//82 105//83
f 182//151 184//304 185//153 183//152
f 183//152 185//153 103//81 104//82
f 184//307 155//283 185//153
f 187//154 188//155 209//329 186//312
f 189//156 209//328 188//155
f 190//157 191//315 209//325 189//156
f 204//168 205//169 210//335 203//324
f 205//169 207//171 206//170
f 206//170 210//333 205//169
f 207//171 210//334 206//170
f 208//172 197//319 210//331 207//171
g cylinder1_cut2_cristal
usemtl cristal
f 211//338 215//350 216//352 212//340
f 212//339 214//345 213//342 211//336
f 212//341 216//353 214//347
f 213//344 215//349 211//337
f 214//346 216//351 215//348 213//343
