# Exported from Wings 3D 0.97.03
mtllib n11.mtl
o icosahedron2_cut61
#4 vertices, 4 faces
v 0.00000e+0 0.479512 -4.86730
v -3.00563e-2 -1.63731 -1.09588
v -0.490556 -0.578901 -1.58168
v 0.460499 -0.578901 -1.58168
vn -0.826288 -0.488332 -0.280677
vn 0.816760 -0.505895 -0.277440
vn 0.00000e+0 0.951833 0.306618
vn -0.826288 -0.488332 -0.280677
vn 0.816760 -0.505895 -0.277440
vn 0.00000e+0 0.417144 0.908840
vn -0.826288 -0.488332 -0.280677
vn 0.00000e+0 0.417144 0.908840
vn 0.00000e+0 0.951833 0.306618
vn 0.816760 -0.505895 -0.277440
vn 0.00000e+0 0.417144 0.908840
vn 0.00000e+0 0.951833 0.306618
g icosahedron2_cut61_cristal
usemtl cristal
f 1//3 3//9 4//12
f 2//5 1//2 4//10
f 2//4 3//7 1//1
f 2//6 4//11 3//8
o icosahedron2
#28 vertices, 35 faces
v -0.951055 0.479512 -2.06747
v 0.951055 0.479512 -2.06747
v 1.70130 -1.05146 0.00000e+0
v -1.70130 -1.05146 0.00000e+0
v 0.00000e+0 0.479512 -4.86730
v 0.00000e+0 -7.23999e-15 21.2185
v 1.13118 0.00000e+0 5.42197
v -1.13118 0.00000e+0 5.42197
v 2.39949e-16 -3.09122 3.72285
v 0.00000e+0 0.479512 3.50987
v -7.33618 -1.19000 7.41715
v 7.33618 -1.19000 7.41715
v 0.00000e+0 0.696138 11.2333
v 0.00000e+0 -0.696138 11.2333
v 1.79795e-2 0.00000e+0 13.8948
v -1.79795e-2 0.00000e+0 13.8948
v 0.00000e+0 0.159156 11.0054
v -9.65577e-2 8.53284e-2 11.3684
v 9.65577e-2 8.53284e-2 11.3684
v 0.00000e+0 -0.159156 11.0054
v 9.65577e-2 -8.53284e-2 11.3684
v -9.65577e-2 -8.53284e-2 11.3684
v -3.00563e-2 -1.63731 -1.09588
v 2.41394e-2 -0.692776 3.72285
v 0.131394 -0.743250 3.52665
v -0.131394 -0.743250 3.52665
v -0.490556 -0.578901 -1.58168
v 0.460499 -0.578901 -1.58168
vn 0.422696 -0.861719 -0.280656
vn -0.429168 -0.858942 -0.279344
vn -1.39178e-16 0.995221 9.76436e-2
vn 0.00000e+0 -0.938841 -0.344350
vn -0.912955 -0.378035 -0.153632
vn 0.912955 -0.378035 -0.153632
vn -0.879449 -0.213325 -0.425514
vn 0.650269 0.745284 -0.147317
vn -0.899449 -0.432800 -6.06291e-2
vn -0.725364 -0.482247 -0.491207
vn -0.725364 -0.482247 -0.491207
vn -0.102609 0.994568 1.74971e-2
vn -0.102609 0.994568 1.74971e-2
vn -0.725364 -0.482247 -0.491207
vn 0.717996 -0.492616 -0.491743
vn 0.717996 -0.492616 -0.491743
vn 0.102609 0.994568 1.74971e-2
vn 0.717996 -0.492616 -0.491743
vn 0.102609 0.994568 1.74971e-2
vn 0.816760 -0.505895 -0.277440
vn 0.00000e+0 1.00000 0.00000e+0
vn -0.826288 -0.488332 -0.280677
vn 0.00000e+0 -0.951833 -0.306618
vn -0.999710 2.69811e-3 2.39383e-2
vn 0.907046 0.420568 1.97485e-2
vn -0.999710 2.69811e-3 2.39383e-2
vn 0.907046 0.420568 1.97485e-2
vn -0.312613 -0.816640 0.485151
vn -0.911355 0.276149 0.305243
vn -0.911355 0.276149 0.305243
vn -0.495295 0.867573 -4.47069e-2
vn 0.911355 0.276149 0.305243
vn -9.63371e-2 -0.942870 0.318929
vn -0.442959 -0.894251 6.40567e-2
vn 0.911355 0.276149 0.305243
vn 8.50350e-2 -0.107282 0.990586
vn 8.50350e-2 -0.107282 0.990586
vn 8.50350e-2 -0.107282 0.990586
vn 8.50350e-2 -0.107282 0.990586
vn -0.299127 -0.950995 -7.82980e-2
vn -0.169569 0.980378 0.100521
vn -0.169569 0.980378 0.100521
vn -0.299127 -0.950995 -7.82980e-2
vn -0.299127 -0.950995 -7.82980e-2
vn 0.169569 0.980378 0.100521
vn 0.145947 -0.989223 -1.17258e-2
vn 0.145947 -0.989223 -1.17258e-2
vn 0.169569 0.980378 0.100521
vn 0.145947 -0.989223 -1.17258e-2
vn 0.00000e+0 0.796747 -0.604312
vn 0.00000e+0 0.796747 -0.604312
vn 0.00000e+0 0.796747 -0.604312
vn 0.00000e+0 0.796747 -0.604312
vn -0.382492 0.489303 -0.783762
vn -0.382492 0.489303 -0.783762
vn -0.382492 0.489303 -0.783762
vn -0.382492 0.489303 -0.783762
vn 0.682165 0.729736 -4.62187e-2
vn 0.682165 0.729736 -4.62187e-2
vn 0.682165 0.729736 -4.62187e-2
vn 0.682165 0.729736 -4.62187e-2
vn -0.737719 -0.674623 2.55779e-2
vn -0.737719 -0.674623 2.55779e-2
vn -0.737719 -0.674623 2.55779e-2
vn -0.737719 -0.674623 2.55779e-2
vn 0.317065 -0.777801 -0.542675
vn -0.459655 -0.853758 -0.244569
vn 0.317065 -0.777801 -0.542675
vn -0.459655 -0.853758 -0.244569
vn 0.998046 -5.78292e-2 -2.36734e-2
vn -0.998327 -5.67780e-2 -1.09041e-2
vn 0.317065 -0.777801 -0.542675
vn -0.121330 -0.673597 0.729072
vn -0.121330 -0.673597 0.729072
vn -0.999384 -2.84154e-2 2.06105e-2
vn -0.999384 -2.84154e-2 2.06105e-2
vn -0.121330 -0.673597 0.729072
vn -0.121330 -0.673597 0.729072
vn 0.481422 -0.810448 0.333776
vn 0.481422 -0.810448 0.333776
vn 0.481422 -0.810448 0.333776
vn 0.481422 -0.810448 0.333776
vn 0.481422 -0.810448 0.333776
vn -0.536002 -0.785814 0.308542
vn -0.536002 -0.785814 0.308542
vn -0.536002 -0.785814 0.308542
vn -0.536002 -0.785814 0.308542
vn -0.536002 -0.785814 0.308542
vn -0.721609 -0.522448 -0.454234
vn -0.721609 -0.522448 -0.454234
vn 0.00000e+0 -0.747791 -0.663934
vn 0.00000e+0 -0.747791 -0.663934
vn 0.397306 -0.692532 -0.602120
vn 0.397306 -0.692532 -0.602120
vn 0.397306 -0.692532 -0.602120
vn 0.397306 -0.692532 -0.602120
g icosahedron2_front
usemtl front
f 5//26 9//34 31//102
f 6//28 32//106 9//32
f 7//13 27//78 32//105 6//27
f 9//35 32//107 31//103
f 15//52 5//23 8//14
f 15//54 12//44 14//15
f 16//61 7//13 6//30
f 16//60 14//15 11//41
f 19//71 25//20 24//19 28//88 11//43
f 20//75 22//17 21//16 14//15 12//47
f 21//16 23//18 19//70 11//42 14//15
f 27//79 8//14 5//22 31//101
f 27//83 13//49 30//99
f 27//84 31//104 32//108
f 28//87 24//19 26//21 20//74 12//46
f 29//94 13//48 27//82
f 29//95 28//89 13//50
f 30//100 13//51 28//90
g icosahedron2_side
usemtl side
f 16//59 29//93 7//13
f 17//63 22//17 20//77 10//38
f 19//72 23//18 17//62 10//37
f 21//16 17//65 23//18
f 21//16 22//17 17//64
f 24//19 18//69 26//21
f 24//19 25//20 18//68
f 25//20 19//73 10//39 18//67
f 26//21 18//66 10//36 20//76
f 27//80 7//13 29//92
f 27//81 30//98 8//14
f 29//91 16//58 11//40 28//85
f 30//96 15//55 8//14
f 30//97 28//86 12//45 15//56
g icosahedron2_under
usemtl under
f 5//24 15//53 14//15
f 6//29 14//15 16//57
f 14//15 6//31 9//33 5//25
