	 {"LayName": "text_city_ani", "LayWidth": 382.000000, "LayHeight": 110.000000, "LayID": 115, "ParentID": 0, "LayIn": -0.47, "LayDur": 4.84, "CompIn": 0.97, "CompDur": 4.84, "NumEffects": 1,
		"SourcePath": "//pc10110074/d$/AE_Project/LandscapeSweet_Slice/text_paris_city.png",
				 "AnchorPoint": { 
					"X": 0.50, "Y": 0.50, "Z": 0.00
					 }, 
				 "Position": { 
					"Type":[ 12 , 12 ],
					"Time":[ 0.96763 , 5.77244 ],
					"X":[ 500.00 , 560.00 ],
					"Y":[ 420.00 , 420.00 ],
					"Z":[ 0.00 , 0.00 ],
					"InTanX":[ 0.00 , 0.00 ],
					"InTanY":[ 0.00 , 0.00 ],
					"InTanZ":[ 0.00 , 0.00 ],
					"OutTanX":[ 0.00 , 0.00 ],
					"OutTanY":[ 0.00 , 0.00 ],
					"OutTanZ":[ 0.00 , 0.00 ]
				}
,				 "Scale": { 
					"X": 100.00, "Y": 100.00, "Z": 100.00
					 }, 
				 "Rotation": { 
					"Val": 0.00
					 }, 
				 "Opacity": { 
					"Type":[ 0 , 0 ],
					"Time":[ 0.96763 , 1.76844 ],
					"Val":[ 0.00 , 100.00 ],
					"InTanX":[ 0.00 , 0.00 ],
					"OutTanX":[ 0.00 , 0.00 ]
				}
	}
