MT BELVIEU ETHANE SWAP - NEW YORK MERCANTILE EXCHANGE ;2009.08.25;   17711;     140;       0;      95;   17101;   17601;   17336;   17696;     375;      15
MT BELVIEU ETHANE SWAP - NEW YORK MERCANTILE EXCHANGE ;2009.08.11;   18813;     200;       0;      65;   18048;   18738;   18313;   18803;     500;      10
MT BELVIEU ETHANE SWAP - NEW YORK MERCANTILE EXCHANGE ;2009.08.04;   18273;     250;       0;      65;   17578;   18198;   17893;   18263;     380;      10
MT BELVIEU ETHANE SWAP - NEW YORK MERCANTILE EXCHANGE ;2009.07.28;   17905;     265;       0;       0;   17145;   17868;   17410;   17868;     495;      37
MT BELVIEU ETHANE SWAP - NEW YORK MERCANTILE EXCHANGE ;2009.07.21;   17440;     295;      45;     300;   16185;   17058;   16780;   17403;     660;      37
MT BELVIEU ETHANE SWAP - NEW YORK MERCANTILE EXCHANGE ;2009.08.25;   17711;     140;       0;      95;   17101;   17601;   17336;   17696;     375;      15
MT BELVIEU ETHANE SWAP - NEW YORK MERCANTILE EXCHANGE ;2009.08.11;   18813;     200;       0;      65;   18048;   18738;   18313;   18803;     500;      10
MT BELVIEU ETHANE SWAP - NEW YORK MERCANTILE EXCHANGE ;2009.08.04;   18273;     250;       0;      65;   17578;   18198;   17893;   18263;     380;      10
MT BELVIEU ETHANE SWAP - NEW YORK MERCANTILE EXCHANGE ;2009.07.28;   17905;     265;       0;       0;   17145;   17868;   17410;   17868;     495;      37
MT BELVIEU ETHANE SWAP - NEW YORK MERCANTILE EXCHANGE ;2009.07.21;   17440;     295;      45;     300;   16185;   17058;   16780;   17403;     660;      37
MT BELVIEU ETHANE SWAP - NEW YORK MERCANTILE EXCHANGE ;2009.08.25;   17711;     140;       0;      95;   17101;   17601;   17336;   17696;     375;      15
MT BELVIEU ETHANE SWAP - NEW YORK MERCANTILE EXCHANGE ;2009.08.11;   18813;     200;       0;      65;   18048;   18738;   18313;   18803;     500;      10
MT BELVIEU ETHANE SWAP - NEW YORK MERCANTILE EXCHANGE ;2009.08.04;   18273;     250;       0;      65;   17578;   18198;   17893;   18263;     380;      10
MT BELVIEU ETHANE SWAP - NEW YORK MERCANTILE EXCHANGE ;2009.07.28;   17905;     265;       0;       0;   17145;   17868;   17410;   17868;     495;      37
MT BELVIEU ETHANE SWAP - NEW YORK MERCANTILE EXCHANGE ;2009.07.21;   17440;     295;      45;     300;   16185;   17058;   16780;   17403;     660;      37
