BRENT-DUBAI SWAP - NEW YORK MERCANTILE EXCHANGE ;2011.07.12;   15905;    2109;     150;       0;   13730;   15710;   15839;   15860;      66;      45
BRENT-DUBAI SWAP - NEW YORK MERCANTILE EXCHANGE ;2011.07.12;   15905;    2109;     150;       0;   13730;   15710;   15839;   15860;      66;      45
BRENT-DUBAI SWAP - NEW YORK MERCANTILE EXCHANGE ;2010.12.28;   16195;    4625;     594;       0;   11545;   15495;   16170;   16089;      25;     106
BRENT-DUBAI SWAP - NEW YORK MERCANTILE EXCHANGE ;2010.12.21;   15645;    4325;     594;       0;   11295;   14945;   15620;   15539;      25;     106
BRENT-DUBAI SWAP - NEW YORK MERCANTILE EXCHANGE ;2010.12.14;   15345;    4325;     621;       0;   10995;   14645;   15320;   15266;      25;      79
BRENT-DUBAI SWAP - NEW YORK MERCANTILE EXCHANGE ;2010.12.07;   14970;    4325;     375;       0;   10620;   14570;   14945;   14945;      25;      25
BRENT-DUBAI SWAP - NEW YORK MERCANTILE EXCHANGE ;2010.11.30;   16925;    4525;     575;       0;   12350;   16300;   16875;   16875;      50;      50
BRENT-DUBAI SWAP - NEW YORK MERCANTILE EXCHANGE ;2010.11.23;   16925;    4525;     575;       0;   12350;   16300;   16875;   16875;      50;      50
BRENT-DUBAI SWAP - NEW YORK MERCANTILE EXCHANGE ;2010.11.16;   16925;    4525;     575;       0;   12200;   16150;   16725;   16725;     200;     200
BRENT-DUBAI SWAP - NEW YORK MERCANTILE EXCHANGE ;2010.11.09;   16718;    4750;     550;       0;   11918;   16118;   16668;   16668;      50;      50
BRENT-DUBAI SWAP - NEW YORK MERCANTILE EXCHANGE ;2010.11.02;   16318;    4750;     550;       0;   11518;   15718;   16268;   16268;      50;      50
BRENT-DUBAI SWAP - NEW YORK MERCANTILE EXCHANGE ;2010.10.26;   18703;    5298;     750;       0;   13228;   17878;   18526;   18628;     177;      75
BRENT-DUBAI SWAP - NEW YORK MERCANTILE EXCHANGE ;2010.10.19;   18653;    5412;     750;       0;   13028;   17828;   18440;   18578;     213;      75
BRENT-DUBAI SWAP - NEW YORK MERCANTILE EXCHANGE ;2010.10.12;   18635;    5643;     750;       0;   12710;   17810;   18353;   18560;     282;      75
BRENT-DUBAI SWAP - NEW YORK MERCANTILE EXCHANGE ;2010.10.05;   18460;    5643;     725;       0;   12535;   17660;   18178;   18385;     282;      75
BRENT-DUBAI SWAP - NEW YORK MERCANTILE EXCHANGE ;2010.09.28;   22785;    8274;     625;     100;   14060;   21985;   22434;   22710;     351;      75
BRENT-DUBAI SWAP - NEW YORK MERCANTILE EXCHANGE ;2010.09.21;   22685;    8274;     625;     100;   13960;   21885;   22334;   22610;     351;      75
BRENT-DUBAI SWAP - NEW YORK MERCANTILE EXCHANGE ;2010.09.14;   19310;    4374;     625;     100;   14485;   18510;   18959;   19235;     351;      75
BRENT-DUBAI SWAP - NEW YORK MERCANTILE EXCHANGE ;2010.09.07;   19635;    5100;     500;     100;   14105;   18660;   19305;   19260;     330;     375
BRENT-DUBAI SWAP - NEW YORK MERCANTILE EXCHANGE ;2010.08.31;   21475;    5100;     400;     200;   16100;   20755;   21400;   21355;      75;     120
BRENT-DUBAI SWAP - NEW YORK MERCANTILE EXCHANGE ;2010.08.24;   21535;    5100;     400;     200;   16010;   20665;   21310;   21265;     225;     270
BRENT-DUBAI SWAP - NEW YORK MERCANTILE EXCHANGE ;2010.08.17;   20810;    5100;     400;     200;   15435;   20090;   20735;   20690;      75;     120
BRENT-DUBAI SWAP - NEW YORK MERCANTILE EXCHANGE ;2010.08.10;   20960;    5100;     400;     200;   15435;   20135;   20735;   20735;     225;     225
BRENT-DUBAI SWAP - NEW YORK MERCANTILE EXCHANGE ;2010.08.03;   20880;    5250;     400;     200;   15310;   20205;   20760;   20805;     120;      75
BRENT-DUBAI SWAP - NEW YORK MERCANTILE EXCHANGE ;2010.07.27;   22690;    5250;     300;     300;   17020;   22015;   22570;   22615;     120;      75
BRENT-DUBAI SWAP - NEW YORK MERCANTILE EXCHANGE ;2010.07.20;   22925;    5250;     300;     300;   17310;   22305;   22860;   22905;      65;      20
BRENT-DUBAI SWAP - NEW YORK MERCANTILE EXCHANGE ;2010.07.13;   22955;    5250;     300;     300;   17360;   22355;   22910;   22955;      45;       0
BRENT-DUBAI SWAP - NEW YORK MERCANTILE EXCHANGE ;2010.07.06;   22665;    4644;     450;     300;   17370;   21915;   22314;   22665;     351;       0
BRENT-DUBAI SWAP - NEW YORK MERCANTILE EXCHANGE ;2010.06.29;   23535;    4744;     450;     300;   18140;   22785;   23184;   23535;     351;       0
BRENT-DUBAI SWAP - NEW YORK MERCANTILE EXCHANGE ;2010.06.22;   23490;    4744;     450;     300;   18140;   22695;   23184;   23445;     306;      45
BRENT-DUBAI SWAP - NEW YORK MERCANTILE EXCHANGE ;2010.06.15;   22445;    4744;     450;     300;   17095;   21695;   22139;   22445;     306;       0
BRENT-DUBAI SWAP - NEW YORK MERCANTILE EXCHANGE ;2010.06.08;   21170;    3544;     450;     300;   17020;   20420;   20864;   21170;     306;       0
BRENT-DUBAI SWAP - NEW YORK MERCANTILE EXCHANGE ;2010.06.01;   20890;    3244;     450;       0;   17040;   20140;   20284;   20590;     606;     300
BRENT-DUBAI SWAP - NEW YORK MERCANTILE EXCHANGE ;2010.05.25;   24575;    3344;     500;       0;   20925;   24075;   24269;   24575;     306;       0
BRENT-DUBAI SWAP - NEW YORK MERCANTILE EXCHANGE ;2010.05.18;   23910;    2144;    1100;       0;   21460;   22810;   23604;   23910;     306;       0
BRENT-DUBAI SWAP - NEW YORK MERCANTILE EXCHANGE ;2010.05.11;   24085;    2024;    1075;      75;   21710;   22935;   23809;   24085;     276;       0
BRENT-DUBAI SWAP - NEW YORK MERCANTILE EXCHANGE ;2010.05.04;   24510;    2024;    1150;      75;   22135;   23285;   24234;   24510;     276;       0
BRENT-DUBAI SWAP - NEW YORK MERCANTILE EXCHANGE ;2010.04.27;   28175;    2095;    1125;     264;   25525;   26750;   27884;   28139;     291;      36
BRENT-DUBAI SWAP - NEW YORK MERCANTILE EXCHANGE ;2010.04.20;   27525;    1795;     450;     264;   25175;   26775;   27234;   27489;     291;      36
BRENT-DUBAI SWAP - NEW YORK MERCANTILE EXCHANGE ;2010.04.13;   27200;    1795;     450;     264;   24850;   26450;   26909;   27164;     291;      36
BRENT-DUBAI SWAP - NEW YORK MERCANTILE EXCHANGE ;2010.04.06;   26975;    1759;     450;     150;   24775;   26375;   26684;   26975;     291;       0
BRENT-DUBAI SWAP - NEW YORK MERCANTILE EXCHANGE ;2010.03.30;   31605;    1946;     560;     233;   29105;   30795;   31284;   31588;     321;      17
BRENT-DUBAI SWAP - NEW YORK MERCANTILE EXCHANGE ;2010.03.23;   31485;    1946;     560;     233;   28985;   30675;   31164;   31468;     321;      17
BRENT-DUBAI SWAP - NEW YORK MERCANTILE EXCHANGE ;2010.03.16;   31280;    1946;     410;     233;   28780;   30620;   30959;   31263;     321;      17
BRENT-DUBAI SWAP - NEW YORK MERCANTILE EXCHANGE ;2010.03.09;   30755;    1946;     410;     233;   28255;   30095;   30434;   30738;     321;      17
BRENT-DUBAI SWAP - NEW YORK MERCANTILE EXCHANGE ;2010.03.02;   30111;    1022;     410;     239;   28805;   29445;   30066;   30094;      45;      17
BRENT-DUBAI SWAP - NEW YORK MERCANTILE EXCHANGE ;2010.02.23;   34200;     950;    1607;     150;   33100;   32310;   34200;   34067;       0;     133
BRENT-DUBAI SWAP - NEW YORK MERCANTILE EXCHANGE ;2010.02.16;   32730;     950;    1607;     150;   31630;   30840;   32730;   32597;       0;     133
BRENT-DUBAI SWAP - NEW YORK MERCANTILE EXCHANGE ;2010.02.09;   32880;     950;    1607;     150;   31780;   30990;   32880;   32747;       0;     133
BRENT-DUBAI SWAP - NEW YORK MERCANTILE EXCHANGE ;2010.02.02;   32910;     950;    1607;     150;   31810;   31020;   32910;   32777;       0;     133
BRENT-DUBAI SWAP - NEW YORK MERCANTILE EXCHANGE ;2010.01.26;   37645;     650;    1800;     150;   36795;   35495;   37595;   37445;      50;     200
BRENT-DUBAI SWAP - NEW YORK MERCANTILE EXCHANGE ;2010.01.19;   38245;     650;    2130;     150;   37445;   35815;   38245;   38095;       0;     150
BRENT-DUBAI SWAP - NEW YORK MERCANTILE EXCHANGE ;2010.01.12;   37030;     500;    2130;     150;   36380;   34600;   37030;   36880;       0;     150
BRENT-DUBAI SWAP - NEW YORK MERCANTILE EXCHANGE ;2010.01.05;   36070;       0;    2130;       0;   36070;   33851;   36070;   35981;       0;      89
BRENT-DUBAI SWAP - NEW YORK MERCANTILE EXCHANGE ;2009.12.29;   40811;       0;    2130;       0;   40796;   38547;   40796;   40677;      15;     134
BRENT-DUBAI SWAP - NEW YORK MERCANTILE EXCHANGE ;2009.12.22;   40666;       0;    2130;       0;   40561;   38428;   40561;   40558;     105;     108
BRENT-DUBAI SWAP - NEW YORK MERCANTILE EXCHANGE ;2009.12.15;   40211;       0;    2130;       0;   39996;   37881;   39996;   40011;     215;     200
BRENT-DUBAI SWAP - NEW YORK MERCANTILE EXCHANGE ;2009.12.08;   40046;       0;    2130;       0;   39831;   37716;   39831;   39846;     215;     200
BRENT-DUBAI SWAP - NEW YORK MERCANTILE EXCHANGE ;2009.12.01;   38551;       0;    2130;       0;   38536;   36221;   38536;   38351;      15;     200
BRENT-DUBAI SWAP - NEW YORK MERCANTILE EXCHANGE ;2009.11.24;   42257;       0;    1518;       0;   42177;   40587;   42177;   42105;      80;     152
BRENT-DUBAI SWAP - NEW YORK MERCANTILE EXCHANGE ;2009.11.17;   42162;       0;    1218;       0;   42082;   40047;   42082;   41265;      80;     897
BRENT-DUBAI SWAP - NEW YORK MERCANTILE EXCHANGE ;2009.11.09;   37767;       0;    1038;       0;   37637;   36587;   37637;   37625;     130;     142
BRENT-DUBAI SWAP - NEW YORK MERCANTILE EXCHANGE ;2009.11.03;   37552;       0;    1343;       0;   37422;   36067;   37422;   37410;     130;     142
BRENT-DUBAI SWAP - NEW YORK MERCANTILE EXCHANGE ;2009.10.27;   41013;       0;    1368;       0;   40818;   39543;   40818;   40911;     195;     102
BRENT-DUBAI SWAP - NEW YORK MERCANTILE EXCHANGE ;2009.10.20;   40398;       0;    1368;       0;   40203;   38928;   40203;   40296;     195;     102
BRENT-DUBAI SWAP - NEW YORK MERCANTILE EXCHANGE ;2009.10.13;   39763;       0;    1368;       0;   39568;   38293;   39568;   39661;     195;     102
BRENT-DUBAI SWAP - NEW YORK MERCANTILE EXCHANGE ;2009.10.06;   39613;       0;    1368;       0;   39418;   37843;   39418;   39211;     195;     402
BRENT-DUBAI SWAP - NEW YORK MERCANTILE EXCHANGE ;2009.09.29;   43098;     400;    1428;       0;   42488;   41568;   42888;   42996;     210;     102
BRENT-DUBAI SWAP - NEW YORK MERCANTILE EXCHANGE ;2009.09.22;   42833;     400;    1428;       0;   42223;   41253;   42623;   42681;     210;     152
BRENT-DUBAI SWAP - NEW YORK MERCANTILE EXCHANGE ;2009.09.15;   42713;     400;    1428;       0;   42103;   41133;   42503;   42561;     210;     152
BRENT-DUBAI SWAP - NEW YORK MERCANTILE EXCHANGE ;2009.09.08;   42598;     400;    1428;       0;   41988;   41018;   42388;   42446;     210;     152
BRENT-DUBAI SWAP - NEW YORK MERCANTILE EXCHANGE ;2009.09.01;   42038;     400;    1248;       0;   41428;   40578;   41828;   41826;     210;     212
BRENT-DUBAI SWAP - NEW YORK MERCANTILE EXCHANGE ;2009.08.25;   44932;     800;    1308;       0;   43907;   43407;   44707;   44715;     225;     217
BRENT-DUBAI SWAP - NEW YORK MERCANTILE EXCHANGE ;2009.08.18;   45027;     800;     948;       0;   44152;   43862;   44952;   44810;      75;     217
BRENT-DUBAI SWAP - NEW YORK MERCANTILE EXCHANGE ;2009.08.11;   42322;    3195;     948;     325;   38727;   40832;   42247;   42105;      75;     217
BRENT-DUBAI SWAP - NEW YORK MERCANTILE EXCHANGE ;2009.08.04;   42357;    3195;     948;     325;   38762;   40867;   42282;   42140;      75;     217
BRENT-DUBAI SWAP - NEW YORK MERCANTILE EXCHANGE ;2009.07.28;   47542;    3205;    1158;     615;   43632;   45607;   47452;   47380;      90;     162
BRENT-DUBAI SWAP - NEW YORK MERCANTILE EXCHANGE ;2009.07.21;   44587;    2905;     858;     615;   40977;   43012;   44497;   44485;      90;     102
BRENT-DUBAI SWAP - NEW YORK MERCANTILE EXCHANGE ;2009.07.14;   40922;    2905;     858;     555;   37372;   39407;   40832;   40820;      90;     102
BRENT-DUBAI SWAP - NEW YORK MERCANTILE EXCHANGE ;2009.07.07;   40272;    3055;     858;     465;   36662;   38847;   40182;   40170;      90;     102
BRENT-DUBAI SWAP - NEW YORK MERCANTILE EXCHANGE ;2009.06.30;   43787;    3050;    2133;     470;   40162;   41082;   43682;   43685;     105;     102
BRENT-DUBAI SWAP - NEW YORK MERCANTILE EXCHANGE ;2009.06.23;   42086;    3050;    2133;     470;   38461;   39381;   41981;   41984;     105;     102
BRENT-DUBAI SWAP - NEW YORK MERCANTILE EXCHANGE ;2009.06.16;   40676;    2850;    2283;     510;   37211;   37781;   40571;   40574;     105;     102
BRENT-DUBAI SWAP - NEW YORK MERCANTILE EXCHANGE ;2009.06.09;   39591;    2850;    2583;     510;   36076;   36096;   39436;   39189;     155;     402
BRENT-DUBAI SWAP - NEW YORK MERCANTILE EXCHANGE ;2009.06.02;   38441;    2850;    2733;     510;   34476;   34571;   37836;   37814;     605;     627
BRENT-DUBAI SWAP - NEW YORK MERCANTILE EXCHANGE ;2009.05.26;   42415;    2510;    3708;     850;   38135;   36930;   41495;   41488;     920;     927
BRENT-DUBAI SWAP - NEW YORK MERCANTILE EXCHANGE ;2009.05.19;   41345;    1910;    3708;     850;   37665;   35860;   40425;   40418;     920;     927
BRENT-DUBAI SWAP - NEW YORK MERCANTILE EXCHANGE ;2009.05.12;   39470;    1185;    3808;     750;   36515;   34035;   38450;   38593;    1020;     877
BRENT-DUBAI SWAP - NEW YORK MERCANTILE EXCHANGE ;2009.05.05;   38450;    1185;    3808;     750;   35595;   32965;   37530;   37523;     920;     927
BRENT-DUBAI SWAP - NEW YORK MERCANTILE EXCHANGE ;2009.04.28;   42734;     795;    5231;     990;   39664;   35734;   41449;   41955;    1285;     779
BRENT-DUBAI SWAP - NEW YORK MERCANTILE EXCHANGE ;2009.04.21;   40183;     265;    5005;    1235;   37598;   33118;   39098;   39358;    1085;     825
BRENT-DUBAI SWAP - NEW YORK MERCANTILE EXCHANGE ;2009.04.14;   39603;     115;    4555;    1355;   36933;   32903;   38403;   38813;    1200;     790
BRENT-DUBAI SWAP - NEW YORK MERCANTILE EXCHANGE ;2009.04.07;   39238;     315;    4555;    1155;   36783;   32703;   38253;   38413;     985;     825
BRENT-DUBAI SWAP - NEW YORK MERCANTILE EXCHANGE ;2009.03.31;   41059;     120;    4955;    1230;   39709;   34874;   41059;   41059;       0;       0
BRENT-DUBAI SWAP - NEW YORK MERCANTILE EXCHANGE ;2009.03.24;   40099;     120;    4955;    1230;   38749;   33914;   40099;   40099;       0;       0
BRENT-DUBAI SWAP - NEW YORK MERCANTILE EXCHANGE ;2009.03.17;   37099;     120;    5045;    1230;   35749;   30824;   37099;   37099;       0;       0
BRENT-DUBAI SWAP - NEW YORK MERCANTILE EXCHANGE ;2009.03.10;   38423;     495;    7145;     885;   37043;   30393;   38423;   38423;       0;       0
BRENT-DUBAI SWAP - NEW YORK MERCANTILE EXCHANGE ;2009.03.03;   36900;     495;    7745;     765;   35640;   28390;   36900;   36900;       0;       0
BRENT-DUBAI SWAP - NEW YORK MERCANTILE EXCHANGE ;2009.02.24;   37626;     725;    7695;     465;   36436;   29466;   37626;   37626;       0;       0
BRENT-DUBAI SWAP - NEW YORK MERCANTILE EXCHANGE ;2009.02.17;   36391;     475;    7695;     390;   35226;   28006;   36091;   36091;     300;     300
BRENT-DUBAI SWAP - NEW YORK MERCANTILE EXCHANGE ;2009.02.10;   34501;       0;    8170;      40;   34461;   26291;   34501;   34501;       0;       0
BRENT-DUBAI SWAP - NEW YORK MERCANTILE EXCHANGE ;2009.02.03;   32974;       0;    8095;      40;   32934;   24839;   32974;   32974;       0;       0
BRENT-DUBAI SWAP - NEW YORK MERCANTILE EXCHANGE ;2009.01.27;   32445;       0;    7165;      95;   32350;   25185;   32445;   32445;       0;       0
BRENT-DUBAI SWAP - NEW YORK MERCANTILE EXCHANGE ;2009.01.20;   31220;       0;    7240;      95;   31125;   23885;   31220;   31220;       0;       0
BRENT-DUBAI SWAP - NEW YORK MERCANTILE EXCHANGE ;2009.01.13;   26845;       0;    2020;      95;   26750;   24730;   26845;   26845;       0;       0
BRENT-DUBAI SWAP - NEW YORK MERCANTILE EXCHANGE ;2009.01.06;   23395;       0;     520;      95;   23300;   22780;   23395;   23395;       0;       0
BRENT-DUBAI SWAP - NEW YORK MERCANTILE EXCHANGE ;2008.12.30;   23620;       0;     645;      65;   23555;   22910;   23620;   23620;       0;       0
BRENT-DUBAI SWAP - NEW YORK MERCANTILE EXCHANGE ;2008.12.22;   22720;       0;     645;      65;   22655;   22010;   22720;   22720;       0;       0
BRENT-DUBAI SWAP - NEW YORK MERCANTILE EXCHANGE ;2008.12.16;   21095;       0;     495;      65;   21030;   20535;   21095;   21095;       0;       0
BRENT-DUBAI SWAP - NEW YORK MERCANTILE EXCHANGE ;2008.12.09;   19912;       0;     495;      65;   19847;   19352;   19912;   19912;       0;       0
BRENT-DUBAI SWAP - NEW YORK MERCANTILE EXCHANGE ;2008.12.02;   19772;       0;     420;      65;   19707;   19287;   19772;   19772;       0;       0
BRENT-DUBAI SWAP - NEW YORK MERCANTILE EXCHANGE ;2008.11.25;   20487;       0;     620;       5;   20482;   19862;   20487;   20487;       0;       0
BRENT-DUBAI SWAP - NEW YORK MERCANTILE EXCHANGE ;2008.11.18;   17887;       0;     670;       0;   17887;   17217;   17887;   17887;       0;       0
BRENT-DUBAI SWAP - NEW YORK MERCANTILE EXCHANGE ;2008.11.11;   16147;       0;     670;       0;   16147;   15477;   16147;   16147;       0;       0
BRENT-DUBAI SWAP - NEW YORK MERCANTILE EXCHANGE ;2008.11.04;   15370;       0;     970;       0;   15370;   14400;   15370;   15370;       0;       0
BRENT-DUBAI SWAP - NEW YORK MERCANTILE EXCHANGE ;2008.10.28;   15683;       0;    1020;       0;   15533;   14513;   15533;   15533;     150;     150
BRENT-DUBAI SWAP - NEW YORK MERCANTILE EXCHANGE ;2008.10.21;   12223;       0;     720;       0;   12223;   11503;   12223;   12223;       0;       0
BRENT-DUBAI SWAP - NEW YORK MERCANTILE EXCHANGE ;2008.10.14;   10100;       0;     720;       0;   10100;    9380;   10100;   10100;       0;       0
BRENT-DUBAI SWAP - NEW YORK MERCANTILE EXCHANGE ;2008.10.07;    8263;       0;     540;       0;    8263;    7723;    8263;    8263;       0;       0
BRENT-DUBAI SWAP - NEW YORK MERCANTILE EXCHANGE ;2008.09.30;    8753;      50;     500;       0;    8703;    8253;    8753;    8753;       0;       0
BRENT-DUBAI SWAP - NEW YORK MERCANTILE EXCHANGE ;2008.09.23;    8542;      50;     500;       0;    7892;    7442;    7942;    7942;     600;     600
BRENT-DUBAI SWAP - NEW YORK MERCANTILE EXCHANGE ;2008.09.16;    8059;      50;     500;       0;    8009;    7559;    8059;    8059;       0;       0
BRENT-DUBAI SWAP - NEW YORK MERCANTILE EXCHANGE ;2008.09.09;    8011;      50;     500;       0;    7961;    7511;    8011;    8011;       0;       0
BRENT-DUBAI SWAP - NEW YORK MERCANTILE EXCHANGE ;2008.09.02;    7569;      50;     500;       0;    7519;    7069;    7569;    7569;       0;       0
BRENT-DUBAI SWAP - NEW YORK MERCANTILE EXCHANGE ;2008.08.26;    7894;     100;     550;       0;    7794;    7344;    7894;    7894;       0;       0
BRENT-DUBAI SWAP - NEW YORK MERCANTILE EXCHANGE ;2008.08.19;    7294;       0;     550;       0;    7294;    6744;    7294;    7294;       0;       0
BRENT-DUBAI SWAP - NEW YORK MERCANTILE EXCHANGE ;2008.08.12;    7444;       0;     550;       0;    7102;    6519;    7102;    7069;     342;     375
BRENT-DUBAI SWAP - NEW YORK MERCANTILE EXCHANGE ;2008.08.05;    7339;       0;     550;       0;    7264;    6714;    7264;    7264;      75;      75
BRENT-DUBAI SWAP - NEW YORK MERCANTILE EXCHANGE ;2008.07.29;    6509;       0;     600;       0;    6509;    5909;    6509;    6509;       0;       0
BRENT-DUBAI SWAP - NEW YORK MERCANTILE EXCHANGE ;2008.07.22;    6509;       0;     600;       0;    6509;    5909;    6509;    6509;       0;       0
BRENT-DUBAI SWAP - NEW YORK MERCANTILE EXCHANGE ;2008.07.15;    5882;       0;     600;       0;    5882;    5090;    5882;    5690;       0;     192
BRENT-DUBAI SWAP - NEW YORK MERCANTILE EXCHANGE ;2008.07.08;    5792;       0;     600;       0;    5792;    5192;    5792;    5792;       0;       0
BRENT-DUBAI SWAP - NEW YORK MERCANTILE EXCHANGE ;2008.07.01;    5792;       0;     600;       0;    5792;    5192;    5792;    5792;       0;       0
BRENT-DUBAI SWAP - NEW YORK MERCANTILE EXCHANGE ;2008.06.24;    6245;      50;     650;       0;    6195;    5595;    6245;    6245;       0;       0
BRENT-DUBAI SWAP - NEW YORK MERCANTILE EXCHANGE ;2008.06.17;    5945;      50;     650;       0;    5895;    5295;    5945;    5945;       0;       0
BRENT-DUBAI SWAP - NEW YORK MERCANTILE EXCHANGE ;2008.06.10;    5945;      50;     650;       0;    5895;    5295;    5945;    5945;       0;       0
BRENT-DUBAI SWAP - NEW YORK MERCANTILE EXCHANGE ;2008.06.03;    5855;      50;     650;       0;    5805;    5205;    5855;    5855;       0;       0
BRENT-DUBAI SWAP - NEW YORK MERCANTILE EXCHANGE ;2008.05.27;    6415;     100;     700;       0;    6015;    5715;    6115;    6415;     300;       0
BRENT-DUBAI SWAP - NEW YORK MERCANTILE EXCHANGE ;2008.05.20;    5815;     400;     400;       0;    5415;    5415;    5815;    5815;       0;       0
BRENT-DUBAI SWAP - NEW YORK MERCANTILE EXCHANGE ;2008.05.13;    5770;     400;     400;       0;    5370;    5370;    5770;    5770;       0;       0
BRENT-DUBAI SWAP - NEW YORK MERCANTILE EXCHANGE ;2008.05.06;    5620;     400;     400;       0;    5220;    5220;    5620;    5620;       0;       0
BRENT-DUBAI SWAP - NEW YORK MERCANTILE EXCHANGE ;2008.04.29;    6495;     450;     450;       0;    6045;    6045;    6495;    6495;       0;       0
BRENT-DUBAI SWAP - NEW YORK MERCANTILE EXCHANGE ;2008.04.22;    6195;     150;     450;       0;    6045;    5745;    6195;    6195;       0;       0
BRENT-DUBAI SWAP - NEW YORK MERCANTILE EXCHANGE ;2008.04.15;    6210;     150;     450;       0;    6000;    5760;    6150;    6210;      60;       0
BRENT-DUBAI SWAP - NEW YORK MERCANTILE EXCHANGE ;2008.03.25;    6635;     150;     500;       0;    6425;    6135;    6575;    6635;      60;       0
BRENT-DUBAI SWAP - NEW YORK MERCANTILE EXCHANGE ;2008.03.18;    6635;     150;     500;       0;    6425;    6135;    6575;    6635;      60;       0
BRENT-DUBAI SWAP - NEW YORK MERCANTILE EXCHANGE ;2008.03.11;    6435;     150;     500;       0;    6225;    5935;    6375;    6435;      60;       0
BRENT-DUBAI SWAP - NEW YORK MERCANTILE EXCHANGE ;2008.03.04;    6435;     150;     500;       0;    6225;    5935;    6375;    6435;      60;       0
BRENT-DUBAI SWAP - NEW YORK MERCANTILE EXCHANGE ;2008.02.26;    7185;     150;     550;       0;    6975;    6635;    7125;    7185;      60;       0
BRENT-DUBAI SWAP - NEW YORK MERCANTILE EXCHANGE ;2008.02.19;    6960;       0;     550;       0;    6900;    6410;    6900;    6960;      60;       0
BRENT-DUBAI SWAP - NEW YORK MERCANTILE EXCHANGE ;2008.02.12;    6760;       0;     550;       0;    6700;    6210;    6700;    6760;      60;       0
BRENT-DUBAI SWAP - NEW YORK MERCANTILE EXCHANGE ;2008.02.05;    6460;       0;     550;       0;    6400;    5910;    6400;    6460;      60;       0
BRENT-DUBAI SWAP - NEW YORK MERCANTILE EXCHANGE ;2008.01.29;    7110;       0;     600;       0;    7050;    6510;    7050;    7110;      60;       0
BRENT-DUBAI SWAP - NEW YORK MERCANTILE EXCHANGE ;2008.01.22;    7110;       0;     600;       0;    7050;    6510;    7050;    7110;      60;       0
BRENT-DUBAI SWAP - NEW YORK MERCANTILE EXCHANGE ;2007.12.31;    8610;      25;     600;       0;    8585;    8010;    8610;    8610;       0;       0
BRENT-DUBAI SWAP - NEW YORK MERCANTILE EXCHANGE ;2007.12.24;    8610;      25;     600;       0;    8585;    8010;    8610;    8610;       0;       0
BRENT-DUBAI SWAP - NEW YORK MERCANTILE EXCHANGE ;2007.12.18;    8610;      25;     600;       0;    8585;    8010;    8610;    8610;       0;       0
BRENT-DUBAI SWAP - NEW YORK MERCANTILE EXCHANGE ;2007.12.11;    7625;      25;     600;       0;    7450;    7025;    7475;    7625;     150;       0
BRENT-DUBAI SWAP - NEW YORK MERCANTILE EXCHANGE ;2007.12.04;    7475;      25;     600;       0;    7450;    6875;    7475;    7475;       0;       0
BRENT-DUBAI SWAP - NEW YORK MERCANTILE EXCHANGE ;2007.11.27;    9225;      50;     600;       0;    9175;    8625;    9225;    9225;       0;       0
BRENT-DUBAI SWAP - NEW YORK MERCANTILE EXCHANGE ;2007.11.20;    9225;      50;     600;       0;    9175;    8625;    9225;    9225;       0;       0
BRENT-DUBAI SWAP - NEW YORK MERCANTILE EXCHANGE ;2007.11.13;    9225;      50;     600;       0;    9175;    8625;    9225;    9225;       0;       0
BRENT-DUBAI SWAP - NEW YORK MERCANTILE EXCHANGE ;2007.11.06;    9075;      50;     600;       0;    9025;    8475;    9075;    9075;       0;       0
BRENT-DUBAI SWAP - NEW YORK MERCANTILE EXCHANGE ;2007.10.30;   10825;      75;     600;       0;   10750;   10225;   10825;   10825;       0;       0
BRENT-DUBAI SWAP - NEW YORK MERCANTILE EXCHANGE ;2011.07.12;   15905;    2109;     150;       0;   13730;   15710;   15839;   15860;      66;      45
BRENT-DUBAI SWAP - NEW YORK MERCANTILE EXCHANGE ;2011.07.05;   15830;    1875;     150;      75;   13730;   15560;   15680;   15785;     150;      45
BRENT-DUBAI SWAP - NEW YORK MERCANTILE EXCHANGE ;2011.06.28;   16970;    1950;     232;      75;   14720;   16525;   16745;   16832;     225;     138
BRENT-DUBAI SWAP - NEW YORK MERCANTILE EXCHANGE ;2011.06.21;   16130;    2640;     355;       0;   13490;   15730;   16130;   16085;       0;      45
BRENT-DUBAI SWAP - NEW YORK MERCANTILE EXCHANGE ;2011.06.14;   16130;    2565;     355;      75;   13490;   15655;   16130;   16085;       0;      45
BRENT-DUBAI SWAP - NEW YORK MERCANTILE EXCHANGE ;2011.06.07;   15305;    2565;     355;       0;   12740;   14905;   15305;   15260;       0;      45
BRENT-DUBAI SWAP - NEW YORK MERCANTILE EXCHANGE ;2011.05.31;   15620;    2475;     287;       0;   13085;   15270;   15560;   15557;      60;      63
BRENT-DUBAI SWAP - NEW YORK MERCANTILE EXCHANGE ;2011.05.24;   15320;    2475;     287;       0;   12845;   14970;   15320;   15257;       0;      63
BRENT-DUBAI SWAP - NEW YORK MERCANTILE EXCHANGE ;2011.05.17;   15245;    2175;     287;       0;   13070;   14895;   15245;   15182;       0;      63
BRENT-DUBAI SWAP - NEW YORK MERCANTILE EXCHANGE ;2011.05.10;   13595;    1275;     287;       0;   12320;   13245;   13595;   13532;       0;      63
BRENT-DUBAI SWAP - NEW YORK MERCANTILE EXCHANGE ;2011.05.03;   12545;     825;     287;       0;   11720;   12195;   12545;   12482;       0;      63
BRENT-DUBAI SWAP - NEW YORK MERCANTILE EXCHANGE ;2011.04.26;   12835;     825;     369;       0;   12010;   12385;   12835;   12754;       0;      81
BRENT-DUBAI SWAP - NEW YORK MERCANTILE EXCHANGE ;2011.04.19;   12535;     525;     369;       0;   12010;   12085;   12535;   12454;       0;      81
BRENT-DUBAI SWAP - NEW YORK MERCANTILE EXCHANGE ;2011.04.12;   12535;     525;     369;       0;   12010;   12085;   12535;   12454;       0;      81
BRENT-DUBAI SWAP - NEW YORK MERCANTILE EXCHANGE ;2011.04.05;   12085;     525;    1419;       0;   11560;   10585;   12085;   12004;       0;      81
BRENT-DUBAI SWAP - NEW YORK MERCANTILE EXCHANGE ;2011.03.29;   13550;    1789;    1269;       0;   11725;   12200;   13514;   13469;      36;      81
BRENT-DUBAI SWAP - NEW YORK MERCANTILE EXCHANGE ;2011.03.22;   13400;    1789;     969;       0;   11575;   12350;   13364;   13319;      36;      81
BRENT-DUBAI SWAP - NEW YORK MERCANTILE EXCHANGE ;2011.03.15;   12545;    1789;     369;       0;   10720;   12095;   12509;   12464;      36;      81
BRENT-DUBAI SWAP - NEW YORK MERCANTILE EXCHANGE ;2011.03.08;   12545;    1789;     369;       0;   10720;   12095;   12509;   12464;      36;      81
BRENT-DUBAI SWAP - NEW YORK MERCANTILE EXCHANGE ;2011.03.01;   12245;    1789;     369;       0;   10420;   11795;   12209;   12164;      36;      81
BRENT-DUBAI SWAP - NEW YORK MERCANTILE EXCHANGE ;2011.02.22;   15259;    3950;     744;       0;   11309;   14434;   15259;   15178;       0;      81
BRENT-DUBAI SWAP - NEW YORK MERCANTILE EXCHANGE ;2011.02.15;   15109;    3800;     969;       0;   11309;   14044;   15109;   15013;       0;      96
BRENT-DUBAI SWAP - NEW YORK MERCANTILE EXCHANGE ;2011.02.08;   14119;    3800;     969;       0;   10319;   13054;   14119;   14023;       0;      96
BRENT-DUBAI SWAP - NEW YORK MERCANTILE EXCHANGE ;2011.02.01;   14224;    3575;     928;     450;   10199;   12684;   14224;   14062;       0;     162
BRENT-DUBAI SWAP - NEW YORK MERCANTILE EXCHANGE ;2011.01.25;   16589;    4275;    1378;       0;   12164;   14899;   16439;   16277;     150;     312
BRENT-DUBAI SWAP - NEW YORK MERCANTILE EXCHANGE ;2011.01.18;   15239;    4725;     738;       0;   10514;   14339;   15239;   15077;       0;     162
BRENT-DUBAI SWAP - NEW YORK MERCANTILE EXCHANGE ;2011.01.11;   15119;    4725;     738;       0;   10244;   14069;   14969;   14807;     150;     312
BRENT-DUBAI SWAP - NEW YORK MERCANTILE EXCHANGE ;2011.01.04;   13920;    4425;     640;       0;    9465;   13145;   13890;   13785;      30;     135
BRENT-DUBAI SWAP - NEW YORK MERCANTILE EXCHANGE ;2011.07.12;   15905;    2109;     150;       0;   13730;   15710;   15839;   15860;      66;      45
BRENT-DUBAI SWAP - NEW YORK MERCANTILE EXCHANGE ;2010.12.28;   16195;    4625;     594;       0;   11545;   15495;   16170;   16089;      25;     106
BRENT-DUBAI SWAP - NEW YORK MERCANTILE EXCHANGE ;2010.12.21;   15645;    4325;     594;       0;   11295;   14945;   15620;   15539;      25;     106
BRENT-DUBAI SWAP - NEW YORK MERCANTILE EXCHANGE ;2010.12.14;   15345;    4325;     621;       0;   10995;   14645;   15320;   15266;      25;      79
BRENT-DUBAI SWAP - NEW YORK MERCANTILE EXCHANGE ;2010.12.07;   14970;    4325;     375;       0;   10620;   14570;   14945;   14945;      25;      25
BRENT-DUBAI SWAP - NEW YORK MERCANTILE EXCHANGE ;2010.11.30;   16925;    4525;     575;       0;   12350;   16300;   16875;   16875;      50;      50
BRENT-DUBAI SWAP - NEW YORK MERCANTILE EXCHANGE ;2010.11.23;   16925;    4525;     575;       0;   12350;   16300;   16875;   16875;      50;      50
BRENT-DUBAI SWAP - NEW YORK MERCANTILE EXCHANGE ;2010.11.16;   16925;    4525;     575;       0;   12200;   16150;   16725;   16725;     200;     200
BRENT-DUBAI SWAP - NEW YORK MERCANTILE EXCHANGE ;2010.11.09;   16718;    4750;     550;       0;   11918;   16118;   16668;   16668;      50;      50
BRENT-DUBAI SWAP - NEW YORK MERCANTILE EXCHANGE ;2010.11.02;   16318;    4750;     550;       0;   11518;   15718;   16268;   16268;      50;      50
BRENT-DUBAI SWAP - NEW YORK MERCANTILE EXCHANGE ;2010.10.26;   18703;    5298;     750;       0;   13228;   17878;   18526;   18628;     177;      75
BRENT-DUBAI SWAP - NEW YORK MERCANTILE EXCHANGE ;2010.10.19;   18653;    5412;     750;       0;   13028;   17828;   18440;   18578;     213;      75
BRENT-DUBAI SWAP - NEW YORK MERCANTILE EXCHANGE ;2010.10.12;   18635;    5643;     750;       0;   12710;   17810;   18353;   18560;     282;      75
BRENT-DUBAI SWAP - NEW YORK MERCANTILE EXCHANGE ;2010.10.05;   18460;    5643;     725;       0;   12535;   17660;   18178;   18385;     282;      75
BRENT-DUBAI SWAP - NEW YORK MERCANTILE EXCHANGE ;2010.09.28;   22785;    8274;     625;     100;   14060;   21985;   22434;   22710;     351;      75
BRENT-DUBAI SWAP - NEW YORK MERCANTILE EXCHANGE ;2010.09.21;   22685;    8274;     625;     100;   13960;   21885;   22334;   22610;     351;      75
BRENT-DUBAI SWAP - NEW YORK MERCANTILE EXCHANGE ;2010.09.14;   19310;    4374;     625;     100;   14485;   18510;   18959;   19235;     351;      75
BRENT-DUBAI SWAP - NEW YORK MERCANTILE EXCHANGE ;2010.09.07;   19635;    5100;     500;     100;   14105;   18660;   19305;   19260;     330;     375
BRENT-DUBAI SWAP - NEW YORK MERCANTILE EXCHANGE ;2010.08.31;   21475;    5100;     400;     200;   16100;   20755;   21400;   21355;      75;     120
BRENT-DUBAI SWAP - NEW YORK MERCANTILE EXCHANGE ;2010.08.24;   21535;    5100;     400;     200;   16010;   20665;   21310;   21265;     225;     270
BRENT-DUBAI SWAP - NEW YORK MERCANTILE EXCHANGE ;2010.08.17;   20810;    5100;     400;     200;   15435;   20090;   20735;   20690;      75;     120
BRENT-DUBAI SWAP - NEW YORK MERCANTILE EXCHANGE ;2010.08.10;   20960;    5100;     400;     200;   15435;   20135;   20735;   20735;     225;     225
BRENT-DUBAI SWAP - NEW YORK MERCANTILE EXCHANGE ;2010.08.03;   20880;    5250;     400;     200;   15310;   20205;   20760;   20805;     120;      75
BRENT-DUBAI SWAP - NEW YORK MERCANTILE EXCHANGE ;2010.07.27;   22690;    5250;     300;     300;   17020;   22015;   22570;   22615;     120;      75
BRENT-DUBAI SWAP - NEW YORK MERCANTILE EXCHANGE ;2010.07.20;   22925;    5250;     300;     300;   17310;   22305;   22860;   22905;      65;      20
BRENT-DUBAI SWAP - NEW YORK MERCANTILE EXCHANGE ;2010.07.13;   22955;    5250;     300;     300;   17360;   22355;   22910;   22955;      45;       0
BRENT-DUBAI SWAP - NEW YORK MERCANTILE EXCHANGE ;2010.07.06;   22665;    4644;     450;     300;   17370;   21915;   22314;   22665;     351;       0
BRENT-DUBAI SWAP - NEW YORK MERCANTILE EXCHANGE ;2010.06.29;   23535;    4744;     450;     300;   18140;   22785;   23184;   23535;     351;       0
BRENT-DUBAI SWAP - NEW YORK MERCANTILE EXCHANGE ;2010.06.22;   23490;    4744;     450;     300;   18140;   22695;   23184;   23445;     306;      45
BRENT-DUBAI SWAP - NEW YORK MERCANTILE EXCHANGE ;2010.06.15;   22445;    4744;     450;     300;   17095;   21695;   22139;   22445;     306;       0
BRENT-DUBAI SWAP - NEW YORK MERCANTILE EXCHANGE ;2010.06.08;   21170;    3544;     450;     300;   17020;   20420;   20864;   21170;     306;       0
BRENT-DUBAI SWAP - NEW YORK MERCANTILE EXCHANGE ;2010.06.01;   20890;    3244;     450;       0;   17040;   20140;   20284;   20590;     606;     300
BRENT-DUBAI SWAP - NEW YORK MERCANTILE EXCHANGE ;2010.05.25;   24575;    3344;     500;       0;   20925;   24075;   24269;   24575;     306;       0
BRENT-DUBAI SWAP - NEW YORK MERCANTILE EXCHANGE ;2010.05.18;   23910;    2144;    1100;       0;   21460;   22810;   23604;   23910;     306;       0
BRENT-DUBAI SWAP - NEW YORK MERCANTILE EXCHANGE ;2010.05.11;   24085;    2024;    1075;      75;   21710;   22935;   23809;   24085;     276;       0
BRENT-DUBAI SWAP - NEW YORK MERCANTILE EXCHANGE ;2010.05.04;   24510;    2024;    1150;      75;   22135;   23285;   24234;   24510;     276;       0
BRENT-DUBAI SWAP - NEW YORK MERCANTILE EXCHANGE ;2010.04.27;   28175;    2095;    1125;     264;   25525;   26750;   27884;   28139;     291;      36
BRENT-DUBAI SWAP - NEW YORK MERCANTILE EXCHANGE ;2010.04.20;   27525;    1795;     450;     264;   25175;   26775;   27234;   27489;     291;      36
BRENT-DUBAI SWAP - NEW YORK MERCANTILE EXCHANGE ;2010.04.13;   27200;    1795;     450;     264;   24850;   26450;   26909;   27164;     291;      36
BRENT-DUBAI SWAP - NEW YORK MERCANTILE EXCHANGE ;2010.04.06;   26975;    1759;     450;     150;   24775;   26375;   26684;   26975;     291;       0
BRENT-DUBAI SWAP - NEW YORK MERCANTILE EXCHANGE ;2010.03.30;   31605;    1946;     560;     233;   29105;   30795;   31284;   31588;     321;      17
BRENT-DUBAI SWAP - NEW YORK MERCANTILE EXCHANGE ;2010.03.23;   31485;    1946;     560;     233;   28985;   30675;   31164;   31468;     321;      17
BRENT-DUBAI SWAP - NEW YORK MERCANTILE EXCHANGE ;2010.03.16;   31280;    1946;     410;     233;   28780;   30620;   30959;   31263;     321;      17
BRENT-DUBAI SWAP - NEW YORK MERCANTILE EXCHANGE ;2010.03.09;   30755;    1946;     410;     233;   28255;   30095;   30434;   30738;     321;      17
BRENT-DUBAI SWAP - NEW YORK MERCANTILE EXCHANGE ;2010.03.02;   30111;    1022;     410;     239;   28805;   29445;   30066;   30094;      45;      17
BRENT-DUBAI SWAP - NEW YORK MERCANTILE EXCHANGE ;2010.02.23;   34200;     950;    1607;     150;   33100;   32310;   34200;   34067;       0;     133
BRENT-DUBAI SWAP - NEW YORK MERCANTILE EXCHANGE ;2010.02.16;   32730;     950;    1607;     150;   31630;   30840;   32730;   32597;       0;     133
BRENT-DUBAI SWAP - NEW YORK MERCANTILE EXCHANGE ;2010.02.09;   32880;     950;    1607;     150;   31780;   30990;   32880;   32747;       0;     133
BRENT-DUBAI SWAP - NEW YORK MERCANTILE EXCHANGE ;2010.02.02;   32910;     950;    1607;     150;   31810;   31020;   32910;   32777;       0;     133
BRENT-DUBAI SWAP - NEW YORK MERCANTILE EXCHANGE ;2010.01.26;   37645;     650;    1800;     150;   36795;   35495;   37595;   37445;      50;     200
BRENT-DUBAI SWAP - NEW YORK MERCANTILE EXCHANGE ;2010.01.19;   38245;     650;    2130;     150;   37445;   35815;   38245;   38095;       0;     150
BRENT-DUBAI SWAP - NEW YORK MERCANTILE EXCHANGE ;2010.01.12;   37030;     500;    2130;     150;   36380;   34600;   37030;   36880;       0;     150
BRENT-DUBAI SWAP - NEW YORK MERCANTILE EXCHANGE ;2010.01.05;   36070;       0;    2130;       0;   36070;   33851;   36070;   35981;       0;      89
BRENT-DUBAI SWAP - NEW YORK MERCANTILE EXCHANGE ;2009.12.29;   40811;       0;    2130;       0;   40796;   38547;   40796;   40677;      15;     134
BRENT-DUBAI SWAP - NEW YORK MERCANTILE EXCHANGE ;2009.12.22;   40666;       0;    2130;       0;   40561;   38428;   40561;   40558;     105;     108
BRENT-DUBAI SWAP - NEW YORK MERCANTILE EXCHANGE ;2009.12.15;   40211;       0;    2130;       0;   39996;   37881;   39996;   40011;     215;     200
BRENT-DUBAI SWAP - NEW YORK MERCANTILE EXCHANGE ;2009.12.08;   40046;       0;    2130;       0;   39831;   37716;   39831;   39846;     215;     200
BRENT-DUBAI SWAP - NEW YORK MERCANTILE EXCHANGE ;2009.12.01;   38551;       0;    2130;       0;   38536;   36221;   38536;   38351;      15;     200
BRENT-DUBAI SWAP - NEW YORK MERCANTILE EXCHANGE ;2009.11.24;   42257;       0;    1518;       0;   42177;   40587;   42177;   42105;      80;     152
BRENT-DUBAI SWAP - NEW YORK MERCANTILE EXCHANGE ;2009.11.17;   42162;       0;    1218;       0;   42082;   40047;   42082;   41265;      80;     897
BRENT-DUBAI SWAP - NEW YORK MERCANTILE EXCHANGE ;2009.11.09;   37767;       0;    1038;       0;   37637;   36587;   37637;   37625;     130;     142
BRENT-DUBAI SWAP - NEW YORK MERCANTILE EXCHANGE ;2009.11.03;   37552;       0;    1343;       0;   37422;   36067;   37422;   37410;     130;     142
BRENT-DUBAI SWAP - NEW YORK MERCANTILE EXCHANGE ;2009.10.27;   41013;       0;    1368;       0;   40818;   39543;   40818;   40911;     195;     102
BRENT-DUBAI SWAP - NEW YORK MERCANTILE EXCHANGE ;2009.10.20;   40398;       0;    1368;       0;   40203;   38928;   40203;   40296;     195;     102
BRENT-DUBAI SWAP - NEW YORK MERCANTILE EXCHANGE ;2009.10.13;   39763;       0;    1368;       0;   39568;   38293;   39568;   39661;     195;     102
BRENT-DUBAI SWAP - NEW YORK MERCANTILE EXCHANGE ;2009.10.06;   39613;       0;    1368;       0;   39418;   37843;   39418;   39211;     195;     402
BRENT-DUBAI SWAP - NEW YORK MERCANTILE EXCHANGE ;2009.09.29;   43098;     400;    1428;       0;   42488;   41568;   42888;   42996;     210;     102
BRENT-DUBAI SWAP - NEW YORK MERCANTILE EXCHANGE ;2009.09.22;   42833;     400;    1428;       0;   42223;   41253;   42623;   42681;     210;     152
BRENT-DUBAI SWAP - NEW YORK MERCANTILE EXCHANGE ;2009.09.15;   42713;     400;    1428;       0;   42103;   41133;   42503;   42561;     210;     152
BRENT-DUBAI SWAP - NEW YORK MERCANTILE EXCHANGE ;2009.09.08;   42598;     400;    1428;       0;   41988;   41018;   42388;   42446;     210;     152
BRENT-DUBAI SWAP - NEW YORK MERCANTILE EXCHANGE ;2009.09.01;   42038;     400;    1248;       0;   41428;   40578;   41828;   41826;     210;     212
BRENT-DUBAI SWAP - NEW YORK MERCANTILE EXCHANGE ;2009.08.25;   44932;     800;    1308;       0;   43907;   43407;   44707;   44715;     225;     217
BRENT-DUBAI SWAP - NEW YORK MERCANTILE EXCHANGE ;2009.08.18;   45027;     800;     948;       0;   44152;   43862;   44952;   44810;      75;     217
BRENT-DUBAI SWAP - NEW YORK MERCANTILE EXCHANGE ;2009.08.11;   42322;    3195;     948;     325;   38727;   40832;   42247;   42105;      75;     217
BRENT-DUBAI SWAP - NEW YORK MERCANTILE EXCHANGE ;2009.08.04;   42357;    3195;     948;     325;   38762;   40867;   42282;   42140;      75;     217
BRENT-DUBAI SWAP - NEW YORK MERCANTILE EXCHANGE ;2009.07.28;   47542;    3205;    1158;     615;   43632;   45607;   47452;   47380;      90;     162
BRENT-DUBAI SWAP - NEW YORK MERCANTILE EXCHANGE ;2009.07.21;   44587;    2905;     858;     615;   40977;   43012;   44497;   44485;      90;     102
BRENT-DUBAI SWAP - NEW YORK MERCANTILE EXCHANGE ;2009.07.14;   40922;    2905;     858;     555;   37372;   39407;   40832;   40820;      90;     102
BRENT-DUBAI SWAP - NEW YORK MERCANTILE EXCHANGE ;2009.07.07;   40272;    3055;     858;     465;   36662;   38847;   40182;   40170;      90;     102
BRENT-DUBAI SWAP - NEW YORK MERCANTILE EXCHANGE ;2009.06.30;   43787;    3050;    2133;     470;   40162;   41082;   43682;   43685;     105;     102
BRENT-DUBAI SWAP - NEW YORK MERCANTILE EXCHANGE ;2009.06.23;   42086;    3050;    2133;     470;   38461;   39381;   41981;   41984;     105;     102
BRENT-DUBAI SWAP - NEW YORK MERCANTILE EXCHANGE ;2009.06.16;   40676;    2850;    2283;     510;   37211;   37781;   40571;   40574;     105;     102
BRENT-DUBAI SWAP - NEW YORK MERCANTILE EXCHANGE ;2009.06.09;   39591;    2850;    2583;     510;   36076;   36096;   39436;   39189;     155;     402
BRENT-DUBAI SWAP - NEW YORK MERCANTILE EXCHANGE ;2009.06.02;   38441;    2850;    2733;     510;   34476;   34571;   37836;   37814;     605;     627
BRENT-DUBAI SWAP - NEW YORK MERCANTILE EXCHANGE ;2009.05.26;   42415;    2510;    3708;     850;   38135;   36930;   41495;   41488;     920;     927
BRENT-DUBAI SWAP - NEW YORK MERCANTILE EXCHANGE ;2009.05.19;   41345;    1910;    3708;     850;   37665;   35860;   40425;   40418;     920;     927
BRENT-DUBAI SWAP - NEW YORK MERCANTILE EXCHANGE ;2009.05.12;   39470;    1185;    3808;     750;   36515;   34035;   38450;   38593;    1020;     877
BRENT-DUBAI SWAP - NEW YORK MERCANTILE EXCHANGE ;2009.05.05;   38450;    1185;    3808;     750;   35595;   32965;   37530;   37523;     920;     927
BRENT-DUBAI SWAP - NEW YORK MERCANTILE EXCHANGE ;2009.04.28;   42734;     795;    5231;     990;   39664;   35734;   41449;   41955;    1285;     779
BRENT-DUBAI SWAP - NEW YORK MERCANTILE EXCHANGE ;2009.04.21;   40183;     265;    5005;    1235;   37598;   33118;   39098;   39358;    1085;     825
BRENT-DUBAI SWAP - NEW YORK MERCANTILE EXCHANGE ;2009.04.14;   39603;     115;    4555;    1355;   36933;   32903;   38403;   38813;    1200;     790
BRENT-DUBAI SWAP - NEW YORK MERCANTILE EXCHANGE ;2009.04.07;   39238;     315;    4555;    1155;   36783;   32703;   38253;   38413;     985;     825
BRENT-DUBAI SWAP - NEW YORK MERCANTILE EXCHANGE ;2009.03.31;   41059;     120;    4955;    1230;   39709;   34874;   41059;   41059;       0;       0
BRENT-DUBAI SWAP - NEW YORK MERCANTILE EXCHANGE ;2009.03.24;   40099;     120;    4955;    1230;   38749;   33914;   40099;   40099;       0;       0
BRENT-DUBAI SWAP - NEW YORK MERCANTILE EXCHANGE ;2009.03.17;   37099;     120;    5045;    1230;   35749;   30824;   37099;   37099;       0;       0
BRENT-DUBAI SWAP - NEW YORK MERCANTILE EXCHANGE ;2009.03.10;   38423;     495;    7145;     885;   37043;   30393;   38423;   38423;       0;       0
BRENT-DUBAI SWAP - NEW YORK MERCANTILE EXCHANGE ;2009.03.03;   36900;     495;    7745;     765;   35640;   28390;   36900;   36900;       0;       0
BRENT-DUBAI SWAP - NEW YORK MERCANTILE EXCHANGE ;2009.02.24;   37626;     725;    7695;     465;   36436;   29466;   37626;   37626;       0;       0
BRENT-DUBAI SWAP - NEW YORK MERCANTILE EXCHANGE ;2009.02.17;   36391;     475;    7695;     390;   35226;   28006;   36091;   36091;     300;     300
BRENT-DUBAI SWAP - NEW YORK MERCANTILE EXCHANGE ;2009.02.10;   34501;       0;    8170;      40;   34461;   26291;   34501;   34501;       0;       0
BRENT-DUBAI SWAP - NEW YORK MERCANTILE EXCHANGE ;2009.02.03;   32974;       0;    8095;      40;   32934;   24839;   32974;   32974;       0;       0
BRENT-DUBAI SWAP - NEW YORK MERCANTILE EXCHANGE ;2009.01.27;   32445;       0;    7165;      95;   32350;   25185;   32445;   32445;       0;       0
BRENT-DUBAI SWAP - NEW YORK MERCANTILE EXCHANGE ;2009.01.20;   31220;       0;    7240;      95;   31125;   23885;   31220;   31220;       0;       0
BRENT-DUBAI SWAP - NEW YORK MERCANTILE EXCHANGE ;2009.01.13;   26845;       0;    2020;      95;   26750;   24730;   26845;   26845;       0;       0
BRENT-DUBAI SWAP - NEW YORK MERCANTILE EXCHANGE ;2009.01.06;   23395;       0;     520;      95;   23300;   22780;   23395;   23395;       0;       0
BRENT-DUBAI SWAP - NEW YORK MERCANTILE EXCHANGE ;2008.12.30;   23620;       0;     645;      65;   23555;   22910;   23620;   23620;       0;       0
BRENT-DUBAI SWAP - NEW YORK MERCANTILE EXCHANGE ;2008.12.22;   22720;       0;     645;      65;   22655;   22010;   22720;   22720;       0;       0
BRENT-DUBAI SWAP - NEW YORK MERCANTILE EXCHANGE ;2008.12.16;   21095;       0;     495;      65;   21030;   20535;   21095;   21095;       0;       0
BRENT-DUBAI SWAP - NEW YORK MERCANTILE EXCHANGE ;2008.12.09;   19912;       0;     495;      65;   19847;   19352;   19912;   19912;       0;       0
BRENT-DUBAI SWAP - NEW YORK MERCANTILE EXCHANGE ;2008.12.02;   19772;       0;     420;      65;   19707;   19287;   19772;   19772;       0;       0
BRENT-DUBAI SWAP - NEW YORK MERCANTILE EXCHANGE ;2008.11.25;   20487;       0;     620;       5;   20482;   19862;   20487;   20487;       0;       0
BRENT-DUBAI SWAP - NEW YORK MERCANTILE EXCHANGE ;2008.11.18;   17887;       0;     670;       0;   17887;   17217;   17887;   17887;       0;       0
BRENT-DUBAI SWAP - NEW YORK MERCANTILE EXCHANGE ;2008.11.11;   16147;       0;     670;       0;   16147;   15477;   16147;   16147;       0;       0
BRENT-DUBAI SWAP - NEW YORK MERCANTILE EXCHANGE ;2008.11.04;   15370;       0;     970;       0;   15370;   14400;   15370;   15370;       0;       0
BRENT-DUBAI SWAP - NEW YORK MERCANTILE EXCHANGE ;2008.10.28;   15683;       0;    1020;       0;   15533;   14513;   15533;   15533;     150;     150
BRENT-DUBAI SWAP - NEW YORK MERCANTILE EXCHANGE ;2008.10.21;   12223;       0;     720;       0;   12223;   11503;   12223;   12223;       0;       0
BRENT-DUBAI SWAP - NEW YORK MERCANTILE EXCHANGE ;2008.10.14;   10100;       0;     720;       0;   10100;    9380;   10100;   10100;       0;       0
BRENT-DUBAI SWAP - NEW YORK MERCANTILE EXCHANGE ;2008.10.07;    8263;       0;     540;       0;    8263;    7723;    8263;    8263;       0;       0
BRENT-DUBAI SWAP - NEW YORK MERCANTILE EXCHANGE ;2008.09.30;    8753;      50;     500;       0;    8703;    8253;    8753;    8753;       0;       0
BRENT-DUBAI SWAP - NEW YORK MERCANTILE EXCHANGE ;2008.09.23;    8542;      50;     500;       0;    7892;    7442;    7942;    7942;     600;     600
BRENT-DUBAI SWAP - NEW YORK MERCANTILE EXCHANGE ;2008.09.16;    8059;      50;     500;       0;    8009;    7559;    8059;    8059;       0;       0
BRENT-DUBAI SWAP - NEW YORK MERCANTILE EXCHANGE ;2008.09.09;    8011;      50;     500;       0;    7961;    7511;    8011;    8011;       0;       0
BRENT-DUBAI SWAP - NEW YORK MERCANTILE EXCHANGE ;2008.09.02;    7569;      50;     500;       0;    7519;    7069;    7569;    7569;       0;       0
BRENT-DUBAI SWAP - NEW YORK MERCANTILE EXCHANGE ;2008.08.26;    7894;     100;     550;       0;    7794;    7344;    7894;    7894;       0;       0
BRENT-DUBAI SWAP - NEW YORK MERCANTILE EXCHANGE ;2008.08.19;    7294;       0;     550;       0;    7294;    6744;    7294;    7294;       0;       0
BRENT-DUBAI SWAP - NEW YORK MERCANTILE EXCHANGE ;2008.08.12;    7444;       0;     550;       0;    7102;    6519;    7102;    7069;     342;     375
BRENT-DUBAI SWAP - NEW YORK MERCANTILE EXCHANGE ;2008.08.05;    7339;       0;     550;       0;    7264;    6714;    7264;    7264;      75;      75
BRENT-DUBAI SWAP - NEW YORK MERCANTILE EXCHANGE ;2008.07.29;    6509;       0;     600;       0;    6509;    5909;    6509;    6509;       0;       0
BRENT-DUBAI SWAP - NEW YORK MERCANTILE EXCHANGE ;2008.07.22;    6509;       0;     600;       0;    6509;    5909;    6509;    6509;       0;       0
BRENT-DUBAI SWAP - NEW YORK MERCANTILE EXCHANGE ;2008.07.15;    5882;       0;     600;       0;    5882;    5090;    5882;    5690;       0;     192
BRENT-DUBAI SWAP - NEW YORK MERCANTILE EXCHANGE ;2008.07.08;    5792;       0;     600;       0;    5792;    5192;    5792;    5792;       0;       0
BRENT-DUBAI SWAP - NEW YORK MERCANTILE EXCHANGE ;2008.07.01;    5792;       0;     600;       0;    5792;    5192;    5792;    5792;       0;       0
BRENT-DUBAI SWAP - NEW YORK MERCANTILE EXCHANGE ;2008.06.24;    6245;      50;     650;       0;    6195;    5595;    6245;    6245;       0;       0
BRENT-DUBAI SWAP - NEW YORK MERCANTILE EXCHANGE ;2008.06.17;    5945;      50;     650;       0;    5895;    5295;    5945;    5945;       0;       0
BRENT-DUBAI SWAP - NEW YORK MERCANTILE EXCHANGE ;2008.06.10;    5945;      50;     650;       0;    5895;    5295;    5945;    5945;       0;       0
BRENT-DUBAI SWAP - NEW YORK MERCANTILE EXCHANGE ;2008.06.03;    5855;      50;     650;       0;    5805;    5205;    5855;    5855;       0;       0
BRENT-DUBAI SWAP - NEW YORK MERCANTILE EXCHANGE ;2008.05.27;    6415;     100;     700;       0;    6015;    5715;    6115;    6415;     300;       0
BRENT-DUBAI SWAP - NEW YORK MERCANTILE EXCHANGE ;2008.05.20;    5815;     400;     400;       0;    5415;    5415;    5815;    5815;       0;       0
BRENT-DUBAI SWAP - NEW YORK MERCANTILE EXCHANGE ;2008.05.13;    5770;     400;     400;       0;    5370;    5370;    5770;    5770;       0;       0
BRENT-DUBAI SWAP - NEW YORK MERCANTILE EXCHANGE ;2008.05.06;    5620;     400;     400;       0;    5220;    5220;    5620;    5620;       0;       0
BRENT-DUBAI SWAP - NEW YORK MERCANTILE EXCHANGE ;2008.04.29;    6495;     450;     450;       0;    6045;    6045;    6495;    6495;       0;       0
BRENT-DUBAI SWAP - NEW YORK MERCANTILE EXCHANGE ;2008.04.22;    6195;     150;     450;       0;    6045;    5745;    6195;    6195;       0;       0
BRENT-DUBAI SWAP - NEW YORK MERCANTILE EXCHANGE ;2008.04.15;    6210;     150;     450;       0;    6000;    5760;    6150;    6210;      60;       0
BRENT-DUBAI SWAP - NEW YORK MERCANTILE EXCHANGE ;2008.03.25;    6635;     150;     500;       0;    6425;    6135;    6575;    6635;      60;       0
BRENT-DUBAI SWAP - NEW YORK MERCANTILE EXCHANGE ;2008.03.18;    6635;     150;     500;       0;    6425;    6135;    6575;    6635;      60;       0
BRENT-DUBAI SWAP - NEW YORK MERCANTILE EXCHANGE ;2008.03.11;    6435;     150;     500;       0;    6225;    5935;    6375;    6435;      60;       0
BRENT-DUBAI SWAP - NEW YORK MERCANTILE EXCHANGE ;2008.03.04;    6435;     150;     500;       0;    6225;    5935;    6375;    6435;      60;       0
BRENT-DUBAI SWAP - NEW YORK MERCANTILE EXCHANGE ;2008.02.26;    7185;     150;     550;       0;    6975;    6635;    7125;    7185;      60;       0
BRENT-DUBAI SWAP - NEW YORK MERCANTILE EXCHANGE ;2008.02.19;    6960;       0;     550;       0;    6900;    6410;    6900;    6960;      60;       0
BRENT-DUBAI SWAP - NEW YORK MERCANTILE EXCHANGE ;2008.02.12;    6760;       0;     550;       0;    6700;    6210;    6700;    6760;      60;       0
BRENT-DUBAI SWAP - NEW YORK MERCANTILE EXCHANGE ;2008.02.05;    6460;       0;     550;       0;    6400;    5910;    6400;    6460;      60;       0
BRENT-DUBAI SWAP - NEW YORK MERCANTILE EXCHANGE ;2008.01.29;    7110;       0;     600;       0;    7050;    6510;    7050;    7110;      60;       0
BRENT-DUBAI SWAP - NEW YORK MERCANTILE EXCHANGE ;2008.01.22;    7110;       0;     600;       0;    7050;    6510;    7050;    7110;      60;       0
BRENT-DUBAI SWAP - NEW YORK MERCANTILE EXCHANGE ;2007.12.31;    8610;      25;     600;       0;    8585;    8010;    8610;    8610;       0;       0
BRENT-DUBAI SWAP - NEW YORK MERCANTILE EXCHANGE ;2007.12.24;    8610;      25;     600;       0;    8585;    8010;    8610;    8610;       0;       0
BRENT-DUBAI SWAP - NEW YORK MERCANTILE EXCHANGE ;2007.12.18;    8610;      25;     600;       0;    8585;    8010;    8610;    8610;       0;       0
BRENT-DUBAI SWAP - NEW YORK MERCANTILE EXCHANGE ;2007.12.11;    7625;      25;     600;       0;    7450;    7025;    7475;    7625;     150;       0
BRENT-DUBAI SWAP - NEW YORK MERCANTILE EXCHANGE ;2007.12.04;    7475;      25;     600;       0;    7450;    6875;    7475;    7475;       0;       0
BRENT-DUBAI SWAP - NEW YORK MERCANTILE EXCHANGE ;2007.11.27;    9225;      50;     600;       0;    9175;    8625;    9225;    9225;       0;       0
BRENT-DUBAI SWAP - NEW YORK MERCANTILE EXCHANGE ;2007.11.20;    9225;      50;     600;       0;    9175;    8625;    9225;    9225;       0;       0
BRENT-DUBAI SWAP - NEW YORK MERCANTILE EXCHANGE ;2007.11.13;    9225;      50;     600;       0;    9175;    8625;    9225;    9225;       0;       0
BRENT-DUBAI SWAP - NEW YORK MERCANTILE EXCHANGE ;2007.11.06;    9075;      50;     600;       0;    9025;    8475;    9075;    9075;       0;       0
BRENT-DUBAI SWAP - NEW YORK MERCANTILE EXCHANGE ;2007.10.30;   10825;      75;     600;       0;   10750;   10225;   10825;   10825;       0;       0
BRENT-DUBAI SWAP - NEW YORK MERCANTILE EXCHANGE ;2011.07.12;   15905;    2109;     150;       0;   13730;   15710;   15839;   15860;      66;      45
BRENT-DUBAI SWAP - NEW YORK MERCANTILE EXCHANGE ;2011.07.05;   15830;    1875;     150;      75;   13730;   15560;   15680;   15785;     150;      45
BRENT-DUBAI SWAP - NEW YORK MERCANTILE EXCHANGE ;2011.06.28;   16970;    1950;     232;      75;   14720;   16525;   16745;   16832;     225;     138
BRENT-DUBAI SWAP - NEW YORK MERCANTILE EXCHANGE ;2011.06.21;   16130;    2640;     355;       0;   13490;   15730;   16130;   16085;       0;      45
BRENT-DUBAI SWAP - NEW YORK MERCANTILE EXCHANGE ;2011.06.14;   16130;    2565;     355;      75;   13490;   15655;   16130;   16085;       0;      45
BRENT-DUBAI SWAP - NEW YORK MERCANTILE EXCHANGE ;2011.06.07;   15305;    2565;     355;       0;   12740;   14905;   15305;   15260;       0;      45
BRENT-DUBAI SWAP - NEW YORK MERCANTILE EXCHANGE ;2011.05.31;   15620;    2475;     287;       0;   13085;   15270;   15560;   15557;      60;      63
BRENT-DUBAI SWAP - NEW YORK MERCANTILE EXCHANGE ;2011.05.24;   15320;    2475;     287;       0;   12845;   14970;   15320;   15257;       0;      63
BRENT-DUBAI SWAP - NEW YORK MERCANTILE EXCHANGE ;2011.05.17;   15245;    2175;     287;       0;   13070;   14895;   15245;   15182;       0;      63
BRENT-DUBAI SWAP - NEW YORK MERCANTILE EXCHANGE ;2011.05.10;   13595;    1275;     287;       0;   12320;   13245;   13595;   13532;       0;      63
BRENT-DUBAI SWAP - NEW YORK MERCANTILE EXCHANGE ;2011.05.03;   12545;     825;     287;       0;   11720;   12195;   12545;   12482;       0;      63
BRENT-DUBAI SWAP - NEW YORK MERCANTILE EXCHANGE ;2011.04.26;   12835;     825;     369;       0;   12010;   12385;   12835;   12754;       0;      81
BRENT-DUBAI SWAP - NEW YORK MERCANTILE EXCHANGE ;2011.04.19;   12535;     525;     369;       0;   12010;   12085;   12535;   12454;       0;      81
BRENT-DUBAI SWAP - NEW YORK MERCANTILE EXCHANGE ;2011.04.12;   12535;     525;     369;       0;   12010;   12085;   12535;   12454;       0;      81
BRENT-DUBAI SWAP - NEW YORK MERCANTILE EXCHANGE ;2011.04.05;   12085;     525;    1419;       0;   11560;   10585;   12085;   12004;       0;      81
BRENT-DUBAI SWAP - NEW YORK MERCANTILE EXCHANGE ;2011.03.29;   13550;    1789;    1269;       0;   11725;   12200;   13514;   13469;      36;      81
BRENT-DUBAI SWAP - NEW YORK MERCANTILE EXCHANGE ;2011.03.22;   13400;    1789;     969;       0;   11575;   12350;   13364;   13319;      36;      81
BRENT-DUBAI SWAP - NEW YORK MERCANTILE EXCHANGE ;2011.03.15;   12545;    1789;     369;       0;   10720;   12095;   12509;   12464;      36;      81
BRENT-DUBAI SWAP - NEW YORK MERCANTILE EXCHANGE ;2011.03.08;   12545;    1789;     369;       0;   10720;   12095;   12509;   12464;      36;      81
BRENT-DUBAI SWAP - NEW YORK MERCANTILE EXCHANGE ;2011.03.01;   12245;    1789;     369;       0;   10420;   11795;   12209;   12164;      36;      81
BRENT-DUBAI SWAP - NEW YORK MERCANTILE EXCHANGE ;2011.02.22;   15259;    3950;     744;       0;   11309;   14434;   15259;   15178;       0;      81
BRENT-DUBAI SWAP - NEW YORK MERCANTILE EXCHANGE ;2011.02.15;   15109;    3800;     969;       0;   11309;   14044;   15109;   15013;       0;      96
BRENT-DUBAI SWAP - NEW YORK MERCANTILE EXCHANGE ;2011.02.08;   14119;    3800;     969;       0;   10319;   13054;   14119;   14023;       0;      96
BRENT-DUBAI SWAP - NEW YORK MERCANTILE EXCHANGE ;2011.02.01;   14224;    3575;     928;     450;   10199;   12684;   14224;   14062;       0;     162
BRENT-DUBAI SWAP - NEW YORK MERCANTILE EXCHANGE ;2011.01.25;   16589;    4275;    1378;       0;   12164;   14899;   16439;   16277;     150;     312
BRENT-DUBAI SWAP - NEW YORK MERCANTILE EXCHANGE ;2011.01.18;   15239;    4725;     738;       0;   10514;   14339;   15239;   15077;       0;     162
BRENT-DUBAI SWAP - NEW YORK MERCANTILE EXCHANGE ;2011.01.11;   15119;    4725;     738;       0;   10244;   14069;   14969;   14807;     150;     312
BRENT-DUBAI SWAP - NEW YORK MERCANTILE EXCHANGE ;2011.01.04;   13920;    4425;     640;       0;    9465;   13145;   13890;   13785;      30;     135
BRENT-DUBAI SWAP - NEW YORK MERCANTILE EXCHANGE ;2011.07.12;   15905;    2109;     150;       0;   13730;   15710;   15839;   15860;      66;      45
BRENT-DUBAI SWAP - NEW YORK MERCANTILE EXCHANGE ;2011.07.05;   15830;    1875;     150;      75;   13730;   15560;   15680;   15785;     150;      45
BRENT-DUBAI SWAP - NEW YORK MERCANTILE EXCHANGE ;2011.06.28;   16970;    1950;     232;      75;   14720;   16525;   16745;   16832;     225;     138
BRENT-DUBAI SWAP - NEW YORK MERCANTILE EXCHANGE ;2011.06.21;   16130;    2640;     355;       0;   13490;   15730;   16130;   16085;       0;      45
BRENT-DUBAI SWAP - NEW YORK MERCANTILE EXCHANGE ;2011.06.14;   16130;    2565;     355;      75;   13490;   15655;   16130;   16085;       0;      45
BRENT-DUBAI SWAP - NEW YORK MERCANTILE EXCHANGE ;2011.06.07;   15305;    2565;     355;       0;   12740;   14905;   15305;   15260;       0;      45
BRENT-DUBAI SWAP - NEW YORK MERCANTILE EXCHANGE ;2011.05.31;   15620;    2475;     287;       0;   13085;   15270;   15560;   15557;      60;      63
BRENT-DUBAI SWAP - NEW YORK MERCANTILE EXCHANGE ;2011.05.24;   15320;    2475;     287;       0;   12845;   14970;   15320;   15257;       0;      63
BRENT-DUBAI SWAP - NEW YORK MERCANTILE EXCHANGE ;2011.05.17;   15245;    2175;     287;       0;   13070;   14895;   15245;   15182;       0;      63
BRENT-DUBAI SWAP - NEW YORK MERCANTILE EXCHANGE ;2011.05.10;   13595;    1275;     287;       0;   12320;   13245;   13595;   13532;       0;      63
BRENT-DUBAI SWAP - NEW YORK MERCANTILE EXCHANGE ;2011.05.03;   12545;     825;     287;       0;   11720;   12195;   12545;   12482;       0;      63
BRENT-DUBAI SWAP - NEW YORK MERCANTILE EXCHANGE ;2011.04.26;   12835;     825;     369;       0;   12010;   12385;   12835;   12754;       0;      81
BRENT-DUBAI SWAP - NEW YORK MERCANTILE EXCHANGE ;2011.04.19;   12535;     525;     369;       0;   12010;   12085;   12535;   12454;       0;      81
BRENT-DUBAI SWAP - NEW YORK MERCANTILE EXCHANGE ;2011.04.12;   12535;     525;     369;       0;   12010;   12085;   12535;   12454;       0;      81
BRENT-DUBAI SWAP - NEW YORK MERCANTILE EXCHANGE ;2011.04.05;   12085;     525;    1419;       0;   11560;   10585;   12085;   12004;       0;      81
BRENT-DUBAI SWAP - NEW YORK MERCANTILE EXCHANGE ;2011.03.29;   13550;    1789;    1269;       0;   11725;   12200;   13514;   13469;      36;      81
BRENT-DUBAI SWAP - NEW YORK MERCANTILE EXCHANGE ;2011.03.22;   13400;    1789;     969;       0;   11575;   12350;   13364;   13319;      36;      81
BRENT-DUBAI SWAP - NEW YORK MERCANTILE EXCHANGE ;2011.03.15;   12545;    1789;     369;       0;   10720;   12095;   12509;   12464;      36;      81
BRENT-DUBAI SWAP - NEW YORK MERCANTILE EXCHANGE ;2011.03.08;   12545;    1789;     369;       0;   10720;   12095;   12509;   12464;      36;      81
BRENT-DUBAI SWAP - NEW YORK MERCANTILE EXCHANGE ;2011.03.01;   12245;    1789;     369;       0;   10420;   11795;   12209;   12164;      36;      81
BRENT-DUBAI SWAP - NEW YORK MERCANTILE EXCHANGE ;2011.02.22;   15259;    3950;     744;       0;   11309;   14434;   15259;   15178;       0;      81
BRENT-DUBAI SWAP - NEW YORK MERCANTILE EXCHANGE ;2011.02.15;   15109;    3800;     969;       0;   11309;   14044;   15109;   15013;       0;      96
BRENT-DUBAI SWAP - NEW YORK MERCANTILE EXCHANGE ;2011.02.08;   14119;    3800;     969;       0;   10319;   13054;   14119;   14023;       0;      96
BRENT-DUBAI SWAP - NEW YORK MERCANTILE EXCHANGE ;2011.02.01;   14224;    3575;     928;     450;   10199;   12684;   14224;   14062;       0;     162
BRENT-DUBAI SWAP - NEW YORK MERCANTILE EXCHANGE ;2011.01.25;   16589;    4275;    1378;       0;   12164;   14899;   16439;   16277;     150;     312
BRENT-DUBAI SWAP - NEW YORK MERCANTILE EXCHANGE ;2011.01.18;   15239;    4725;     738;       0;   10514;   14339;   15239;   15077;       0;     162
BRENT-DUBAI SWAP - NEW YORK MERCANTILE EXCHANGE ;2011.01.11;   15119;    4725;     738;       0;   10244;   14069;   14969;   14807;     150;     312
BRENT-DUBAI SWAP - NEW YORK MERCANTILE EXCHANGE ;2011.01.04;   13920;    4425;     640;       0;    9465;   13145;   13890;   13785;      30;     135
BRENT-DUBAI SWAP - NEW YORK MERCANTILE EXCHANGE ;2010.12.28;   16195;    4625;     594;       0;   11545;   15495;   16170;   16089;      25;     106
BRENT-DUBAI SWAP - NEW YORK MERCANTILE EXCHANGE ;2010.12.21;   15645;    4325;     594;       0;   11295;   14945;   15620;   15539;      25;     106
BRENT-DUBAI SWAP - NEW YORK MERCANTILE EXCHANGE ;2010.12.14;   15345;    4325;     621;       0;   10995;   14645;   15320;   15266;      25;      79
BRENT-DUBAI SWAP - NEW YORK MERCANTILE EXCHANGE ;2010.12.07;   14970;    4325;     375;       0;   10620;   14570;   14945;   14945;      25;      25
BRENT-DUBAI SWAP - NEW YORK MERCANTILE EXCHANGE ;2010.11.30;   16925;    4525;     575;       0;   12350;   16300;   16875;   16875;      50;      50
BRENT-DUBAI SWAP - NEW YORK MERCANTILE EXCHANGE ;2010.11.23;   16925;    4525;     575;       0;   12350;   16300;   16875;   16875;      50;      50
BRENT-DUBAI SWAP - NEW YORK MERCANTILE EXCHANGE ;2010.11.16;   16925;    4525;     575;       0;   12200;   16150;   16725;   16725;     200;     200
BRENT-DUBAI SWAP - NEW YORK MERCANTILE EXCHANGE ;2010.11.09;   16718;    4750;     550;       0;   11918;   16118;   16668;   16668;      50;      50
BRENT-DUBAI SWAP - NEW YORK MERCANTILE EXCHANGE ;2010.11.02;   16318;    4750;     550;       0;   11518;   15718;   16268;   16268;      50;      50
BRENT-DUBAI SWAP - NEW YORK MERCANTILE EXCHANGE ;2010.10.26;   18703;    5298;     750;       0;   13228;   17878;   18526;   18628;     177;      75
BRENT-DUBAI SWAP - NEW YORK MERCANTILE EXCHANGE ;2010.10.19;   18653;    5412;     750;       0;   13028;   17828;   18440;   18578;     213;      75
BRENT-DUBAI SWAP - NEW YORK MERCANTILE EXCHANGE ;2010.10.12;   18635;    5643;     750;       0;   12710;   17810;   18353;   18560;     282;      75
BRENT-DUBAI SWAP - NEW YORK MERCANTILE EXCHANGE ;2010.10.05;   18460;    5643;     725;       0;   12535;   17660;   18178;   18385;     282;      75
BRENT-DUBAI SWAP - NEW YORK MERCANTILE EXCHANGE ;2010.09.28;   22785;    8274;     625;     100;   14060;   21985;   22434;   22710;     351;      75
BRENT-DUBAI SWAP - NEW YORK MERCANTILE EXCHANGE ;2010.09.21;   22685;    8274;     625;     100;   13960;   21885;   22334;   22610;     351;      75
BRENT-DUBAI SWAP - NEW YORK MERCANTILE EXCHANGE ;2010.09.14;   19310;    4374;     625;     100;   14485;   18510;   18959;   19235;     351;      75
BRENT-DUBAI SWAP - NEW YORK MERCANTILE EXCHANGE ;2010.09.07;   19635;    5100;     500;     100;   14105;   18660;   19305;   19260;     330;     375
BRENT-DUBAI SWAP - NEW YORK MERCANTILE EXCHANGE ;2010.08.31;   21475;    5100;     400;     200;   16100;   20755;   21400;   21355;      75;     120
BRENT-DUBAI SWAP - NEW YORK MERCANTILE EXCHANGE ;2010.08.24;   21535;    5100;     400;     200;   16010;   20665;   21310;   21265;     225;     270
BRENT-DUBAI SWAP - NEW YORK MERCANTILE EXCHANGE ;2010.08.17;   20810;    5100;     400;     200;   15435;   20090;   20735;   20690;      75;     120
BRENT-DUBAI SWAP - NEW YORK MERCANTILE EXCHANGE ;2010.08.10;   20960;    5100;     400;     200;   15435;   20135;   20735;   20735;     225;     225
BRENT-DUBAI SWAP - NEW YORK MERCANTILE EXCHANGE ;2010.08.03;   20880;    5250;     400;     200;   15310;   20205;   20760;   20805;     120;      75
BRENT-DUBAI SWAP - NEW YORK MERCANTILE EXCHANGE ;2010.07.27;   22690;    5250;     300;     300;   17020;   22015;   22570;   22615;     120;      75
BRENT-DUBAI SWAP - NEW YORK MERCANTILE EXCHANGE ;2010.07.20;   22925;    5250;     300;     300;   17310;   22305;   22860;   22905;      65;      20
BRENT-DUBAI SWAP - NEW YORK MERCANTILE EXCHANGE ;2010.07.13;   22955;    5250;     300;     300;   17360;   22355;   22910;   22955;      45;       0
BRENT-DUBAI SWAP - NEW YORK MERCANTILE EXCHANGE ;2010.07.06;   22665;    4644;     450;     300;   17370;   21915;   22314;   22665;     351;       0
BRENT-DUBAI SWAP - NEW YORK MERCANTILE EXCHANGE ;2010.06.29;   23535;    4744;     450;     300;   18140;   22785;   23184;   23535;     351;       0
BRENT-DUBAI SWAP - NEW YORK MERCANTILE EXCHANGE ;2010.06.22;   23490;    4744;     450;     300;   18140;   22695;   23184;   23445;     306;      45
BRENT-DUBAI SWAP - NEW YORK MERCANTILE EXCHANGE ;2010.06.15;   22445;    4744;     450;     300;   17095;   21695;   22139;   22445;     306;       0
BRENT-DUBAI SWAP - NEW YORK MERCANTILE EXCHANGE ;2010.06.08;   21170;    3544;     450;     300;   17020;   20420;   20864;   21170;     306;       0
BRENT-DUBAI SWAP - NEW YORK MERCANTILE EXCHANGE ;2010.06.01;   20890;    3244;     450;       0;   17040;   20140;   20284;   20590;     606;     300
BRENT-DUBAI SWAP - NEW YORK MERCANTILE EXCHANGE ;2010.05.25;   24575;    3344;     500;       0;   20925;   24075;   24269;   24575;     306;       0
BRENT-DUBAI SWAP - NEW YORK MERCANTILE EXCHANGE ;2010.05.18;   23910;    2144;    1100;       0;   21460;   22810;   23604;   23910;     306;       0
BRENT-DUBAI SWAP - NEW YORK MERCANTILE EXCHANGE ;2010.05.11;   24085;    2024;    1075;      75;   21710;   22935;   23809;   24085;     276;       0
BRENT-DUBAI SWAP - NEW YORK MERCANTILE EXCHANGE ;2010.05.04;   24510;    2024;    1150;      75;   22135;   23285;   24234;   24510;     276;       0
BRENT-DUBAI SWAP - NEW YORK MERCANTILE EXCHANGE ;2010.04.27;   28175;    2095;    1125;     264;   25525;   26750;   27884;   28139;     291;      36
BRENT-DUBAI SWAP - NEW YORK MERCANTILE EXCHANGE ;2010.04.20;   27525;    1795;     450;     264;   25175;   26775;   27234;   27489;     291;      36
BRENT-DUBAI SWAP - NEW YORK MERCANTILE EXCHANGE ;2010.04.13;   27200;    1795;     450;     264;   24850;   26450;   26909;   27164;     291;      36
BRENT-DUBAI SWAP - NEW YORK MERCANTILE EXCHANGE ;2010.04.06;   26975;    1759;     450;     150;   24775;   26375;   26684;   26975;     291;       0
BRENT-DUBAI SWAP - NEW YORK MERCANTILE EXCHANGE ;2010.03.30;   31605;    1946;     560;     233;   29105;   30795;   31284;   31588;     321;      17
BRENT-DUBAI SWAP - NEW YORK MERCANTILE EXCHANGE ;2010.03.23;   31485;    1946;     560;     233;   28985;   30675;   31164;   31468;     321;      17
BRENT-DUBAI SWAP - NEW YORK MERCANTILE EXCHANGE ;2010.03.16;   31280;    1946;     410;     233;   28780;   30620;   30959;   31263;     321;      17
BRENT-DUBAI SWAP - NEW YORK MERCANTILE EXCHANGE ;2010.03.09;   30755;    1946;     410;     233;   28255;   30095;   30434;   30738;     321;      17
BRENT-DUBAI SWAP - NEW YORK MERCANTILE EXCHANGE ;2010.03.02;   30111;    1022;     410;     239;   28805;   29445;   30066;   30094;      45;      17
BRENT-DUBAI SWAP - NEW YORK MERCANTILE EXCHANGE ;2010.02.23;   34200;     950;    1607;     150;   33100;   32310;   34200;   34067;       0;     133
BRENT-DUBAI SWAP - NEW YORK MERCANTILE EXCHANGE ;2010.02.16;   32730;     950;    1607;     150;   31630;   30840;   32730;   32597;       0;     133
BRENT-DUBAI SWAP - NEW YORK MERCANTILE EXCHANGE ;2010.02.09;   32880;     950;    1607;     150;   31780;   30990;   32880;   32747;       0;     133
BRENT-DUBAI SWAP - NEW YORK MERCANTILE EXCHANGE ;2010.02.02;   32910;     950;    1607;     150;   31810;   31020;   32910;   32777;       0;     133
BRENT-DUBAI SWAP - NEW YORK MERCANTILE EXCHANGE ;2010.01.26;   37645;     650;    1800;     150;   36795;   35495;   37595;   37445;      50;     200
BRENT-DUBAI SWAP - NEW YORK MERCANTILE EXCHANGE ;2010.01.19;   38245;     650;    2130;     150;   37445;   35815;   38245;   38095;       0;     150
BRENT-DUBAI SWAP - NEW YORK MERCANTILE EXCHANGE ;2010.01.12;   37030;     500;    2130;     150;   36380;   34600;   37030;   36880;       0;     150
BRENT-DUBAI SWAP - NEW YORK MERCANTILE EXCHANGE ;2010.01.05;   36070;       0;    2130;       0;   36070;   33851;   36070;   35981;       0;      89
BRENT-DUBAI SWAP - NEW YORK MERCANTILE EXCHANGE ;2009.12.29;   40811;       0;    2130;       0;   40796;   38547;   40796;   40677;      15;     134
BRENT-DUBAI SWAP - NEW YORK MERCANTILE EXCHANGE ;2009.12.22;   40666;       0;    2130;       0;   40561;   38428;   40561;   40558;     105;     108
BRENT-DUBAI SWAP - NEW YORK MERCANTILE EXCHANGE ;2009.12.15;   40211;       0;    2130;       0;   39996;   37881;   39996;   40011;     215;     200
BRENT-DUBAI SWAP - NEW YORK MERCANTILE EXCHANGE ;2009.12.08;   40046;       0;    2130;       0;   39831;   37716;   39831;   39846;     215;     200
BRENT-DUBAI SWAP - NEW YORK MERCANTILE EXCHANGE ;2009.12.01;   38551;       0;    2130;       0;   38536;   36221;   38536;   38351;      15;     200
BRENT-DUBAI SWAP - NEW YORK MERCANTILE EXCHANGE ;2009.11.24;   42257;       0;    1518;       0;   42177;   40587;   42177;   42105;      80;     152
BRENT-DUBAI SWAP - NEW YORK MERCANTILE EXCHANGE ;2009.11.17;   42162;       0;    1218;       0;   42082;   40047;   42082;   41265;      80;     897
BRENT-DUBAI SWAP - NEW YORK MERCANTILE EXCHANGE ;2009.11.09;   37767;       0;    1038;       0;   37637;   36587;   37637;   37625;     130;     142
BRENT-DUBAI SWAP - NEW YORK MERCANTILE EXCHANGE ;2009.11.03;   37552;       0;    1343;       0;   37422;   36067;   37422;   37410;     130;     142
BRENT-DUBAI SWAP - NEW YORK MERCANTILE EXCHANGE ;2009.10.27;   41013;       0;    1368;       0;   40818;   39543;   40818;   40911;     195;     102
BRENT-DUBAI SWAP - NEW YORK MERCANTILE EXCHANGE ;2009.10.20;   40398;       0;    1368;       0;   40203;   38928;   40203;   40296;     195;     102
BRENT-DUBAI SWAP - NEW YORK MERCANTILE EXCHANGE ;2009.10.13;   39763;       0;    1368;       0;   39568;   38293;   39568;   39661;     195;     102
BRENT-DUBAI SWAP - NEW YORK MERCANTILE EXCHANGE ;2009.10.06;   39613;       0;    1368;       0;   39418;   37843;   39418;   39211;     195;     402
BRENT-DUBAI SWAP - NEW YORK MERCANTILE EXCHANGE ;2009.09.29;   43098;     400;    1428;       0;   42488;   41568;   42888;   42996;     210;     102
BRENT-DUBAI SWAP - NEW YORK MERCANTILE EXCHANGE ;2009.09.22;   42833;     400;    1428;       0;   42223;   41253;   42623;   42681;     210;     152
BRENT-DUBAI SWAP - NEW YORK MERCANTILE EXCHANGE ;2009.09.15;   42713;     400;    1428;       0;   42103;   41133;   42503;   42561;     210;     152
BRENT-DUBAI SWAP - NEW YORK MERCANTILE EXCHANGE ;2009.09.08;   42598;     400;    1428;       0;   41988;   41018;   42388;   42446;     210;     152
BRENT-DUBAI SWAP - NEW YORK MERCANTILE EXCHANGE ;2009.09.01;   42038;     400;    1248;       0;   41428;   40578;   41828;   41826;     210;     212
BRENT-DUBAI SWAP - NEW YORK MERCANTILE EXCHANGE ;2009.08.25;   44932;     800;    1308;       0;   43907;   43407;   44707;   44715;     225;     217
BRENT-DUBAI SWAP - NEW YORK MERCANTILE EXCHANGE ;2009.08.18;   45027;     800;     948;       0;   44152;   43862;   44952;   44810;      75;     217
BRENT-DUBAI SWAP - NEW YORK MERCANTILE EXCHANGE ;2009.08.11;   42322;    3195;     948;     325;   38727;   40832;   42247;   42105;      75;     217
BRENT-DUBAI SWAP - NEW YORK MERCANTILE EXCHANGE ;2009.08.04;   42357;    3195;     948;     325;   38762;   40867;   42282;   42140;      75;     217
BRENT-DUBAI SWAP - NEW YORK MERCANTILE EXCHANGE ;2009.07.28;   47542;    3205;    1158;     615;   43632;   45607;   47452;   47380;      90;     162
BRENT-DUBAI SWAP - NEW YORK MERCANTILE EXCHANGE ;2009.07.21;   44587;    2905;     858;     615;   40977;   43012;   44497;   44485;      90;     102
BRENT-DUBAI SWAP - NEW YORK MERCANTILE EXCHANGE ;2009.07.14;   40922;    2905;     858;     555;   37372;   39407;   40832;   40820;      90;     102
BRENT-DUBAI SWAP - NEW YORK MERCANTILE EXCHANGE ;2009.07.07;   40272;    3055;     858;     465;   36662;   38847;   40182;   40170;      90;     102
BRENT-DUBAI SWAP - NEW YORK MERCANTILE EXCHANGE ;2009.06.30;   43787;    3050;    2133;     470;   40162;   41082;   43682;   43685;     105;     102
BRENT-DUBAI SWAP - NEW YORK MERCANTILE EXCHANGE ;2009.06.23;   42086;    3050;    2133;     470;   38461;   39381;   41981;   41984;     105;     102
BRENT-DUBAI SWAP - NEW YORK MERCANTILE EXCHANGE ;2009.06.16;   40676;    2850;    2283;     510;   37211;   37781;   40571;   40574;     105;     102
BRENT-DUBAI SWAP - NEW YORK MERCANTILE EXCHANGE ;2009.06.09;   39591;    2850;    2583;     510;   36076;   36096;   39436;   39189;     155;     402
BRENT-DUBAI SWAP - NEW YORK MERCANTILE EXCHANGE ;2009.06.02;   38441;    2850;    2733;     510;   34476;   34571;   37836;   37814;     605;     627
BRENT-DUBAI SWAP - NEW YORK MERCANTILE EXCHANGE ;2009.05.26;   42415;    2510;    3708;     850;   38135;   36930;   41495;   41488;     920;     927
BRENT-DUBAI SWAP - NEW YORK MERCANTILE EXCHANGE ;2009.05.19;   41345;    1910;    3708;     850;   37665;   35860;   40425;   40418;     920;     927
BRENT-DUBAI SWAP - NEW YORK MERCANTILE EXCHANGE ;2009.05.12;   39470;    1185;    3808;     750;   36515;   34035;   38450;   38593;    1020;     877
BRENT-DUBAI SWAP - NEW YORK MERCANTILE EXCHANGE ;2009.05.05;   38450;    1185;    3808;     750;   35595;   32965;   37530;   37523;     920;     927
BRENT-DUBAI SWAP - NEW YORK MERCANTILE EXCHANGE ;2009.04.28;   42734;     795;    5231;     990;   39664;   35734;   41449;   41955;    1285;     779
BRENT-DUBAI SWAP - NEW YORK MERCANTILE EXCHANGE ;2009.04.21;   40183;     265;    5005;    1235;   37598;   33118;   39098;   39358;    1085;     825
BRENT-DUBAI SWAP - NEW YORK MERCANTILE EXCHANGE ;2009.04.14;   39603;     115;    4555;    1355;   36933;   32903;   38403;   38813;    1200;     790
BRENT-DUBAI SWAP - NEW YORK MERCANTILE EXCHANGE ;2009.04.07;   39238;     315;    4555;    1155;   36783;   32703;   38253;   38413;     985;     825
BRENT-DUBAI SWAP - NEW YORK MERCANTILE EXCHANGE ;2009.03.31;   41059;     120;    4955;    1230;   39709;   34874;   41059;   41059;       0;       0
BRENT-DUBAI SWAP - NEW YORK MERCANTILE EXCHANGE ;2009.03.24;   40099;     120;    4955;    1230;   38749;   33914;   40099;   40099;       0;       0
BRENT-DUBAI SWAP - NEW YORK MERCANTILE EXCHANGE ;2009.03.17;   37099;     120;    5045;    1230;   35749;   30824;   37099;   37099;       0;       0
BRENT-DUBAI SWAP - NEW YORK MERCANTILE EXCHANGE ;2009.03.10;   38423;     495;    7145;     885;   37043;   30393;   38423;   38423;       0;       0
BRENT-DUBAI SWAP - NEW YORK MERCANTILE EXCHANGE ;2009.03.03;   36900;     495;    7745;     765;   35640;   28390;   36900;   36900;       0;       0
BRENT-DUBAI SWAP - NEW YORK MERCANTILE EXCHANGE ;2009.02.24;   37626;     725;    7695;     465;   36436;   29466;   37626;   37626;       0;       0
BRENT-DUBAI SWAP - NEW YORK MERCANTILE EXCHANGE ;2009.02.17;   36391;     475;    7695;     390;   35226;   28006;   36091;   36091;     300;     300
BRENT-DUBAI SWAP - NEW YORK MERCANTILE EXCHANGE ;2009.02.10;   34501;       0;    8170;      40;   34461;   26291;   34501;   34501;       0;       0
BRENT-DUBAI SWAP - NEW YORK MERCANTILE EXCHANGE ;2009.02.03;   32974;       0;    8095;      40;   32934;   24839;   32974;   32974;       0;       0
BRENT-DUBAI SWAP - NEW YORK MERCANTILE EXCHANGE ;2009.01.27;   32445;       0;    7165;      95;   32350;   25185;   32445;   32445;       0;       0
BRENT-DUBAI SWAP - NEW YORK MERCANTILE EXCHANGE ;2009.01.20;   31220;       0;    7240;      95;   31125;   23885;   31220;   31220;       0;       0
BRENT-DUBAI SWAP - NEW YORK MERCANTILE EXCHANGE ;2009.01.13;   26845;       0;    2020;      95;   26750;   24730;   26845;   26845;       0;       0
BRENT-DUBAI SWAP - NEW YORK MERCANTILE EXCHANGE ;2009.01.06;   23395;       0;     520;      95;   23300;   22780;   23395;   23395;       0;       0
BRENT-DUBAI SWAP - NEW YORK MERCANTILE EXCHANGE ;2008.12.30;   23620;       0;     645;      65;   23555;   22910;   23620;   23620;       0;       0
BRENT-DUBAI SWAP - NEW YORK MERCANTILE EXCHANGE ;2008.12.22;   22720;       0;     645;      65;   22655;   22010;   22720;   22720;       0;       0
BRENT-DUBAI SWAP - NEW YORK MERCANTILE EXCHANGE ;2008.12.16;   21095;       0;     495;      65;   21030;   20535;   21095;   21095;       0;       0
BRENT-DUBAI SWAP - NEW YORK MERCANTILE EXCHANGE ;2008.12.09;   19912;       0;     495;      65;   19847;   19352;   19912;   19912;       0;       0
BRENT-DUBAI SWAP - NEW YORK MERCANTILE EXCHANGE ;2008.12.02;   19772;       0;     420;      65;   19707;   19287;   19772;   19772;       0;       0
BRENT-DUBAI SWAP - NEW YORK MERCANTILE EXCHANGE ;2008.11.25;   20487;       0;     620;       5;   20482;   19862;   20487;   20487;       0;       0
BRENT-DUBAI SWAP - NEW YORK MERCANTILE EXCHANGE ;2008.11.18;   17887;       0;     670;       0;   17887;   17217;   17887;   17887;       0;       0
BRENT-DUBAI SWAP - NEW YORK MERCANTILE EXCHANGE ;2008.11.11;   16147;       0;     670;       0;   16147;   15477;   16147;   16147;       0;       0
BRENT-DUBAI SWAP - NEW YORK MERCANTILE EXCHANGE ;2008.11.04;   15370;       0;     970;       0;   15370;   14400;   15370;   15370;       0;       0
BRENT-DUBAI SWAP - NEW YORK MERCANTILE EXCHANGE ;2008.10.28;   15683;       0;    1020;       0;   15533;   14513;   15533;   15533;     150;     150
BRENT-DUBAI SWAP - NEW YORK MERCANTILE EXCHANGE ;2008.10.21;   12223;       0;     720;       0;   12223;   11503;   12223;   12223;       0;       0
BRENT-DUBAI SWAP - NEW YORK MERCANTILE EXCHANGE ;2008.10.14;   10100;       0;     720;       0;   10100;    9380;   10100;   10100;       0;       0
BRENT-DUBAI SWAP - NEW YORK MERCANTILE EXCHANGE ;2008.10.07;    8263;       0;     540;       0;    8263;    7723;    8263;    8263;       0;       0
BRENT-DUBAI SWAP - NEW YORK MERCANTILE EXCHANGE ;2008.09.30;    8753;      50;     500;       0;    8703;    8253;    8753;    8753;       0;       0
BRENT-DUBAI SWAP - NEW YORK MERCANTILE EXCHANGE ;2008.09.23;    8542;      50;     500;       0;    7892;    7442;    7942;    7942;     600;     600
BRENT-DUBAI SWAP - NEW YORK MERCANTILE EXCHANGE ;2008.09.16;    8059;      50;     500;       0;    8009;    7559;    8059;    8059;       0;       0
BRENT-DUBAI SWAP - NEW YORK MERCANTILE EXCHANGE ;2008.09.09;    8011;      50;     500;       0;    7961;    7511;    8011;    8011;       0;       0
BRENT-DUBAI SWAP - NEW YORK MERCANTILE EXCHANGE ;2008.09.02;    7569;      50;     500;       0;    7519;    7069;    7569;    7569;       0;       0
BRENT-DUBAI SWAP - NEW YORK MERCANTILE EXCHANGE ;2008.08.26;    7894;     100;     550;       0;    7794;    7344;    7894;    7894;       0;       0
BRENT-DUBAI SWAP - NEW YORK MERCANTILE EXCHANGE ;2008.08.19;    7294;       0;     550;       0;    7294;    6744;    7294;    7294;       0;       0
BRENT-DUBAI SWAP - NEW YORK MERCANTILE EXCHANGE ;2008.08.12;    7444;       0;     550;       0;    7102;    6519;    7102;    7069;     342;     375
BRENT-DUBAI SWAP - NEW YORK MERCANTILE EXCHANGE ;2008.08.05;    7339;       0;     550;       0;    7264;    6714;    7264;    7264;      75;      75
BRENT-DUBAI SWAP - NEW YORK MERCANTILE EXCHANGE ;2008.07.29;    6509;       0;     600;       0;    6509;    5909;    6509;    6509;       0;       0
BRENT-DUBAI SWAP - NEW YORK MERCANTILE EXCHANGE ;2008.07.22;    6509;       0;     600;       0;    6509;    5909;    6509;    6509;       0;       0
BRENT-DUBAI SWAP - NEW YORK MERCANTILE EXCHANGE ;2008.07.15;    5882;       0;     600;       0;    5882;    5090;    5882;    5690;       0;     192
BRENT-DUBAI SWAP - NEW YORK MERCANTILE EXCHANGE ;2008.07.08;    5792;       0;     600;       0;    5792;    5192;    5792;    5792;       0;       0
BRENT-DUBAI SWAP - NEW YORK MERCANTILE EXCHANGE ;2008.07.01;    5792;       0;     600;       0;    5792;    5192;    5792;    5792;       0;       0
BRENT-DUBAI SWAP - NEW YORK MERCANTILE EXCHANGE ;2008.06.24;    6245;      50;     650;       0;    6195;    5595;    6245;    6245;       0;       0
BRENT-DUBAI SWAP - NEW YORK MERCANTILE EXCHANGE ;2008.06.17;    5945;      50;     650;       0;    5895;    5295;    5945;    5945;       0;       0
BRENT-DUBAI SWAP - NEW YORK MERCANTILE EXCHANGE ;2008.06.10;    5945;      50;     650;       0;    5895;    5295;    5945;    5945;       0;       0
BRENT-DUBAI SWAP - NEW YORK MERCANTILE EXCHANGE ;2008.06.03;    5855;      50;     650;       0;    5805;    5205;    5855;    5855;       0;       0
BRENT-DUBAI SWAP - NEW YORK MERCANTILE EXCHANGE ;2008.05.27;    6415;     100;     700;       0;    6015;    5715;    6115;    6415;     300;       0
BRENT-DUBAI SWAP - NEW YORK MERCANTILE EXCHANGE ;2008.05.20;    5815;     400;     400;       0;    5415;    5415;    5815;    5815;       0;       0
BRENT-DUBAI SWAP - NEW YORK MERCANTILE EXCHANGE ;2008.05.13;    5770;     400;     400;       0;    5370;    5370;    5770;    5770;       0;       0
BRENT-DUBAI SWAP - NEW YORK MERCANTILE EXCHANGE ;2008.05.06;    5620;     400;     400;       0;    5220;    5220;    5620;    5620;       0;       0
BRENT-DUBAI SWAP - NEW YORK MERCANTILE EXCHANGE ;2008.04.29;    6495;     450;     450;       0;    6045;    6045;    6495;    6495;       0;       0
BRENT-DUBAI SWAP - NEW YORK MERCANTILE EXCHANGE ;2008.04.22;    6195;     150;     450;       0;    6045;    5745;    6195;    6195;       0;       0
BRENT-DUBAI SWAP - NEW YORK MERCANTILE EXCHANGE ;2008.04.15;    6210;     150;     450;       0;    6000;    5760;    6150;    6210;      60;       0
BRENT-DUBAI SWAP - NEW YORK MERCANTILE EXCHANGE ;2008.03.25;    6635;     150;     500;       0;    6425;    6135;    6575;    6635;      60;       0
BRENT-DUBAI SWAP - NEW YORK MERCANTILE EXCHANGE ;2008.03.18;    6635;     150;     500;       0;    6425;    6135;    6575;    6635;      60;       0
BRENT-DUBAI SWAP - NEW YORK MERCANTILE EXCHANGE ;2008.03.11;    6435;     150;     500;       0;    6225;    5935;    6375;    6435;      60;       0
BRENT-DUBAI SWAP - NEW YORK MERCANTILE EXCHANGE ;2008.03.04;    6435;     150;     500;       0;    6225;    5935;    6375;    6435;      60;       0
BRENT-DUBAI SWAP - NEW YORK MERCANTILE EXCHANGE ;2008.02.26;    7185;     150;     550;       0;    6975;    6635;    7125;    7185;      60;       0
BRENT-DUBAI SWAP - NEW YORK MERCANTILE EXCHANGE ;2008.02.19;    6960;       0;     550;       0;    6900;    6410;    6900;    6960;      60;       0
BRENT-DUBAI SWAP - NEW YORK MERCANTILE EXCHANGE ;2008.02.12;    6760;       0;     550;       0;    6700;    6210;    6700;    6760;      60;       0
BRENT-DUBAI SWAP - NEW YORK MERCANTILE EXCHANGE ;2008.02.05;    6460;       0;     550;       0;    6400;    5910;    6400;    6460;      60;       0
BRENT-DUBAI SWAP - NEW YORK MERCANTILE EXCHANGE ;2008.01.29;    7110;       0;     600;       0;    7050;    6510;    7050;    7110;      60;       0
BRENT-DUBAI SWAP - NEW YORK MERCANTILE EXCHANGE ;2008.01.22;    7110;       0;     600;       0;    7050;    6510;    7050;    7110;      60;       0
BRENT-DUBAI SWAP - NEW YORK MERCANTILE EXCHANGE ;2007.12.31;    8610;      25;     600;       0;    8585;    8010;    8610;    8610;       0;       0
BRENT-DUBAI SWAP - NEW YORK MERCANTILE EXCHANGE ;2007.12.24;    8610;      25;     600;       0;    8585;    8010;    8610;    8610;       0;       0
BRENT-DUBAI SWAP - NEW YORK MERCANTILE EXCHANGE ;2007.12.18;    8610;      25;     600;       0;    8585;    8010;    8610;    8610;       0;       0
BRENT-DUBAI SWAP - NEW YORK MERCANTILE EXCHANGE ;2007.12.11;    7625;      25;     600;       0;    7450;    7025;    7475;    7625;     150;       0
BRENT-DUBAI SWAP - NEW YORK MERCANTILE EXCHANGE ;2007.12.04;    7475;      25;     600;       0;    7450;    6875;    7475;    7475;       0;       0
BRENT-DUBAI SWAP - NEW YORK MERCANTILE EXCHANGE ;2007.11.27;    9225;      50;     600;       0;    9175;    8625;    9225;    9225;       0;       0
BRENT-DUBAI SWAP - NEW YORK MERCANTILE EXCHANGE ;2007.11.20;    9225;      50;     600;       0;    9175;    8625;    9225;    9225;       0;       0
BRENT-DUBAI SWAP - NEW YORK MERCANTILE EXCHANGE ;2007.11.13;    9225;      50;     600;       0;    9175;    8625;    9225;    9225;       0;       0
BRENT-DUBAI SWAP - NEW YORK MERCANTILE EXCHANGE ;2007.11.06;    9075;      50;     600;       0;    9025;    8475;    9075;    9075;       0;       0
BRENT-DUBAI SWAP - NEW YORK MERCANTILE EXCHANGE ;2007.10.30;   10825;      75;     600;       0;   10750;   10225;   10825;   10825;       0;       0
BRENT-DUBAI SWAP - NEW YORK MERCANTILE EXCHANGE ;2011.07.12;   15905;    2109;     150;       0;   13730;   15710;   15839;   15860;      66;      45
