JAPANESE YEN - IMM JAPANESE YEN ;1995.04.11;  115093;   10621;    9187;   19170;   61475;   54655;   91266;   83013;   23828;   32081
JAPANESE YEN - IMM JAPANESE YEN ;1995.04.04;  125047;   11189;   12365;   22487;   66297;   57557;   99974;   92409;   25073;   32639
JAPANESE YEN - IMM JAPANESE YEN ;1995.03.28;  113982;   11721;   10995;   20028;   58716;   53058;   90466;   84082;   23516;   29900
JAPANESE YEN - IMM JAPANESE YEN ;1995.03.21;  112217;   13316;    9530;   19960;   55019;   52119;   88295;   81610;   23922;   30607
JAPANESE YEN - IMM JAPANESE YEN ;1995.04.11;  115093;   10621;    9187;   19170;   61475;   54655;   91266;   83013;   23828;   32081
JAPANESE YEN - IMM JAPANESE YEN ;1995.04.04;  125047;   11189;   12365;   22487;   66297;   57557;   99974;   92409;   25073;   32639
JAPANESE YEN - IMM JAPANESE YEN ;1995.03.28;  113982;   11721;   10995;   20028;   58716;   53058;   90466;   84082;   23516;   29900
JAPANESE YEN - IMM JAPANESE YEN ;1995.03.21;  112217;   13316;    9530;   19960;   55019;   52119;   88295;   81610;   23922;   30607
JAPANESE YEN - IMM JAPANESE YEN ;1995.04.11;  115093;   10621;    9187;   19170;   61475;   54655;   91266;   83013;   23828;   32081
JAPANESE YEN - IMM JAPANESE YEN ;1995.04.04;  125047;   11189;   12365;   22487;   66297;   57557;   99974;   92409;   25073;   32639
JAPANESE YEN - IMM JAPANESE YEN ;1995.03.28;  113982;   11721;   10995;   20028;   58716;   53058;   90466;   84082;   23516;   29900
JAPANESE YEN - IMM JAPANESE YEN ;1995.03.21;  112217;   13316;    9530;   19960;   55019;   52119;   88295;   81610;   23922;   30607
