RBOB CALENDAR SWAP - NEW YORK MERCANTILE EXCHANGE ;2011.07.12;   26253;    9454;     261;     678;   10692;   20924;   20824;   21863;    5429;    4390
RBOB CALENDAR SWAP - NEW YORK MERCANTILE EXCHANGE ;2011.07.12;   26253;    9454;     261;     678;   10692;   20924;   20824;   21863;    5429;    4390
RBOB CALENDAR SWAP - NEW YORK MERCANTILE EXCHANGE ;2010.12.28;   20539;    3072;    1169;    1358;   11937;   12610;   16367;   15137;    4172;    5402
RBOB CALENDAR SWAP - NEW YORK MERCANTILE EXCHANGE ;2010.12.21;   20382;    3057;    1243;    1358;   11854;   12654;   16269;   15255;    4113;    5127
RBOB CALENDAR SWAP - NEW YORK MERCANTILE EXCHANGE ;2010.12.14;   20231;    3102;    1235;    1226;   12129;   13097;   16457;   15558;    3774;    4673
RBOB CALENDAR SWAP - NEW YORK MERCANTILE EXCHANGE ;2010.12.07;   19927;    3102;    1318;    1226;   10703;   11984;   15031;   14528;    4896;    5399
RBOB CALENDAR SWAP - NEW YORK MERCANTILE EXCHANGE ;2010.11.30;   23716;    2402;    1139;    1567;   16068;   16781;   20037;   19487;    3679;    4229
RBOB CALENDAR SWAP - NEW YORK MERCANTILE EXCHANGE ;2010.11.23;   24171;    2402;     739;    1572;   16147;   17360;   20121;   19671;    4050;    4500
RBOB CALENDAR SWAP - NEW YORK MERCANTILE EXCHANGE ;2010.11.16;   24142;    2852;     669;    1116;   16200;   17339;   20168;   19124;    3974;    5018
RBOB CALENDAR SWAP - NEW YORK MERCANTILE EXCHANGE ;2010.11.09;   23216;    2783;     669;    1128;   15693;   16700;   19604;   18497;    3612;    4719
RBOB CALENDAR SWAP - NEW YORK MERCANTILE EXCHANGE ;2010.11.02;   21962;    2518;     519;    1128;   14561;   15582;   18207;   17229;    3755;    4733
RBOB CALENDAR SWAP - NEW YORK MERCANTILE EXCHANGE ;2010.10.26;   24711;    2549;     711;    1627;   15551;   16905;   19727;   19243;    4984;    5468
RBOB CALENDAR SWAP - NEW YORK MERCANTILE EXCHANGE ;2010.10.19;   22781;    2541;     377;    1847;   13064;   14611;   17452;   16835;    5329;    5946
RBOB CALENDAR SWAP - NEW YORK MERCANTILE EXCHANGE ;2010.10.12;   22180;    2628;     534;    1597;   12052;   14003;   16277;   16134;    5903;    6046
RBOB CALENDAR SWAP - NEW YORK MERCANTILE EXCHANGE ;2010.10.05;   21406;    2540;     179;    1347;   11392;   13506;   15279;   15032;    6127;    6374
RBOB CALENDAR SWAP - NEW YORK MERCANTILE EXCHANGE ;2010.09.28;   24294;    2449;    1052;    1988;   14873;   17395;   19310;   20435;    4984;    3859
RBOB CALENDAR SWAP - NEW YORK MERCANTILE EXCHANGE ;2010.09.21;   24637;    2397;     585;    2327;   14950;   17851;   19674;   20763;    4963;    3874
RBOB CALENDAR SWAP - NEW YORK MERCANTILE EXCHANGE ;2010.09.14;   24876;    3202;     480;    2174;   15277;   18969;   20653;   21623;    4223;    3253
RBOB CALENDAR SWAP - NEW YORK MERCANTILE EXCHANGE ;2010.09.07;   25515;    3152;     480;    2174;   14960;   18972;   20286;   21626;    5229;    3889
RBOB CALENDAR SWAP - NEW YORK MERCANTILE EXCHANGE ;2010.08.31;   28159;    4307;     196;    2027;   16444;   22654;   22778;   24877;    5381;    3282
RBOB CALENDAR SWAP - NEW YORK MERCANTILE EXCHANGE ;2010.08.24;   27985;    4502;     196;    1877;   16208;   22702;   22587;   24775;    5398;    3210
RBOB CALENDAR SWAP - NEW YORK MERCANTILE EXCHANGE ;2010.08.17;   26972;    4744;     196;    1837;   15860;   21776;   22441;   23809;    4531;    3163
RBOB CALENDAR SWAP - NEW YORK MERCANTILE EXCHANGE ;2010.08.10;   26146;    5752;     196;    1197;   14729;   21469;   21678;   22862;    4468;    3284
RBOB CALENDAR SWAP - NEW YORK MERCANTILE EXCHANGE ;2010.08.03;   25516;    5640;     196;    1199;   14439;   20271;   21278;   21666;    4238;    3850
RBOB CALENDAR SWAP - NEW YORK MERCANTILE EXCHANGE ;2010.07.27;   30229;    6525;     157;    1550;   17276;   23781;   25351;   25488;    4878;    4741
RBOB CALENDAR SWAP - NEW YORK MERCANTILE EXCHANGE ;2010.07.20;   28760;    6220;     157;    1653;   16474;   22574;   24347;   24384;    4413;    4376
RBOB CALENDAR SWAP - NEW YORK MERCANTILE EXCHANGE ;2010.07.13;   27398;    6192;     157;    1297;   15558;   21623;   23047;   23077;    4351;    4321
RBOB CALENDAR SWAP - NEW YORK MERCANTILE EXCHANGE ;2010.07.06;   26854;    5845;     157;    1284;   15550;   21224;   22679;   22665;    4175;    4189
RBOB CALENDAR SWAP - NEW YORK MERCANTILE EXCHANGE ;2010.06.29;   30877;    7189;     130;    1381;   17476;   25259;   26046;   26770;    4831;    4107
RBOB CALENDAR SWAP - NEW YORK MERCANTILE EXCHANGE ;2010.06.22;   30070;    6517;     130;    1479;   17214;   24284;   25210;   25893;    4860;    4177
RBOB CALENDAR SWAP - NEW YORK MERCANTILE EXCHANGE ;2010.06.15;   28547;    6015;     130;    1546;   15829;   22569;   23390;   24245;    5157;    4302
RBOB CALENDAR SWAP - NEW YORK MERCANTILE EXCHANGE ;2010.06.08;   27905;    5978;     130;    1555;   14902;   21690;   22435;   23375;    5470;    4530
RBOB CALENDAR SWAP - NEW YORK MERCANTILE EXCHANGE ;2010.06.01;   25398;    5577;     130;    1663;   12936;   18801;   20176;   20594;    5222;    4804
RBOB CALENDAR SWAP - NEW YORK MERCANTILE EXCHANGE ;2010.05.25;   28988;    7396;     103;    1754;   15059;   21592;   24209;   23449;    4779;    5539
RBOB CALENDAR SWAP - NEW YORK MERCANTILE EXCHANGE ;2010.05.18;   27668;    7592;     103;    1784;   13743;   19914;   23119;   21801;    4549;    5867
RBOB CALENDAR SWAP - NEW YORK MERCANTILE EXCHANGE ;2010.05.11;   28335;    8369;      91;    1724;   13659;   20315;   23752;   22130;    4583;    6205
RBOB CALENDAR SWAP - NEW YORK MERCANTILE EXCHANGE ;2010.05.04;   27676;    7400;       4;    1015;   13703;   19728;   22118;   20747;    5558;    6929
RBOB CALENDAR SWAP - NEW YORK MERCANTILE EXCHANGE ;2010.04.27;   30403;    7969;       0;     762;   14894;   21734;   23625;   22496;    6778;    7907
RBOB CALENDAR SWAP - NEW YORK MERCANTILE EXCHANGE ;2010.04.20;   29350;    7256;       0;     762;   14807;   20750;   22825;   21512;    6525;    7838
RBOB CALENDAR SWAP - NEW YORK MERCANTILE EXCHANGE ;2010.04.13;   28490;    6117;     624;    1137;   14841;   21633;   22095;   23394;    6395;    5096
RBOB CALENDAR SWAP - NEW YORK MERCANTILE EXCHANGE ;2010.04.06;   26465;    3359;     733;    1028;   15477;   20013;   19864;   21774;    6601;    4691
RBOB CALENDAR SWAP - NEW YORK MERCANTILE EXCHANGE ;2010.03.30;   28324;    3208;    1083;    1028;   17189;   21243;   21425;   23354;    6899;    4970
RBOB CALENDAR SWAP - NEW YORK MERCANTILE EXCHANGE ;2010.03.23;   26290;    2705;     982;     217;   17011;   19646;   19933;   20845;    6357;    5445
RBOB CALENDAR SWAP - NEW YORK MERCANTILE EXCHANGE ;2010.03.16;   25692;    2618;     982;     217;   16445;   18433;   19280;   19632;    6412;    6060
RBOB CALENDAR SWAP - NEW YORK MERCANTILE EXCHANGE ;2010.03.09;   24085;    2390;     982;     304;   15428;   16914;   18122;   18200;    5963;    5885
RBOB CALENDAR SWAP - NEW YORK MERCANTILE EXCHANGE ;2010.03.02;   21034;    2015;       0;     304;   13478;   14967;   15797;   15271;    5237;    5763
RBOB CALENDAR SWAP - NEW YORK MERCANTILE EXCHANGE ;2010.02.23;   22678;    2268;       0;     304;   14581;   16117;   17153;   16421;    5525;    6257
RBOB CALENDAR SWAP - NEW YORK MERCANTILE EXCHANGE ;2010.02.16;   21528;    1807;       0;     316;   13775;   15605;   15898;   15921;    5630;    5607
RBOB CALENDAR SWAP - NEW YORK MERCANTILE EXCHANGE ;2010.02.09;   20512;    1720;       0;     316;   12662;   13758;   14698;   14074;    5814;    6438
RBOB CALENDAR SWAP - NEW YORK MERCANTILE EXCHANGE ;2010.02.02;   20254;     391;       0;     712;   12791;   13757;   13894;   14469;    6360;    5785
RBOB CALENDAR SWAP - NEW YORK MERCANTILE EXCHANGE ;2010.01.26;   23624;    1944;       0;     495;   15748;   16596;   18187;   17091;    5437;    6533
RBOB CALENDAR SWAP - NEW YORK MERCANTILE EXCHANGE ;2010.01.19;   23372;    1981;    1245;     495;   15767;   16169;   18243;   17909;    5129;    5463
RBOB CALENDAR SWAP - NEW YORK MERCANTILE EXCHANGE ;2010.01.12;   22454;    1404;       0;     495;   14837;   15376;   16736;   15871;    5718;    6583
RBOB CALENDAR SWAP - NEW YORK MERCANTILE EXCHANGE ;2010.01.05;   21379;    1374;       0;     495;   14330;   14979;   16199;   15474;    5180;    5905
RBOB CALENDAR SWAP - NEW YORK MERCANTILE EXCHANGE ;2009.12.29;   23263;    2093;       0;     663;   15570;   17283;   18326;   17946;    4937;    5317
RBOB CALENDAR SWAP - NEW YORK MERCANTILE EXCHANGE ;2009.12.22;   23089;    2093;       0;     663;   15396;   17146;   18152;   17809;    4937;    5280
RBOB CALENDAR SWAP - NEW YORK MERCANTILE EXCHANGE ;2009.12.15;   21986;     650;       0;     687;   14885;   16192;   16222;   16879;    5764;    5107
RBOB CALENDAR SWAP - NEW YORK MERCANTILE EXCHANGE ;2009.12.08;   21949;    1425;       0;     687;   14297;   15256;   16409;   15943;    5540;    6006
RBOB CALENDAR SWAP - NEW YORK MERCANTILE EXCHANGE ;2009.12.01;   21223;    1426;       0;     237;   13990;   15174;   15653;   15411;    5570;    5812
RBOB CALENDAR SWAP - NEW YORK MERCANTILE EXCHANGE ;2009.11.24;   23185;    1933;       0;     423;   15105;   16014;   17461;   16437;    5724;    6748
RBOB CALENDAR SWAP - NEW YORK MERCANTILE EXCHANGE ;2009.11.17;   23083;    1896;       0;     440;   15032;   16175;   17368;   16615;    5715;    6468
RBOB CALENDAR SWAP - NEW YORK MERCANTILE EXCHANGE ;2009.11.09;   22483;    1896;       0;     440;   14632;   15528;   16968;   15968;    5515;    6515
RBOB CALENDAR SWAP - NEW YORK MERCANTILE EXCHANGE ;2009.11.03;   22384;    1704;       0;     440;   15388;   16457;   17532;   16897;    4852;    5487
RBOB CALENDAR SWAP - NEW YORK MERCANTILE EXCHANGE ;2009.10.27;   25438;    1994;       0;     444;   17533;   19378;   19971;   19822;    5467;    5616
RBOB CALENDAR SWAP - NEW YORK MERCANTILE EXCHANGE ;2009.10.20;   23499;    1220;       0;     615;   15904;   16048;   17739;   16663;    5760;    6836
RBOB CALENDAR SWAP - NEW YORK MERCANTILE EXCHANGE ;2009.10.13;   21618;    1124;       0;     285;   14971;   14748;   16380;   15033;    5238;    6585
RBOB CALENDAR SWAP - NEW YORK MERCANTILE EXCHANGE ;2009.10.06;   20702;    1124;       0;     285;   14620;   14212;   16029;   14497;    4673;    6205
RBOB CALENDAR SWAP - NEW YORK MERCANTILE EXCHANGE ;2009.09.29;   22982;    1356;       0;     328;   16640;   18068;   18324;   18396;    4658;    4586
RBOB CALENDAR SWAP - NEW YORK MERCANTILE EXCHANGE ;2009.09.22;   22870;    1290;       0;     328;   16390;   17973;   18008;   18301;    4862;    4569
RBOB CALENDAR SWAP - NEW YORK MERCANTILE EXCHANGE ;2009.09.15;   20953;    1263;       0;     220;   14818;   16115;   16301;   16335;    4652;    4618
RBOB CALENDAR SWAP - NEW YORK MERCANTILE EXCHANGE ;2009.09.08;   20546;    1242;       0;     213;   14443;   15699;   15898;   15912;    4648;    4634
RBOB CALENDAR SWAP - NEW YORK MERCANTILE EXCHANGE ;2009.09.01;   20475;    1224;       0;     201;   14498;   15700;   15923;   15901;    4552;    4574
RBOB CALENDAR SWAP - NEW YORK MERCANTILE EXCHANGE ;2009.08.25;   23956;    1437;       0;     244;   17584;   19116;   19265;   19360;    4691;    4596
RBOB CALENDAR SWAP - NEW YORK MERCANTILE EXCHANGE ;2009.08.18;   21924;    1416;       0;     244;   14770;   16870;   16430;   17114;    5494;    4810
RBOB CALENDAR SWAP - NEW YORK MERCANTILE EXCHANGE ;2009.08.11;   21159;    1416;       0;     244;   13743;   16215;   15403;   16459;    5756;    4700
RBOB CALENDAR SWAP - NEW YORK MERCANTILE EXCHANGE ;2009.08.04;   20925;    1329;       0;     250;   13866;   16155;   15445;   16405;    5480;    4520
RBOB CALENDAR SWAP - NEW YORK MERCANTILE EXCHANGE ;2009.07.28;   23413;    1530;     167;     293;   15940;   18359;   17763;   18819;    5650;    4594
RBOB CALENDAR SWAP - NEW YORK MERCANTILE EXCHANGE ;2009.07.21;   23217;    1476;     167;     293;   16106;   18513;   17875;   18973;    5342;    4244
RBOB CALENDAR SWAP - NEW YORK MERCANTILE EXCHANGE ;2009.07.14;   22416;    1152;     167;     287;   15535;   17889;   16974;   18343;    5442;    4073
RBOB CALENDAR SWAP - NEW YORK MERCANTILE EXCHANGE ;2009.07.07;   21838;    2441;     167;     959;   12369;   16137;   15769;   17263;    6069;    4575
RBOB CALENDAR SWAP - NEW YORK MERCANTILE EXCHANGE ;2009.06.30;   20540;    1972;     167;     834;   11545;   15132;   14351;   16133;    6189;    4407
RBOB CALENDAR SWAP - NEW YORK MERCANTILE EXCHANGE ;2009.06.23;   23082;    1803;     167;     661;   13387;   17874;   15851;   18702;    7231;    4380
RBOB CALENDAR SWAP - NEW YORK MERCANTILE EXCHANGE ;2009.05.26;   20994;     746;       0;    1077;   12947;   13934;   14770;   15011;    6224;    5983
RBOB CALENDAR SWAP - NEW YORK MERCANTILE EXCHANGE ;2009.04.28;   21802;       0;    1182;     429;   16013;   14259;   16442;   15870;    5360;    5932
RBOB CALENDAR SWAP - NEW YORK MERCANTILE EXCHANGE ;2009.04.21;   21509;       0;     906;     639;   16205;   14109;   16844;   15654;    4665;    5855
RBOB CALENDAR SWAP - NEW YORK MERCANTILE EXCHANGE ;2009.01.27;   17860;       0;     687;      81;   12633;   12647;   12714;   13415;    5146;    4445
RBOB CALENDAR SWAP - NEW YORK MERCANTILE EXCHANGE ;2009.01.20;   17471;       0;     632;      96;   11987;   12485;   12083;   13213;    5388;    4258
RBOB CALENDAR SWAP - NEW YORK MERCANTILE EXCHANGE ;2009.01.13;   16616;       0;       0;       0;   11718;   11699;   11718;   11699;    4898;    4917
RBOB CALENDAR SWAP - NEW YORK MERCANTILE EXCHANGE ;2008.12.30;   17733;     410;       0;     157;   12301;   12460;   12868;   12617;    4865;    5116
RBOB CALENDAR SWAP - NEW YORK MERCANTILE EXCHANGE ;2008.12.22;   17783;     410;       0;     157;   12042;   12579;   12609;   12736;    5174;    5047
RBOB CALENDAR SWAP - NEW YORK MERCANTILE EXCHANGE ;2008.12.16;   17708;     590;       0;      70;   11898;   11715;   12558;   11785;    5150;    5923
RBOB CALENDAR SWAP - NEW YORK MERCANTILE EXCHANGE ;2011.07.12;   26253;    9454;     261;     678;   10692;   20924;   20824;   21863;    5429;    4390
RBOB CALENDAR SWAP - NEW YORK MERCANTILE EXCHANGE ;2011.07.05;   24442;    7277;     261;     701;   10504;   19170;   18482;   20132;    5960;    4310
RBOB CALENDAR SWAP - NEW YORK MERCANTILE EXCHANGE ;2011.06.28;   27875;    6610;     251;     852;   13242;   22110;   20704;   23213;    7171;    4662
RBOB CALENDAR SWAP - NEW YORK MERCANTILE EXCHANGE ;2011.06.21;   26944;    6606;     251;     846;   12094;   21339;   19546;   22436;    7398;    4508
RBOB CALENDAR SWAP - NEW YORK MERCANTILE EXCHANGE ;2011.06.14;   27008;    6853;     251;     646;   12418;   21892;   19917;   22789;    7091;    4219
RBOB CALENDAR SWAP - NEW YORK MERCANTILE EXCHANGE ;2011.06.07;   25260;    6845;     251;     598;   11870;   20332;   19313;   21181;    5947;    4079
RBOB CALENDAR SWAP - NEW YORK MERCANTILE EXCHANGE ;2011.05.31;   31135;    8877;     241;     914;   15311;   26330;   25102;   27485;    6033;    3650
RBOB CALENDAR SWAP - NEW YORK MERCANTILE EXCHANGE ;2011.05.24;   29982;    8860;     241;     774;   14790;   25530;   24424;   26545;    5558;    3437
RBOB CALENDAR SWAP - NEW YORK MERCANTILE EXCHANGE ;2011.05.17;   30199;    9805;     241;     623;   14349;   25579;   24777;   26443;    5422;    3756
RBOB CALENDAR SWAP - NEW YORK MERCANTILE EXCHANGE ;2011.05.10;   29467;   10183;       0;     577;   13402;   24745;   24162;   25322;    5305;    4145
RBOB CALENDAR SWAP - NEW YORK MERCANTILE EXCHANGE ;2011.05.03;   28363;    9594;       0;     457;   13432;   23880;   23483;   24337;    4880;    4026
RBOB CALENDAR SWAP - NEW YORK MERCANTILE EXCHANGE ;2011.04.26;   35386;   11578;      57;     606;   18930;   28672;   31114;   29335;    4272;    6051
RBOB CALENDAR SWAP - NEW YORK MERCANTILE EXCHANGE ;2011.04.19;   35405;   11775;      57;     606;   18910;   28597;   31291;   29260;    4114;    6145
RBOB CALENDAR SWAP - NEW YORK MERCANTILE EXCHANGE ;2011.04.12;   34598;   11222;      57;     606;   18687;   28220;   30515;   28883;    4083;    5715
RBOB CALENDAR SWAP - NEW YORK MERCANTILE EXCHANGE ;2011.04.05;   33459;   10455;     108;     555;   18293;   27221;   29303;   27884;    4156;    5575
RBOB CALENDAR SWAP - NEW YORK MERCANTILE EXCHANGE ;2011.03.29;   35991;    9769;     128;     555;   21627;   30764;   31951;   31447;    4040;    4544
RBOB CALENDAR SWAP - NEW YORK MERCANTILE EXCHANGE ;2011.03.22;   32491;    7712;     140;     796;   19866;   26070;   28374;   27006;    4117;    5485
RBOB CALENDAR SWAP - NEW YORK MERCANTILE EXCHANGE ;2011.03.15;   29071;    6885;     543;     544;   17853;   23234;   25282;   24321;    3789;    4750
RBOB CALENDAR SWAP - NEW YORK MERCANTILE EXCHANGE ;2011.03.08;   25123;    4120;     851;     606;   16016;   18876;   20742;   20333;    4381;    4790
RBOB CALENDAR SWAP - NEW YORK MERCANTILE EXCHANGE ;2011.03.01;   23024;    2422;     993;    1284;   15889;   15962;   19595;   18239;    3429;    4785
RBOB CALENDAR SWAP - NEW YORK MERCANTILE EXCHANGE ;2011.02.22;   24261;    2397;    1871;    1365;   16028;   16690;   19790;   19926;    4471;    4335
RBOB CALENDAR SWAP - NEW YORK MERCANTILE EXCHANGE ;2011.02.15;   23621;    2325;    2265;    1277;   16277;   15338;   19879;   18880;    3742;    4741
RBOB CALENDAR SWAP - NEW YORK MERCANTILE EXCHANGE ;2011.02.08;   22136;    2225;    2497;     958;   14406;   14279;   17589;   17734;    4547;    4402
RBOB CALENDAR SWAP - NEW YORK MERCANTILE EXCHANGE ;2011.02.01;   21103;    2225;    2340;    1058;   13601;   13568;   16884;   16966;    4219;    4137
RBOB CALENDAR SWAP - NEW YORK MERCANTILE EXCHANGE ;2011.01.25;   21991;    2225;    2436;    1239;   14802;   13884;   18266;   17559;    3725;    4432
RBOB CALENDAR SWAP - NEW YORK MERCANTILE EXCHANGE ;2011.01.18;   20538;    2177;    2053;    1260;   13711;   12977;   17148;   16290;    3390;    4248
RBOB CALENDAR SWAP - NEW YORK MERCANTILE EXCHANGE ;2011.01.11;   19532;    2612;    1780;     885;   12691;   12020;   16188;   14685;    3344;    4847
RBOB CALENDAR SWAP - NEW YORK MERCANTILE EXCHANGE ;2011.01.04;   16542;    2762;    1430;     885;    8577;    9229;   12224;   11544;    4318;    4998
RBOB CALENDAR SWAP - NEW YORK MERCANTILE EXCHANGE ;2011.07.12;   26253;    9454;     261;     678;   10692;   20924;   20824;   21863;    5429;    4390
RBOB CALENDAR SWAP - NEW YORK MERCANTILE EXCHANGE ;2010.12.28;   20539;    3072;    1169;    1358;   11937;   12610;   16367;   15137;    4172;    5402
RBOB CALENDAR SWAP - NEW YORK MERCANTILE EXCHANGE ;2010.12.21;   20382;    3057;    1243;    1358;   11854;   12654;   16269;   15255;    4113;    5127
RBOB CALENDAR SWAP - NEW YORK MERCANTILE EXCHANGE ;2010.12.14;   20231;    3102;    1235;    1226;   12129;   13097;   16457;   15558;    3774;    4673
RBOB CALENDAR SWAP - NEW YORK MERCANTILE EXCHANGE ;2010.12.07;   19927;    3102;    1318;    1226;   10703;   11984;   15031;   14528;    4896;    5399
RBOB CALENDAR SWAP - NEW YORK MERCANTILE EXCHANGE ;2010.11.30;   23716;    2402;    1139;    1567;   16068;   16781;   20037;   19487;    3679;    4229
RBOB CALENDAR SWAP - NEW YORK MERCANTILE EXCHANGE ;2010.11.23;   24171;    2402;     739;    1572;   16147;   17360;   20121;   19671;    4050;    4500
RBOB CALENDAR SWAP - NEW YORK MERCANTILE EXCHANGE ;2010.11.16;   24142;    2852;     669;    1116;   16200;   17339;   20168;   19124;    3974;    5018
RBOB CALENDAR SWAP - NEW YORK MERCANTILE EXCHANGE ;2010.11.09;   23216;    2783;     669;    1128;   15693;   16700;   19604;   18497;    3612;    4719
RBOB CALENDAR SWAP - NEW YORK MERCANTILE EXCHANGE ;2010.11.02;   21962;    2518;     519;    1128;   14561;   15582;   18207;   17229;    3755;    4733
RBOB CALENDAR SWAP - NEW YORK MERCANTILE EXCHANGE ;2010.10.26;   24711;    2549;     711;    1627;   15551;   16905;   19727;   19243;    4984;    5468
RBOB CALENDAR SWAP - NEW YORK MERCANTILE EXCHANGE ;2010.10.19;   22781;    2541;     377;    1847;   13064;   14611;   17452;   16835;    5329;    5946
RBOB CALENDAR SWAP - NEW YORK MERCANTILE EXCHANGE ;2010.10.12;   22180;    2628;     534;    1597;   12052;   14003;   16277;   16134;    5903;    6046
RBOB CALENDAR SWAP - NEW YORK MERCANTILE EXCHANGE ;2010.10.05;   21406;    2540;     179;    1347;   11392;   13506;   15279;   15032;    6127;    6374
RBOB CALENDAR SWAP - NEW YORK MERCANTILE EXCHANGE ;2010.09.28;   24294;    2449;    1052;    1988;   14873;   17395;   19310;   20435;    4984;    3859
RBOB CALENDAR SWAP - NEW YORK MERCANTILE EXCHANGE ;2010.09.21;   24637;    2397;     585;    2327;   14950;   17851;   19674;   20763;    4963;    3874
RBOB CALENDAR SWAP - NEW YORK MERCANTILE EXCHANGE ;2010.09.14;   24876;    3202;     480;    2174;   15277;   18969;   20653;   21623;    4223;    3253
RBOB CALENDAR SWAP - NEW YORK MERCANTILE EXCHANGE ;2010.09.07;   25515;    3152;     480;    2174;   14960;   18972;   20286;   21626;    5229;    3889
RBOB CALENDAR SWAP - NEW YORK MERCANTILE EXCHANGE ;2010.08.31;   28159;    4307;     196;    2027;   16444;   22654;   22778;   24877;    5381;    3282
RBOB CALENDAR SWAP - NEW YORK MERCANTILE EXCHANGE ;2010.08.24;   27985;    4502;     196;    1877;   16208;   22702;   22587;   24775;    5398;    3210
RBOB CALENDAR SWAP - NEW YORK MERCANTILE EXCHANGE ;2010.08.17;   26972;    4744;     196;    1837;   15860;   21776;   22441;   23809;    4531;    3163
RBOB CALENDAR SWAP - NEW YORK MERCANTILE EXCHANGE ;2010.08.10;   26146;    5752;     196;    1197;   14729;   21469;   21678;   22862;    4468;    3284
RBOB CALENDAR SWAP - NEW YORK MERCANTILE EXCHANGE ;2010.08.03;   25516;    5640;     196;    1199;   14439;   20271;   21278;   21666;    4238;    3850
RBOB CALENDAR SWAP - NEW YORK MERCANTILE EXCHANGE ;2010.07.27;   30229;    6525;     157;    1550;   17276;   23781;   25351;   25488;    4878;    4741
RBOB CALENDAR SWAP - NEW YORK MERCANTILE EXCHANGE ;2010.07.20;   28760;    6220;     157;    1653;   16474;   22574;   24347;   24384;    4413;    4376
RBOB CALENDAR SWAP - NEW YORK MERCANTILE EXCHANGE ;2010.07.13;   27398;    6192;     157;    1297;   15558;   21623;   23047;   23077;    4351;    4321
RBOB CALENDAR SWAP - NEW YORK MERCANTILE EXCHANGE ;2010.07.06;   26854;    5845;     157;    1284;   15550;   21224;   22679;   22665;    4175;    4189
RBOB CALENDAR SWAP - NEW YORK MERCANTILE EXCHANGE ;2010.06.29;   30877;    7189;     130;    1381;   17476;   25259;   26046;   26770;    4831;    4107
RBOB CALENDAR SWAP - NEW YORK MERCANTILE EXCHANGE ;2010.06.22;   30070;    6517;     130;    1479;   17214;   24284;   25210;   25893;    4860;    4177
RBOB CALENDAR SWAP - NEW YORK MERCANTILE EXCHANGE ;2010.06.15;   28547;    6015;     130;    1546;   15829;   22569;   23390;   24245;    5157;    4302
RBOB CALENDAR SWAP - NEW YORK MERCANTILE EXCHANGE ;2010.06.08;   27905;    5978;     130;    1555;   14902;   21690;   22435;   23375;    5470;    4530
RBOB CALENDAR SWAP - NEW YORK MERCANTILE EXCHANGE ;2010.06.01;   25398;    5577;     130;    1663;   12936;   18801;   20176;   20594;    5222;    4804
RBOB CALENDAR SWAP - NEW YORK MERCANTILE EXCHANGE ;2010.05.25;   28988;    7396;     103;    1754;   15059;   21592;   24209;   23449;    4779;    5539
RBOB CALENDAR SWAP - NEW YORK MERCANTILE EXCHANGE ;2010.05.18;   27668;    7592;     103;    1784;   13743;   19914;   23119;   21801;    4549;    5867
RBOB CALENDAR SWAP - NEW YORK MERCANTILE EXCHANGE ;2010.05.11;   28335;    8369;      91;    1724;   13659;   20315;   23752;   22130;    4583;    6205
RBOB CALENDAR SWAP - NEW YORK MERCANTILE EXCHANGE ;2010.05.04;   27676;    7400;       4;    1015;   13703;   19728;   22118;   20747;    5558;    6929
RBOB CALENDAR SWAP - NEW YORK MERCANTILE EXCHANGE ;2010.04.27;   30403;    7969;       0;     762;   14894;   21734;   23625;   22496;    6778;    7907
RBOB CALENDAR SWAP - NEW YORK MERCANTILE EXCHANGE ;2010.04.20;   29350;    7256;       0;     762;   14807;   20750;   22825;   21512;    6525;    7838
RBOB CALENDAR SWAP - NEW YORK MERCANTILE EXCHANGE ;2010.04.13;   28490;    6117;     624;    1137;   14841;   21633;   22095;   23394;    6395;    5096
RBOB CALENDAR SWAP - NEW YORK MERCANTILE EXCHANGE ;2010.04.06;   26465;    3359;     733;    1028;   15477;   20013;   19864;   21774;    6601;    4691
RBOB CALENDAR SWAP - NEW YORK MERCANTILE EXCHANGE ;2010.03.30;   28324;    3208;    1083;    1028;   17189;   21243;   21425;   23354;    6899;    4970
RBOB CALENDAR SWAP - NEW YORK MERCANTILE EXCHANGE ;2010.03.23;   26290;    2705;     982;     217;   17011;   19646;   19933;   20845;    6357;    5445
RBOB CALENDAR SWAP - NEW YORK MERCANTILE EXCHANGE ;2010.03.16;   25692;    2618;     982;     217;   16445;   18433;   19280;   19632;    6412;    6060
RBOB CALENDAR SWAP - NEW YORK MERCANTILE EXCHANGE ;2010.03.09;   24085;    2390;     982;     304;   15428;   16914;   18122;   18200;    5963;    5885
RBOB CALENDAR SWAP - NEW YORK MERCANTILE EXCHANGE ;2010.03.02;   21034;    2015;       0;     304;   13478;   14967;   15797;   15271;    5237;    5763
RBOB CALENDAR SWAP - NEW YORK MERCANTILE EXCHANGE ;2010.02.23;   22678;    2268;       0;     304;   14581;   16117;   17153;   16421;    5525;    6257
RBOB CALENDAR SWAP - NEW YORK MERCANTILE EXCHANGE ;2010.02.16;   21528;    1807;       0;     316;   13775;   15605;   15898;   15921;    5630;    5607
RBOB CALENDAR SWAP - NEW YORK MERCANTILE EXCHANGE ;2010.02.09;   20512;    1720;       0;     316;   12662;   13758;   14698;   14074;    5814;    6438
RBOB CALENDAR SWAP - NEW YORK MERCANTILE EXCHANGE ;2010.02.02;   20254;     391;       0;     712;   12791;   13757;   13894;   14469;    6360;    5785
RBOB CALENDAR SWAP - NEW YORK MERCANTILE EXCHANGE ;2010.01.26;   23624;    1944;       0;     495;   15748;   16596;   18187;   17091;    5437;    6533
RBOB CALENDAR SWAP - NEW YORK MERCANTILE EXCHANGE ;2010.01.19;   23372;    1981;    1245;     495;   15767;   16169;   18243;   17909;    5129;    5463
RBOB CALENDAR SWAP - NEW YORK MERCANTILE EXCHANGE ;2010.01.12;   22454;    1404;       0;     495;   14837;   15376;   16736;   15871;    5718;    6583
RBOB CALENDAR SWAP - NEW YORK MERCANTILE EXCHANGE ;2010.01.05;   21379;    1374;       0;     495;   14330;   14979;   16199;   15474;    5180;    5905
RBOB CALENDAR SWAP - NEW YORK MERCANTILE EXCHANGE ;2009.12.29;   23263;    2093;       0;     663;   15570;   17283;   18326;   17946;    4937;    5317
RBOB CALENDAR SWAP - NEW YORK MERCANTILE EXCHANGE ;2009.12.22;   23089;    2093;       0;     663;   15396;   17146;   18152;   17809;    4937;    5280
RBOB CALENDAR SWAP - NEW YORK MERCANTILE EXCHANGE ;2009.12.15;   21986;     650;       0;     687;   14885;   16192;   16222;   16879;    5764;    5107
RBOB CALENDAR SWAP - NEW YORK MERCANTILE EXCHANGE ;2009.12.08;   21949;    1425;       0;     687;   14297;   15256;   16409;   15943;    5540;    6006
RBOB CALENDAR SWAP - NEW YORK MERCANTILE EXCHANGE ;2009.12.01;   21223;    1426;       0;     237;   13990;   15174;   15653;   15411;    5570;    5812
RBOB CALENDAR SWAP - NEW YORK MERCANTILE EXCHANGE ;2009.11.24;   23185;    1933;       0;     423;   15105;   16014;   17461;   16437;    5724;    6748
RBOB CALENDAR SWAP - NEW YORK MERCANTILE EXCHANGE ;2009.11.17;   23083;    1896;       0;     440;   15032;   16175;   17368;   16615;    5715;    6468
RBOB CALENDAR SWAP - NEW YORK MERCANTILE EXCHANGE ;2009.11.09;   22483;    1896;       0;     440;   14632;   15528;   16968;   15968;    5515;    6515
RBOB CALENDAR SWAP - NEW YORK MERCANTILE EXCHANGE ;2009.11.03;   22384;    1704;       0;     440;   15388;   16457;   17532;   16897;    4852;    5487
RBOB CALENDAR SWAP - NEW YORK MERCANTILE EXCHANGE ;2009.10.27;   25438;    1994;       0;     444;   17533;   19378;   19971;   19822;    5467;    5616
RBOB CALENDAR SWAP - NEW YORK MERCANTILE EXCHANGE ;2009.10.20;   23499;    1220;       0;     615;   15904;   16048;   17739;   16663;    5760;    6836
RBOB CALENDAR SWAP - NEW YORK MERCANTILE EXCHANGE ;2009.10.13;   21618;    1124;       0;     285;   14971;   14748;   16380;   15033;    5238;    6585
RBOB CALENDAR SWAP - NEW YORK MERCANTILE EXCHANGE ;2009.10.06;   20702;    1124;       0;     285;   14620;   14212;   16029;   14497;    4673;    6205
RBOB CALENDAR SWAP - NEW YORK MERCANTILE EXCHANGE ;2009.09.29;   22982;    1356;       0;     328;   16640;   18068;   18324;   18396;    4658;    4586
RBOB CALENDAR SWAP - NEW YORK MERCANTILE EXCHANGE ;2009.09.22;   22870;    1290;       0;     328;   16390;   17973;   18008;   18301;    4862;    4569
RBOB CALENDAR SWAP - NEW YORK MERCANTILE EXCHANGE ;2009.09.15;   20953;    1263;       0;     220;   14818;   16115;   16301;   16335;    4652;    4618
RBOB CALENDAR SWAP - NEW YORK MERCANTILE EXCHANGE ;2009.09.08;   20546;    1242;       0;     213;   14443;   15699;   15898;   15912;    4648;    4634
RBOB CALENDAR SWAP - NEW YORK MERCANTILE EXCHANGE ;2009.09.01;   20475;    1224;       0;     201;   14498;   15700;   15923;   15901;    4552;    4574
RBOB CALENDAR SWAP - NEW YORK MERCANTILE EXCHANGE ;2009.08.25;   23956;    1437;       0;     244;   17584;   19116;   19265;   19360;    4691;    4596
RBOB CALENDAR SWAP - NEW YORK MERCANTILE EXCHANGE ;2009.08.18;   21924;    1416;       0;     244;   14770;   16870;   16430;   17114;    5494;    4810
RBOB CALENDAR SWAP - NEW YORK MERCANTILE EXCHANGE ;2009.08.11;   21159;    1416;       0;     244;   13743;   16215;   15403;   16459;    5756;    4700
RBOB CALENDAR SWAP - NEW YORK MERCANTILE EXCHANGE ;2009.08.04;   20925;    1329;       0;     250;   13866;   16155;   15445;   16405;    5480;    4520
RBOB CALENDAR SWAP - NEW YORK MERCANTILE EXCHANGE ;2009.07.28;   23413;    1530;     167;     293;   15940;   18359;   17763;   18819;    5650;    4594
RBOB CALENDAR SWAP - NEW YORK MERCANTILE EXCHANGE ;2009.07.21;   23217;    1476;     167;     293;   16106;   18513;   17875;   18973;    5342;    4244
RBOB CALENDAR SWAP - NEW YORK MERCANTILE EXCHANGE ;2009.07.14;   22416;    1152;     167;     287;   15535;   17889;   16974;   18343;    5442;    4073
RBOB CALENDAR SWAP - NEW YORK MERCANTILE EXCHANGE ;2009.07.07;   21838;    2441;     167;     959;   12369;   16137;   15769;   17263;    6069;    4575
RBOB CALENDAR SWAP - NEW YORK MERCANTILE EXCHANGE ;2009.06.30;   20540;    1972;     167;     834;   11545;   15132;   14351;   16133;    6189;    4407
RBOB CALENDAR SWAP - NEW YORK MERCANTILE EXCHANGE ;2009.06.23;   23082;    1803;     167;     661;   13387;   17874;   15851;   18702;    7231;    4380
RBOB CALENDAR SWAP - NEW YORK MERCANTILE EXCHANGE ;2009.05.26;   20994;     746;       0;    1077;   12947;   13934;   14770;   15011;    6224;    5983
RBOB CALENDAR SWAP - NEW YORK MERCANTILE EXCHANGE ;2009.04.28;   21802;       0;    1182;     429;   16013;   14259;   16442;   15870;    5360;    5932
RBOB CALENDAR SWAP - NEW YORK MERCANTILE EXCHANGE ;2009.04.21;   21509;       0;     906;     639;   16205;   14109;   16844;   15654;    4665;    5855
RBOB CALENDAR SWAP - NEW YORK MERCANTILE EXCHANGE ;2009.01.27;   17860;       0;     687;      81;   12633;   12647;   12714;   13415;    5146;    4445
RBOB CALENDAR SWAP - NEW YORK MERCANTILE EXCHANGE ;2009.01.20;   17471;       0;     632;      96;   11987;   12485;   12083;   13213;    5388;    4258
RBOB CALENDAR SWAP - NEW YORK MERCANTILE EXCHANGE ;2009.01.13;   16616;       0;       0;       0;   11718;   11699;   11718;   11699;    4898;    4917
RBOB CALENDAR SWAP - NEW YORK MERCANTILE EXCHANGE ;2008.12.30;   17733;     410;       0;     157;   12301;   12460;   12868;   12617;    4865;    5116
RBOB CALENDAR SWAP - NEW YORK MERCANTILE EXCHANGE ;2008.12.22;   17783;     410;       0;     157;   12042;   12579;   12609;   12736;    5174;    5047
RBOB CALENDAR SWAP - NEW YORK MERCANTILE EXCHANGE ;2008.12.16;   17708;     590;       0;      70;   11898;   11715;   12558;   11785;    5150;    5923
RBOB CALENDAR SWAP - NEW YORK MERCANTILE EXCHANGE ;2011.07.12;   26253;    9454;     261;     678;   10692;   20924;   20824;   21863;    5429;    4390
RBOB CALENDAR SWAP - NEW YORK MERCANTILE EXCHANGE ;2011.07.05;   24442;    7277;     261;     701;   10504;   19170;   18482;   20132;    5960;    4310
RBOB CALENDAR SWAP - NEW YORK MERCANTILE EXCHANGE ;2011.06.28;   27875;    6610;     251;     852;   13242;   22110;   20704;   23213;    7171;    4662
RBOB CALENDAR SWAP - NEW YORK MERCANTILE EXCHANGE ;2011.06.21;   26944;    6606;     251;     846;   12094;   21339;   19546;   22436;    7398;    4508
RBOB CALENDAR SWAP - NEW YORK MERCANTILE EXCHANGE ;2011.06.14;   27008;    6853;     251;     646;   12418;   21892;   19917;   22789;    7091;    4219
RBOB CALENDAR SWAP - NEW YORK MERCANTILE EXCHANGE ;2011.06.07;   25260;    6845;     251;     598;   11870;   20332;   19313;   21181;    5947;    4079
RBOB CALENDAR SWAP - NEW YORK MERCANTILE EXCHANGE ;2011.05.31;   31135;    8877;     241;     914;   15311;   26330;   25102;   27485;    6033;    3650
RBOB CALENDAR SWAP - NEW YORK MERCANTILE EXCHANGE ;2011.05.24;   29982;    8860;     241;     774;   14790;   25530;   24424;   26545;    5558;    3437
RBOB CALENDAR SWAP - NEW YORK MERCANTILE EXCHANGE ;2011.05.17;   30199;    9805;     241;     623;   14349;   25579;   24777;   26443;    5422;    3756
RBOB CALENDAR SWAP - NEW YORK MERCANTILE EXCHANGE ;2011.05.10;   29467;   10183;       0;     577;   13402;   24745;   24162;   25322;    5305;    4145
RBOB CALENDAR SWAP - NEW YORK MERCANTILE EXCHANGE ;2011.05.03;   28363;    9594;       0;     457;   13432;   23880;   23483;   24337;    4880;    4026
RBOB CALENDAR SWAP - NEW YORK MERCANTILE EXCHANGE ;2011.04.26;   35386;   11578;      57;     606;   18930;   28672;   31114;   29335;    4272;    6051
RBOB CALENDAR SWAP - NEW YORK MERCANTILE EXCHANGE ;2011.04.19;   35405;   11775;      57;     606;   18910;   28597;   31291;   29260;    4114;    6145
RBOB CALENDAR SWAP - NEW YORK MERCANTILE EXCHANGE ;2011.04.12;   34598;   11222;      57;     606;   18687;   28220;   30515;   28883;    4083;    5715
RBOB CALENDAR SWAP - NEW YORK MERCANTILE EXCHANGE ;2011.04.05;   33459;   10455;     108;     555;   18293;   27221;   29303;   27884;    4156;    5575
RBOB CALENDAR SWAP - NEW YORK MERCANTILE EXCHANGE ;2011.03.29;   35991;    9769;     128;     555;   21627;   30764;   31951;   31447;    4040;    4544
RBOB CALENDAR SWAP - NEW YORK MERCANTILE EXCHANGE ;2011.03.22;   32491;    7712;     140;     796;   19866;   26070;   28374;   27006;    4117;    5485
RBOB CALENDAR SWAP - NEW YORK MERCANTILE EXCHANGE ;2011.03.15;   29071;    6885;     543;     544;   17853;   23234;   25282;   24321;    3789;    4750
RBOB CALENDAR SWAP - NEW YORK MERCANTILE EXCHANGE ;2011.03.08;   25123;    4120;     851;     606;   16016;   18876;   20742;   20333;    4381;    4790
RBOB CALENDAR SWAP - NEW YORK MERCANTILE EXCHANGE ;2011.03.01;   23024;    2422;     993;    1284;   15889;   15962;   19595;   18239;    3429;    4785
RBOB CALENDAR SWAP - NEW YORK MERCANTILE EXCHANGE ;2011.02.22;   24261;    2397;    1871;    1365;   16028;   16690;   19790;   19926;    4471;    4335
RBOB CALENDAR SWAP - NEW YORK MERCANTILE EXCHANGE ;2011.02.15;   23621;    2325;    2265;    1277;   16277;   15338;   19879;   18880;    3742;    4741
RBOB CALENDAR SWAP - NEW YORK MERCANTILE EXCHANGE ;2011.02.08;   22136;    2225;    2497;     958;   14406;   14279;   17589;   17734;    4547;    4402
RBOB CALENDAR SWAP - NEW YORK MERCANTILE EXCHANGE ;2011.02.01;   21103;    2225;    2340;    1058;   13601;   13568;   16884;   16966;    4219;    4137
RBOB CALENDAR SWAP - NEW YORK MERCANTILE EXCHANGE ;2011.01.25;   21991;    2225;    2436;    1239;   14802;   13884;   18266;   17559;    3725;    4432
RBOB CALENDAR SWAP - NEW YORK MERCANTILE EXCHANGE ;2011.01.18;   20538;    2177;    2053;    1260;   13711;   12977;   17148;   16290;    3390;    4248
RBOB CALENDAR SWAP - NEW YORK MERCANTILE EXCHANGE ;2011.01.11;   19532;    2612;    1780;     885;   12691;   12020;   16188;   14685;    3344;    4847
RBOB CALENDAR SWAP - NEW YORK MERCANTILE EXCHANGE ;2011.01.04;   16542;    2762;    1430;     885;    8577;    9229;   12224;   11544;    4318;    4998
RBOB CALENDAR SWAP - NEW YORK MERCANTILE EXCHANGE ;2011.07.12;   26253;    9454;     261;     678;   10692;   20924;   20824;   21863;    5429;    4390
RBOB CALENDAR SWAP - NEW YORK MERCANTILE EXCHANGE ;2011.07.05;   24442;    7277;     261;     701;   10504;   19170;   18482;   20132;    5960;    4310
RBOB CALENDAR SWAP - NEW YORK MERCANTILE EXCHANGE ;2011.06.28;   27875;    6610;     251;     852;   13242;   22110;   20704;   23213;    7171;    4662
RBOB CALENDAR SWAP - NEW YORK MERCANTILE EXCHANGE ;2011.06.21;   26944;    6606;     251;     846;   12094;   21339;   19546;   22436;    7398;    4508
RBOB CALENDAR SWAP - NEW YORK MERCANTILE EXCHANGE ;2011.06.14;   27008;    6853;     251;     646;   12418;   21892;   19917;   22789;    7091;    4219
RBOB CALENDAR SWAP - NEW YORK MERCANTILE EXCHANGE ;2011.06.07;   25260;    6845;     251;     598;   11870;   20332;   19313;   21181;    5947;    4079
RBOB CALENDAR SWAP - NEW YORK MERCANTILE EXCHANGE ;2011.05.31;   31135;    8877;     241;     914;   15311;   26330;   25102;   27485;    6033;    3650
RBOB CALENDAR SWAP - NEW YORK MERCANTILE EXCHANGE ;2011.05.24;   29982;    8860;     241;     774;   14790;   25530;   24424;   26545;    5558;    3437
RBOB CALENDAR SWAP - NEW YORK MERCANTILE EXCHANGE ;2011.05.17;   30199;    9805;     241;     623;   14349;   25579;   24777;   26443;    5422;    3756
RBOB CALENDAR SWAP - NEW YORK MERCANTILE EXCHANGE ;2011.05.10;   29467;   10183;       0;     577;   13402;   24745;   24162;   25322;    5305;    4145
RBOB CALENDAR SWAP - NEW YORK MERCANTILE EXCHANGE ;2011.05.03;   28363;    9594;       0;     457;   13432;   23880;   23483;   24337;    4880;    4026
RBOB CALENDAR SWAP - NEW YORK MERCANTILE EXCHANGE ;2011.04.26;   35386;   11578;      57;     606;   18930;   28672;   31114;   29335;    4272;    6051
RBOB CALENDAR SWAP - NEW YORK MERCANTILE EXCHANGE ;2011.04.19;   35405;   11775;      57;     606;   18910;   28597;   31291;   29260;    4114;    6145
RBOB CALENDAR SWAP - NEW YORK MERCANTILE EXCHANGE ;2011.04.12;   34598;   11222;      57;     606;   18687;   28220;   30515;   28883;    4083;    5715
RBOB CALENDAR SWAP - NEW YORK MERCANTILE EXCHANGE ;2011.04.05;   33459;   10455;     108;     555;   18293;   27221;   29303;   27884;    4156;    5575
RBOB CALENDAR SWAP - NEW YORK MERCANTILE EXCHANGE ;2011.03.29;   35991;    9769;     128;     555;   21627;   30764;   31951;   31447;    4040;    4544
RBOB CALENDAR SWAP - NEW YORK MERCANTILE EXCHANGE ;2011.03.22;   32491;    7712;     140;     796;   19866;   26070;   28374;   27006;    4117;    5485
RBOB CALENDAR SWAP - NEW YORK MERCANTILE EXCHANGE ;2011.03.15;   29071;    6885;     543;     544;   17853;   23234;   25282;   24321;    3789;    4750
RBOB CALENDAR SWAP - NEW YORK MERCANTILE EXCHANGE ;2011.03.08;   25123;    4120;     851;     606;   16016;   18876;   20742;   20333;    4381;    4790
RBOB CALENDAR SWAP - NEW YORK MERCANTILE EXCHANGE ;2011.03.01;   23024;    2422;     993;    1284;   15889;   15962;   19595;   18239;    3429;    4785
RBOB CALENDAR SWAP - NEW YORK MERCANTILE EXCHANGE ;2011.02.22;   24261;    2397;    1871;    1365;   16028;   16690;   19790;   19926;    4471;    4335
RBOB CALENDAR SWAP - NEW YORK MERCANTILE EXCHANGE ;2011.02.15;   23621;    2325;    2265;    1277;   16277;   15338;   19879;   18880;    3742;    4741
RBOB CALENDAR SWAP - NEW YORK MERCANTILE EXCHANGE ;2011.02.08;   22136;    2225;    2497;     958;   14406;   14279;   17589;   17734;    4547;    4402
RBOB CALENDAR SWAP - NEW YORK MERCANTILE EXCHANGE ;2011.02.01;   21103;    2225;    2340;    1058;   13601;   13568;   16884;   16966;    4219;    4137
RBOB CALENDAR SWAP - NEW YORK MERCANTILE EXCHANGE ;2011.01.25;   21991;    2225;    2436;    1239;   14802;   13884;   18266;   17559;    3725;    4432
RBOB CALENDAR SWAP - NEW YORK MERCANTILE EXCHANGE ;2011.01.18;   20538;    2177;    2053;    1260;   13711;   12977;   17148;   16290;    3390;    4248
RBOB CALENDAR SWAP - NEW YORK MERCANTILE EXCHANGE ;2011.01.11;   19532;    2612;    1780;     885;   12691;   12020;   16188;   14685;    3344;    4847
RBOB CALENDAR SWAP - NEW YORK MERCANTILE EXCHANGE ;2011.01.04;   16542;    2762;    1430;     885;    8577;    9229;   12224;   11544;    4318;    4998
RBOB CALENDAR SWAP - NEW YORK MERCANTILE EXCHANGE ;2010.12.28;   20539;    3072;    1169;    1358;   11937;   12610;   16367;   15137;    4172;    5402
RBOB CALENDAR SWAP - NEW YORK MERCANTILE EXCHANGE ;2010.12.21;   20382;    3057;    1243;    1358;   11854;   12654;   16269;   15255;    4113;    5127
RBOB CALENDAR SWAP - NEW YORK MERCANTILE EXCHANGE ;2010.12.14;   20231;    3102;    1235;    1226;   12129;   13097;   16457;   15558;    3774;    4673
RBOB CALENDAR SWAP - NEW YORK MERCANTILE EXCHANGE ;2010.12.07;   19927;    3102;    1318;    1226;   10703;   11984;   15031;   14528;    4896;    5399
RBOB CALENDAR SWAP - NEW YORK MERCANTILE EXCHANGE ;2010.11.30;   23716;    2402;    1139;    1567;   16068;   16781;   20037;   19487;    3679;    4229
RBOB CALENDAR SWAP - NEW YORK MERCANTILE EXCHANGE ;2010.11.23;   24171;    2402;     739;    1572;   16147;   17360;   20121;   19671;    4050;    4500
RBOB CALENDAR SWAP - NEW YORK MERCANTILE EXCHANGE ;2010.11.16;   24142;    2852;     669;    1116;   16200;   17339;   20168;   19124;    3974;    5018
RBOB CALENDAR SWAP - NEW YORK MERCANTILE EXCHANGE ;2010.11.09;   23216;    2783;     669;    1128;   15693;   16700;   19604;   18497;    3612;    4719
RBOB CALENDAR SWAP - NEW YORK MERCANTILE EXCHANGE ;2010.11.02;   21962;    2518;     519;    1128;   14561;   15582;   18207;   17229;    3755;    4733
RBOB CALENDAR SWAP - NEW YORK MERCANTILE EXCHANGE ;2010.10.26;   24711;    2549;     711;    1627;   15551;   16905;   19727;   19243;    4984;    5468
RBOB CALENDAR SWAP - NEW YORK MERCANTILE EXCHANGE ;2010.10.19;   22781;    2541;     377;    1847;   13064;   14611;   17452;   16835;    5329;    5946
RBOB CALENDAR SWAP - NEW YORK MERCANTILE EXCHANGE ;2010.10.12;   22180;    2628;     534;    1597;   12052;   14003;   16277;   16134;    5903;    6046
RBOB CALENDAR SWAP - NEW YORK MERCANTILE EXCHANGE ;2010.10.05;   21406;    2540;     179;    1347;   11392;   13506;   15279;   15032;    6127;    6374
RBOB CALENDAR SWAP - NEW YORK MERCANTILE EXCHANGE ;2010.09.28;   24294;    2449;    1052;    1988;   14873;   17395;   19310;   20435;    4984;    3859
RBOB CALENDAR SWAP - NEW YORK MERCANTILE EXCHANGE ;2010.09.21;   24637;    2397;     585;    2327;   14950;   17851;   19674;   20763;    4963;    3874
RBOB CALENDAR SWAP - NEW YORK MERCANTILE EXCHANGE ;2010.09.14;   24876;    3202;     480;    2174;   15277;   18969;   20653;   21623;    4223;    3253
RBOB CALENDAR SWAP - NEW YORK MERCANTILE EXCHANGE ;2010.09.07;   25515;    3152;     480;    2174;   14960;   18972;   20286;   21626;    5229;    3889
RBOB CALENDAR SWAP - NEW YORK MERCANTILE EXCHANGE ;2010.08.31;   28159;    4307;     196;    2027;   16444;   22654;   22778;   24877;    5381;    3282
RBOB CALENDAR SWAP - NEW YORK MERCANTILE EXCHANGE ;2010.08.24;   27985;    4502;     196;    1877;   16208;   22702;   22587;   24775;    5398;    3210
RBOB CALENDAR SWAP - NEW YORK MERCANTILE EXCHANGE ;2010.08.17;   26972;    4744;     196;    1837;   15860;   21776;   22441;   23809;    4531;    3163
RBOB CALENDAR SWAP - NEW YORK MERCANTILE EXCHANGE ;2010.08.10;   26146;    5752;     196;    1197;   14729;   21469;   21678;   22862;    4468;    3284
RBOB CALENDAR SWAP - NEW YORK MERCANTILE EXCHANGE ;2010.08.03;   25516;    5640;     196;    1199;   14439;   20271;   21278;   21666;    4238;    3850
RBOB CALENDAR SWAP - NEW YORK MERCANTILE EXCHANGE ;2010.07.27;   30229;    6525;     157;    1550;   17276;   23781;   25351;   25488;    4878;    4741
RBOB CALENDAR SWAP - NEW YORK MERCANTILE EXCHANGE ;2010.07.20;   28760;    6220;     157;    1653;   16474;   22574;   24347;   24384;    4413;    4376
RBOB CALENDAR SWAP - NEW YORK MERCANTILE EXCHANGE ;2010.07.13;   27398;    6192;     157;    1297;   15558;   21623;   23047;   23077;    4351;    4321
RBOB CALENDAR SWAP - NEW YORK MERCANTILE EXCHANGE ;2010.07.06;   26854;    5845;     157;    1284;   15550;   21224;   22679;   22665;    4175;    4189
RBOB CALENDAR SWAP - NEW YORK MERCANTILE EXCHANGE ;2010.06.29;   30877;    7189;     130;    1381;   17476;   25259;   26046;   26770;    4831;    4107
RBOB CALENDAR SWAP - NEW YORK MERCANTILE EXCHANGE ;2010.06.22;   30070;    6517;     130;    1479;   17214;   24284;   25210;   25893;    4860;    4177
RBOB CALENDAR SWAP - NEW YORK MERCANTILE EXCHANGE ;2010.06.15;   28547;    6015;     130;    1546;   15829;   22569;   23390;   24245;    5157;    4302
RBOB CALENDAR SWAP - NEW YORK MERCANTILE EXCHANGE ;2010.06.08;   27905;    5978;     130;    1555;   14902;   21690;   22435;   23375;    5470;    4530
RBOB CALENDAR SWAP - NEW YORK MERCANTILE EXCHANGE ;2010.06.01;   25398;    5577;     130;    1663;   12936;   18801;   20176;   20594;    5222;    4804
RBOB CALENDAR SWAP - NEW YORK MERCANTILE EXCHANGE ;2010.05.25;   28988;    7396;     103;    1754;   15059;   21592;   24209;   23449;    4779;    5539
RBOB CALENDAR SWAP - NEW YORK MERCANTILE EXCHANGE ;2010.05.18;   27668;    7592;     103;    1784;   13743;   19914;   23119;   21801;    4549;    5867
RBOB CALENDAR SWAP - NEW YORK MERCANTILE EXCHANGE ;2010.05.11;   28335;    8369;      91;    1724;   13659;   20315;   23752;   22130;    4583;    6205
RBOB CALENDAR SWAP - NEW YORK MERCANTILE EXCHANGE ;2010.05.04;   27676;    7400;       4;    1015;   13703;   19728;   22118;   20747;    5558;    6929
RBOB CALENDAR SWAP - NEW YORK MERCANTILE EXCHANGE ;2010.04.27;   30403;    7969;       0;     762;   14894;   21734;   23625;   22496;    6778;    7907
RBOB CALENDAR SWAP - NEW YORK MERCANTILE EXCHANGE ;2010.04.20;   29350;    7256;       0;     762;   14807;   20750;   22825;   21512;    6525;    7838
RBOB CALENDAR SWAP - NEW YORK MERCANTILE EXCHANGE ;2010.04.13;   28490;    6117;     624;    1137;   14841;   21633;   22095;   23394;    6395;    5096
RBOB CALENDAR SWAP - NEW YORK MERCANTILE EXCHANGE ;2010.04.06;   26465;    3359;     733;    1028;   15477;   20013;   19864;   21774;    6601;    4691
RBOB CALENDAR SWAP - NEW YORK MERCANTILE EXCHANGE ;2010.03.30;   28324;    3208;    1083;    1028;   17189;   21243;   21425;   23354;    6899;    4970
RBOB CALENDAR SWAP - NEW YORK MERCANTILE EXCHANGE ;2010.03.23;   26290;    2705;     982;     217;   17011;   19646;   19933;   20845;    6357;    5445
RBOB CALENDAR SWAP - NEW YORK MERCANTILE EXCHANGE ;2010.03.16;   25692;    2618;     982;     217;   16445;   18433;   19280;   19632;    6412;    6060
RBOB CALENDAR SWAP - NEW YORK MERCANTILE EXCHANGE ;2010.03.09;   24085;    2390;     982;     304;   15428;   16914;   18122;   18200;    5963;    5885
RBOB CALENDAR SWAP - NEW YORK MERCANTILE EXCHANGE ;2010.03.02;   21034;    2015;       0;     304;   13478;   14967;   15797;   15271;    5237;    5763
RBOB CALENDAR SWAP - NEW YORK MERCANTILE EXCHANGE ;2010.02.23;   22678;    2268;       0;     304;   14581;   16117;   17153;   16421;    5525;    6257
RBOB CALENDAR SWAP - NEW YORK MERCANTILE EXCHANGE ;2010.02.16;   21528;    1807;       0;     316;   13775;   15605;   15898;   15921;    5630;    5607
RBOB CALENDAR SWAP - NEW YORK MERCANTILE EXCHANGE ;2010.02.09;   20512;    1720;       0;     316;   12662;   13758;   14698;   14074;    5814;    6438
RBOB CALENDAR SWAP - NEW YORK MERCANTILE EXCHANGE ;2010.02.02;   20254;     391;       0;     712;   12791;   13757;   13894;   14469;    6360;    5785
RBOB CALENDAR SWAP - NEW YORK MERCANTILE EXCHANGE ;2010.01.26;   23624;    1944;       0;     495;   15748;   16596;   18187;   17091;    5437;    6533
RBOB CALENDAR SWAP - NEW YORK MERCANTILE EXCHANGE ;2010.01.19;   23372;    1981;    1245;     495;   15767;   16169;   18243;   17909;    5129;    5463
RBOB CALENDAR SWAP - NEW YORK MERCANTILE EXCHANGE ;2010.01.12;   22454;    1404;       0;     495;   14837;   15376;   16736;   15871;    5718;    6583
RBOB CALENDAR SWAP - NEW YORK MERCANTILE EXCHANGE ;2010.01.05;   21379;    1374;       0;     495;   14330;   14979;   16199;   15474;    5180;    5905
RBOB CALENDAR SWAP - NEW YORK MERCANTILE EXCHANGE ;2009.12.29;   23263;    2093;       0;     663;   15570;   17283;   18326;   17946;    4937;    5317
RBOB CALENDAR SWAP - NEW YORK MERCANTILE EXCHANGE ;2009.12.22;   23089;    2093;       0;     663;   15396;   17146;   18152;   17809;    4937;    5280
RBOB CALENDAR SWAP - NEW YORK MERCANTILE EXCHANGE ;2009.12.15;   21986;     650;       0;     687;   14885;   16192;   16222;   16879;    5764;    5107
RBOB CALENDAR SWAP - NEW YORK MERCANTILE EXCHANGE ;2009.12.08;   21949;    1425;       0;     687;   14297;   15256;   16409;   15943;    5540;    6006
RBOB CALENDAR SWAP - NEW YORK MERCANTILE EXCHANGE ;2009.12.01;   21223;    1426;       0;     237;   13990;   15174;   15653;   15411;    5570;    5812
RBOB CALENDAR SWAP - NEW YORK MERCANTILE EXCHANGE ;2009.11.24;   23185;    1933;       0;     423;   15105;   16014;   17461;   16437;    5724;    6748
RBOB CALENDAR SWAP - NEW YORK MERCANTILE EXCHANGE ;2009.11.17;   23083;    1896;       0;     440;   15032;   16175;   17368;   16615;    5715;    6468
RBOB CALENDAR SWAP - NEW YORK MERCANTILE EXCHANGE ;2009.11.09;   22483;    1896;       0;     440;   14632;   15528;   16968;   15968;    5515;    6515
RBOB CALENDAR SWAP - NEW YORK MERCANTILE EXCHANGE ;2009.11.03;   22384;    1704;       0;     440;   15388;   16457;   17532;   16897;    4852;    5487
RBOB CALENDAR SWAP - NEW YORK MERCANTILE EXCHANGE ;2009.10.27;   25438;    1994;       0;     444;   17533;   19378;   19971;   19822;    5467;    5616
RBOB CALENDAR SWAP - NEW YORK MERCANTILE EXCHANGE ;2009.10.20;   23499;    1220;       0;     615;   15904;   16048;   17739;   16663;    5760;    6836
RBOB CALENDAR SWAP - NEW YORK MERCANTILE EXCHANGE ;2009.10.13;   21618;    1124;       0;     285;   14971;   14748;   16380;   15033;    5238;    6585
RBOB CALENDAR SWAP - NEW YORK MERCANTILE EXCHANGE ;2009.10.06;   20702;    1124;       0;     285;   14620;   14212;   16029;   14497;    4673;    6205
RBOB CALENDAR SWAP - NEW YORK MERCANTILE EXCHANGE ;2009.09.29;   22982;    1356;       0;     328;   16640;   18068;   18324;   18396;    4658;    4586
RBOB CALENDAR SWAP - NEW YORK MERCANTILE EXCHANGE ;2009.09.22;   22870;    1290;       0;     328;   16390;   17973;   18008;   18301;    4862;    4569
RBOB CALENDAR SWAP - NEW YORK MERCANTILE EXCHANGE ;2009.09.15;   20953;    1263;       0;     220;   14818;   16115;   16301;   16335;    4652;    4618
RBOB CALENDAR SWAP - NEW YORK MERCANTILE EXCHANGE ;2009.09.08;   20546;    1242;       0;     213;   14443;   15699;   15898;   15912;    4648;    4634
RBOB CALENDAR SWAP - NEW YORK MERCANTILE EXCHANGE ;2009.09.01;   20475;    1224;       0;     201;   14498;   15700;   15923;   15901;    4552;    4574
RBOB CALENDAR SWAP - NEW YORK MERCANTILE EXCHANGE ;2009.08.25;   23956;    1437;       0;     244;   17584;   19116;   19265;   19360;    4691;    4596
RBOB CALENDAR SWAP - NEW YORK MERCANTILE EXCHANGE ;2009.08.18;   21924;    1416;       0;     244;   14770;   16870;   16430;   17114;    5494;    4810
RBOB CALENDAR SWAP - NEW YORK MERCANTILE EXCHANGE ;2009.08.11;   21159;    1416;       0;     244;   13743;   16215;   15403;   16459;    5756;    4700
RBOB CALENDAR SWAP - NEW YORK MERCANTILE EXCHANGE ;2009.08.04;   20925;    1329;       0;     250;   13866;   16155;   15445;   16405;    5480;    4520
RBOB CALENDAR SWAP - NEW YORK MERCANTILE EXCHANGE ;2009.07.28;   23413;    1530;     167;     293;   15940;   18359;   17763;   18819;    5650;    4594
RBOB CALENDAR SWAP - NEW YORK MERCANTILE EXCHANGE ;2009.07.21;   23217;    1476;     167;     293;   16106;   18513;   17875;   18973;    5342;    4244
RBOB CALENDAR SWAP - NEW YORK MERCANTILE EXCHANGE ;2009.07.14;   22416;    1152;     167;     287;   15535;   17889;   16974;   18343;    5442;    4073
RBOB CALENDAR SWAP - NEW YORK MERCANTILE EXCHANGE ;2009.07.07;   21838;    2441;     167;     959;   12369;   16137;   15769;   17263;    6069;    4575
RBOB CALENDAR SWAP - NEW YORK MERCANTILE EXCHANGE ;2009.06.30;   20540;    1972;     167;     834;   11545;   15132;   14351;   16133;    6189;    4407
RBOB CALENDAR SWAP - NEW YORK MERCANTILE EXCHANGE ;2009.06.23;   23082;    1803;     167;     661;   13387;   17874;   15851;   18702;    7231;    4380
RBOB CALENDAR SWAP - NEW YORK MERCANTILE EXCHANGE ;2009.05.26;   20994;     746;       0;    1077;   12947;   13934;   14770;   15011;    6224;    5983
RBOB CALENDAR SWAP - NEW YORK MERCANTILE EXCHANGE ;2009.04.28;   21802;       0;    1182;     429;   16013;   14259;   16442;   15870;    5360;    5932
RBOB CALENDAR SWAP - NEW YORK MERCANTILE EXCHANGE ;2009.04.21;   21509;       0;     906;     639;   16205;   14109;   16844;   15654;    4665;    5855
RBOB CALENDAR SWAP - NEW YORK MERCANTILE EXCHANGE ;2009.01.27;   17860;       0;     687;      81;   12633;   12647;   12714;   13415;    5146;    4445
RBOB CALENDAR SWAP - NEW YORK MERCANTILE EXCHANGE ;2009.01.20;   17471;       0;     632;      96;   11987;   12485;   12083;   13213;    5388;    4258
RBOB CALENDAR SWAP - NEW YORK MERCANTILE EXCHANGE ;2009.01.13;   16616;       0;       0;       0;   11718;   11699;   11718;   11699;    4898;    4917
RBOB CALENDAR SWAP - NEW YORK MERCANTILE EXCHANGE ;2008.12.30;   17733;     410;       0;     157;   12301;   12460;   12868;   12617;    4865;    5116
RBOB CALENDAR SWAP - NEW YORK MERCANTILE EXCHANGE ;2008.12.22;   17783;     410;       0;     157;   12042;   12579;   12609;   12736;    5174;    5047
RBOB CALENDAR SWAP - NEW YORK MERCANTILE EXCHANGE ;2008.12.16;   17708;     590;       0;      70;   11898;   11715;   12558;   11785;    5150;    5923
RBOB CALENDAR SWAP - NEW YORK MERCANTILE EXCHANGE ;2011.07.12;   26253;    9454;     261;     678;   10692;   20924;   20824;   21863;    5429;    4390
