NW EUR HI LO FUEL OIL SPR SWAP - NEW YORK MERCANTILE EXCHANGE ;2009.11.17;    5378;      76;       0;      80;    3767;    3709;    3923;    3789;    1455;    1589
NW EUR HI LO FUEL OIL SPR SWAP - NEW YORK MERCANTILE EXCHANGE ;2009.11.09;    5281;      61;       0;      80;    3672;    3647;    3813;    3727;    1468;    1554
NW EUR HI LO FUEL OIL SPR SWAP - NEW YORK MERCANTILE EXCHANGE ;2009.10.27;    5840;      58;       0;      83;    4226;    4416;    4367;    4499;    1473;    1341
NW EUR HI LO FUEL OIL SPR SWAP - NEW YORK MERCANTILE EXCHANGE ;2009.09.29;    6140;     115;       0;      83;    4718;    4874;    4916;    4957;    1224;    1183
NW EUR HI LO FUEL OIL SPR SWAP - NEW YORK MERCANTILE EXCHANGE ;2009.09.22;    6063;     115;       0;      83;    4712;    4818;    4910;    4901;    1153;    1162
NW EUR HI LO FUEL OIL SPR SWAP - NEW YORK MERCANTILE EXCHANGE ;2009.09.15;    5952;     115;       0;      83;    4501;    4699;    4699;    4782;    1253;    1170
NW EUR HI LO FUEL OIL SPR SWAP - NEW YORK MERCANTILE EXCHANGE ;2009.09.08;    5922;     115;       0;      83;    4464;    4695;    4662;    4778;    1260;    1144
NW EUR HI LO FUEL OIL SPR SWAP - NEW YORK MERCANTILE EXCHANGE ;2009.09.01;    6327;     127;       0;      83;    4620;    4995;    4830;    5078;    1497;    1249
NW EUR HI LO FUEL OIL SPR SWAP - NEW YORK MERCANTILE EXCHANGE ;2009.08.25;    6292;      97;       0;     113;    4595;    4935;    4805;    5048;    1487;    1244
NW EUR HI LO FUEL OIL SPR SWAP - NEW YORK MERCANTILE EXCHANGE ;2009.06.09;    6228;      87;       0;      90;    4513;    5261;    4690;    5351;    1538;     877
NW EUR HI LO FUEL OIL SPR SWAP - NEW YORK MERCANTILE EXCHANGE ;2009.05.26;    6321;      44;       0;     133;    4402;    5153;    4579;    5286;    1742;    1035
NW EUR HI LO FUEL OIL SPR SWAP - NEW YORK MERCANTILE EXCHANGE ;2009.05.19;    6314;      44;       0;     133;    4383;    5149;    4560;    5282;    1754;    1032
NW EUR HI LO FUEL OIL SPR SWAP - NEW YORK MERCANTILE EXCHANGE ;2009.04.28;    6511;     199;      64;     177;    4402;    5053;    4778;    5294;    1733;    1217
NW EUR HI LO FUEL OIL SPR SWAP - NEW YORK MERCANTILE EXCHANGE ;2009.04.21;    6357;     199;      79;     177;    4277;    4948;    4653;    5204;    1704;    1153
NW EUR HI LO FUEL OIL SPR SWAP - NEW YORK MERCANTILE EXCHANGE ;2009.04.14;    6330;     170;      40;     216;    4475;    4933;    4861;    5189;    1469;    1141
NW EUR HI LO FUEL OIL SPR SWAP - NEW YORK MERCANTILE EXCHANGE ;2009.04.07;    6223;     170;      40;     216;    4271;    4758;    4657;    5014;    1566;    1209
NW EUR HI LO FUEL OIL SPR SWAP - NEW YORK MERCANTILE EXCHANGE ;2009.03.31;    6726;     175;     173;     216;    4924;    5387;    5315;    5776;    1411;     950
NW EUR HI LO FUEL OIL SPR SWAP - NEW YORK MERCANTILE EXCHANGE ;2009.03.24;    6161;     165;     293;      96;    4650;    4956;    4911;    5345;    1250;     816
NW EUR HI LO FUEL OIL SPR SWAP - NEW YORK MERCANTILE EXCHANGE ;2009.03.17;    5916;     120;     224;     174;    4418;    4691;    4712;    5089;    1204;     827
NW EUR HI LO FUEL OIL SPR SWAP - NEW YORK MERCANTILE EXCHANGE ;2009.03.10;    5766;     120;     254;      84;    4348;    4641;    4552;    4979;    1214;     787
NW EUR HI LO FUEL OIL SPR SWAP - NEW YORK MERCANTILE EXCHANGE ;2009.03.03;    5604;     120;     254;      84;    4126;    4413;    4330;    4751;    1274;     853
NW EUR HI LO FUEL OIL SPR SWAP - NEW YORK MERCANTILE EXCHANGE ;2009.02.24;    5940;     115;     347;      89;    4673;    4842;    4877;    5278;    1063;     662
NW EUR HI LO FUEL OIL SPR SWAP - NEW YORK MERCANTILE EXCHANGE ;2009.02.17;    5823;       0;     342;      66;    4569;    4639;    4635;    5047;    1188;     776
NW EUR HI LO FUEL OIL SPR SWAP - NEW YORK MERCANTILE EXCHANGE ;2009.02.10;    5584;       0;     342;      66;    4338;    4380;    4404;    4788;    1180;     796
NW EUR HI LO FUEL OIL SPR SWAP - NEW YORK MERCANTILE EXCHANGE ;2009.02.03;    5344;       0;     352;      66;    4028;    4036;    4094;    4454;    1250;     890
NW EUR HI LO FUEL OIL SPR SWAP - NEW YORK MERCANTILE EXCHANGE ;2009.01.27;    5626;       0;     385;      66;    4240;    4309;    4306;    4760;    1320;     866
NW EUR HI LO FUEL OIL SPR SWAP - NEW YORK MERCANTILE EXCHANGE ;2009.01.20;    5401;       0;     278;       0;    4077;    4259;    4077;    4537;    1324;     864
NW EUR HI LO FUEL OIL SPR SWAP - NEW YORK MERCANTILE EXCHANGE ;2009.01.13;    5110;       0;     248;       0;    3867;    4028;    3867;    4276;    1243;     834
NW EUR HI LO FUEL OIL SPR SWAP - NEW YORK MERCANTILE EXCHANGE ;2009.01.06;    4732;       0;     298;       0;    3706;    3846;    3706;    4144;    1026;     588
NW EUR HI LO FUEL OIL SPR SWAP - NEW YORK MERCANTILE EXCHANGE ;2008.12.30;    5113;       0;     264;       0;    4215;    4268;    4215;    4532;     898;     581
NW EUR HI LO FUEL OIL SPR SWAP - NEW YORK MERCANTILE EXCHANGE ;2008.12.22;    5044;       0;     269;       0;    4140;    4220;    4140;    4489;     904;     555
NW EUR HI LO FUEL OIL SPR SWAP - NEW YORK MERCANTILE EXCHANGE ;2008.12.16;    4914;       0;     259;       0;    3993;    3965;    3993;    4224;     921;     690
NW EUR HI LO FUEL OIL SPR SWAP - NEW YORK MERCANTILE EXCHANGE ;2008.12.09;    4652;       0;     259;       0;    3738;    3723;    3738;    3982;     914;     670
NW EUR HI LO FUEL OIL SPR SWAP - NEW YORK MERCANTILE EXCHANGE ;2008.12.02;    4186;       0;     219;       0;    3337;    3225;    3337;    3444;     849;     742
NW EUR HI LO FUEL OIL SPR SWAP - NEW YORK MERCANTILE EXCHANGE ;2008.11.25;    4120;       0;     199;       0;    3234;    3087;    3234;    3286;     886;     834
NW EUR HI LO FUEL OIL SPR SWAP - NEW YORK MERCANTILE EXCHANGE ;2008.11.18;    4112;       0;     169;       0;    3110;    3031;    3110;    3200;    1002;     912
NW EUR HI LO FUEL OIL SPR SWAP - NEW YORK MERCANTILE EXCHANGE ;2008.10.28;    3655;      30;      77;       0;    2492;    2945;    2522;    3022;    1133;     633
NW EUR HI LO FUEL OIL SPR SWAP - NEW YORK MERCANTILE EXCHANGE ;2009.11.17;    5378;      76;       0;      80;    3767;    3709;    3923;    3789;    1455;    1589
NW EUR HI LO FUEL OIL SPR SWAP - NEW YORK MERCANTILE EXCHANGE ;2009.11.09;    5281;      61;       0;      80;    3672;    3647;    3813;    3727;    1468;    1554
NW EUR HI LO FUEL OIL SPR SWAP - NEW YORK MERCANTILE EXCHANGE ;2009.10.27;    5840;      58;       0;      83;    4226;    4416;    4367;    4499;    1473;    1341
NW EUR HI LO FUEL OIL SPR SWAP - NEW YORK MERCANTILE EXCHANGE ;2009.09.29;    6140;     115;       0;      83;    4718;    4874;    4916;    4957;    1224;    1183
NW EUR HI LO FUEL OIL SPR SWAP - NEW YORK MERCANTILE EXCHANGE ;2009.09.22;    6063;     115;       0;      83;    4712;    4818;    4910;    4901;    1153;    1162
NW EUR HI LO FUEL OIL SPR SWAP - NEW YORK MERCANTILE EXCHANGE ;2009.09.15;    5952;     115;       0;      83;    4501;    4699;    4699;    4782;    1253;    1170
NW EUR HI LO FUEL OIL SPR SWAP - NEW YORK MERCANTILE EXCHANGE ;2009.09.08;    5922;     115;       0;      83;    4464;    4695;    4662;    4778;    1260;    1144
NW EUR HI LO FUEL OIL SPR SWAP - NEW YORK MERCANTILE EXCHANGE ;2009.09.01;    6327;     127;       0;      83;    4620;    4995;    4830;    5078;    1497;    1249
NW EUR HI LO FUEL OIL SPR SWAP - NEW YORK MERCANTILE EXCHANGE ;2009.08.25;    6292;      97;       0;     113;    4595;    4935;    4805;    5048;    1487;    1244
NW EUR HI LO FUEL OIL SPR SWAP - NEW YORK MERCANTILE EXCHANGE ;2009.06.09;    6228;      87;       0;      90;    4513;    5261;    4690;    5351;    1538;     877
NW EUR HI LO FUEL OIL SPR SWAP - NEW YORK MERCANTILE EXCHANGE ;2009.05.26;    6321;      44;       0;     133;    4402;    5153;    4579;    5286;    1742;    1035
NW EUR HI LO FUEL OIL SPR SWAP - NEW YORK MERCANTILE EXCHANGE ;2009.05.19;    6314;      44;       0;     133;    4383;    5149;    4560;    5282;    1754;    1032
NW EUR HI LO FUEL OIL SPR SWAP - NEW YORK MERCANTILE EXCHANGE ;2009.04.28;    6511;     199;      64;     177;    4402;    5053;    4778;    5294;    1733;    1217
NW EUR HI LO FUEL OIL SPR SWAP - NEW YORK MERCANTILE EXCHANGE ;2009.04.21;    6357;     199;      79;     177;    4277;    4948;    4653;    5204;    1704;    1153
NW EUR HI LO FUEL OIL SPR SWAP - NEW YORK MERCANTILE EXCHANGE ;2009.04.14;    6330;     170;      40;     216;    4475;    4933;    4861;    5189;    1469;    1141
NW EUR HI LO FUEL OIL SPR SWAP - NEW YORK MERCANTILE EXCHANGE ;2009.04.07;    6223;     170;      40;     216;    4271;    4758;    4657;    5014;    1566;    1209
NW EUR HI LO FUEL OIL SPR SWAP - NEW YORK MERCANTILE EXCHANGE ;2009.03.31;    6726;     175;     173;     216;    4924;    5387;    5315;    5776;    1411;     950
NW EUR HI LO FUEL OIL SPR SWAP - NEW YORK MERCANTILE EXCHANGE ;2009.03.24;    6161;     165;     293;      96;    4650;    4956;    4911;    5345;    1250;     816
NW EUR HI LO FUEL OIL SPR SWAP - NEW YORK MERCANTILE EXCHANGE ;2009.03.17;    5916;     120;     224;     174;    4418;    4691;    4712;    5089;    1204;     827
NW EUR HI LO FUEL OIL SPR SWAP - NEW YORK MERCANTILE EXCHANGE ;2009.03.10;    5766;     120;     254;      84;    4348;    4641;    4552;    4979;    1214;     787
NW EUR HI LO FUEL OIL SPR SWAP - NEW YORK MERCANTILE EXCHANGE ;2009.03.03;    5604;     120;     254;      84;    4126;    4413;    4330;    4751;    1274;     853
NW EUR HI LO FUEL OIL SPR SWAP - NEW YORK MERCANTILE EXCHANGE ;2009.02.24;    5940;     115;     347;      89;    4673;    4842;    4877;    5278;    1063;     662
NW EUR HI LO FUEL OIL SPR SWAP - NEW YORK MERCANTILE EXCHANGE ;2009.02.17;    5823;       0;     342;      66;    4569;    4639;    4635;    5047;    1188;     776
NW EUR HI LO FUEL OIL SPR SWAP - NEW YORK MERCANTILE EXCHANGE ;2009.02.10;    5584;       0;     342;      66;    4338;    4380;    4404;    4788;    1180;     796
NW EUR HI LO FUEL OIL SPR SWAP - NEW YORK MERCANTILE EXCHANGE ;2009.02.03;    5344;       0;     352;      66;    4028;    4036;    4094;    4454;    1250;     890
NW EUR HI LO FUEL OIL SPR SWAP - NEW YORK MERCANTILE EXCHANGE ;2009.01.27;    5626;       0;     385;      66;    4240;    4309;    4306;    4760;    1320;     866
NW EUR HI LO FUEL OIL SPR SWAP - NEW YORK MERCANTILE EXCHANGE ;2009.01.20;    5401;       0;     278;       0;    4077;    4259;    4077;    4537;    1324;     864
NW EUR HI LO FUEL OIL SPR SWAP - NEW YORK MERCANTILE EXCHANGE ;2009.01.13;    5110;       0;     248;       0;    3867;    4028;    3867;    4276;    1243;     834
NW EUR HI LO FUEL OIL SPR SWAP - NEW YORK MERCANTILE EXCHANGE ;2009.01.06;    4732;       0;     298;       0;    3706;    3846;    3706;    4144;    1026;     588
NW EUR HI LO FUEL OIL SPR SWAP - NEW YORK MERCANTILE EXCHANGE ;2008.12.30;    5113;       0;     264;       0;    4215;    4268;    4215;    4532;     898;     581
NW EUR HI LO FUEL OIL SPR SWAP - NEW YORK MERCANTILE EXCHANGE ;2008.12.22;    5044;       0;     269;       0;    4140;    4220;    4140;    4489;     904;     555
NW EUR HI LO FUEL OIL SPR SWAP - NEW YORK MERCANTILE EXCHANGE ;2008.12.16;    4914;       0;     259;       0;    3993;    3965;    3993;    4224;     921;     690
NW EUR HI LO FUEL OIL SPR SWAP - NEW YORK MERCANTILE EXCHANGE ;2008.12.09;    4652;       0;     259;       0;    3738;    3723;    3738;    3982;     914;     670
NW EUR HI LO FUEL OIL SPR SWAP - NEW YORK MERCANTILE EXCHANGE ;2008.12.02;    4186;       0;     219;       0;    3337;    3225;    3337;    3444;     849;     742
NW EUR HI LO FUEL OIL SPR SWAP - NEW YORK MERCANTILE EXCHANGE ;2008.11.25;    4120;       0;     199;       0;    3234;    3087;    3234;    3286;     886;     834
NW EUR HI LO FUEL OIL SPR SWAP - NEW YORK MERCANTILE EXCHANGE ;2008.11.18;    4112;       0;     169;       0;    3110;    3031;    3110;    3200;    1002;     912
NW EUR HI LO FUEL OIL SPR SWAP - NEW YORK MERCANTILE EXCHANGE ;2008.10.28;    3655;      30;      77;       0;    2492;    2945;    2522;    3022;    1133;     633
NW EUR HI LO FUEL OIL SPR SWAP - NEW YORK MERCANTILE EXCHANGE ;2009.11.17;    5378;      76;       0;      80;    3767;    3709;    3923;    3789;    1455;    1589
NW EUR HI LO FUEL OIL SPR SWAP - NEW YORK MERCANTILE EXCHANGE ;2009.11.09;    5281;      61;       0;      80;    3672;    3647;    3813;    3727;    1468;    1554
NW EUR HI LO FUEL OIL SPR SWAP - NEW YORK MERCANTILE EXCHANGE ;2009.10.27;    5840;      58;       0;      83;    4226;    4416;    4367;    4499;    1473;    1341
NW EUR HI LO FUEL OIL SPR SWAP - NEW YORK MERCANTILE EXCHANGE ;2009.09.29;    6140;     115;       0;      83;    4718;    4874;    4916;    4957;    1224;    1183
NW EUR HI LO FUEL OIL SPR SWAP - NEW YORK MERCANTILE EXCHANGE ;2009.09.22;    6063;     115;       0;      83;    4712;    4818;    4910;    4901;    1153;    1162
NW EUR HI LO FUEL OIL SPR SWAP - NEW YORK MERCANTILE EXCHANGE ;2009.09.15;    5952;     115;       0;      83;    4501;    4699;    4699;    4782;    1253;    1170
NW EUR HI LO FUEL OIL SPR SWAP - NEW YORK MERCANTILE EXCHANGE ;2009.09.08;    5922;     115;       0;      83;    4464;    4695;    4662;    4778;    1260;    1144
NW EUR HI LO FUEL OIL SPR SWAP - NEW YORK MERCANTILE EXCHANGE ;2009.09.01;    6327;     127;       0;      83;    4620;    4995;    4830;    5078;    1497;    1249
NW EUR HI LO FUEL OIL SPR SWAP - NEW YORK MERCANTILE EXCHANGE ;2009.08.25;    6292;      97;       0;     113;    4595;    4935;    4805;    5048;    1487;    1244
NW EUR HI LO FUEL OIL SPR SWAP - NEW YORK MERCANTILE EXCHANGE ;2009.06.09;    6228;      87;       0;      90;    4513;    5261;    4690;    5351;    1538;     877
NW EUR HI LO FUEL OIL SPR SWAP - NEW YORK MERCANTILE EXCHANGE ;2009.05.26;    6321;      44;       0;     133;    4402;    5153;    4579;    5286;    1742;    1035
NW EUR HI LO FUEL OIL SPR SWAP - NEW YORK MERCANTILE EXCHANGE ;2009.05.19;    6314;      44;       0;     133;    4383;    5149;    4560;    5282;    1754;    1032
NW EUR HI LO FUEL OIL SPR SWAP - NEW YORK MERCANTILE EXCHANGE ;2009.04.28;    6511;     199;      64;     177;    4402;    5053;    4778;    5294;    1733;    1217
NW EUR HI LO FUEL OIL SPR SWAP - NEW YORK MERCANTILE EXCHANGE ;2009.04.21;    6357;     199;      79;     177;    4277;    4948;    4653;    5204;    1704;    1153
NW EUR HI LO FUEL OIL SPR SWAP - NEW YORK MERCANTILE EXCHANGE ;2009.04.14;    6330;     170;      40;     216;    4475;    4933;    4861;    5189;    1469;    1141
NW EUR HI LO FUEL OIL SPR SWAP - NEW YORK MERCANTILE EXCHANGE ;2009.04.07;    6223;     170;      40;     216;    4271;    4758;    4657;    5014;    1566;    1209
NW EUR HI LO FUEL OIL SPR SWAP - NEW YORK MERCANTILE EXCHANGE ;2009.03.31;    6726;     175;     173;     216;    4924;    5387;    5315;    5776;    1411;     950
NW EUR HI LO FUEL OIL SPR SWAP - NEW YORK MERCANTILE EXCHANGE ;2009.03.24;    6161;     165;     293;      96;    4650;    4956;    4911;    5345;    1250;     816
NW EUR HI LO FUEL OIL SPR SWAP - NEW YORK MERCANTILE EXCHANGE ;2009.03.17;    5916;     120;     224;     174;    4418;    4691;    4712;    5089;    1204;     827
NW EUR HI LO FUEL OIL SPR SWAP - NEW YORK MERCANTILE EXCHANGE ;2009.03.10;    5766;     120;     254;      84;    4348;    4641;    4552;    4979;    1214;     787
NW EUR HI LO FUEL OIL SPR SWAP - NEW YORK MERCANTILE EXCHANGE ;2009.03.03;    5604;     120;     254;      84;    4126;    4413;    4330;    4751;    1274;     853
NW EUR HI LO FUEL OIL SPR SWAP - NEW YORK MERCANTILE EXCHANGE ;2009.02.24;    5940;     115;     347;      89;    4673;    4842;    4877;    5278;    1063;     662
NW EUR HI LO FUEL OIL SPR SWAP - NEW YORK MERCANTILE EXCHANGE ;2009.02.17;    5823;       0;     342;      66;    4569;    4639;    4635;    5047;    1188;     776
NW EUR HI LO FUEL OIL SPR SWAP - NEW YORK MERCANTILE EXCHANGE ;2009.02.10;    5584;       0;     342;      66;    4338;    4380;    4404;    4788;    1180;     796
NW EUR HI LO FUEL OIL SPR SWAP - NEW YORK MERCANTILE EXCHANGE ;2009.02.03;    5344;       0;     352;      66;    4028;    4036;    4094;    4454;    1250;     890
NW EUR HI LO FUEL OIL SPR SWAP - NEW YORK MERCANTILE EXCHANGE ;2009.01.27;    5626;       0;     385;      66;    4240;    4309;    4306;    4760;    1320;     866
NW EUR HI LO FUEL OIL SPR SWAP - NEW YORK MERCANTILE EXCHANGE ;2009.01.20;    5401;       0;     278;       0;    4077;    4259;    4077;    4537;    1324;     864
NW EUR HI LO FUEL OIL SPR SWAP - NEW YORK MERCANTILE EXCHANGE ;2009.01.13;    5110;       0;     248;       0;    3867;    4028;    3867;    4276;    1243;     834
NW EUR HI LO FUEL OIL SPR SWAP - NEW YORK MERCANTILE EXCHANGE ;2009.01.06;    4732;       0;     298;       0;    3706;    3846;    3706;    4144;    1026;     588
NW EUR HI LO FUEL OIL SPR SWAP - NEW YORK MERCANTILE EXCHANGE ;2008.12.30;    5113;       0;     264;       0;    4215;    4268;    4215;    4532;     898;     581
NW EUR HI LO FUEL OIL SPR SWAP - NEW YORK MERCANTILE EXCHANGE ;2008.12.22;    5044;       0;     269;       0;    4140;    4220;    4140;    4489;     904;     555
NW EUR HI LO FUEL OIL SPR SWAP - NEW YORK MERCANTILE EXCHANGE ;2008.12.16;    4914;       0;     259;       0;    3993;    3965;    3993;    4224;     921;     690
NW EUR HI LO FUEL OIL SPR SWAP - NEW YORK MERCANTILE EXCHANGE ;2008.12.09;    4652;       0;     259;       0;    3738;    3723;    3738;    3982;     914;     670
NW EUR HI LO FUEL OIL SPR SWAP - NEW YORK MERCANTILE EXCHANGE ;2008.12.02;    4186;       0;     219;       0;    3337;    3225;    3337;    3444;     849;     742
NW EUR HI LO FUEL OIL SPR SWAP - NEW YORK MERCANTILE EXCHANGE ;2008.11.25;    4120;       0;     199;       0;    3234;    3087;    3234;    3286;     886;     834
NW EUR HI LO FUEL OIL SPR SWAP - NEW YORK MERCANTILE EXCHANGE ;2008.11.18;    4112;       0;     169;       0;    3110;    3031;    3110;    3200;    1002;     912
NW EUR HI LO FUEL OIL SPR SWAP - NEW YORK MERCANTILE EXCHANGE ;2008.10.28;    3655;      30;      77;       0;    2492;    2945;    2522;    3022;    1133;     633
