10-YEAR U.S. TREASURY NOTES - CBT 10-YR US T-NOTES ;1995.04.11;  356785;   15381;   17282;   36102;  251079;  242893;  302562;  296278;   54223;   60507
10-YEAR U.S. TREASURY NOTES - CBT 10-YR US T-NOTES ;1995.04.04;  340447;   14348;   13613;   32500;  240384;  234331;  287231;  280444;   53215;   60003
10-YEAR U.S. TREASURY NOTES - CBT 10-YR US T-NOTES ;1995.03.28;  336278;   12975;   16214;   30860;  243943;  223737;  287778;  270812;   48500;   65466
10-YEAR U.S. TREASURY NOTES - CBT 10-YR US T-NOTES ;1995.03.21;  356518;   15529;   15531;   33601;  256510;  239315;  305640;  288447;   50878;   68071
10-YEAR U.S. TREASURY NOTES - CBT 10-YR US T-NOTES ;1995.04.11;  356785;   15381;   17282;   36102;  251079;  242893;  302562;  296278;   54223;   60507
10-YEAR U.S. TREASURY NOTES - CBT 10-YR US T-NOTES ;1995.04.04;  340447;   14348;   13613;   32500;  240384;  234331;  287231;  280444;   53215;   60003
10-YEAR U.S. TREASURY NOTES - CBT 10-YR US T-NOTES ;1995.03.28;  336278;   12975;   16214;   30860;  243943;  223737;  287778;  270812;   48500;   65466
10-YEAR U.S. TREASURY NOTES - CBT 10-YR US T-NOTES ;1995.03.21;  356518;   15529;   15531;   33601;  256510;  239315;  305640;  288447;   50878;   68071
10-YEAR U.S. TREASURY NOTES - CBT 10-YR US T-NOTES ;1995.04.11;  356785;   15381;   17282;   36102;  251079;  242893;  302562;  296278;   54223;   60507
10-YEAR U.S. TREASURY NOTES - CBT 10-YR US T-NOTES ;1995.04.04;  340447;   14348;   13613;   32500;  240384;  234331;  287231;  280444;   53215;   60003
10-YEAR U.S. TREASURY NOTES - CBT 10-YR US T-NOTES ;1995.03.28;  336278;   12975;   16214;   30860;  243943;  223737;  287778;  270812;   48500;   65466
10-YEAR U.S. TREASURY NOTES - CBT 10-YR US T-NOTES ;1995.03.21;  356518;   15529;   15531;   33601;  256510;  239315;  305640;  288447;   50878;   68071
