TEN-YEAR AGENCY NOTE - CHICAGO BOARD OF TRADE ;2003.09.02;    4618;       0;     251;       0;    4505;    4314;    4505;    4565;     113;      53
TEN-YEAR AGENCY NOTE - CHICAGO BOARD OF TRADE ;2003.08.26;    3883;       0;     384;       0;    3779;    3432;    3779;    3816;     104;      67
TEN-YEAR AGENCY NOTE - CHICAGO BOARD OF TRADE ;2003.08.19;    3981;       0;     439;       0;    3873;    3462;    3873;    3901;     108;      80
TEN-YEAR AGENCY NOTE - CHICAGO BOARD OF TRADE ;2003.08.12;    3900;       0;     409;       0;    3796;    3362;    3796;    3771;     104;     129
TEN-YEAR AGENCY NOTE - CHICAGO BOARD OF TRADE ;2003.08.05;    4036;       0;     565;       0;    3931;    3397;    3931;    3962;     105;      74
TEN-YEAR AGENCY NOTE - CHICAGO BOARD OF TRADE ;2003.07.29;    4209;      25;     635;       0;    4073;    3486;    4098;    4121;     111;      88
TEN-YEAR AGENCY NOTE - CHICAGO BOARD OF TRADE ;2003.07.22;    4303;       0;     665;       0;    4192;    3527;    4192;    4192;     111;     111
TEN-YEAR AGENCY NOTE - CHICAGO BOARD OF TRADE ;2003.07.01;    4756;      50;     520;       0;    4563;    4184;    4613;    4704;     143;      52
TEN-YEAR AGENCY NOTE - CHICAGO BOARD OF TRADE ;2003.06.24;    6817;     106;     625;       0;    6552;    6133;    6658;    6758;     159;      59
TEN-YEAR AGENCY NOTE - CHICAGO BOARD OF TRADE ;2003.06.03;    5180;     152;     611;       0;    4907;    4546;    5059;    5157;     121;      23
TEN-YEAR AGENCY NOTE - CHICAGO BOARD OF TRADE ;2003.05.27;    4999;     130;     261;       0;    4750;    4723;    4880;    4984;     119;      15
TEN-YEAR AGENCY NOTE - CHICAGO BOARD OF TRADE ;2003.05.20;    5581;     130;     261;       0;    5335;    5305;    5465;    5566;     116;      15
TEN-YEAR AGENCY NOTE - CHICAGO BOARD OF TRADE ;2003.05.13;    5599;     115;     326;       0;    5368;    5255;    5483;    5581;     116;      18
TEN-YEAR AGENCY NOTE - CHICAGO BOARD OF TRADE ;2003.05.06;    5609;      85;     326;       0;    5402;    5252;    5487;    5578;     122;      31
TEN-YEAR AGENCY NOTE - CHICAGO BOARD OF TRADE ;2003.04.29;    5626;      78;     326;       0;    5441;    5272;    5519;    5598;     107;      28
TEN-YEAR AGENCY NOTE - CHICAGO BOARD OF TRADE ;2003.04.22;    5598;      78;     276;       0;    5399;    5292;    5477;    5568;     121;      30
TEN-YEAR AGENCY NOTE - CHICAGO BOARD OF TRADE ;2003.04.15;    5891;      32;     276;       0;    5698;    5582;    5730;    5858;     161;      33
TEN-YEAR AGENCY NOTE - CHICAGO BOARD OF TRADE ;2003.04.08;    5826;     163;      40;      61;    5472;    5690;    5696;    5791;     130;      35
TEN-YEAR AGENCY NOTE - CHICAGO BOARD OF TRADE ;2003.04.01;    5916;     182;     340;      61;    5540;    5487;    5783;    5888;     133;      28
TEN-YEAR AGENCY NOTE - CHICAGO BOARD OF TRADE ;2003.03.25;    6025;     104;     390;      61;    5720;    5521;    5885;    5972;     140;      53
TEN-YEAR AGENCY NOTE - CHICAGO BOARD OF TRADE ;2003.03.18;    6228;     321;     540;      61;    5708;    5571;    6090;    6172;     138;      56
TEN-YEAR AGENCY NOTE - CHICAGO BOARD OF TRADE ;2003.03.11;    7037;     352;     240;      61;    6477;    6599;    6890;    6900;     147;     137
TEN-YEAR AGENCY NOTE - CHICAGO BOARD OF TRADE ;2003.03.04;    7672;     350;     330;      61;    7096;    7176;    7507;    7567;     165;     105
TEN-YEAR AGENCY NOTE - CHICAGO BOARD OF TRADE ;2003.02.25;    7191;     360;     130;      61;    6597;    6876;    7018;    7067;     173;     124
TEN-YEAR AGENCY NOTE - CHICAGO BOARD OF TRADE ;2003.02.18;    8087;     270;     168;      61;    7586;    7742;    7917;    7971;     170;     116
TEN-YEAR AGENCY NOTE - CHICAGO BOARD OF TRADE ;2003.02.11;    8953;     162;      25;      61;    8542;    8772;    8765;    8858;     188;      95
TEN-YEAR AGENCY NOTE - CHICAGO BOARD OF TRADE ;2003.02.04;    9901;     168;      25;      61;    9501;    9707;    9730;    9793;     171;     108
TEN-YEAR AGENCY NOTE - CHICAGO BOARD OF TRADE ;2003.01.28;    9970;     170;      25;      61;    9553;    9807;    9784;    9893;     186;      77
TEN-YEAR AGENCY NOTE - CHICAGO BOARD OF TRADE ;2003.01.21;   10173;     295;      25;      61;    9618;   10011;    9974;   10097;     199;      76
TEN-YEAR AGENCY NOTE - CHICAGO BOARD OF TRADE ;2003.01.14;   10821;     192;      25;      61;   10333;   10664;   10586;   10750;     235;      71
TEN-YEAR AGENCY NOTE - CHICAGO BOARD OF TRADE ;2003.01.07;   10933;     352;     153;      61;   10333;   10639;   10746;   10853;     187;      80
TEN-YEAR AGENCY NOTE - CHICAGO BOARD OF TRADE ;2002.12.31;   11252;     470;     198;      61;   10558;   10907;   11089;   11166;     163;      86
TEN-YEAR AGENCY NOTE - CHICAGO BOARD OF TRADE ;2002.12.23;   11286;     449;     446;      54;   10621;   10687;   11124;   11187;     162;      99
TEN-YEAR AGENCY NOTE - CHICAGO BOARD OF TRADE ;2002.12.17;   11041;     285;     435;      54;   10560;   10477;   10899;   10966;     142;      75
TEN-YEAR AGENCY NOTE - CHICAGO BOARD OF TRADE ;2002.12.10;   17314;     363;     159;      88;   16736;   16977;   17187;   17224;     127;      90
TEN-YEAR AGENCY NOTE - CHICAGO BOARD OF TRADE ;2002.12.03;   14764;     376;     356;       6;   14235;   14214;   14617;   14576;     147;     188
TEN-YEAR AGENCY NOTE - CHICAGO BOARD OF TRADE ;2002.11.26;   12573;     502;     221;       0;   12040;   12175;   12542;   12396;      31;     177
TEN-YEAR AGENCY NOTE - CHICAGO BOARD OF TRADE ;2002.11.19;   13986;     108;     266;      24;   13659;   13531;   13791;   13821;     195;     165
TEN-YEAR AGENCY NOTE - CHICAGO BOARD OF TRADE ;2002.11.12;   14349;     170;     622;       0;   14008;   13531;   14178;   14153;     171;     196
TEN-YEAR AGENCY NOTE - CHICAGO BOARD OF TRADE ;2002.11.05;   15566;      83;     775;       0;   15279;   14627;   15362;   15402;     204;     164
TEN-YEAR AGENCY NOTE - CHICAGO BOARD OF TRADE ;2002.10.29;   15573;     170;     624;       0;   15223;   14787;   15393;   15411;     180;     162
TEN-YEAR AGENCY NOTE - CHICAGO BOARD OF TRADE ;2002.10.22;   15743;     205;     624;       0;   15323;   14985;   15528;   15609;     215;     134
TEN-YEAR AGENCY NOTE - CHICAGO BOARD OF TRADE ;2002.10.15;   16838;     741;     693;       0;   15874;   16018;   16615;   16711;     223;     127
TEN-YEAR AGENCY NOTE - CHICAGO BOARD OF TRADE ;2002.10.08;   16943;    1002;     743;       0;   15686;   16063;   16688;   16806;     255;     137
TEN-YEAR AGENCY NOTE - CHICAGO BOARD OF TRADE ;2002.10.01;   17171;     904;     743;       0;   16007;   16289;   16911;   17032;     260;     139
TEN-YEAR AGENCY NOTE - CHICAGO BOARD OF TRADE ;2002.09.24;   18526;    1754;     830;       0;   16501;   17582;   18255;   18412;     271;     114
TEN-YEAR AGENCY NOTE - CHICAGO BOARD OF TRADE ;2002.09.17;   18128;    1128;     979;     200;   16412;   16742;   17740;   17921;     388;     207
TEN-YEAR AGENCY NOTE - CHICAGO BOARD OF TRADE ;2002.09.10;   17996;    1151;    1384;     250;   16366;   16201;   17767;   17835;     229;     161
TEN-YEAR AGENCY NOTE - CHICAGO BOARD OF TRADE ;2002.09.03;   18240;    1463;    1093;      61;   16425;   16866;   17949;   18020;     291;     220
TEN-YEAR AGENCY NOTE - CHICAGO BOARD OF TRADE ;2002.08.27;   18564;     909;    1730;       0;   17360;   16312;   18269;   18042;     295;     522
TEN-YEAR AGENCY NOTE - CHICAGO BOARD OF TRADE ;2002.08.20;   21063;    1052;    1300;       0;   19723;   19366;   20775;   20666;     288;     397
TEN-YEAR AGENCY NOTE - CHICAGO BOARD OF TRADE ;2002.08.13;   22970;    1839;    1261;       0;   20880;   21125;   22719;   22386;     251;     584
TEN-YEAR AGENCY NOTE - CHICAGO BOARD OF TRADE ;2002.08.06;   24225;     914;    2787;      50;   22940;   20757;   23904;   23594;     321;     631
TEN-YEAR AGENCY NOTE - CHICAGO BOARD OF TRADE ;2002.07.30;   24276;     847;    3141;      50;   23131;   20871;   24028;   24062;     248;     214
TEN-YEAR AGENCY NOTE - CHICAGO BOARD OF TRADE ;2002.07.23;   24200;     883;    2308;      50;   23012;   21631;   23945;   23989;     255;     211
TEN-YEAR AGENCY NOTE - CHICAGO BOARD OF TRADE ;2002.07.16;   24738;     986;    2033;      50;   23433;   22334;   24469;   24417;     269;     321
TEN-YEAR AGENCY NOTE - CHICAGO BOARD OF TRADE ;2002.07.09;   25396;     755;    3163;      50;   24367;   21954;   25172;   25167;     224;     229
TEN-YEAR AGENCY NOTE - CHICAGO BOARD OF TRADE ;2002.07.02;   25377;     831;    3051;      50;   24241;   22072;   25122;   25173;     255;     204
TEN-YEAR AGENCY NOTE - CHICAGO BOARD OF TRADE ;2002.06.25;   33419;     954;    3937;      50;   32082;   29272;   33086;   33259;     333;     160
TEN-YEAR AGENCY NOTE - CHICAGO BOARD OF TRADE ;2002.06.18;   33099;     966;    3803;      93;   31951;   29038;   33010;   32934;      89;     165
TEN-YEAR AGENCY NOTE - CHICAGO BOARD OF TRADE ;2002.06.11;   34329;     744;    3664;    1172;   32092;   29258;   34008;   34094;     321;     235
TEN-YEAR AGENCY NOTE - CHICAGO BOARD OF TRADE ;2002.06.04;   25659;     988;    2566;     575;   23831;   22370;   25394;   25511;     265;     148
TEN-YEAR AGENCY NOTE - CHICAGO BOARD OF TRADE ;2002.05.28;   25929;     802;    2021;     846;   24106;   19754;   25754;   22621;     175;    3308
TEN-YEAR AGENCY NOTE - CHICAGO BOARD OF TRADE ;2002.05.21;   25472;    1011;    1152;      70;   24014;   23982;   25095;   25204;     377;     268
TEN-YEAR AGENCY NOTE - CHICAGO BOARD OF TRADE ;2002.05.14;   26188;     462;    1633;      71;   25243;   24072;   25776;   25776;     412;     412
TEN-YEAR AGENCY NOTE - CHICAGO BOARD OF TRADE ;2002.05.07;   30025;    1091;    2026;      71;   28524;   26895;   29686;   28992;     339;    1033
TEN-YEAR AGENCY NOTE - CHICAGO BOARD OF TRADE ;2002.04.30;   31792;     682;    2342;       1;   30783;   29199;   31466;   31542;     326;     250
TEN-YEAR AGENCY NOTE - CHICAGO BOARD OF TRADE ;2002.04.23;   32139;     920;    2271;       1;   30947;   29711;   31868;   31983;     271;     156
TEN-YEAR AGENCY NOTE - CHICAGO BOARD OF TRADE ;2002.04.16;   32407;    1145;    2121;       1;   31005;   30113;   32151;   32235;     256;     172
TEN-YEAR AGENCY NOTE - CHICAGO BOARD OF TRADE ;2002.04.09;   32893;     397;    1826;       1;   32186;   30740;   32584;   32567;     309;     326
TEN-YEAR AGENCY NOTE - CHICAGO BOARD OF TRADE ;2002.04.02;   33415;     249;    2371;       1;   32876;   30700;   33126;   33072;     289;     343
TEN-YEAR AGENCY NOTE - CHICAGO BOARD OF TRADE ;2002.03.26;   49611;     378;    2973;       0;   48927;   46295;   49305;   49268;     306;     343
TEN-YEAR AGENCY NOTE - CHICAGO BOARD OF TRADE ;2002.03.19;   49239;     374;    2414;       0;   48612;   46477;   48986;   48891;     253;     348
TEN-YEAR AGENCY NOTE - CHICAGO BOARD OF TRADE ;2002.03.12;   46949;     421;    1699;     332;   45939;   44507;   46692;   46538;     257;     411
TEN-YEAR AGENCY NOTE - CHICAGO BOARD OF TRADE ;2002.03.05;   44943;     360;    2014;     494;   43806;   42072;   44660;   44580;     283;     363
TEN-YEAR AGENCY NOTE - CHICAGO BOARD OF TRADE ;2002.02.26;   36029;     425;    2658;     238;   35128;   32821;   35791;   35717;     238;     312
TEN-YEAR AGENCY NOTE - CHICAGO BOARD OF TRADE ;2002.02.19;   34304;     660;    2170;      32;   33305;   31758;   33997;   33960;     307;     344
TEN-YEAR AGENCY NOTE - CHICAGO BOARD OF TRADE ;2002.02.12;   36080;     714;    2572;       0;   35006;   33044;   35720;   35616;     360;     464
TEN-YEAR AGENCY NOTE - CHICAGO BOARD OF TRADE ;2002.02.05;   37017;     539;    2352;       0;   36157;   34285;   36696;   36637;     321;     380
TEN-YEAR AGENCY NOTE - CHICAGO BOARD OF TRADE ;2002.01.29;   36646;     399;    2549;       0;   35946;   33959;   36345;   36508;     301;     138
TEN-YEAR AGENCY NOTE - CHICAGO BOARD OF TRADE ;2002.01.22;   37127;     416;    1865;       0;   36376;   35091;   36792;   36956;     335;     171
TEN-YEAR AGENCY NOTE - CHICAGO BOARD OF TRADE ;2002.01.15;   36752;     383;    1730;       0;   36078;   34859;   36461;   36589;     291;     163
TEN-YEAR AGENCY NOTE - CHICAGO BOARD OF TRADE ;2002.01.08;   39971;     591;    1851;       0;   39076;   37975;   39667;   39826;     304;     145
TEN-YEAR AGENCY NOTE - CHICAGO BOARD OF TRADE ;2001.12.28;   38787;     550;    1930;       0;   38008;   36691;   38558;   38621;     229;     166
TEN-YEAR AGENCY NOTE - CHICAGO BOARD OF TRADE ;2001.12.21;   38846;     748;    1780;       0;   37879;   36890;   38627;   38670;     219;     176
TEN-YEAR AGENCY NOTE - CHICAGO BOARD OF TRADE ;2001.12.18;   39790;    1027;    2350;     125;   38094;   37131;   39246;   39606;     544;     184
TEN-YEAR AGENCY NOTE - CHICAGO BOARD OF TRADE ;2001.12.11;   36783;     354;    1998;     760;   35464;   33893;   36578;   36651;     205;     132
TEN-YEAR AGENCY NOTE - CHICAGO BOARD OF TRADE ;2001.12.04;   35011;     403;    1382;     314;   33960;   33212;   34677;   34908;     334;     103
TEN-YEAR AGENCY NOTE - CHICAGO BOARD OF TRADE ;2001.11.27;   33070;     173;    2009;      35;   32624;   30936;   32832;   32980;     238;      90
TEN-YEAR AGENCY NOTE - CHICAGO BOARD OF TRADE ;2001.11.20;   32895;      29;    1674;       0;   32492;   31091;   32521;   32765;     374;     130
TEN-YEAR AGENCY NOTE - CHICAGO BOARD OF TRADE ;2001.11.13;   33250;     209;     896;       0;   32844;   31555;   33053;   32451;     197;     799
TEN-YEAR AGENCY NOTE - CHICAGO BOARD OF TRADE ;2001.11.06;   33920;     209;    1266;       0;   33353;   32298;   33562;   33564;     358;     356
TEN-YEAR AGENCY NOTE - CHICAGO BOARD OF TRADE ;2001.10.30;   38343;     765;    1421;       0;   37248;   36530;   38013;   37951;     330;     392
TEN-YEAR AGENCY NOTE - CHICAGO BOARD OF TRADE ;2001.10.23;   39055;     452;     915;       0;   38234;   37536;   38686;   38451;     369;     604
TEN-YEAR AGENCY NOTE - CHICAGO BOARD OF TRADE ;2001.10.16;   40992;     694;    1166;       0;   39636;   39643;   40330;   40809;     662;     183
TEN-YEAR AGENCY NOTE - CHICAGO BOARD OF TRADE ;2001.10.09;   42245;     430;    1521;       0;   41599;   40432;   42029;   41953;     216;     292
TEN-YEAR AGENCY NOTE - CHICAGO BOARD OF TRADE ;2001.10.02;   42877;     586;    1887;       0;   42107;   40688;   42693;   42575;     184;     302
TEN-YEAR AGENCY NOTE - CHICAGO BOARD OF TRADE ;2001.09.25;   57890;     574;    3921;       0;   57127;   53686;   57701;   57607;     189;     283
TEN-YEAR AGENCY NOTE - CHICAGO BOARD OF TRADE ;2001.09.18;   61593;     542;    4374;      50;   60200;   56350;   60792;   60774;     801;     819
TEN-YEAR AGENCY NOTE - CHICAGO BOARD OF TRADE ;2001.09.10;   66324;     505;    3983;    1677;   63271;   59724;   65453;   65384;     871;     940
TEN-YEAR AGENCY NOTE - CHICAGO BOARD OF TRADE ;2001.09.04;   62930;     498;    4545;    1929;   59817;   56120;   62244;   62594;     686;     336
TEN-YEAR AGENCY NOTE - CHICAGO BOARD OF TRADE ;2001.08.28;   52872;    1005;    5084;    3764;   47556;   43541;   52325;   52389;     547;     483
TEN-YEAR AGENCY NOTE - CHICAGO BOARD OF TRADE ;2001.08.21;   49343;    1066;    4920;      66;   47869;   44107;   49001;   49093;     342;     250
TEN-YEAR AGENCY NOTE - CHICAGO BOARD OF TRADE ;2001.08.14;   48795;    1114;    5733;       4;   47296;   42857;   48414;   48594;     381;     201
TEN-YEAR AGENCY NOTE - CHICAGO BOARD OF TRADE ;2001.08.07;   51205;     807;    6496;       0;   50057;   44509;   50864;   51005;     341;     200
TEN-YEAR AGENCY NOTE - CHICAGO BOARD OF TRADE ;2001.07.31;   51970;     859;    5816;       0;   50523;   45964;   51382;   51780;     588;     190
TEN-YEAR AGENCY NOTE - CHICAGO BOARD OF TRADE ;2001.07.24;   54185;    1073;    6455;       0;   52366;   47291;   53439;   53746;     746;     439
TEN-YEAR AGENCY NOTE - CHICAGO BOARD OF TRADE ;2001.07.17;   59308;     803;    6396;       0;   57616;   50646;   58419;   57042;     889;    2266
TEN-YEAR AGENCY NOTE - CHICAGO BOARD OF TRADE ;2001.07.10;   58445;     961;    6615;       0;   57062;   51425;   58023;   58040;     422;     405
TEN-YEAR AGENCY NOTE - CHICAGO BOARD OF TRADE ;2001.07.03;   59012;     821;    7037;       0;   57843;   51643;   58664;   58680;     348;     332
TEN-YEAR AGENCY NOTE - CHICAGO BOARD OF TRADE ;2001.06.26;   68683;     938;    6204;     901;   65654;   56888;   67493;   63993;    1190;    4690
TEN-YEAR AGENCY NOTE - CHICAGO BOARD OF TRADE ;2001.06.19;   67403;    1009;    5291;     786;   65336;   60651;   67131;   66728;     272;     675
TEN-YEAR AGENCY NOTE - CHICAGO BOARD OF TRADE ;2001.06.12;   70741;    1030;    4355;    2759;   66737;   62993;   70526;   70107;     215;     634
TEN-YEAR AGENCY NOTE - CHICAGO BOARD OF TRADE ;2001.06.05;   62981;     917;    2755;    1797;   60118;   58374;   62832;   62926;     149;      55
TEN-YEAR AGENCY NOTE - CHICAGO BOARD OF TRADE ;2001.05.29;   57738;    1214;    2999;    2321;   53782;   52194;   57317;   57514;     421;     224
TEN-YEAR AGENCY NOTE - CHICAGO BOARD OF TRADE ;2001.05.22;   50375;    2682;    2805;     756;   46669;   46610;   50107;   50171;     268;     204
TEN-YEAR AGENCY NOTE - CHICAGO BOARD OF TRADE ;2001.05.15;   50870;     946;    2534;     582;   49114;   47174;   50642;   50290;     228;     580
TEN-YEAR AGENCY NOTE - CHICAGO BOARD OF TRADE ;2001.05.08;   48365;    1389;    1610;       1;   46255;   45145;   47645;   46756;     720;    1609
TEN-YEAR AGENCY NOTE - CHICAGO BOARD OF TRADE ;2001.05.01;   50896;     827;    1083;       0;   49610;   46543;   50437;   47626;     459;    3270
TEN-YEAR AGENCY NOTE - CHICAGO BOARD OF TRADE ;2001.04.24;   52896;     691;    1954;       2;   51609;   50335;   52302;   52291;     595;     606
TEN-YEAR AGENCY NOTE - CHICAGO BOARD OF TRADE ;2001.04.17;   52057;     535;    2187;       1;   51238;   49219;   51774;   51407;     283;     650
TEN-YEAR AGENCY NOTE - CHICAGO BOARD OF TRADE ;2001.04.10;   53033;     682;    2040;       1;   52057;   50311;   52740;   52352;     293;     681
TEN-YEAR AGENCY NOTE - CHICAGO BOARD OF TRADE ;2001.04.03;   51460;     680;    1127;       2;   50320;   49683;   51002;   50812;     458;     648
TEN-YEAR AGENCY NOTE - CHICAGO BOARD OF TRADE ;2001.03.27;   55293;     686;    5305;      22;   54138;   49536;   54846;   54863;     447;     430
TEN-YEAR AGENCY NOTE - CHICAGO BOARD OF TRADE ;2001.03.20;   55419;     554;    4447;      86;   53952;   50507;   54592;   55040;     827;     379
TEN-YEAR AGENCY NOTE - CHICAGO BOARD OF TRADE ;2001.03.13;   56263;     458;    4332;     757;   54520;   50646;   55735;   55735;     528;     528
TEN-YEAR AGENCY NOTE - CHICAGO BOARD OF TRADE ;2001.03.06;   49153;    1498;    2185;    1845;   45098;   44592;   48441;   48622;     712;     531
TEN-YEAR AGENCY NOTE - CHICAGO BOARD OF TRADE ;2001.02.27;   50185;    1304;    4647;     317;   47431;   44369;   49052;   49333;    1133;     852
TEN-YEAR AGENCY NOTE - CHICAGO BOARD OF TRADE ;2001.02.20;   45076;    1033;    3773;      33;   43188;   40671;   44254;   44477;     822;     599
TEN-YEAR AGENCY NOTE - CHICAGO BOARD OF TRADE ;2001.02.13;   49830;     620;    1702;    1355;   47418;   46413;   49393;   49469;     438;     361
TEN-YEAR AGENCY NOTE - CHICAGO BOARD OF TRADE ;2001.02.06;   50479;     669;    1737;    1444;   47898;   46983;   50011;   50164;     468;     315
TEN-YEAR AGENCY NOTE - CHICAGO BOARD OF TRADE ;2001.01.30;   52934;    1165;    2336;    1361;   49902;   48926;   52428;   52622;     506;     312
TEN-YEAR AGENCY NOTE - CHICAGO BOARD OF TRADE ;2001.01.23;   50737;    1193;    1166;    1154;   47972;   48102;   50319;   50423;     418;     314
TEN-YEAR AGENCY NOTE - CHICAGO BOARD OF TRADE ;2001.01.16;   52032;    1243;    3726;    1220;   49101;   46768;   51564;   51714;     468;     318
TEN-YEAR AGENCY NOTE - CHICAGO BOARD OF TRADE ;2001.01.09;   52002;    3309;    3051;    1437;   46730;   47252;   51476;   51741;     526;     261
TEN-YEAR AGENCY NOTE - CHICAGO BOARD OF TRADE ;2001.01.02;   54373;     617;    3457;    1005;   52264;   49286;   53886;   53748;     487;     625
TEN-YEAR AGENCY NOTE - CHICAGO BOARD OF TRADE ;2000.12.26;   58991;     644;    2866;    1152;   57010;   54179;   58806;   58197;     185;     794
TEN-YEAR AGENCY NOTE - CHICAGO BOARD OF TRADE ;2000.12.19;   57926;     576;    2816;    1153;   56029;   53528;   57758;   57497;     169;     429
TEN-YEAR AGENCY NOTE - CHICAGO BOARD OF TRADE ;2000.12.12;   60762;     942;    3028;     804;   58722;   56394;   60467;   60226;     295;     536
TEN-YEAR AGENCY NOTE - CHICAGO BOARD OF TRADE ;2000.12.05;   65067;    3855;    3363;     498;   60285;   60567;   64639;   64428;     428;     638
TEN-YEAR AGENCY NOTE - CHICAGO BOARD OF TRADE ;2000.11.28;   57341;    3640;    2707;     478;   52106;   52980;   56224;   56165;    1118;    1176
TEN-YEAR AGENCY NOTE - CHICAGO BOARD OF TRADE ;2000.11.21;   54121;    3478;    2580;     258;   50000;   50891;   53735;   53729;     385;     392
TEN-YEAR AGENCY NOTE - CHICAGO BOARD OF TRADE ;2000.11.14;   61206;    3150;    2943;    1997;   55391;   55863;   60538;   60803;     668;     403
TEN-YEAR AGENCY NOTE - CHICAGO BOARD OF TRADE ;2000.11.07;   56373;    2934;    2359;    1452;   51686;   52062;   56071;   55873;     302;     500
TEN-YEAR AGENCY NOTE - CHICAGO BOARD OF TRADE ;2000.10.31;   58323;    3089;    1363;    1925;   52874;   54470;   57888;   57757;     435;     567
TEN-YEAR AGENCY NOTE - CHICAGO BOARD OF TRADE ;2000.10.24;   60150;    2917;    2589;    2328;   54234;   54660;   59479;   59577;     671;     573
TEN-YEAR AGENCY NOTE - CHICAGO BOARD OF TRADE ;2000.10.17;   61219;    4067;    8233;    1559;   55064;   50993;   60690;   60784;     530;     435
TEN-YEAR AGENCY NOTE - CHICAGO BOARD OF TRADE ;2000.10.10;   54597;    3482;    8515;     498;   49991;   45217;   53971;   54230;     626;     368
TEN-YEAR AGENCY NOTE - CHICAGO BOARD OF TRADE ;2000.10.03;   47632;    1764;    6306;     520;   44848;   40044;   47133;   46870;     500;     762
TEN-YEAR AGENCY NOTE - CHICAGO BOARD OF TRADE ;2000.09.26;   49140;    1819;    5664;     491;   46168;   40692;   48478;   46848;     662;    2292
TEN-YEAR AGENCY NOTE - CHICAGO BOARD OF TRADE ;2000.09.19;   53978;    1748;    4299;     363;   50599;   47417;   52710;   52079;    1268;    1899
TEN-YEAR AGENCY NOTE - CHICAGO BOARD OF TRADE ;2000.09.12;   56312;    1485;    3773;    1613;   52647;   50182;   55745;   55568;     567;     743
TEN-YEAR AGENCY NOTE - CHICAGO BOARD OF TRADE ;2000.09.05;   47595;    2220;    4652;    2473;   42462;   39220;   47156;   46346;     439;    1249
TEN-YEAR AGENCY NOTE - CHICAGO BOARD OF TRADE ;2000.08.29;   44291;    2671;    5027;    1620;   39662;   36723;   43953;   43370;     339;     921
TEN-YEAR AGENCY NOTE - CHICAGO BOARD OF TRADE ;2000.08.22;   40547;    8037;    5909;     698;   30932;   31962;   39667;   38569;     880;    1979
TEN-YEAR AGENCY NOTE - CHICAGO BOARD OF TRADE ;2000.08.15;   49110;    8809;    6147;    1624;   37850;   39193;   48283;   46963;     827;    2147
TEN-YEAR AGENCY NOTE - CHICAGO BOARD OF TRADE ;2000.08.08;   47308;    8455;    6479;    1486;   35867;   35410;   45808;   43375;    1500;    3933
TEN-YEAR AGENCY NOTE - CHICAGO BOARD OF TRADE ;2000.08.01;   46016;    8128;    8623;    1728;   34936;   31715;   44792;   42066;    1224;    3950
TEN-YEAR AGENCY NOTE - CHICAGO BOARD OF TRADE ;2000.07.25;   45235;    8152;    8218;    1735;   34577;   32153;   44463;   42105;     772;    3130
TEN-YEAR AGENCY NOTE - CHICAGO BOARD OF TRADE ;2000.07.18;   47710;    8493;    7111;    2592;   35338;   32994;   46423;   42698;    1287;    5012
TEN-YEAR AGENCY NOTE - CHICAGO BOARD OF TRADE ;2000.07.11;   50121;    8523;    6393;    2523;   37329;   37777;   48375;   46694;    1746;    3428
TEN-YEAR AGENCY NOTE - CHICAGO BOARD OF TRADE ;2000.07.05;   51150;    7586;    5831;     910;   40464;   41625;   48959;   48366;    2191;    2784
TEN-YEAR AGENCY NOTE - CHICAGO BOARD OF TRADE ;2000.06.27;   50059;    7304;    5582;     859;   39499;   40822;   47661;   47262;    2398;    2796
TEN-YEAR AGENCY NOTE - CHICAGO BOARD OF TRADE ;2000.06.20;   53943;    1670;    3054;     618;   48329;   46141;   50616;   49812;    3327;    4131
TEN-YEAR AGENCY NOTE - CHICAGO BOARD OF TRADE ;2000.06.13;   47557;    1604;    2977;    1417;   40813;   39684;   43834;   44077;    3724;    3480
TEN-YEAR AGENCY NOTE - CHICAGO BOARD OF TRADE ;2000.06.06;   46751;    2263;    4002;    4671;   37645;   35009;   44579;   43681;    2171;    3070
TEN-YEAR AGENCY NOTE - CHICAGO BOARD OF TRADE ;2000.05.30;   40628;    1186;    2639;    1616;   35891;   33394;   38693;   37649;    1934;    2979
TEN-YEAR AGENCY NOTE - CHICAGO BOARD OF TRADE ;2000.05.23;   40440;     924;    2684;     951;   36753;   33734;   38627;   37368;    1813;    3072
TEN-YEAR AGENCY NOTE - CHICAGO BOARD OF TRADE ;2000.05.16;   44889;    1713;    3653;     947;   39657;   37049;   42317;   41650;    2572;    3240
TEN-YEAR AGENCY NOTE - CHICAGO BOARD OF TRADE ;2000.05.09;   38056;    1591;    2325;     816;   33263;   31662;   35670;   34802;    2386;    3254
TEN-YEAR AGENCY NOTE - CHICAGO BOARD OF TRADE ;2000.05.02;   33150;    1825;    1745;     777;   28221;   28490;   30823;   31013;    2327;    2138
TEN-YEAR AGENCY NOTE - CHICAGO BOARD OF TRADE ;2000.04.25;   31113;    2636;    1471;     491;   25529;   27498;   28657;   29460;    2456;    1653
TEN-YEAR AGENCY NOTE - CHICAGO BOARD OF TRADE ;2000.04.18;   30609;    2794;    1555;     514;   25614;   26904;   28922;   28972;    1687;    1636
TEN-YEAR AGENCY NOTE - CHICAGO BOARD OF TRADE ;2000.04.11;   30333;    2286;    6582;     438;   25865;   21686;   28589;   28705;    1744;    1628
TEN-YEAR AGENCY NOTE - CHICAGO BOARD OF TRADE ;2000.04.04;   22813;   19254;   19897;    1953;       0;       0;   21207;   21850;    1606;     963
TEN-YEAR AGENCY NOTE - CHICAGO BOARD OF TRADE ;2000.03.28;    9679;    6269;    8353;     986;       0;      70;    7255;    9409;    2424;     270
TEN-YEAR AGENCY NOTE - CHICAGO BOARD OF TRADE ;2000.03.21;    2467;    1103;    1583;     474;       0;       0;    1577;    2057;     890;     410
TEN-YEAR AGENCY NOTE - CHICAGO BOARD OF TRADE ;2003.09.02;    4618;       0;     251;       0;    4505;    4314;    4505;    4565;     113;      53
TEN-YEAR AGENCY NOTE - CHICAGO BOARD OF TRADE ;2003.08.26;    3883;       0;     384;       0;    3779;    3432;    3779;    3816;     104;      67
TEN-YEAR AGENCY NOTE - CHICAGO BOARD OF TRADE ;2003.08.19;    3981;       0;     439;       0;    3873;    3462;    3873;    3901;     108;      80
TEN-YEAR AGENCY NOTE - CHICAGO BOARD OF TRADE ;2003.08.12;    3900;       0;     409;       0;    3796;    3362;    3796;    3771;     104;     129
TEN-YEAR AGENCY NOTE - CHICAGO BOARD OF TRADE ;2003.08.05;    4036;       0;     565;       0;    3931;    3397;    3931;    3962;     105;      74
TEN-YEAR AGENCY NOTE - CHICAGO BOARD OF TRADE ;2003.07.29;    4209;      25;     635;       0;    4073;    3486;    4098;    4121;     111;      88
TEN-YEAR AGENCY NOTE - CHICAGO BOARD OF TRADE ;2003.07.22;    4303;       0;     665;       0;    4192;    3527;    4192;    4192;     111;     111
TEN-YEAR AGENCY NOTE - CHICAGO BOARD OF TRADE ;2003.07.01;    4756;      50;     520;       0;    4563;    4184;    4613;    4704;     143;      52
TEN-YEAR AGENCY NOTE - CHICAGO BOARD OF TRADE ;2003.06.24;    6817;     106;     625;       0;    6552;    6133;    6658;    6758;     159;      59
TEN-YEAR AGENCY NOTE - CHICAGO BOARD OF TRADE ;2003.06.03;    5180;     152;     611;       0;    4907;    4546;    5059;    5157;     121;      23
TEN-YEAR AGENCY NOTE - CHICAGO BOARD OF TRADE ;2003.05.27;    4999;     130;     261;       0;    4750;    4723;    4880;    4984;     119;      15
TEN-YEAR AGENCY NOTE - CHICAGO BOARD OF TRADE ;2003.05.20;    5581;     130;     261;       0;    5335;    5305;    5465;    5566;     116;      15
TEN-YEAR AGENCY NOTE - CHICAGO BOARD OF TRADE ;2003.05.13;    5599;     115;     326;       0;    5368;    5255;    5483;    5581;     116;      18
TEN-YEAR AGENCY NOTE - CHICAGO BOARD OF TRADE ;2003.05.06;    5609;      85;     326;       0;    5402;    5252;    5487;    5578;     122;      31
TEN-YEAR AGENCY NOTE - CHICAGO BOARD OF TRADE ;2003.04.29;    5626;      78;     326;       0;    5441;    5272;    5519;    5598;     107;      28
TEN-YEAR AGENCY NOTE - CHICAGO BOARD OF TRADE ;2003.04.22;    5598;      78;     276;       0;    5399;    5292;    5477;    5568;     121;      30
TEN-YEAR AGENCY NOTE - CHICAGO BOARD OF TRADE ;2003.04.15;    5891;      32;     276;       0;    5698;    5582;    5730;    5858;     161;      33
TEN-YEAR AGENCY NOTE - CHICAGO BOARD OF TRADE ;2003.04.08;    5826;     163;      40;      61;    5472;    5690;    5696;    5791;     130;      35
TEN-YEAR AGENCY NOTE - CHICAGO BOARD OF TRADE ;2003.04.01;    5916;     182;     340;      61;    5540;    5487;    5783;    5888;     133;      28
TEN-YEAR AGENCY NOTE - CHICAGO BOARD OF TRADE ;2003.03.25;    6025;     104;     390;      61;    5720;    5521;    5885;    5972;     140;      53
TEN-YEAR AGENCY NOTE - CHICAGO BOARD OF TRADE ;2003.03.18;    6228;     321;     540;      61;    5708;    5571;    6090;    6172;     138;      56
TEN-YEAR AGENCY NOTE - CHICAGO BOARD OF TRADE ;2003.03.11;    7037;     352;     240;      61;    6477;    6599;    6890;    6900;     147;     137
TEN-YEAR AGENCY NOTE - CHICAGO BOARD OF TRADE ;2003.03.04;    7672;     350;     330;      61;    7096;    7176;    7507;    7567;     165;     105
TEN-YEAR AGENCY NOTE - CHICAGO BOARD OF TRADE ;2003.02.25;    7191;     360;     130;      61;    6597;    6876;    7018;    7067;     173;     124
TEN-YEAR AGENCY NOTE - CHICAGO BOARD OF TRADE ;2003.02.18;    8087;     270;     168;      61;    7586;    7742;    7917;    7971;     170;     116
TEN-YEAR AGENCY NOTE - CHICAGO BOARD OF TRADE ;2003.02.11;    8953;     162;      25;      61;    8542;    8772;    8765;    8858;     188;      95
TEN-YEAR AGENCY NOTE - CHICAGO BOARD OF TRADE ;2003.02.04;    9901;     168;      25;      61;    9501;    9707;    9730;    9793;     171;     108
TEN-YEAR AGENCY NOTE - CHICAGO BOARD OF TRADE ;2003.01.28;    9970;     170;      25;      61;    9553;    9807;    9784;    9893;     186;      77
TEN-YEAR AGENCY NOTE - CHICAGO BOARD OF TRADE ;2003.01.21;   10173;     295;      25;      61;    9618;   10011;    9974;   10097;     199;      76
TEN-YEAR AGENCY NOTE - CHICAGO BOARD OF TRADE ;2003.01.14;   10821;     192;      25;      61;   10333;   10664;   10586;   10750;     235;      71
TEN-YEAR AGENCY NOTE - CHICAGO BOARD OF TRADE ;2003.01.07;   10933;     352;     153;      61;   10333;   10639;   10746;   10853;     187;      80
TEN-YEAR AGENCY NOTE - CHICAGO BOARD OF TRADE ;2002.12.31;   11252;     470;     198;      61;   10558;   10907;   11089;   11166;     163;      86
TEN-YEAR AGENCY NOTE - CHICAGO BOARD OF TRADE ;2002.12.23;   11286;     449;     446;      54;   10621;   10687;   11124;   11187;     162;      99
TEN-YEAR AGENCY NOTE - CHICAGO BOARD OF TRADE ;2002.12.17;   11041;     285;     435;      54;   10560;   10477;   10899;   10966;     142;      75
TEN-YEAR AGENCY NOTE - CHICAGO BOARD OF TRADE ;2002.12.10;   17314;     363;     159;      88;   16736;   16977;   17187;   17224;     127;      90
TEN-YEAR AGENCY NOTE - CHICAGO BOARD OF TRADE ;2002.12.03;   14764;     376;     356;       6;   14235;   14214;   14617;   14576;     147;     188
TEN-YEAR AGENCY NOTE - CHICAGO BOARD OF TRADE ;2002.11.26;   12573;     502;     221;       0;   12040;   12175;   12542;   12396;      31;     177
TEN-YEAR AGENCY NOTE - CHICAGO BOARD OF TRADE ;2002.11.19;   13986;     108;     266;      24;   13659;   13531;   13791;   13821;     195;     165
TEN-YEAR AGENCY NOTE - CHICAGO BOARD OF TRADE ;2002.11.12;   14349;     170;     622;       0;   14008;   13531;   14178;   14153;     171;     196
TEN-YEAR AGENCY NOTE - CHICAGO BOARD OF TRADE ;2002.11.05;   15566;      83;     775;       0;   15279;   14627;   15362;   15402;     204;     164
TEN-YEAR AGENCY NOTE - CHICAGO BOARD OF TRADE ;2002.10.29;   15573;     170;     624;       0;   15223;   14787;   15393;   15411;     180;     162
TEN-YEAR AGENCY NOTE - CHICAGO BOARD OF TRADE ;2002.10.22;   15743;     205;     624;       0;   15323;   14985;   15528;   15609;     215;     134
TEN-YEAR AGENCY NOTE - CHICAGO BOARD OF TRADE ;2002.10.15;   16838;     741;     693;       0;   15874;   16018;   16615;   16711;     223;     127
TEN-YEAR AGENCY NOTE - CHICAGO BOARD OF TRADE ;2002.10.08;   16943;    1002;     743;       0;   15686;   16063;   16688;   16806;     255;     137
TEN-YEAR AGENCY NOTE - CHICAGO BOARD OF TRADE ;2002.10.01;   17171;     904;     743;       0;   16007;   16289;   16911;   17032;     260;     139
TEN-YEAR AGENCY NOTE - CHICAGO BOARD OF TRADE ;2002.09.24;   18526;    1754;     830;       0;   16501;   17582;   18255;   18412;     271;     114
TEN-YEAR AGENCY NOTE - CHICAGO BOARD OF TRADE ;2002.09.17;   18128;    1128;     979;     200;   16412;   16742;   17740;   17921;     388;     207
TEN-YEAR AGENCY NOTE - CHICAGO BOARD OF TRADE ;2002.09.10;   17996;    1151;    1384;     250;   16366;   16201;   17767;   17835;     229;     161
TEN-YEAR AGENCY NOTE - CHICAGO BOARD OF TRADE ;2002.09.03;   18240;    1463;    1093;      61;   16425;   16866;   17949;   18020;     291;     220
TEN-YEAR AGENCY NOTE - CHICAGO BOARD OF TRADE ;2002.08.27;   18564;     909;    1730;       0;   17360;   16312;   18269;   18042;     295;     522
TEN-YEAR AGENCY NOTE - CHICAGO BOARD OF TRADE ;2002.08.20;   21063;    1052;    1300;       0;   19723;   19366;   20775;   20666;     288;     397
TEN-YEAR AGENCY NOTE - CHICAGO BOARD OF TRADE ;2002.08.13;   22970;    1839;    1261;       0;   20880;   21125;   22719;   22386;     251;     584
TEN-YEAR AGENCY NOTE - CHICAGO BOARD OF TRADE ;2002.08.06;   24225;     914;    2787;      50;   22940;   20757;   23904;   23594;     321;     631
TEN-YEAR AGENCY NOTE - CHICAGO BOARD OF TRADE ;2002.07.30;   24276;     847;    3141;      50;   23131;   20871;   24028;   24062;     248;     214
TEN-YEAR AGENCY NOTE - CHICAGO BOARD OF TRADE ;2002.07.23;   24200;     883;    2308;      50;   23012;   21631;   23945;   23989;     255;     211
TEN-YEAR AGENCY NOTE - CHICAGO BOARD OF TRADE ;2002.07.16;   24738;     986;    2033;      50;   23433;   22334;   24469;   24417;     269;     321
TEN-YEAR AGENCY NOTE - CHICAGO BOARD OF TRADE ;2002.07.09;   25396;     755;    3163;      50;   24367;   21954;   25172;   25167;     224;     229
TEN-YEAR AGENCY NOTE - CHICAGO BOARD OF TRADE ;2002.07.02;   25377;     831;    3051;      50;   24241;   22072;   25122;   25173;     255;     204
TEN-YEAR AGENCY NOTE - CHICAGO BOARD OF TRADE ;2002.06.25;   33419;     954;    3937;      50;   32082;   29272;   33086;   33259;     333;     160
TEN-YEAR AGENCY NOTE - CHICAGO BOARD OF TRADE ;2002.06.18;   33099;     966;    3803;      93;   31951;   29038;   33010;   32934;      89;     165
TEN-YEAR AGENCY NOTE - CHICAGO BOARD OF TRADE ;2002.06.11;   34329;     744;    3664;    1172;   32092;   29258;   34008;   34094;     321;     235
TEN-YEAR AGENCY NOTE - CHICAGO BOARD OF TRADE ;2002.06.04;   25659;     988;    2566;     575;   23831;   22370;   25394;   25511;     265;     148
TEN-YEAR AGENCY NOTE - CHICAGO BOARD OF TRADE ;2002.05.28;   25929;     802;    2021;     846;   24106;   19754;   25754;   22621;     175;    3308
TEN-YEAR AGENCY NOTE - CHICAGO BOARD OF TRADE ;2002.05.21;   25472;    1011;    1152;      70;   24014;   23982;   25095;   25204;     377;     268
TEN-YEAR AGENCY NOTE - CHICAGO BOARD OF TRADE ;2002.05.14;   26188;     462;    1633;      71;   25243;   24072;   25776;   25776;     412;     412
TEN-YEAR AGENCY NOTE - CHICAGO BOARD OF TRADE ;2002.05.07;   30025;    1091;    2026;      71;   28524;   26895;   29686;   28992;     339;    1033
TEN-YEAR AGENCY NOTE - CHICAGO BOARD OF TRADE ;2002.04.30;   31792;     682;    2342;       1;   30783;   29199;   31466;   31542;     326;     250
TEN-YEAR AGENCY NOTE - CHICAGO BOARD OF TRADE ;2002.04.23;   32139;     920;    2271;       1;   30947;   29711;   31868;   31983;     271;     156
TEN-YEAR AGENCY NOTE - CHICAGO BOARD OF TRADE ;2002.04.16;   32407;    1145;    2121;       1;   31005;   30113;   32151;   32235;     256;     172
TEN-YEAR AGENCY NOTE - CHICAGO BOARD OF TRADE ;2002.04.09;   32893;     397;    1826;       1;   32186;   30740;   32584;   32567;     309;     326
TEN-YEAR AGENCY NOTE - CHICAGO BOARD OF TRADE ;2002.04.02;   33415;     249;    2371;       1;   32876;   30700;   33126;   33072;     289;     343
TEN-YEAR AGENCY NOTE - CHICAGO BOARD OF TRADE ;2002.03.26;   49611;     378;    2973;       0;   48927;   46295;   49305;   49268;     306;     343
TEN-YEAR AGENCY NOTE - CHICAGO BOARD OF TRADE ;2002.03.19;   49239;     374;    2414;       0;   48612;   46477;   48986;   48891;     253;     348
TEN-YEAR AGENCY NOTE - CHICAGO BOARD OF TRADE ;2002.03.12;   46949;     421;    1699;     332;   45939;   44507;   46692;   46538;     257;     411
TEN-YEAR AGENCY NOTE - CHICAGO BOARD OF TRADE ;2002.03.05;   44943;     360;    2014;     494;   43806;   42072;   44660;   44580;     283;     363
TEN-YEAR AGENCY NOTE - CHICAGO BOARD OF TRADE ;2002.02.26;   36029;     425;    2658;     238;   35128;   32821;   35791;   35717;     238;     312
TEN-YEAR AGENCY NOTE - CHICAGO BOARD OF TRADE ;2002.02.19;   34304;     660;    2170;      32;   33305;   31758;   33997;   33960;     307;     344
TEN-YEAR AGENCY NOTE - CHICAGO BOARD OF TRADE ;2002.02.12;   36080;     714;    2572;       0;   35006;   33044;   35720;   35616;     360;     464
TEN-YEAR AGENCY NOTE - CHICAGO BOARD OF TRADE ;2002.02.05;   37017;     539;    2352;       0;   36157;   34285;   36696;   36637;     321;     380
TEN-YEAR AGENCY NOTE - CHICAGO BOARD OF TRADE ;2002.01.29;   36646;     399;    2549;       0;   35946;   33959;   36345;   36508;     301;     138
TEN-YEAR AGENCY NOTE - CHICAGO BOARD OF TRADE ;2002.01.22;   37127;     416;    1865;       0;   36376;   35091;   36792;   36956;     335;     171
TEN-YEAR AGENCY NOTE - CHICAGO BOARD OF TRADE ;2002.01.15;   36752;     383;    1730;       0;   36078;   34859;   36461;   36589;     291;     163
TEN-YEAR AGENCY NOTE - CHICAGO BOARD OF TRADE ;2002.01.08;   39971;     591;    1851;       0;   39076;   37975;   39667;   39826;     304;     145
TEN-YEAR AGENCY NOTE - CHICAGO BOARD OF TRADE ;2001.12.28;   38787;     550;    1930;       0;   38008;   36691;   38558;   38621;     229;     166
TEN-YEAR AGENCY NOTE - CHICAGO BOARD OF TRADE ;2001.12.21;   38846;     748;    1780;       0;   37879;   36890;   38627;   38670;     219;     176
TEN-YEAR AGENCY NOTE - CHICAGO BOARD OF TRADE ;2001.12.18;   39790;    1027;    2350;     125;   38094;   37131;   39246;   39606;     544;     184
TEN-YEAR AGENCY NOTE - CHICAGO BOARD OF TRADE ;2001.12.11;   36783;     354;    1998;     760;   35464;   33893;   36578;   36651;     205;     132
TEN-YEAR AGENCY NOTE - CHICAGO BOARD OF TRADE ;2001.12.04;   35011;     403;    1382;     314;   33960;   33212;   34677;   34908;     334;     103
TEN-YEAR AGENCY NOTE - CHICAGO BOARD OF TRADE ;2001.11.27;   33070;     173;    2009;      35;   32624;   30936;   32832;   32980;     238;      90
TEN-YEAR AGENCY NOTE - CHICAGO BOARD OF TRADE ;2001.11.20;   32895;      29;    1674;       0;   32492;   31091;   32521;   32765;     374;     130
TEN-YEAR AGENCY NOTE - CHICAGO BOARD OF TRADE ;2001.11.13;   33250;     209;     896;       0;   32844;   31555;   33053;   32451;     197;     799
TEN-YEAR AGENCY NOTE - CHICAGO BOARD OF TRADE ;2001.11.06;   33920;     209;    1266;       0;   33353;   32298;   33562;   33564;     358;     356
TEN-YEAR AGENCY NOTE - CHICAGO BOARD OF TRADE ;2001.10.30;   38343;     765;    1421;       0;   37248;   36530;   38013;   37951;     330;     392
TEN-YEAR AGENCY NOTE - CHICAGO BOARD OF TRADE ;2001.10.23;   39055;     452;     915;       0;   38234;   37536;   38686;   38451;     369;     604
TEN-YEAR AGENCY NOTE - CHICAGO BOARD OF TRADE ;2001.10.16;   40992;     694;    1166;       0;   39636;   39643;   40330;   40809;     662;     183
TEN-YEAR AGENCY NOTE - CHICAGO BOARD OF TRADE ;2001.10.09;   42245;     430;    1521;       0;   41599;   40432;   42029;   41953;     216;     292
TEN-YEAR AGENCY NOTE - CHICAGO BOARD OF TRADE ;2001.10.02;   42877;     586;    1887;       0;   42107;   40688;   42693;   42575;     184;     302
TEN-YEAR AGENCY NOTE - CHICAGO BOARD OF TRADE ;2001.09.25;   57890;     574;    3921;       0;   57127;   53686;   57701;   57607;     189;     283
TEN-YEAR AGENCY NOTE - CHICAGO BOARD OF TRADE ;2001.09.18;   61593;     542;    4374;      50;   60200;   56350;   60792;   60774;     801;     819
TEN-YEAR AGENCY NOTE - CHICAGO BOARD OF TRADE ;2001.09.10;   66324;     505;    3983;    1677;   63271;   59724;   65453;   65384;     871;     940
TEN-YEAR AGENCY NOTE - CHICAGO BOARD OF TRADE ;2001.09.04;   62930;     498;    4545;    1929;   59817;   56120;   62244;   62594;     686;     336
TEN-YEAR AGENCY NOTE - CHICAGO BOARD OF TRADE ;2001.08.28;   52872;    1005;    5084;    3764;   47556;   43541;   52325;   52389;     547;     483
TEN-YEAR AGENCY NOTE - CHICAGO BOARD OF TRADE ;2001.08.21;   49343;    1066;    4920;      66;   47869;   44107;   49001;   49093;     342;     250
TEN-YEAR AGENCY NOTE - CHICAGO BOARD OF TRADE ;2001.08.14;   48795;    1114;    5733;       4;   47296;   42857;   48414;   48594;     381;     201
TEN-YEAR AGENCY NOTE - CHICAGO BOARD OF TRADE ;2001.08.07;   51205;     807;    6496;       0;   50057;   44509;   50864;   51005;     341;     200
TEN-YEAR AGENCY NOTE - CHICAGO BOARD OF TRADE ;2001.07.31;   51970;     859;    5816;       0;   50523;   45964;   51382;   51780;     588;     190
TEN-YEAR AGENCY NOTE - CHICAGO BOARD OF TRADE ;2001.07.24;   54185;    1073;    6455;       0;   52366;   47291;   53439;   53746;     746;     439
TEN-YEAR AGENCY NOTE - CHICAGO BOARD OF TRADE ;2001.07.17;   59308;     803;    6396;       0;   57616;   50646;   58419;   57042;     889;    2266
TEN-YEAR AGENCY NOTE - CHICAGO BOARD OF TRADE ;2001.07.10;   58445;     961;    6615;       0;   57062;   51425;   58023;   58040;     422;     405
TEN-YEAR AGENCY NOTE - CHICAGO BOARD OF TRADE ;2001.07.03;   59012;     821;    7037;       0;   57843;   51643;   58664;   58680;     348;     332
TEN-YEAR AGENCY NOTE - CHICAGO BOARD OF TRADE ;2001.06.26;   68683;     938;    6204;     901;   65654;   56888;   67493;   63993;    1190;    4690
TEN-YEAR AGENCY NOTE - CHICAGO BOARD OF TRADE ;2001.06.19;   67403;    1009;    5291;     786;   65336;   60651;   67131;   66728;     272;     675
TEN-YEAR AGENCY NOTE - CHICAGO BOARD OF TRADE ;2001.06.12;   70741;    1030;    4355;    2759;   66737;   62993;   70526;   70107;     215;     634
TEN-YEAR AGENCY NOTE - CHICAGO BOARD OF TRADE ;2001.06.05;   62981;     917;    2755;    1797;   60118;   58374;   62832;   62926;     149;      55
TEN-YEAR AGENCY NOTE - CHICAGO BOARD OF TRADE ;2001.05.29;   57738;    1214;    2999;    2321;   53782;   52194;   57317;   57514;     421;     224
TEN-YEAR AGENCY NOTE - CHICAGO BOARD OF TRADE ;2001.05.22;   50375;    2682;    2805;     756;   46669;   46610;   50107;   50171;     268;     204
TEN-YEAR AGENCY NOTE - CHICAGO BOARD OF TRADE ;2001.05.15;   50870;     946;    2534;     582;   49114;   47174;   50642;   50290;     228;     580
TEN-YEAR AGENCY NOTE - CHICAGO BOARD OF TRADE ;2001.05.08;   48365;    1389;    1610;       1;   46255;   45145;   47645;   46756;     720;    1609
TEN-YEAR AGENCY NOTE - CHICAGO BOARD OF TRADE ;2001.05.01;   50896;     827;    1083;       0;   49610;   46543;   50437;   47626;     459;    3270
TEN-YEAR AGENCY NOTE - CHICAGO BOARD OF TRADE ;2001.04.24;   52896;     691;    1954;       2;   51609;   50335;   52302;   52291;     595;     606
TEN-YEAR AGENCY NOTE - CHICAGO BOARD OF TRADE ;2001.04.17;   52057;     535;    2187;       1;   51238;   49219;   51774;   51407;     283;     650
TEN-YEAR AGENCY NOTE - CHICAGO BOARD OF TRADE ;2001.04.10;   53033;     682;    2040;       1;   52057;   50311;   52740;   52352;     293;     681
TEN-YEAR AGENCY NOTE - CHICAGO BOARD OF TRADE ;2001.04.03;   51460;     680;    1127;       2;   50320;   49683;   51002;   50812;     458;     648
TEN-YEAR AGENCY NOTE - CHICAGO BOARD OF TRADE ;2001.03.27;   55293;     686;    5305;      22;   54138;   49536;   54846;   54863;     447;     430
TEN-YEAR AGENCY NOTE - CHICAGO BOARD OF TRADE ;2001.03.20;   55419;     554;    4447;      86;   53952;   50507;   54592;   55040;     827;     379
TEN-YEAR AGENCY NOTE - CHICAGO BOARD OF TRADE ;2001.03.13;   56263;     458;    4332;     757;   54520;   50646;   55735;   55735;     528;     528
TEN-YEAR AGENCY NOTE - CHICAGO BOARD OF TRADE ;2001.03.06;   49153;    1498;    2185;    1845;   45098;   44592;   48441;   48622;     712;     531
TEN-YEAR AGENCY NOTE - CHICAGO BOARD OF TRADE ;2001.02.27;   50185;    1304;    4647;     317;   47431;   44369;   49052;   49333;    1133;     852
TEN-YEAR AGENCY NOTE - CHICAGO BOARD OF TRADE ;2001.02.20;   45076;    1033;    3773;      33;   43188;   40671;   44254;   44477;     822;     599
TEN-YEAR AGENCY NOTE - CHICAGO BOARD OF TRADE ;2001.02.13;   49830;     620;    1702;    1355;   47418;   46413;   49393;   49469;     438;     361
TEN-YEAR AGENCY NOTE - CHICAGO BOARD OF TRADE ;2001.02.06;   50479;     669;    1737;    1444;   47898;   46983;   50011;   50164;     468;     315
TEN-YEAR AGENCY NOTE - CHICAGO BOARD OF TRADE ;2001.01.30;   52934;    1165;    2336;    1361;   49902;   48926;   52428;   52622;     506;     312
TEN-YEAR AGENCY NOTE - CHICAGO BOARD OF TRADE ;2001.01.23;   50737;    1193;    1166;    1154;   47972;   48102;   50319;   50423;     418;     314
TEN-YEAR AGENCY NOTE - CHICAGO BOARD OF TRADE ;2001.01.16;   52032;    1243;    3726;    1220;   49101;   46768;   51564;   51714;     468;     318
TEN-YEAR AGENCY NOTE - CHICAGO BOARD OF TRADE ;2001.01.09;   52002;    3309;    3051;    1437;   46730;   47252;   51476;   51741;     526;     261
TEN-YEAR AGENCY NOTE - CHICAGO BOARD OF TRADE ;2001.01.02;   54373;     617;    3457;    1005;   52264;   49286;   53886;   53748;     487;     625
TEN-YEAR AGENCY NOTE - CHICAGO BOARD OF TRADE ;2000.12.26;   58991;     644;    2866;    1152;   57010;   54179;   58806;   58197;     185;     794
TEN-YEAR AGENCY NOTE - CHICAGO BOARD OF TRADE ;2000.12.19;   57926;     576;    2816;    1153;   56029;   53528;   57758;   57497;     169;     429
TEN-YEAR AGENCY NOTE - CHICAGO BOARD OF TRADE ;2000.12.12;   60762;     942;    3028;     804;   58722;   56394;   60467;   60226;     295;     536
TEN-YEAR AGENCY NOTE - CHICAGO BOARD OF TRADE ;2000.12.05;   65067;    3855;    3363;     498;   60285;   60567;   64639;   64428;     428;     638
TEN-YEAR AGENCY NOTE - CHICAGO BOARD OF TRADE ;2000.11.28;   57341;    3640;    2707;     478;   52106;   52980;   56224;   56165;    1118;    1176
TEN-YEAR AGENCY NOTE - CHICAGO BOARD OF TRADE ;2000.11.21;   54121;    3478;    2580;     258;   50000;   50891;   53735;   53729;     385;     392
TEN-YEAR AGENCY NOTE - CHICAGO BOARD OF TRADE ;2000.11.14;   61206;    3150;    2943;    1997;   55391;   55863;   60538;   60803;     668;     403
TEN-YEAR AGENCY NOTE - CHICAGO BOARD OF TRADE ;2000.11.07;   56373;    2934;    2359;    1452;   51686;   52062;   56071;   55873;     302;     500
TEN-YEAR AGENCY NOTE - CHICAGO BOARD OF TRADE ;2000.10.31;   58323;    3089;    1363;    1925;   52874;   54470;   57888;   57757;     435;     567
TEN-YEAR AGENCY NOTE - CHICAGO BOARD OF TRADE ;2000.10.24;   60150;    2917;    2589;    2328;   54234;   54660;   59479;   59577;     671;     573
TEN-YEAR AGENCY NOTE - CHICAGO BOARD OF TRADE ;2000.10.17;   61219;    4067;    8233;    1559;   55064;   50993;   60690;   60784;     530;     435
TEN-YEAR AGENCY NOTE - CHICAGO BOARD OF TRADE ;2000.10.10;   54597;    3482;    8515;     498;   49991;   45217;   53971;   54230;     626;     368
TEN-YEAR AGENCY NOTE - CHICAGO BOARD OF TRADE ;2000.10.03;   47632;    1764;    6306;     520;   44848;   40044;   47133;   46870;     500;     762
TEN-YEAR AGENCY NOTE - CHICAGO BOARD OF TRADE ;2000.09.26;   49140;    1819;    5664;     491;   46168;   40692;   48478;   46848;     662;    2292
TEN-YEAR AGENCY NOTE - CHICAGO BOARD OF TRADE ;2000.09.19;   53978;    1748;    4299;     363;   50599;   47417;   52710;   52079;    1268;    1899
TEN-YEAR AGENCY NOTE - CHICAGO BOARD OF TRADE ;2000.09.12;   56312;    1485;    3773;    1613;   52647;   50182;   55745;   55568;     567;     743
TEN-YEAR AGENCY NOTE - CHICAGO BOARD OF TRADE ;2000.09.05;   47595;    2220;    4652;    2473;   42462;   39220;   47156;   46346;     439;    1249
TEN-YEAR AGENCY NOTE - CHICAGO BOARD OF TRADE ;2000.08.29;   44291;    2671;    5027;    1620;   39662;   36723;   43953;   43370;     339;     921
TEN-YEAR AGENCY NOTE - CHICAGO BOARD OF TRADE ;2000.08.22;   40547;    8037;    5909;     698;   30932;   31962;   39667;   38569;     880;    1979
TEN-YEAR AGENCY NOTE - CHICAGO BOARD OF TRADE ;2000.08.15;   49110;    8809;    6147;    1624;   37850;   39193;   48283;   46963;     827;    2147
TEN-YEAR AGENCY NOTE - CHICAGO BOARD OF TRADE ;2000.08.08;   47308;    8455;    6479;    1486;   35867;   35410;   45808;   43375;    1500;    3933
TEN-YEAR AGENCY NOTE - CHICAGO BOARD OF TRADE ;2000.08.01;   46016;    8128;    8623;    1728;   34936;   31715;   44792;   42066;    1224;    3950
TEN-YEAR AGENCY NOTE - CHICAGO BOARD OF TRADE ;2000.07.25;   45235;    8152;    8218;    1735;   34577;   32153;   44463;   42105;     772;    3130
TEN-YEAR AGENCY NOTE - CHICAGO BOARD OF TRADE ;2000.07.18;   47710;    8493;    7111;    2592;   35338;   32994;   46423;   42698;    1287;    5012
TEN-YEAR AGENCY NOTE - CHICAGO BOARD OF TRADE ;2000.07.11;   50121;    8523;    6393;    2523;   37329;   37777;   48375;   46694;    1746;    3428
TEN-YEAR AGENCY NOTE - CHICAGO BOARD OF TRADE ;2000.07.05;   51150;    7586;    5831;     910;   40464;   41625;   48959;   48366;    2191;    2784
TEN-YEAR AGENCY NOTE - CHICAGO BOARD OF TRADE ;2000.06.27;   50059;    7304;    5582;     859;   39499;   40822;   47661;   47262;    2398;    2796
TEN-YEAR AGENCY NOTE - CHICAGO BOARD OF TRADE ;2000.06.20;   53943;    1670;    3054;     618;   48329;   46141;   50616;   49812;    3327;    4131
TEN-YEAR AGENCY NOTE - CHICAGO BOARD OF TRADE ;2000.06.13;   47557;    1604;    2977;    1417;   40813;   39684;   43834;   44077;    3724;    3480
TEN-YEAR AGENCY NOTE - CHICAGO BOARD OF TRADE ;2000.06.06;   46751;    2263;    4002;    4671;   37645;   35009;   44579;   43681;    2171;    3070
TEN-YEAR AGENCY NOTE - CHICAGO BOARD OF TRADE ;2000.05.30;   40628;    1186;    2639;    1616;   35891;   33394;   38693;   37649;    1934;    2979
TEN-YEAR AGENCY NOTE - CHICAGO BOARD OF TRADE ;2000.05.23;   40440;     924;    2684;     951;   36753;   33734;   38627;   37368;    1813;    3072
TEN-YEAR AGENCY NOTE - CHICAGO BOARD OF TRADE ;2000.05.16;   44889;    1713;    3653;     947;   39657;   37049;   42317;   41650;    2572;    3240
TEN-YEAR AGENCY NOTE - CHICAGO BOARD OF TRADE ;2000.05.09;   38056;    1591;    2325;     816;   33263;   31662;   35670;   34802;    2386;    3254
TEN-YEAR AGENCY NOTE - CHICAGO BOARD OF TRADE ;2000.05.02;   33150;    1825;    1745;     777;   28221;   28490;   30823;   31013;    2327;    2138
TEN-YEAR AGENCY NOTE - CHICAGO BOARD OF TRADE ;2000.04.25;   31113;    2636;    1471;     491;   25529;   27498;   28657;   29460;    2456;    1653
TEN-YEAR AGENCY NOTE - CHICAGO BOARD OF TRADE ;2000.04.18;   30609;    2794;    1555;     514;   25614;   26904;   28922;   28972;    1687;    1636
TEN-YEAR AGENCY NOTE - CHICAGO BOARD OF TRADE ;2000.04.11;   30333;    2286;    6582;     438;   25865;   21686;   28589;   28705;    1744;    1628
TEN-YEAR AGENCY NOTE - CHICAGO BOARD OF TRADE ;2000.04.04;   22813;   19254;   19897;    1953;       0;       0;   21207;   21850;    1606;     963
TEN-YEAR AGENCY NOTE - CHICAGO BOARD OF TRADE ;2000.03.28;    9679;    6269;    8353;     986;       0;      70;    7255;    9409;    2424;     270
TEN-YEAR AGENCY NOTE - CHICAGO BOARD OF TRADE ;2000.03.21;    2467;    1103;    1583;     474;       0;       0;    1577;    2057;     890;     410
TEN-YEAR AGENCY NOTE - CHICAGO BOARD OF TRADE ;2003.09.02;    4618;       0;     251;       0;    4505;    4314;    4505;    4565;     113;      53
TEN-YEAR AGENCY NOTE - CHICAGO BOARD OF TRADE ;2003.08.26;    3883;       0;     384;       0;    3779;    3432;    3779;    3816;     104;      67
TEN-YEAR AGENCY NOTE - CHICAGO BOARD OF TRADE ;2003.08.19;    3981;       0;     439;       0;    3873;    3462;    3873;    3901;     108;      80
TEN-YEAR AGENCY NOTE - CHICAGO BOARD OF TRADE ;2003.08.12;    3900;       0;     409;       0;    3796;    3362;    3796;    3771;     104;     129
TEN-YEAR AGENCY NOTE - CHICAGO BOARD OF TRADE ;2003.08.05;    4036;       0;     565;       0;    3931;    3397;    3931;    3962;     105;      74
TEN-YEAR AGENCY NOTE - CHICAGO BOARD OF TRADE ;2003.07.29;    4209;      25;     635;       0;    4073;    3486;    4098;    4121;     111;      88
TEN-YEAR AGENCY NOTE - CHICAGO BOARD OF TRADE ;2003.07.22;    4303;       0;     665;       0;    4192;    3527;    4192;    4192;     111;     111
TEN-YEAR AGENCY NOTE - CHICAGO BOARD OF TRADE ;2003.07.01;    4756;      50;     520;       0;    4563;    4184;    4613;    4704;     143;      52
TEN-YEAR AGENCY NOTE - CHICAGO BOARD OF TRADE ;2003.06.24;    6817;     106;     625;       0;    6552;    6133;    6658;    6758;     159;      59
TEN-YEAR AGENCY NOTE - CHICAGO BOARD OF TRADE ;2003.06.03;    5180;     152;     611;       0;    4907;    4546;    5059;    5157;     121;      23
TEN-YEAR AGENCY NOTE - CHICAGO BOARD OF TRADE ;2003.05.27;    4999;     130;     261;       0;    4750;    4723;    4880;    4984;     119;      15
TEN-YEAR AGENCY NOTE - CHICAGO BOARD OF TRADE ;2003.05.20;    5581;     130;     261;       0;    5335;    5305;    5465;    5566;     116;      15
TEN-YEAR AGENCY NOTE - CHICAGO BOARD OF TRADE ;2003.05.13;    5599;     115;     326;       0;    5368;    5255;    5483;    5581;     116;      18
TEN-YEAR AGENCY NOTE - CHICAGO BOARD OF TRADE ;2003.05.06;    5609;      85;     326;       0;    5402;    5252;    5487;    5578;     122;      31
TEN-YEAR AGENCY NOTE - CHICAGO BOARD OF TRADE ;2003.04.29;    5626;      78;     326;       0;    5441;    5272;    5519;    5598;     107;      28
TEN-YEAR AGENCY NOTE - CHICAGO BOARD OF TRADE ;2003.04.22;    5598;      78;     276;       0;    5399;    5292;    5477;    5568;     121;      30
TEN-YEAR AGENCY NOTE - CHICAGO BOARD OF TRADE ;2003.04.15;    5891;      32;     276;       0;    5698;    5582;    5730;    5858;     161;      33
TEN-YEAR AGENCY NOTE - CHICAGO BOARD OF TRADE ;2003.04.08;    5826;     163;      40;      61;    5472;    5690;    5696;    5791;     130;      35
TEN-YEAR AGENCY NOTE - CHICAGO BOARD OF TRADE ;2003.04.01;    5916;     182;     340;      61;    5540;    5487;    5783;    5888;     133;      28
TEN-YEAR AGENCY NOTE - CHICAGO BOARD OF TRADE ;2003.03.25;    6025;     104;     390;      61;    5720;    5521;    5885;    5972;     140;      53
TEN-YEAR AGENCY NOTE - CHICAGO BOARD OF TRADE ;2003.03.18;    6228;     321;     540;      61;    5708;    5571;    6090;    6172;     138;      56
TEN-YEAR AGENCY NOTE - CHICAGO BOARD OF TRADE ;2003.03.11;    7037;     352;     240;      61;    6477;    6599;    6890;    6900;     147;     137
TEN-YEAR AGENCY NOTE - CHICAGO BOARD OF TRADE ;2003.03.04;    7672;     350;     330;      61;    7096;    7176;    7507;    7567;     165;     105
TEN-YEAR AGENCY NOTE - CHICAGO BOARD OF TRADE ;2003.02.25;    7191;     360;     130;      61;    6597;    6876;    7018;    7067;     173;     124
TEN-YEAR AGENCY NOTE - CHICAGO BOARD OF TRADE ;2003.02.18;    8087;     270;     168;      61;    7586;    7742;    7917;    7971;     170;     116
TEN-YEAR AGENCY NOTE - CHICAGO BOARD OF TRADE ;2003.02.11;    8953;     162;      25;      61;    8542;    8772;    8765;    8858;     188;      95
TEN-YEAR AGENCY NOTE - CHICAGO BOARD OF TRADE ;2003.02.04;    9901;     168;      25;      61;    9501;    9707;    9730;    9793;     171;     108
TEN-YEAR AGENCY NOTE - CHICAGO BOARD OF TRADE ;2003.01.28;    9970;     170;      25;      61;    9553;    9807;    9784;    9893;     186;      77
TEN-YEAR AGENCY NOTE - CHICAGO BOARD OF TRADE ;2003.01.21;   10173;     295;      25;      61;    9618;   10011;    9974;   10097;     199;      76
TEN-YEAR AGENCY NOTE - CHICAGO BOARD OF TRADE ;2003.01.14;   10821;     192;      25;      61;   10333;   10664;   10586;   10750;     235;      71
TEN-YEAR AGENCY NOTE - CHICAGO BOARD OF TRADE ;2003.01.07;   10933;     352;     153;      61;   10333;   10639;   10746;   10853;     187;      80
TEN-YEAR AGENCY NOTE - CHICAGO BOARD OF TRADE ;2002.12.31;   11252;     470;     198;      61;   10558;   10907;   11089;   11166;     163;      86
TEN-YEAR AGENCY NOTE - CHICAGO BOARD OF TRADE ;2002.12.23;   11286;     449;     446;      54;   10621;   10687;   11124;   11187;     162;      99
TEN-YEAR AGENCY NOTE - CHICAGO BOARD OF TRADE ;2002.12.17;   11041;     285;     435;      54;   10560;   10477;   10899;   10966;     142;      75
TEN-YEAR AGENCY NOTE - CHICAGO BOARD OF TRADE ;2002.12.10;   17314;     363;     159;      88;   16736;   16977;   17187;   17224;     127;      90
TEN-YEAR AGENCY NOTE - CHICAGO BOARD OF TRADE ;2002.12.03;   14764;     376;     356;       6;   14235;   14214;   14617;   14576;     147;     188
TEN-YEAR AGENCY NOTE - CHICAGO BOARD OF TRADE ;2002.11.26;   12573;     502;     221;       0;   12040;   12175;   12542;   12396;      31;     177
TEN-YEAR AGENCY NOTE - CHICAGO BOARD OF TRADE ;2002.11.19;   13986;     108;     266;      24;   13659;   13531;   13791;   13821;     195;     165
TEN-YEAR AGENCY NOTE - CHICAGO BOARD OF TRADE ;2002.11.12;   14349;     170;     622;       0;   14008;   13531;   14178;   14153;     171;     196
TEN-YEAR AGENCY NOTE - CHICAGO BOARD OF TRADE ;2002.11.05;   15566;      83;     775;       0;   15279;   14627;   15362;   15402;     204;     164
TEN-YEAR AGENCY NOTE - CHICAGO BOARD OF TRADE ;2002.10.29;   15573;     170;     624;       0;   15223;   14787;   15393;   15411;     180;     162
TEN-YEAR AGENCY NOTE - CHICAGO BOARD OF TRADE ;2002.10.22;   15743;     205;     624;       0;   15323;   14985;   15528;   15609;     215;     134
TEN-YEAR AGENCY NOTE - CHICAGO BOARD OF TRADE ;2002.10.15;   16838;     741;     693;       0;   15874;   16018;   16615;   16711;     223;     127
TEN-YEAR AGENCY NOTE - CHICAGO BOARD OF TRADE ;2002.10.08;   16943;    1002;     743;       0;   15686;   16063;   16688;   16806;     255;     137
TEN-YEAR AGENCY NOTE - CHICAGO BOARD OF TRADE ;2002.10.01;   17171;     904;     743;       0;   16007;   16289;   16911;   17032;     260;     139
TEN-YEAR AGENCY NOTE - CHICAGO BOARD OF TRADE ;2002.09.24;   18526;    1754;     830;       0;   16501;   17582;   18255;   18412;     271;     114
TEN-YEAR AGENCY NOTE - CHICAGO BOARD OF TRADE ;2002.09.17;   18128;    1128;     979;     200;   16412;   16742;   17740;   17921;     388;     207
TEN-YEAR AGENCY NOTE - CHICAGO BOARD OF TRADE ;2002.09.10;   17996;    1151;    1384;     250;   16366;   16201;   17767;   17835;     229;     161
TEN-YEAR AGENCY NOTE - CHICAGO BOARD OF TRADE ;2002.09.03;   18240;    1463;    1093;      61;   16425;   16866;   17949;   18020;     291;     220
TEN-YEAR AGENCY NOTE - CHICAGO BOARD OF TRADE ;2002.08.27;   18564;     909;    1730;       0;   17360;   16312;   18269;   18042;     295;     522
TEN-YEAR AGENCY NOTE - CHICAGO BOARD OF TRADE ;2002.08.20;   21063;    1052;    1300;       0;   19723;   19366;   20775;   20666;     288;     397
TEN-YEAR AGENCY NOTE - CHICAGO BOARD OF TRADE ;2002.08.13;   22970;    1839;    1261;       0;   20880;   21125;   22719;   22386;     251;     584
TEN-YEAR AGENCY NOTE - CHICAGO BOARD OF TRADE ;2002.08.06;   24225;     914;    2787;      50;   22940;   20757;   23904;   23594;     321;     631
TEN-YEAR AGENCY NOTE - CHICAGO BOARD OF TRADE ;2002.07.30;   24276;     847;    3141;      50;   23131;   20871;   24028;   24062;     248;     214
TEN-YEAR AGENCY NOTE - CHICAGO BOARD OF TRADE ;2002.07.23;   24200;     883;    2308;      50;   23012;   21631;   23945;   23989;     255;     211
TEN-YEAR AGENCY NOTE - CHICAGO BOARD OF TRADE ;2002.07.16;   24738;     986;    2033;      50;   23433;   22334;   24469;   24417;     269;     321
TEN-YEAR AGENCY NOTE - CHICAGO BOARD OF TRADE ;2002.07.09;   25396;     755;    3163;      50;   24367;   21954;   25172;   25167;     224;     229
TEN-YEAR AGENCY NOTE - CHICAGO BOARD OF TRADE ;2002.07.02;   25377;     831;    3051;      50;   24241;   22072;   25122;   25173;     255;     204
TEN-YEAR AGENCY NOTE - CHICAGO BOARD OF TRADE ;2002.06.25;   33419;     954;    3937;      50;   32082;   29272;   33086;   33259;     333;     160
TEN-YEAR AGENCY NOTE - CHICAGO BOARD OF TRADE ;2002.06.18;   33099;     966;    3803;      93;   31951;   29038;   33010;   32934;      89;     165
TEN-YEAR AGENCY NOTE - CHICAGO BOARD OF TRADE ;2002.06.11;   34329;     744;    3664;    1172;   32092;   29258;   34008;   34094;     321;     235
TEN-YEAR AGENCY NOTE - CHICAGO BOARD OF TRADE ;2002.06.04;   25659;     988;    2566;     575;   23831;   22370;   25394;   25511;     265;     148
TEN-YEAR AGENCY NOTE - CHICAGO BOARD OF TRADE ;2002.05.28;   25929;     802;    2021;     846;   24106;   19754;   25754;   22621;     175;    3308
TEN-YEAR AGENCY NOTE - CHICAGO BOARD OF TRADE ;2002.05.21;   25472;    1011;    1152;      70;   24014;   23982;   25095;   25204;     377;     268
TEN-YEAR AGENCY NOTE - CHICAGO BOARD OF TRADE ;2002.05.14;   26188;     462;    1633;      71;   25243;   24072;   25776;   25776;     412;     412
TEN-YEAR AGENCY NOTE - CHICAGO BOARD OF TRADE ;2002.05.07;   30025;    1091;    2026;      71;   28524;   26895;   29686;   28992;     339;    1033
TEN-YEAR AGENCY NOTE - CHICAGO BOARD OF TRADE ;2002.04.30;   31792;     682;    2342;       1;   30783;   29199;   31466;   31542;     326;     250
TEN-YEAR AGENCY NOTE - CHICAGO BOARD OF TRADE ;2002.04.23;   32139;     920;    2271;       1;   30947;   29711;   31868;   31983;     271;     156
TEN-YEAR AGENCY NOTE - CHICAGO BOARD OF TRADE ;2002.04.16;   32407;    1145;    2121;       1;   31005;   30113;   32151;   32235;     256;     172
TEN-YEAR AGENCY NOTE - CHICAGO BOARD OF TRADE ;2002.04.09;   32893;     397;    1826;       1;   32186;   30740;   32584;   32567;     309;     326
TEN-YEAR AGENCY NOTE - CHICAGO BOARD OF TRADE ;2002.04.02;   33415;     249;    2371;       1;   32876;   30700;   33126;   33072;     289;     343
TEN-YEAR AGENCY NOTE - CHICAGO BOARD OF TRADE ;2002.03.26;   49611;     378;    2973;       0;   48927;   46295;   49305;   49268;     306;     343
TEN-YEAR AGENCY NOTE - CHICAGO BOARD OF TRADE ;2002.03.19;   49239;     374;    2414;       0;   48612;   46477;   48986;   48891;     253;     348
TEN-YEAR AGENCY NOTE - CHICAGO BOARD OF TRADE ;2002.03.12;   46949;     421;    1699;     332;   45939;   44507;   46692;   46538;     257;     411
TEN-YEAR AGENCY NOTE - CHICAGO BOARD OF TRADE ;2002.03.05;   44943;     360;    2014;     494;   43806;   42072;   44660;   44580;     283;     363
TEN-YEAR AGENCY NOTE - CHICAGO BOARD OF TRADE ;2002.02.26;   36029;     425;    2658;     238;   35128;   32821;   35791;   35717;     238;     312
TEN-YEAR AGENCY NOTE - CHICAGO BOARD OF TRADE ;2002.02.19;   34304;     660;    2170;      32;   33305;   31758;   33997;   33960;     307;     344
TEN-YEAR AGENCY NOTE - CHICAGO BOARD OF TRADE ;2002.02.12;   36080;     714;    2572;       0;   35006;   33044;   35720;   35616;     360;     464
TEN-YEAR AGENCY NOTE - CHICAGO BOARD OF TRADE ;2002.02.05;   37017;     539;    2352;       0;   36157;   34285;   36696;   36637;     321;     380
TEN-YEAR AGENCY NOTE - CHICAGO BOARD OF TRADE ;2002.01.29;   36646;     399;    2549;       0;   35946;   33959;   36345;   36508;     301;     138
TEN-YEAR AGENCY NOTE - CHICAGO BOARD OF TRADE ;2002.01.22;   37127;     416;    1865;       0;   36376;   35091;   36792;   36956;     335;     171
TEN-YEAR AGENCY NOTE - CHICAGO BOARD OF TRADE ;2002.01.15;   36752;     383;    1730;       0;   36078;   34859;   36461;   36589;     291;     163
TEN-YEAR AGENCY NOTE - CHICAGO BOARD OF TRADE ;2002.01.08;   39971;     591;    1851;       0;   39076;   37975;   39667;   39826;     304;     145
TEN-YEAR AGENCY NOTE - CHICAGO BOARD OF TRADE ;2001.12.28;   38787;     550;    1930;       0;   38008;   36691;   38558;   38621;     229;     166
TEN-YEAR AGENCY NOTE - CHICAGO BOARD OF TRADE ;2001.12.21;   38846;     748;    1780;       0;   37879;   36890;   38627;   38670;     219;     176
TEN-YEAR AGENCY NOTE - CHICAGO BOARD OF TRADE ;2001.12.18;   39790;    1027;    2350;     125;   38094;   37131;   39246;   39606;     544;     184
TEN-YEAR AGENCY NOTE - CHICAGO BOARD OF TRADE ;2001.12.11;   36783;     354;    1998;     760;   35464;   33893;   36578;   36651;     205;     132
TEN-YEAR AGENCY NOTE - CHICAGO BOARD OF TRADE ;2001.12.04;   35011;     403;    1382;     314;   33960;   33212;   34677;   34908;     334;     103
TEN-YEAR AGENCY NOTE - CHICAGO BOARD OF TRADE ;2001.11.27;   33070;     173;    2009;      35;   32624;   30936;   32832;   32980;     238;      90
TEN-YEAR AGENCY NOTE - CHICAGO BOARD OF TRADE ;2001.11.20;   32895;      29;    1674;       0;   32492;   31091;   32521;   32765;     374;     130
TEN-YEAR AGENCY NOTE - CHICAGO BOARD OF TRADE ;2001.11.13;   33250;     209;     896;       0;   32844;   31555;   33053;   32451;     197;     799
TEN-YEAR AGENCY NOTE - CHICAGO BOARD OF TRADE ;2001.11.06;   33920;     209;    1266;       0;   33353;   32298;   33562;   33564;     358;     356
TEN-YEAR AGENCY NOTE - CHICAGO BOARD OF TRADE ;2001.10.30;   38343;     765;    1421;       0;   37248;   36530;   38013;   37951;     330;     392
TEN-YEAR AGENCY NOTE - CHICAGO BOARD OF TRADE ;2001.10.23;   39055;     452;     915;       0;   38234;   37536;   38686;   38451;     369;     604
TEN-YEAR AGENCY NOTE - CHICAGO BOARD OF TRADE ;2001.10.16;   40992;     694;    1166;       0;   39636;   39643;   40330;   40809;     662;     183
TEN-YEAR AGENCY NOTE - CHICAGO BOARD OF TRADE ;2001.10.09;   42245;     430;    1521;       0;   41599;   40432;   42029;   41953;     216;     292
TEN-YEAR AGENCY NOTE - CHICAGO BOARD OF TRADE ;2001.10.02;   42877;     586;    1887;       0;   42107;   40688;   42693;   42575;     184;     302
TEN-YEAR AGENCY NOTE - CHICAGO BOARD OF TRADE ;2001.09.25;   57890;     574;    3921;       0;   57127;   53686;   57701;   57607;     189;     283
TEN-YEAR AGENCY NOTE - CHICAGO BOARD OF TRADE ;2001.09.18;   61593;     542;    4374;      50;   60200;   56350;   60792;   60774;     801;     819
TEN-YEAR AGENCY NOTE - CHICAGO BOARD OF TRADE ;2001.09.10;   66324;     505;    3983;    1677;   63271;   59724;   65453;   65384;     871;     940
TEN-YEAR AGENCY NOTE - CHICAGO BOARD OF TRADE ;2001.09.04;   62930;     498;    4545;    1929;   59817;   56120;   62244;   62594;     686;     336
TEN-YEAR AGENCY NOTE - CHICAGO BOARD OF TRADE ;2001.08.28;   52872;    1005;    5084;    3764;   47556;   43541;   52325;   52389;     547;     483
TEN-YEAR AGENCY NOTE - CHICAGO BOARD OF TRADE ;2001.08.21;   49343;    1066;    4920;      66;   47869;   44107;   49001;   49093;     342;     250
TEN-YEAR AGENCY NOTE - CHICAGO BOARD OF TRADE ;2001.08.14;   48795;    1114;    5733;       4;   47296;   42857;   48414;   48594;     381;     201
TEN-YEAR AGENCY NOTE - CHICAGO BOARD OF TRADE ;2001.08.07;   51205;     807;    6496;       0;   50057;   44509;   50864;   51005;     341;     200
TEN-YEAR AGENCY NOTE - CHICAGO BOARD OF TRADE ;2001.07.31;   51970;     859;    5816;       0;   50523;   45964;   51382;   51780;     588;     190
TEN-YEAR AGENCY NOTE - CHICAGO BOARD OF TRADE ;2001.07.24;   54185;    1073;    6455;       0;   52366;   47291;   53439;   53746;     746;     439
TEN-YEAR AGENCY NOTE - CHICAGO BOARD OF TRADE ;2001.07.17;   59308;     803;    6396;       0;   57616;   50646;   58419;   57042;     889;    2266
TEN-YEAR AGENCY NOTE - CHICAGO BOARD OF TRADE ;2001.07.10;   58445;     961;    6615;       0;   57062;   51425;   58023;   58040;     422;     405
TEN-YEAR AGENCY NOTE - CHICAGO BOARD OF TRADE ;2001.07.03;   59012;     821;    7037;       0;   57843;   51643;   58664;   58680;     348;     332
TEN-YEAR AGENCY NOTE - CHICAGO BOARD OF TRADE ;2001.06.26;   68683;     938;    6204;     901;   65654;   56888;   67493;   63993;    1190;    4690
TEN-YEAR AGENCY NOTE - CHICAGO BOARD OF TRADE ;2001.06.19;   67403;    1009;    5291;     786;   65336;   60651;   67131;   66728;     272;     675
TEN-YEAR AGENCY NOTE - CHICAGO BOARD OF TRADE ;2001.06.12;   70741;    1030;    4355;    2759;   66737;   62993;   70526;   70107;     215;     634
TEN-YEAR AGENCY NOTE - CHICAGO BOARD OF TRADE ;2001.06.05;   62981;     917;    2755;    1797;   60118;   58374;   62832;   62926;     149;      55
TEN-YEAR AGENCY NOTE - CHICAGO BOARD OF TRADE ;2001.05.29;   57738;    1214;    2999;    2321;   53782;   52194;   57317;   57514;     421;     224
TEN-YEAR AGENCY NOTE - CHICAGO BOARD OF TRADE ;2001.05.22;   50375;    2682;    2805;     756;   46669;   46610;   50107;   50171;     268;     204
TEN-YEAR AGENCY NOTE - CHICAGO BOARD OF TRADE ;2001.05.15;   50870;     946;    2534;     582;   49114;   47174;   50642;   50290;     228;     580
TEN-YEAR AGENCY NOTE - CHICAGO BOARD OF TRADE ;2001.05.08;   48365;    1389;    1610;       1;   46255;   45145;   47645;   46756;     720;    1609
TEN-YEAR AGENCY NOTE - CHICAGO BOARD OF TRADE ;2001.05.01;   50896;     827;    1083;       0;   49610;   46543;   50437;   47626;     459;    3270
TEN-YEAR AGENCY NOTE - CHICAGO BOARD OF TRADE ;2001.04.24;   52896;     691;    1954;       2;   51609;   50335;   52302;   52291;     595;     606
TEN-YEAR AGENCY NOTE - CHICAGO BOARD OF TRADE ;2001.04.17;   52057;     535;    2187;       1;   51238;   49219;   51774;   51407;     283;     650
TEN-YEAR AGENCY NOTE - CHICAGO BOARD OF TRADE ;2001.04.10;   53033;     682;    2040;       1;   52057;   50311;   52740;   52352;     293;     681
TEN-YEAR AGENCY NOTE - CHICAGO BOARD OF TRADE ;2001.04.03;   51460;     680;    1127;       2;   50320;   49683;   51002;   50812;     458;     648
TEN-YEAR AGENCY NOTE - CHICAGO BOARD OF TRADE ;2001.03.27;   55293;     686;    5305;      22;   54138;   49536;   54846;   54863;     447;     430
TEN-YEAR AGENCY NOTE - CHICAGO BOARD OF TRADE ;2001.03.20;   55419;     554;    4447;      86;   53952;   50507;   54592;   55040;     827;     379
TEN-YEAR AGENCY NOTE - CHICAGO BOARD OF TRADE ;2001.03.13;   56263;     458;    4332;     757;   54520;   50646;   55735;   55735;     528;     528
TEN-YEAR AGENCY NOTE - CHICAGO BOARD OF TRADE ;2001.03.06;   49153;    1498;    2185;    1845;   45098;   44592;   48441;   48622;     712;     531
TEN-YEAR AGENCY NOTE - CHICAGO BOARD OF TRADE ;2001.02.27;   50185;    1304;    4647;     317;   47431;   44369;   49052;   49333;    1133;     852
TEN-YEAR AGENCY NOTE - CHICAGO BOARD OF TRADE ;2001.02.20;   45076;    1033;    3773;      33;   43188;   40671;   44254;   44477;     822;     599
TEN-YEAR AGENCY NOTE - CHICAGO BOARD OF TRADE ;2001.02.13;   49830;     620;    1702;    1355;   47418;   46413;   49393;   49469;     438;     361
TEN-YEAR AGENCY NOTE - CHICAGO BOARD OF TRADE ;2001.02.06;   50479;     669;    1737;    1444;   47898;   46983;   50011;   50164;     468;     315
TEN-YEAR AGENCY NOTE - CHICAGO BOARD OF TRADE ;2001.01.30;   52934;    1165;    2336;    1361;   49902;   48926;   52428;   52622;     506;     312
TEN-YEAR AGENCY NOTE - CHICAGO BOARD OF TRADE ;2001.01.23;   50737;    1193;    1166;    1154;   47972;   48102;   50319;   50423;     418;     314
TEN-YEAR AGENCY NOTE - CHICAGO BOARD OF TRADE ;2001.01.16;   52032;    1243;    3726;    1220;   49101;   46768;   51564;   51714;     468;     318
TEN-YEAR AGENCY NOTE - CHICAGO BOARD OF TRADE ;2001.01.09;   52002;    3309;    3051;    1437;   46730;   47252;   51476;   51741;     526;     261
TEN-YEAR AGENCY NOTE - CHICAGO BOARD OF TRADE ;2001.01.02;   54373;     617;    3457;    1005;   52264;   49286;   53886;   53748;     487;     625
TEN-YEAR AGENCY NOTE - CHICAGO BOARD OF TRADE ;2000.12.26;   58991;     644;    2866;    1152;   57010;   54179;   58806;   58197;     185;     794
TEN-YEAR AGENCY NOTE - CHICAGO BOARD OF TRADE ;2000.12.19;   57926;     576;    2816;    1153;   56029;   53528;   57758;   57497;     169;     429
TEN-YEAR AGENCY NOTE - CHICAGO BOARD OF TRADE ;2000.12.12;   60762;     942;    3028;     804;   58722;   56394;   60467;   60226;     295;     536
TEN-YEAR AGENCY NOTE - CHICAGO BOARD OF TRADE ;2000.12.05;   65067;    3855;    3363;     498;   60285;   60567;   64639;   64428;     428;     638
TEN-YEAR AGENCY NOTE - CHICAGO BOARD OF TRADE ;2000.11.28;   57341;    3640;    2707;     478;   52106;   52980;   56224;   56165;    1118;    1176
TEN-YEAR AGENCY NOTE - CHICAGO BOARD OF TRADE ;2000.11.21;   54121;    3478;    2580;     258;   50000;   50891;   53735;   53729;     385;     392
TEN-YEAR AGENCY NOTE - CHICAGO BOARD OF TRADE ;2000.11.14;   61206;    3150;    2943;    1997;   55391;   55863;   60538;   60803;     668;     403
TEN-YEAR AGENCY NOTE - CHICAGO BOARD OF TRADE ;2000.11.07;   56373;    2934;    2359;    1452;   51686;   52062;   56071;   55873;     302;     500
TEN-YEAR AGENCY NOTE - CHICAGO BOARD OF TRADE ;2000.10.31;   58323;    3089;    1363;    1925;   52874;   54470;   57888;   57757;     435;     567
TEN-YEAR AGENCY NOTE - CHICAGO BOARD OF TRADE ;2000.10.24;   60150;    2917;    2589;    2328;   54234;   54660;   59479;   59577;     671;     573
TEN-YEAR AGENCY NOTE - CHICAGO BOARD OF TRADE ;2000.10.17;   61219;    4067;    8233;    1559;   55064;   50993;   60690;   60784;     530;     435
TEN-YEAR AGENCY NOTE - CHICAGO BOARD OF TRADE ;2000.10.10;   54597;    3482;    8515;     498;   49991;   45217;   53971;   54230;     626;     368
TEN-YEAR AGENCY NOTE - CHICAGO BOARD OF TRADE ;2000.10.03;   47632;    1764;    6306;     520;   44848;   40044;   47133;   46870;     500;     762
TEN-YEAR AGENCY NOTE - CHICAGO BOARD OF TRADE ;2000.09.26;   49140;    1819;    5664;     491;   46168;   40692;   48478;   46848;     662;    2292
TEN-YEAR AGENCY NOTE - CHICAGO BOARD OF TRADE ;2000.09.19;   53978;    1748;    4299;     363;   50599;   47417;   52710;   52079;    1268;    1899
TEN-YEAR AGENCY NOTE - CHICAGO BOARD OF TRADE ;2000.09.12;   56312;    1485;    3773;    1613;   52647;   50182;   55745;   55568;     567;     743
TEN-YEAR AGENCY NOTE - CHICAGO BOARD OF TRADE ;2000.09.05;   47595;    2220;    4652;    2473;   42462;   39220;   47156;   46346;     439;    1249
TEN-YEAR AGENCY NOTE - CHICAGO BOARD OF TRADE ;2000.08.29;   44291;    2671;    5027;    1620;   39662;   36723;   43953;   43370;     339;     921
TEN-YEAR AGENCY NOTE - CHICAGO BOARD OF TRADE ;2000.08.22;   40547;    8037;    5909;     698;   30932;   31962;   39667;   38569;     880;    1979
TEN-YEAR AGENCY NOTE - CHICAGO BOARD OF TRADE ;2000.08.15;   49110;    8809;    6147;    1624;   37850;   39193;   48283;   46963;     827;    2147
TEN-YEAR AGENCY NOTE - CHICAGO BOARD OF TRADE ;2000.08.08;   47308;    8455;    6479;    1486;   35867;   35410;   45808;   43375;    1500;    3933
TEN-YEAR AGENCY NOTE - CHICAGO BOARD OF TRADE ;2000.08.01;   46016;    8128;    8623;    1728;   34936;   31715;   44792;   42066;    1224;    3950
TEN-YEAR AGENCY NOTE - CHICAGO BOARD OF TRADE ;2000.07.25;   45235;    8152;    8218;    1735;   34577;   32153;   44463;   42105;     772;    3130
TEN-YEAR AGENCY NOTE - CHICAGO BOARD OF TRADE ;2000.07.18;   47710;    8493;    7111;    2592;   35338;   32994;   46423;   42698;    1287;    5012
TEN-YEAR AGENCY NOTE - CHICAGO BOARD OF TRADE ;2000.07.11;   50121;    8523;    6393;    2523;   37329;   37777;   48375;   46694;    1746;    3428
TEN-YEAR AGENCY NOTE - CHICAGO BOARD OF TRADE ;2000.07.05;   51150;    7586;    5831;     910;   40464;   41625;   48959;   48366;    2191;    2784
TEN-YEAR AGENCY NOTE - CHICAGO BOARD OF TRADE ;2000.06.27;   50059;    7304;    5582;     859;   39499;   40822;   47661;   47262;    2398;    2796
TEN-YEAR AGENCY NOTE - CHICAGO BOARD OF TRADE ;2000.06.20;   53943;    1670;    3054;     618;   48329;   46141;   50616;   49812;    3327;    4131
TEN-YEAR AGENCY NOTE - CHICAGO BOARD OF TRADE ;2000.06.13;   47557;    1604;    2977;    1417;   40813;   39684;   43834;   44077;    3724;    3480
TEN-YEAR AGENCY NOTE - CHICAGO BOARD OF TRADE ;2000.06.06;   46751;    2263;    4002;    4671;   37645;   35009;   44579;   43681;    2171;    3070
TEN-YEAR AGENCY NOTE - CHICAGO BOARD OF TRADE ;2000.05.30;   40628;    1186;    2639;    1616;   35891;   33394;   38693;   37649;    1934;    2979
TEN-YEAR AGENCY NOTE - CHICAGO BOARD OF TRADE ;2000.05.23;   40440;     924;    2684;     951;   36753;   33734;   38627;   37368;    1813;    3072
TEN-YEAR AGENCY NOTE - CHICAGO BOARD OF TRADE ;2000.05.16;   44889;    1713;    3653;     947;   39657;   37049;   42317;   41650;    2572;    3240
TEN-YEAR AGENCY NOTE - CHICAGO BOARD OF TRADE ;2000.05.09;   38056;    1591;    2325;     816;   33263;   31662;   35670;   34802;    2386;    3254
TEN-YEAR AGENCY NOTE - CHICAGO BOARD OF TRADE ;2000.05.02;   33150;    1825;    1745;     777;   28221;   28490;   30823;   31013;    2327;    2138
TEN-YEAR AGENCY NOTE - CHICAGO BOARD OF TRADE ;2000.04.25;   31113;    2636;    1471;     491;   25529;   27498;   28657;   29460;    2456;    1653
TEN-YEAR AGENCY NOTE - CHICAGO BOARD OF TRADE ;2000.04.18;   30609;    2794;    1555;     514;   25614;   26904;   28922;   28972;    1687;    1636
TEN-YEAR AGENCY NOTE - CHICAGO BOARD OF TRADE ;2000.04.11;   30333;    2286;    6582;     438;   25865;   21686;   28589;   28705;    1744;    1628
TEN-YEAR AGENCY NOTE - CHICAGO BOARD OF TRADE ;2000.04.04;   22813;   19254;   19897;    1953;       0;       0;   21207;   21850;    1606;     963
TEN-YEAR AGENCY NOTE - CHICAGO BOARD OF TRADE ;2000.03.28;    9679;    6269;    8353;     986;       0;      70;    7255;    9409;    2424;     270
TEN-YEAR AGENCY NOTE - CHICAGO BOARD OF TRADE ;2000.03.21;    2467;    1103;    1583;     474;       0;       0;    1577;    2057;     890;     410
