E-MINI NASDAQ 100 STOCK INDEX - INTERNATIONAL MONETARY MARKET ;1999.12.14;    9775;    4795;     704;     163;     979;    7413;    5937;    8280;    3838;    1495
E-MINI NASDAQ 100 STOCK INDEX - INTERNATIONAL MONETARY MARKET ;1999.12.07;    9672;    7501;    1557;      50;     844;    6445;    8395;    8052;    1277;    1620
E-MINI NASDAQ 100 STOCK INDEX - INTERNATIONAL MONETARY MARKET ;1999.11.30;    6943;    3563;    1737;      69;     458;    3681;    4090;    5487;    2853;    1456
E-MINI NASDAQ 100 STOCK INDEX - INTERNATIONAL MONETARY MARKET ;1999.11.23;    5812;    2907;    1812;      31;     412;    2328;    3350;    4171;    2462;    1641
E-MINI NASDAQ 100 STOCK INDEX - INTERNATIONAL MONETARY MARKET ;1999.11.16;    5152;    3010;    1420;       0;    1067;    2087;    4077;    3507;    1075;    1645
E-MINI NASDAQ 100 STOCK INDEX - INTERNATIONAL MONETARY MARKET ;1999.11.09;    4197;    2395;    1127;       0;     889;    1528;    3284;    2655;     913;    1542
E-MINI NASDAQ 100 STOCK INDEX - INTERNATIONAL MONETARY MARKET ;1999.11.02;    3591;    2283;     755;       0;     544;    1413;    2827;    2168;     764;    1423
E-MINI NASDAQ 100 STOCK INDEX - INTERNATIONAL MONETARY MARKET ;1999.10.26;    3216;    2008;     935;      45;     644;    1002;    2697;    1982;     519;    1234
E-MINI NASDAQ 100 STOCK INDEX - INTERNATIONAL MONETARY MARKET ;1999.10.19;    3448;    1818;     775;       0;     874;    1330;    2692;    2105;     756;    1343
E-MINI NASDAQ 100 STOCK INDEX - INTERNATIONAL MONETARY MARKET ;1999.10.12;    2886;    1954;     304;       0;     177;    1196;    2131;    1500;     755;    1386
E-MINI NASDAQ 100 STOCK INDEX - INTERNATIONAL MONETARY MARKET ;1999.10.05;    2426;    1115;    1025;       0;     230;     411;    1345;    1436;    1081;     990
E-MINI NASDAQ 100 STOCK INDEX - INTERNATIONAL MONETARY MARKET ;1999.09.28;    2392;    1224;     945;       0;     173;     535;    1397;    1480;     995;     912
E-MINI NASDAQ 100 STOCK INDEX - INTERNATIONAL MONETARY MARKET ;1999.09.21;    1887;    1103;     365;       0;      62;     847;    1165;    1212;     722;     675
E-MINI NASDAQ 100 STOCK INDEX - INTERNATIONAL MONETARY MARKET ;1999.09.14;    4287;    1969;     247;      51;     520;    3037;    2540;    3335;    1747;     952
E-MINI NASDAQ 100 STOCK INDEX - INTERNATIONAL MONETARY MARKET ;1999.09.07;    5489;    3387;    1535;     197;     517;    2756;    4101;    4488;    1388;    1001
E-MINI NASDAQ 100 STOCK INDEX - INTERNATIONAL MONETARY MARKET ;1999.08.31;    4840;    2892;    1560;     436;     524;    2236;    3852;    4232;     988;     608
E-MINI NASDAQ 100 STOCK INDEX - INTERNATIONAL MONETARY MARKET ;1999.08.24;    4706;    2852;    1335;     425;     544;    2247;    3821;    4007;     885;     699
E-MINI NASDAQ 100 STOCK INDEX - INTERNATIONAL MONETARY MARKET ;1999.08.17;    4367;    2491;    1255;     435;     509;    2033;    3435;    3723;     932;     644
E-MINI NASDAQ 100 STOCK INDEX - INTERNATIONAL MONETARY MARKET ;1999.08.10;    4127;    2593;    1138;     280;     511;    2225;    3384;    3643;     743;     484
E-MINI NASDAQ 100 STOCK INDEX - INTERNATIONAL MONETARY MARKET ;1999.08.03;    3562;    2074;     750;     251;     460;    1993;    2785;    2994;     777;     568
E-MINI NASDAQ 100 STOCK INDEX - INTERNATIONAL MONETARY MARKET ;1999.07.27;    2857;    1637;     605;     237;     399;    1498;    2273;    2340;     584;     517
E-MINI NASDAQ 100 STOCK INDEX - INTERNATIONAL MONETARY MARKET ;1999.07.20;    2653;    1663;     450;      73;     416;    1625;    2152;    2148;     501;     505
E-MINI NASDAQ 100 STOCK INDEX - INTERNATIONAL MONETARY MARKET ;1999.07.13;    2236;    1293;     325;       5;     470;    1399;    1768;    1729;     468;     507
E-MINI NASDAQ 100 STOCK INDEX - INTERNATIONAL MONETARY MARKET ;1999.07.06;    1525;     510;     348;       5;     576;     650;    1091;    1003;     434;     522
E-MINI NASDAQ 100 STOCK INDEX - INTERNATIONAL MONETARY MARKET ;1999.06.29;    1299;     517;     251;       0;     383;     618;     900;     869;     399;     430
E-MINI NASDAQ 100 STOCK INDEX - INTERNATIONAL MONETARY MARKET ;1999.06.22;     537;     227;      40;       0;      10;     154;     237;     194;     300;     343
E-MINI NASDAQ 100 STOCK INDEX - INTERNATIONAL MONETARY MARKET ;1999.12.14;    9775;    4795;     704;     163;     979;    7413;    5937;    8280;    3838;    1495
E-MINI NASDAQ 100 STOCK INDEX - INTERNATIONAL MONETARY MARKET ;1999.12.07;    9672;    7501;    1557;      50;     844;    6445;    8395;    8052;    1277;    1620
E-MINI NASDAQ 100 STOCK INDEX - INTERNATIONAL MONETARY MARKET ;1999.11.30;    6943;    3563;    1737;      69;     458;    3681;    4090;    5487;    2853;    1456
E-MINI NASDAQ 100 STOCK INDEX - INTERNATIONAL MONETARY MARKET ;1999.11.23;    5812;    2907;    1812;      31;     412;    2328;    3350;    4171;    2462;    1641
E-MINI NASDAQ 100 STOCK INDEX - INTERNATIONAL MONETARY MARKET ;1999.11.16;    5152;    3010;    1420;       0;    1067;    2087;    4077;    3507;    1075;    1645
E-MINI NASDAQ 100 STOCK INDEX - INTERNATIONAL MONETARY MARKET ;1999.11.09;    4197;    2395;    1127;       0;     889;    1528;    3284;    2655;     913;    1542
E-MINI NASDAQ 100 STOCK INDEX - INTERNATIONAL MONETARY MARKET ;1999.11.02;    3591;    2283;     755;       0;     544;    1413;    2827;    2168;     764;    1423
E-MINI NASDAQ 100 STOCK INDEX - INTERNATIONAL MONETARY MARKET ;1999.10.26;    3216;    2008;     935;      45;     644;    1002;    2697;    1982;     519;    1234
E-MINI NASDAQ 100 STOCK INDEX - INTERNATIONAL MONETARY MARKET ;1999.10.19;    3448;    1818;     775;       0;     874;    1330;    2692;    2105;     756;    1343
E-MINI NASDAQ 100 STOCK INDEX - INTERNATIONAL MONETARY MARKET ;1999.10.12;    2886;    1954;     304;       0;     177;    1196;    2131;    1500;     755;    1386
E-MINI NASDAQ 100 STOCK INDEX - INTERNATIONAL MONETARY MARKET ;1999.10.05;    2426;    1115;    1025;       0;     230;     411;    1345;    1436;    1081;     990
E-MINI NASDAQ 100 STOCK INDEX - INTERNATIONAL MONETARY MARKET ;1999.09.28;    2392;    1224;     945;       0;     173;     535;    1397;    1480;     995;     912
E-MINI NASDAQ 100 STOCK INDEX - INTERNATIONAL MONETARY MARKET ;1999.09.21;    1887;    1103;     365;       0;      62;     847;    1165;    1212;     722;     675
E-MINI NASDAQ 100 STOCK INDEX - INTERNATIONAL MONETARY MARKET ;1999.09.14;    4287;    1969;     247;      51;     520;    3037;    2540;    3335;    1747;     952
E-MINI NASDAQ 100 STOCK INDEX - INTERNATIONAL MONETARY MARKET ;1999.09.07;    5489;    3387;    1535;     197;     517;    2756;    4101;    4488;    1388;    1001
E-MINI NASDAQ 100 STOCK INDEX - INTERNATIONAL MONETARY MARKET ;1999.08.31;    4840;    2892;    1560;     436;     524;    2236;    3852;    4232;     988;     608
E-MINI NASDAQ 100 STOCK INDEX - INTERNATIONAL MONETARY MARKET ;1999.08.24;    4706;    2852;    1335;     425;     544;    2247;    3821;    4007;     885;     699
E-MINI NASDAQ 100 STOCK INDEX - INTERNATIONAL MONETARY MARKET ;1999.08.17;    4367;    2491;    1255;     435;     509;    2033;    3435;    3723;     932;     644
E-MINI NASDAQ 100 STOCK INDEX - INTERNATIONAL MONETARY MARKET ;1999.08.10;    4127;    2593;    1138;     280;     511;    2225;    3384;    3643;     743;     484
E-MINI NASDAQ 100 STOCK INDEX - INTERNATIONAL MONETARY MARKET ;1999.08.03;    3562;    2074;     750;     251;     460;    1993;    2785;    2994;     777;     568
E-MINI NASDAQ 100 STOCK INDEX - INTERNATIONAL MONETARY MARKET ;1999.07.27;    2857;    1637;     605;     237;     399;    1498;    2273;    2340;     584;     517
E-MINI NASDAQ 100 STOCK INDEX - INTERNATIONAL MONETARY MARKET ;1999.07.20;    2653;    1663;     450;      73;     416;    1625;    2152;    2148;     501;     505
E-MINI NASDAQ 100 STOCK INDEX - INTERNATIONAL MONETARY MARKET ;1999.07.13;    2236;    1293;     325;       5;     470;    1399;    1768;    1729;     468;     507
E-MINI NASDAQ 100 STOCK INDEX - INTERNATIONAL MONETARY MARKET ;1999.07.06;    1525;     510;     348;       5;     576;     650;    1091;    1003;     434;     522
E-MINI NASDAQ 100 STOCK INDEX - INTERNATIONAL MONETARY MARKET ;1999.06.29;    1299;     517;     251;       0;     383;     618;     900;     869;     399;     430
E-MINI NASDAQ 100 STOCK INDEX - INTERNATIONAL MONETARY MARKET ;1999.06.22;     537;     227;      40;       0;      10;     154;     237;     194;     300;     343
E-MINI NASDAQ 100 STOCK INDEX - INTERNATIONAL MONETARY MARKET ;1999.12.14;    9775;    4795;     704;     163;     979;    7413;    5937;    8280;    3838;    1495
E-MINI NASDAQ 100 STOCK INDEX - INTERNATIONAL MONETARY MARKET ;1999.12.07;    9672;    7501;    1557;      50;     844;    6445;    8395;    8052;    1277;    1620
E-MINI NASDAQ 100 STOCK INDEX - INTERNATIONAL MONETARY MARKET ;1999.11.30;    6943;    3563;    1737;      69;     458;    3681;    4090;    5487;    2853;    1456
E-MINI NASDAQ 100 STOCK INDEX - INTERNATIONAL MONETARY MARKET ;1999.11.23;    5812;    2907;    1812;      31;     412;    2328;    3350;    4171;    2462;    1641
E-MINI NASDAQ 100 STOCK INDEX - INTERNATIONAL MONETARY MARKET ;1999.11.16;    5152;    3010;    1420;       0;    1067;    2087;    4077;    3507;    1075;    1645
E-MINI NASDAQ 100 STOCK INDEX - INTERNATIONAL MONETARY MARKET ;1999.11.09;    4197;    2395;    1127;       0;     889;    1528;    3284;    2655;     913;    1542
E-MINI NASDAQ 100 STOCK INDEX - INTERNATIONAL MONETARY MARKET ;1999.11.02;    3591;    2283;     755;       0;     544;    1413;    2827;    2168;     764;    1423
E-MINI NASDAQ 100 STOCK INDEX - INTERNATIONAL MONETARY MARKET ;1999.10.26;    3216;    2008;     935;      45;     644;    1002;    2697;    1982;     519;    1234
E-MINI NASDAQ 100 STOCK INDEX - INTERNATIONAL MONETARY MARKET ;1999.10.19;    3448;    1818;     775;       0;     874;    1330;    2692;    2105;     756;    1343
E-MINI NASDAQ 100 STOCK INDEX - INTERNATIONAL MONETARY MARKET ;1999.10.12;    2886;    1954;     304;       0;     177;    1196;    2131;    1500;     755;    1386
E-MINI NASDAQ 100 STOCK INDEX - INTERNATIONAL MONETARY MARKET ;1999.10.05;    2426;    1115;    1025;       0;     230;     411;    1345;    1436;    1081;     990
E-MINI NASDAQ 100 STOCK INDEX - INTERNATIONAL MONETARY MARKET ;1999.09.28;    2392;    1224;     945;       0;     173;     535;    1397;    1480;     995;     912
E-MINI NASDAQ 100 STOCK INDEX - INTERNATIONAL MONETARY MARKET ;1999.09.21;    1887;    1103;     365;       0;      62;     847;    1165;    1212;     722;     675
E-MINI NASDAQ 100 STOCK INDEX - INTERNATIONAL MONETARY MARKET ;1999.09.14;    4287;    1969;     247;      51;     520;    3037;    2540;    3335;    1747;     952
E-MINI NASDAQ 100 STOCK INDEX - INTERNATIONAL MONETARY MARKET ;1999.09.07;    5489;    3387;    1535;     197;     517;    2756;    4101;    4488;    1388;    1001
E-MINI NASDAQ 100 STOCK INDEX - INTERNATIONAL MONETARY MARKET ;1999.08.31;    4840;    2892;    1560;     436;     524;    2236;    3852;    4232;     988;     608
E-MINI NASDAQ 100 STOCK INDEX - INTERNATIONAL MONETARY MARKET ;1999.08.24;    4706;    2852;    1335;     425;     544;    2247;    3821;    4007;     885;     699
E-MINI NASDAQ 100 STOCK INDEX - INTERNATIONAL MONETARY MARKET ;1999.08.17;    4367;    2491;    1255;     435;     509;    2033;    3435;    3723;     932;     644
E-MINI NASDAQ 100 STOCK INDEX - INTERNATIONAL MONETARY MARKET ;1999.08.10;    4127;    2593;    1138;     280;     511;    2225;    3384;    3643;     743;     484
E-MINI NASDAQ 100 STOCK INDEX - INTERNATIONAL MONETARY MARKET ;1999.08.03;    3562;    2074;     750;     251;     460;    1993;    2785;    2994;     777;     568
E-MINI NASDAQ 100 STOCK INDEX - INTERNATIONAL MONETARY MARKET ;1999.07.27;    2857;    1637;     605;     237;     399;    1498;    2273;    2340;     584;     517
E-MINI NASDAQ 100 STOCK INDEX - INTERNATIONAL MONETARY MARKET ;1999.07.20;    2653;    1663;     450;      73;     416;    1625;    2152;    2148;     501;     505
E-MINI NASDAQ 100 STOCK INDEX - INTERNATIONAL MONETARY MARKET ;1999.07.13;    2236;    1293;     325;       5;     470;    1399;    1768;    1729;     468;     507
E-MINI NASDAQ 100 STOCK INDEX - INTERNATIONAL MONETARY MARKET ;1999.07.06;    1525;     510;     348;       5;     576;     650;    1091;    1003;     434;     522
E-MINI NASDAQ 100 STOCK INDEX - INTERNATIONAL MONETARY MARKET ;1999.06.29;    1299;     517;     251;       0;     383;     618;     900;     869;     399;     430
E-MINI NASDAQ 100 STOCK INDEX - INTERNATIONAL MONETARY MARKET ;1999.06.22;     537;     227;      40;       0;      10;     154;     237;     194;     300;     343
