COLUMBIA GULF ONSHORE SWAP - NEW YORK MERCANTILE EXCHANGE ;2009.02.24;   75686;       0;    7126;    4864;   64042;   59720;   68906;   71710;    6780;    3976
COLUMBIA GULF ONSHORE SWAP - NEW YORK MERCANTILE EXCHANGE ;2009.02.17;   75686;       0;    7982;    4864;   64042;   59720;   68906;   72566;    6780;    3120
COLUMBIA GULF ONSHORE SWAP - NEW YORK MERCANTILE EXCHANGE ;2009.02.10;   74966;       0;    9190;    4144;   64042;   59418;   68186;   72752;    6780;    2214
COLUMBIA GULF ONSHORE SWAP - NEW YORK MERCANTILE EXCHANGE ;2009.02.03;   74820;       0;   12512;    3784;   64256;   56310;   68040;   72606;    6780;    2214
COLUMBIA GULF ONSHORE SWAP - NEW YORK MERCANTILE EXCHANGE ;2009.01.27;   76809;       0;   10476;    3784;   69185;   60419;   72969;   74679;    3840;    2130
COLUMBIA GULF ONSHORE SWAP - NEW YORK MERCANTILE EXCHANGE ;2008.10.28;   90539;       0;   48984;       0;   90115;   40185;   90115;   89169;     424;    1370
COLUMBIA GULF ONSHORE SWAP - NEW YORK MERCANTILE EXCHANGE ;2009.02.24;   75686;       0;    7126;    4864;   64042;   59720;   68906;   71710;    6780;    3976
COLUMBIA GULF ONSHORE SWAP - NEW YORK MERCANTILE EXCHANGE ;2009.02.17;   75686;       0;    7982;    4864;   64042;   59720;   68906;   72566;    6780;    3120
COLUMBIA GULF ONSHORE SWAP - NEW YORK MERCANTILE EXCHANGE ;2009.02.10;   74966;       0;    9190;    4144;   64042;   59418;   68186;   72752;    6780;    2214
COLUMBIA GULF ONSHORE SWAP - NEW YORK MERCANTILE EXCHANGE ;2009.02.03;   74820;       0;   12512;    3784;   64256;   56310;   68040;   72606;    6780;    2214
COLUMBIA GULF ONSHORE SWAP - NEW YORK MERCANTILE EXCHANGE ;2009.01.27;   76809;       0;   10476;    3784;   69185;   60419;   72969;   74679;    3840;    2130
COLUMBIA GULF ONSHORE SWAP - NEW YORK MERCANTILE EXCHANGE ;2008.10.28;   90539;       0;   48984;       0;   90115;   40185;   90115;   89169;     424;    1370
COLUMBIA GULF ONSHORE SWAP - NEW YORK MERCANTILE EXCHANGE ;2009.02.24;   75686;       0;    7126;    4864;   64042;   59720;   68906;   71710;    6780;    3976
COLUMBIA GULF ONSHORE SWAP - NEW YORK MERCANTILE EXCHANGE ;2009.02.17;   75686;       0;    7982;    4864;   64042;   59720;   68906;   72566;    6780;    3120
COLUMBIA GULF ONSHORE SWAP - NEW YORK MERCANTILE EXCHANGE ;2009.02.10;   74966;       0;    9190;    4144;   64042;   59418;   68186;   72752;    6780;    2214
COLUMBIA GULF ONSHORE SWAP - NEW YORK MERCANTILE EXCHANGE ;2009.02.03;   74820;       0;   12512;    3784;   64256;   56310;   68040;   72606;    6780;    2214
COLUMBIA GULF ONSHORE SWAP - NEW YORK MERCANTILE EXCHANGE ;2009.01.27;   76809;       0;   10476;    3784;   69185;   60419;   72969;   74679;    3840;    2130
COLUMBIA GULF ONSHORE SWAP - NEW YORK MERCANTILE EXCHANGE ;2008.10.28;   90539;       0;   48984;       0;   90115;   40185;   90115;   89169;     424;    1370
