COFFEE C - COFFEE SUGAR AND COCOA EXCHANGE ;2004.12.28;  156467;   50969;   10254;   43609;   49488;   96022;  144067;  149885;   12401;    6582
COFFEE C - COFFEE SUGAR AND COCOA EXCHANGE ;2004.12.21;  157674;   53048;    9706;   42530;   48770;   97366;  144348;  149603;   13325;    8071
COFFEE C - COFFEE SUGAR AND COCOA EXCHANGE ;2004.12.14;  141085;   49230;    8663;   34198;   45006;   91235;  128434;  134095;   12651;    6990
COFFEE C - COFFEE SUGAR AND COCOA EXCHANGE ;2004.12.07;  147863;   51521;    9505;   39482;   43253;   91469;  134256;  140456;   13607;    7407
COFFEE C - COFFEE SUGAR AND COCOA EXCHANGE ;2004.11.30;  137269;   46169;    8529;   34839;   42055;   86157;  123063;  129524;   14206;    7745
COFFEE C - COFFEE SUGAR AND COCOA EXCHANGE ;2004.11.23;  123220;   39297;    7880;   29545;   40622;   78638;  109464;  116063;   13756;    7157
COFFEE C - COFFEE SUGAR AND COCOA EXCHANGE ;2004.11.16;  121350;   33854;    7283;   26876;   45797;   78574;  106527;  112733;   14823;    8617
COFFEE C - COFFEE SUGAR AND COCOA EXCHANGE ;2004.11.09;  112364;   21915;    7289;   31302;   44664;   65283;   97881;  103874;   14483;    8490
COFFEE C - COFFEE SUGAR AND COCOA EXCHANGE ;2004.11.02;  107189;   20037;   10565;   29407;   45247;   59371;   94691;   99343;   12497;    7846
COFFEE C - COFFEE SUGAR AND COCOA EXCHANGE ;2004.10.26;  101797;   19254;    9052;   27497;   42824;   57194;   89576;   93744;   12222;    8054
COFFEE C - COFFEE SUGAR AND COCOA EXCHANGE ;2004.10.19;  106329;   17769;   16899;   28445;   47768;   53579;   93982;   98924;   12347;    7405
COFFEE C - COFFEE SUGAR AND COCOA EXCHANGE ;2004.10.12;  107013;   20985;   15134;   26640;   47163;   58244;   94788;  100017;   12225;    6996
COFFEE C - COFFEE SUGAR AND COCOA EXCHANGE ;2004.10.05;  114862;   23772;   13608;   30635;   46593;   63041;  101000;  107284;   13861;    7578
COFFEE C - COFFEE SUGAR AND COCOA EXCHANGE ;2004.09.28;  122328;   27769;   15457;   32915;   47290;   65308;  107973;  113679;   14355;    8649
COFFEE C - COFFEE SUGAR AND COCOA EXCHANGE ;2004.09.21;  115017;   21658;   18635;   29306;   49836;   59084;  100801;  107025;   14216;    7992
COFFEE C - COFFEE SUGAR AND COCOA EXCHANGE ;2004.09.14;  109559;   18407;   23550;   25469;   52069;   53076;   95945;  102095;   13614;    7464
COFFEE C - COFFEE SUGAR AND COCOA EXCHANGE ;2004.09.07;  104414;   14903;   29792;   21622;   54161;   45832;   90687;   97245;   13727;    7168
COFFEE C - COFFEE SUGAR AND COCOA EXCHANGE ;2004.08.31;  105102;   15760;   30104;   22156;   53698;   46274;   91614;   98534;   13488;    6569
COFFEE C - COFFEE SUGAR AND COCOA EXCHANGE ;2004.08.24;  104597;   16210;   30482;   20961;   53625;   46106;   90797;   97549;   13800;    7047
COFFEE C - COFFEE SUGAR AND COCOA EXCHANGE ;2004.08.17;  112198;   15625;   31089;   21042;   62034;   52953;   98701;  105084;   13497;    7114
COFFEE C - COFFEE SUGAR AND COCOA EXCHANGE ;2004.08.10;  127314;   16362;   33898;   30163;   67791;   57097;  114316;  121157;   12997;    6157
COFFEE C - COFFEE SUGAR AND COCOA EXCHANGE ;2004.08.03;  124635;   16790;   31517;   29450;   64003;   55882;  110243;  116849;   14392;    7786
COFFEE C - COFFEE SUGAR AND COCOA EXCHANGE ;2004.07.27;  119231;   17395;   22474;   27524;   59201;   60535;  104120;  110533;   15111;    8698
COFFEE C - COFFEE SUGAR AND COCOA EXCHANGE ;2004.07.20;  118070;   20411;   19996;   26348;   55331;   63901;  102090;  110245;   15981;    7825
COFFEE C - COFFEE SUGAR AND COCOA EXCHANGE ;2004.07.13;  114156;   18415;   20025;   23409;   55974;   62543;   97798;  105976;   16358;    8179
COFFEE C - COFFEE SUGAR AND COCOA EXCHANGE ;2004.07.06;  117665;   20769;   17604;   26202;   54316;   65032;  101287;  108838;   16378;    8827
COFFEE C - COFFEE SUGAR AND COCOA EXCHANGE ;2004.06.29;  115732;   22907;   14219;   26649;   51108;   68496;  100664;  109364;   15068;    6368
COFFEE C - COFFEE SUGAR AND COCOA EXCHANGE ;2004.06.22;  120067;   28118;   12580;   28345;   48548;   73000;  105011;  113925;   15056;    6141
COFFEE C - COFFEE SUGAR AND COCOA EXCHANGE ;2004.06.15;  131944;   40109;   14734;   26720;   50236;   83509;  117065;  124963;   14879;    6981
COFFEE C - COFFEE SUGAR AND COCOA EXCHANGE ;2004.06.08;  159726;   44964;   18059;   44170;   54869;   89271;  144003;  151500;   15723;    8226
COFFEE C - COFFEE SUGAR AND COCOA EXCHANGE ;2004.06.01;  159164;   41538;   18523;   42787;   59000;   89912;  143325;  151222;   15839;    7942
COFFEE C - COFFEE SUGAR AND COCOA EXCHANGE ;2004.05.25;  129466;   25021;   14485;   31746;   57357;   75645;  114124;  121876;   15341;    7590
COFFEE C - COFFEE SUGAR AND COCOA EXCHANGE ;2004.05.18;  125629;   22177;   23097;   28691;   59271;   65312;  110139;  117100;   15490;    8529
COFFEE C - COFFEE SUGAR AND COCOA EXCHANGE ;2004.05.11;  126434;   23284;   23907;   27724;   59995;   66589;  111002;  118220;   15432;    8214
COFFEE C - COFFEE SUGAR AND COCOA EXCHANGE ;2004.05.04;  123079;   23872;   26333;   25194;   57741;   63446;  106808;  114973;   16271;    8105
COFFEE C - COFFEE SUGAR AND COCOA EXCHANGE ;2004.04.27;  115633;   23798;   23910;   21215;   54859;   62841;   99872;  107966;   15761;    7667
COFFEE C - COFFEE SUGAR AND COCOA EXCHANGE ;2004.04.20;  119270;   25827;   20358;   20603;   56639;   70876;  103069;  111837;   16200;    7433
COFFEE C - COFFEE SUGAR AND COCOA EXCHANGE ;2004.04.12;  120015;   30020;   14806;   19270;   54459;   79111;  103749;  113187;   16266;    6828
COFFEE C - COFFEE SUGAR AND COCOA EXCHANGE ;2004.04.06;  130054;   30851;   13695;   25031;   53265;   79857;  109147;  118583;   20907;   11470
COFFEE C - COFFEE SUGAR AND COCOA EXCHANGE ;2004.03.30;  128597;   33271;   13550;   24816;   50887;   81954;  108974;  120320;   19623;    8277
COFFEE C - COFFEE SUGAR AND COCOA EXCHANGE ;2004.03.23;  135970;   40827;   10693;   25647;   48517;   92396;  114991;  128736;   20979;    7234
COFFEE C - COFFEE SUGAR AND COCOA EXCHANGE ;2004.03.16;  135003;   42150;   11141;   24204;   49356;   93858;  115710;  129203;   19293;    5800
COFFEE C - COFFEE SUGAR AND COCOA EXCHANGE ;2004.03.09;  123701;   35314;    9453;   23342;   47443;   84513;  106099;  117307;   17602;    6394
COFFEE C - COFFEE SUGAR AND COCOA EXCHANGE ;2004.03.02;  123926;   37797;   10355;   22317;   45052;   84687;  105166;  117359;   18760;    6567
COFFEE C - COFFEE SUGAR AND COCOA EXCHANGE ;2004.02.24;  118744;   33611;   10516;   21289;   44696;   80163;   99596;  111968;   19149;    6776
COFFEE C - COFFEE SUGAR AND COCOA EXCHANGE ;2004.02.17;  134334;   43950;   14690;   23539;   45458;   87644;  112948;  125873;   21386;    8461
COFFEE C - COFFEE SUGAR AND COCOA EXCHANGE ;2004.02.10;  144397;   42917;   15361;   32579;   47566;   88279;  123062;  136219;   21335;    8179
COFFEE C - COFFEE SUGAR AND COCOA EXCHANGE ;2004.02.03;  146620;   46488;   16261;   34986;   44579;   86811;  126053;  138058;   20567;    8562
COFFEE C - COFFEE SUGAR AND COCOA EXCHANGE ;2004.01.27;  146325;   47033;   18021;   34107;   47883;   88181;  129023;  140310;   17302;    6015
COFFEE C - COFFEE SUGAR AND COCOA EXCHANGE ;2004.01.20;  126074;   31375;   17223;   29545;   46996;   73389;  107916;  120157;   18158;    5917
COFFEE C - COFFEE SUGAR AND COCOA EXCHANGE ;2004.01.13;  112934;   27017;   17403;   25826;   43255;   64789;   96098;  108018;   16835;    4916
COFFEE C - COFFEE SUGAR AND COCOA EXCHANGE ;2004.01.06;  110024;   19843;   16609;   27204;   42339;   58456;   89386;  102269;   20638;    7755
COFFEE C - COFFEE SUGAR AND COCOA EXCHANGE ;2003.12.30;   99929;   15793;   24594;   22340;   44575;   46288;   82708;   93222;   17222;    6707
COFFEE C - COFFEE SUGAR AND COCOA EXCHANGE ;2003.12.22;  100091;   15742;   24190;   21439;   46756;   48304;   83937;   93933;   16154;    6158
COFFEE C - COFFEE SUGAR AND COCOA EXCHANGE ;2003.12.16;   97135;   15140;   25293;   20561;   45826;   45772;   81528;   91626;   15607;    5508
COFFEE C - COFFEE SUGAR AND COCOA EXCHANGE ;2003.12.09;   98387;   16022;   23007;   22334;   44087;   47634;   82444;   92976;   15943;    5411
COFFEE C - COFFEE SUGAR AND COCOA EXCHANGE ;2003.12.02;   98972;   14121;   32345;   20058;   45982;   38748;   80160;   91151;   18812;    7821
COFFEE C - COFFEE SUGAR AND COCOA EXCHANGE ;2003.11.25;   99160;   14290;   38050;   19171;   47048;   31856;   80510;   89077;   18650;   10083
COFFEE C - COFFEE SUGAR AND COCOA EXCHANGE ;2003.11.18;   90419;   16021;   29465;   17729;   39633;   35192;   73383;   82387;   17036;    8033
COFFEE C - COFFEE SUGAR AND COCOA EXCHANGE ;2003.11.11;   97193;   17557;   30875;   17933;   43804;   40852;   79293;   89660;   17900;    7534
COFFEE C - COFFEE SUGAR AND COCOA EXCHANGE ;2003.11.04;  110598;   14458;   31015;   28495;   50144;   41859;   93096;  101369;   17502;    9230
COFFEE C - COFFEE SUGAR AND COCOA EXCHANGE ;2003.10.28;  105937;   15219;   20894;   28558;   43863;   48826;   87641;   98277;   18296;    7659
COFFEE C - COFFEE SUGAR AND COCOA EXCHANGE ;2003.10.21;  103911;   12596;   25151;   28166;   46007;   41711;   86769;   95028;   17142;    8883
COFFEE C - COFFEE SUGAR AND COCOA EXCHANGE ;2003.10.14;   98617;   12340;   22578;   26106;   43723;   40689;   82169;   89373;   16449;    9245
COFFEE C - COFFEE SUGAR AND COCOA EXCHANGE ;2003.10.07;   98948;   14419;   15788;   28836;   38633;   45468;   81888;   90091;   17061;    8857
COFFEE C - COFFEE SUGAR AND COCOA EXCHANGE ;2003.09.30;   95973;   16240;   16709;   25840;   38089;   45553;   80170;   88102;   15803;    7870
COFFEE C - COFFEE SUGAR AND COCOA EXCHANGE ;2003.09.23;   94268;   16745;   14227;   24871;   37120;   46455;   78736;   85553;   15532;    8715
COFFEE C - COFFEE SUGAR AND COCOA EXCHANGE ;2003.09.16;   91362;   19210;   13139;   21085;   33897;   49203;   74191;   83427;   17171;    7936
COFFEE C - COFFEE SUGAR AND COCOA EXCHANGE ;2003.09.09;   98819;   24775;   17368;   22904;   35052;   51560;   82731;   91832;   16088;    6987
COFFEE C - COFFEE SUGAR AND COCOA EXCHANGE ;2003.09.02;   84787;   11054;   25323;   18040;   38509;   34377;   67603;   77740;   17184;    7047
COFFEE C - COFFEE SUGAR AND COCOA EXCHANGE ;2003.08.26;   82817;   11264;   22687;   18727;   36973;   34567;   66964;   75981;   15853;    6836
COFFEE C - COFFEE SUGAR AND COCOA EXCHANGE ;2003.08.19;   84496;   11393;   21326;   19668;   36362;   35555;   67423;   76549;   17073;    7947
COFFEE C - COFFEE SUGAR AND COCOA EXCHANGE ;2003.08.12;   79840;   10162;   15706;   18062;   35062;   37498;   63285;   71266;   16555;    8574
COFFEE C - COFFEE SUGAR AND COCOA EXCHANGE ;2003.08.05;   90597;   12170;   16580;   23453;   39084;   43586;   74706;   83618;   15891;    6979
COFFEE C - COFFEE SUGAR AND COCOA EXCHANGE ;2003.07.29;   94413;    9669;   23813;   24031;   42777;   38523;   76476;   86367;   17937;    8046
COFFEE C - COFFEE SUGAR AND COCOA EXCHANGE ;2003.07.22;   91200;    9400;   26492;   19730;   44872;   37480;   74001;   83701;   17199;    7499
COFFEE C - COFFEE SUGAR AND COCOA EXCHANGE ;2003.07.15;   88268;    9924;   22843;   19236;   42313;   39284;   71474;   81363;   16794;    6905
COFFEE C - COFFEE SUGAR AND COCOA EXCHANGE ;2003.07.08;   91944;   10221;   26252;   19623;   43956;   38169;   73800;   84044;   18144;    7900
COFFEE C - COFFEE SUGAR AND COCOA EXCHANGE ;2003.07.01;   91303;    9166;   31757;   18656;   48109;   35408;   75932;   85822;   15371;    5481
COFFEE C - COFFEE SUGAR AND COCOA EXCHANGE ;2003.06.24;   88535;    9578;   30897;   17524;   46049;   32609;   73150;   81029;   15385;    7506
COFFEE C - COFFEE SUGAR AND COCOA EXCHANGE ;2003.06.17;   86591;    9026;   25703;   16937;   42273;   35400;   68237;   78040;   18354;    8550
COFFEE C - COFFEE SUGAR AND COCOA EXCHANGE ;2003.06.10;   98955;    9506;   25267;   23674;   48057;   41675;   81237;   90616;   17718;    8339
COFFEE C - COFFEE SUGAR AND COCOA EXCHANGE ;2003.06.03;   98212;    8914;   22177;   24392;   47558;   43549;   80865;   90118;   17347;    8094
COFFEE C - COFFEE SUGAR AND COCOA EXCHANGE ;2003.05.27;   96792;   12010;   14817;   23533;   42245;   49667;   77789;   88017;   19003;    8775
COFFEE C - COFFEE SUGAR AND COCOA EXCHANGE ;2003.05.20;   96915;   15499;   12545;   24094;   39949;   53755;   79542;   90394;   17373;    6521
COFFEE C - COFFEE SUGAR AND COCOA EXCHANGE ;2003.05.13;   96019;   14817;   11623;   24579;   40126;   53467;   79522;   89669;   16497;    6350
COFFEE C - COFFEE SUGAR AND COCOA EXCHANGE ;2003.05.06;  100213;   15179;   12606;   25817;   42814;   54803;   83810;   93226;   16403;    6987
COFFEE C - COFFEE SUGAR AND COCOA EXCHANGE ;2003.04.29;   96525;   12368;   16972;   23492;   45036;   49178;   80897;   89643;   15629;    6882
COFFEE C - COFFEE SUGAR AND COCOA EXCHANGE ;2003.04.22;   99516;   13598;   20609;   23159;   46857;   47851;   83615;   91620;   15901;    7896
COFFEE C - COFFEE SUGAR AND COCOA EXCHANGE ;2003.04.15;  102078;    9170;   22124;   25723;   50267;   45631;   85160;   93478;   16918;    8600
COFFEE C - COFFEE SUGAR AND COCOA EXCHANGE ;2003.04.08;  103498;    9660;   20279;   26861;   49715;   47449;   86236;   94589;   17262;    8910
COFFEE C - COFFEE SUGAR AND COCOA EXCHANGE ;2003.04.01;  104049;    8000;   24171;   25364;   53529;   45185;   86893;   94720;   17157;    9329
COFFEE C - COFFEE SUGAR AND COCOA EXCHANGE ;2003.03.25;  101818;    8625;   22692;   24954;   51375;   45090;   84953;   92736;   16864;    9082
COFFEE C - COFFEE SUGAR AND COCOA EXCHANGE ;2003.03.18;   99551;    8720;   22730;   24123;   50536;   43787;   83379;   90640;   16172;    8911
COFFEE C - COFFEE SUGAR AND COCOA EXCHANGE ;2003.03.11;   98526;    8983;   22436;   23682;   48899;   43415;   81564;   89534;   16962;    8992
COFFEE C - COFFEE SUGAR AND COCOA EXCHANGE ;2003.03.04;   96565;    8500;   20357;   24034;   48027;   43781;   80561;   88171;   16003;    8393
COFFEE C - COFFEE SUGAR AND COCOA EXCHANGE ;2003.02.25;   91499;   11887;   14810;   21466;   43064;   47342;   76417;   83618;   15082;    7880
COFFEE C - COFFEE SUGAR AND COCOA EXCHANGE ;2004.12.28;  156467;   50969;   10254;   43609;   49488;   96022;  144067;  149885;   12401;    6582
COFFEE C - COFFEE SUGAR AND COCOA EXCHANGE ;2004.12.21;  157674;   53048;    9706;   42530;   48770;   97366;  144348;  149603;   13325;    8071
COFFEE C - COFFEE SUGAR AND COCOA EXCHANGE ;2004.12.14;  141085;   49230;    8663;   34198;   45006;   91235;  128434;  134095;   12651;    6990
COFFEE C - COFFEE SUGAR AND COCOA EXCHANGE ;2004.12.07;  147863;   51521;    9505;   39482;   43253;   91469;  134256;  140456;   13607;    7407
COFFEE C - COFFEE SUGAR AND COCOA EXCHANGE ;2004.11.30;  137269;   46169;    8529;   34839;   42055;   86157;  123063;  129524;   14206;    7745
COFFEE C - COFFEE SUGAR AND COCOA EXCHANGE ;2004.11.23;  123220;   39297;    7880;   29545;   40622;   78638;  109464;  116063;   13756;    7157
COFFEE C - COFFEE SUGAR AND COCOA EXCHANGE ;2004.11.16;  121350;   33854;    7283;   26876;   45797;   78574;  106527;  112733;   14823;    8617
COFFEE C - COFFEE SUGAR AND COCOA EXCHANGE ;2004.11.09;  112364;   21915;    7289;   31302;   44664;   65283;   97881;  103874;   14483;    8490
COFFEE C - COFFEE SUGAR AND COCOA EXCHANGE ;2004.11.02;  107189;   20037;   10565;   29407;   45247;   59371;   94691;   99343;   12497;    7846
COFFEE C - COFFEE SUGAR AND COCOA EXCHANGE ;2004.10.26;  101797;   19254;    9052;   27497;   42824;   57194;   89576;   93744;   12222;    8054
COFFEE C - COFFEE SUGAR AND COCOA EXCHANGE ;2004.10.19;  106329;   17769;   16899;   28445;   47768;   53579;   93982;   98924;   12347;    7405
COFFEE C - COFFEE SUGAR AND COCOA EXCHANGE ;2004.10.12;  107013;   20985;   15134;   26640;   47163;   58244;   94788;  100017;   12225;    6996
COFFEE C - COFFEE SUGAR AND COCOA EXCHANGE ;2004.10.05;  114862;   23772;   13608;   30635;   46593;   63041;  101000;  107284;   13861;    7578
COFFEE C - COFFEE SUGAR AND COCOA EXCHANGE ;2004.09.28;  122328;   27769;   15457;   32915;   47290;   65308;  107973;  113679;   14355;    8649
COFFEE C - COFFEE SUGAR AND COCOA EXCHANGE ;2004.09.21;  115017;   21658;   18635;   29306;   49836;   59084;  100801;  107025;   14216;    7992
COFFEE C - COFFEE SUGAR AND COCOA EXCHANGE ;2004.09.14;  109559;   18407;   23550;   25469;   52069;   53076;   95945;  102095;   13614;    7464
COFFEE C - COFFEE SUGAR AND COCOA EXCHANGE ;2004.09.07;  104414;   14903;   29792;   21622;   54161;   45832;   90687;   97245;   13727;    7168
COFFEE C - COFFEE SUGAR AND COCOA EXCHANGE ;2004.08.31;  105102;   15760;   30104;   22156;   53698;   46274;   91614;   98534;   13488;    6569
COFFEE C - COFFEE SUGAR AND COCOA EXCHANGE ;2004.08.24;  104597;   16210;   30482;   20961;   53625;   46106;   90797;   97549;   13800;    7047
COFFEE C - COFFEE SUGAR AND COCOA EXCHANGE ;2004.08.17;  112198;   15625;   31089;   21042;   62034;   52953;   98701;  105084;   13497;    7114
COFFEE C - COFFEE SUGAR AND COCOA EXCHANGE ;2004.08.10;  127314;   16362;   33898;   30163;   67791;   57097;  114316;  121157;   12997;    6157
COFFEE C - COFFEE SUGAR AND COCOA EXCHANGE ;2004.08.03;  124635;   16790;   31517;   29450;   64003;   55882;  110243;  116849;   14392;    7786
COFFEE C - COFFEE SUGAR AND COCOA EXCHANGE ;2004.07.27;  119231;   17395;   22474;   27524;   59201;   60535;  104120;  110533;   15111;    8698
COFFEE C - COFFEE SUGAR AND COCOA EXCHANGE ;2004.07.20;  118070;   20411;   19996;   26348;   55331;   63901;  102090;  110245;   15981;    7825
COFFEE C - COFFEE SUGAR AND COCOA EXCHANGE ;2004.07.13;  114156;   18415;   20025;   23409;   55974;   62543;   97798;  105976;   16358;    8179
COFFEE C - COFFEE SUGAR AND COCOA EXCHANGE ;2004.07.06;  117665;   20769;   17604;   26202;   54316;   65032;  101287;  108838;   16378;    8827
COFFEE C - COFFEE SUGAR AND COCOA EXCHANGE ;2004.06.29;  115732;   22907;   14219;   26649;   51108;   68496;  100664;  109364;   15068;    6368
COFFEE C - COFFEE SUGAR AND COCOA EXCHANGE ;2004.06.22;  120067;   28118;   12580;   28345;   48548;   73000;  105011;  113925;   15056;    6141
COFFEE C - COFFEE SUGAR AND COCOA EXCHANGE ;2004.06.15;  131944;   40109;   14734;   26720;   50236;   83509;  117065;  124963;   14879;    6981
COFFEE C - COFFEE SUGAR AND COCOA EXCHANGE ;2004.06.08;  159726;   44964;   18059;   44170;   54869;   89271;  144003;  151500;   15723;    8226
COFFEE C - COFFEE SUGAR AND COCOA EXCHANGE ;2004.06.01;  159164;   41538;   18523;   42787;   59000;   89912;  143325;  151222;   15839;    7942
COFFEE C - COFFEE SUGAR AND COCOA EXCHANGE ;2004.05.25;  129466;   25021;   14485;   31746;   57357;   75645;  114124;  121876;   15341;    7590
COFFEE C - COFFEE SUGAR AND COCOA EXCHANGE ;2004.05.18;  125629;   22177;   23097;   28691;   59271;   65312;  110139;  117100;   15490;    8529
COFFEE C - COFFEE SUGAR AND COCOA EXCHANGE ;2004.05.11;  126434;   23284;   23907;   27724;   59995;   66589;  111002;  118220;   15432;    8214
COFFEE C - COFFEE SUGAR AND COCOA EXCHANGE ;2004.05.04;  123079;   23872;   26333;   25194;   57741;   63446;  106808;  114973;   16271;    8105
COFFEE C - COFFEE SUGAR AND COCOA EXCHANGE ;2004.04.27;  115633;   23798;   23910;   21215;   54859;   62841;   99872;  107966;   15761;    7667
COFFEE C - COFFEE SUGAR AND COCOA EXCHANGE ;2004.04.20;  119270;   25827;   20358;   20603;   56639;   70876;  103069;  111837;   16200;    7433
COFFEE C - COFFEE SUGAR AND COCOA EXCHANGE ;2004.04.12;  120015;   30020;   14806;   19270;   54459;   79111;  103749;  113187;   16266;    6828
COFFEE C - COFFEE SUGAR AND COCOA EXCHANGE ;2004.04.06;  130054;   30851;   13695;   25031;   53265;   79857;  109147;  118583;   20907;   11470
COFFEE C - COFFEE SUGAR AND COCOA EXCHANGE ;2004.03.30;  128597;   33271;   13550;   24816;   50887;   81954;  108974;  120320;   19623;    8277
COFFEE C - COFFEE SUGAR AND COCOA EXCHANGE ;2004.03.23;  135970;   40827;   10693;   25647;   48517;   92396;  114991;  128736;   20979;    7234
COFFEE C - COFFEE SUGAR AND COCOA EXCHANGE ;2004.03.16;  135003;   42150;   11141;   24204;   49356;   93858;  115710;  129203;   19293;    5800
COFFEE C - COFFEE SUGAR AND COCOA EXCHANGE ;2004.03.09;  123701;   35314;    9453;   23342;   47443;   84513;  106099;  117307;   17602;    6394
COFFEE C - COFFEE SUGAR AND COCOA EXCHANGE ;2004.03.02;  123926;   37797;   10355;   22317;   45052;   84687;  105166;  117359;   18760;    6567
COFFEE C - COFFEE SUGAR AND COCOA EXCHANGE ;2004.02.24;  118744;   33611;   10516;   21289;   44696;   80163;   99596;  111968;   19149;    6776
COFFEE C - COFFEE SUGAR AND COCOA EXCHANGE ;2004.02.17;  134334;   43950;   14690;   23539;   45458;   87644;  112948;  125873;   21386;    8461
COFFEE C - COFFEE SUGAR AND COCOA EXCHANGE ;2004.02.10;  144397;   42917;   15361;   32579;   47566;   88279;  123062;  136219;   21335;    8179
COFFEE C - COFFEE SUGAR AND COCOA EXCHANGE ;2004.02.03;  146620;   46488;   16261;   34986;   44579;   86811;  126053;  138058;   20567;    8562
COFFEE C - COFFEE SUGAR AND COCOA EXCHANGE ;2004.01.27;  146325;   47033;   18021;   34107;   47883;   88181;  129023;  140310;   17302;    6015
COFFEE C - COFFEE SUGAR AND COCOA EXCHANGE ;2004.01.20;  126074;   31375;   17223;   29545;   46996;   73389;  107916;  120157;   18158;    5917
COFFEE C - COFFEE SUGAR AND COCOA EXCHANGE ;2004.01.13;  112934;   27017;   17403;   25826;   43255;   64789;   96098;  108018;   16835;    4916
COFFEE C - COFFEE SUGAR AND COCOA EXCHANGE ;2004.01.06;  110024;   19843;   16609;   27204;   42339;   58456;   89386;  102269;   20638;    7755
COFFEE C - COFFEE SUGAR AND COCOA EXCHANGE ;2003.12.30;   99929;   15793;   24594;   22340;   44575;   46288;   82708;   93222;   17222;    6707
COFFEE C - COFFEE SUGAR AND COCOA EXCHANGE ;2003.12.22;  100091;   15742;   24190;   21439;   46756;   48304;   83937;   93933;   16154;    6158
COFFEE C - COFFEE SUGAR AND COCOA EXCHANGE ;2003.12.16;   97135;   15140;   25293;   20561;   45826;   45772;   81528;   91626;   15607;    5508
COFFEE C - COFFEE SUGAR AND COCOA EXCHANGE ;2003.12.09;   98387;   16022;   23007;   22334;   44087;   47634;   82444;   92976;   15943;    5411
COFFEE C - COFFEE SUGAR AND COCOA EXCHANGE ;2003.12.02;   98972;   14121;   32345;   20058;   45982;   38748;   80160;   91151;   18812;    7821
COFFEE C - COFFEE SUGAR AND COCOA EXCHANGE ;2003.11.25;   99160;   14290;   38050;   19171;   47048;   31856;   80510;   89077;   18650;   10083
COFFEE C - COFFEE SUGAR AND COCOA EXCHANGE ;2003.11.18;   90419;   16021;   29465;   17729;   39633;   35192;   73383;   82387;   17036;    8033
COFFEE C - COFFEE SUGAR AND COCOA EXCHANGE ;2003.11.11;   97193;   17557;   30875;   17933;   43804;   40852;   79293;   89660;   17900;    7534
COFFEE C - COFFEE SUGAR AND COCOA EXCHANGE ;2003.11.04;  110598;   14458;   31015;   28495;   50144;   41859;   93096;  101369;   17502;    9230
COFFEE C - COFFEE SUGAR AND COCOA EXCHANGE ;2003.10.28;  105937;   15219;   20894;   28558;   43863;   48826;   87641;   98277;   18296;    7659
COFFEE C - COFFEE SUGAR AND COCOA EXCHANGE ;2003.10.21;  103911;   12596;   25151;   28166;   46007;   41711;   86769;   95028;   17142;    8883
COFFEE C - COFFEE SUGAR AND COCOA EXCHANGE ;2003.10.14;   98617;   12340;   22578;   26106;   43723;   40689;   82169;   89373;   16449;    9245
COFFEE C - COFFEE SUGAR AND COCOA EXCHANGE ;2003.10.07;   98948;   14419;   15788;   28836;   38633;   45468;   81888;   90091;   17061;    8857
COFFEE C - COFFEE SUGAR AND COCOA EXCHANGE ;2003.09.30;   95973;   16240;   16709;   25840;   38089;   45553;   80170;   88102;   15803;    7870
COFFEE C - COFFEE SUGAR AND COCOA EXCHANGE ;2003.09.23;   94268;   16745;   14227;   24871;   37120;   46455;   78736;   85553;   15532;    8715
COFFEE C - COFFEE SUGAR AND COCOA EXCHANGE ;2003.09.16;   91362;   19210;   13139;   21085;   33897;   49203;   74191;   83427;   17171;    7936
COFFEE C - COFFEE SUGAR AND COCOA EXCHANGE ;2003.09.09;   98819;   24775;   17368;   22904;   35052;   51560;   82731;   91832;   16088;    6987
COFFEE C - COFFEE SUGAR AND COCOA EXCHANGE ;2003.09.02;   84787;   11054;   25323;   18040;   38509;   34377;   67603;   77740;   17184;    7047
COFFEE C - COFFEE SUGAR AND COCOA EXCHANGE ;2003.08.26;   82817;   11264;   22687;   18727;   36973;   34567;   66964;   75981;   15853;    6836
COFFEE C - COFFEE SUGAR AND COCOA EXCHANGE ;2003.08.19;   84496;   11393;   21326;   19668;   36362;   35555;   67423;   76549;   17073;    7947
COFFEE C - COFFEE SUGAR AND COCOA EXCHANGE ;2003.08.12;   79840;   10162;   15706;   18062;   35062;   37498;   63285;   71266;   16555;    8574
COFFEE C - COFFEE SUGAR AND COCOA EXCHANGE ;2003.08.05;   90597;   12170;   16580;   23453;   39084;   43586;   74706;   83618;   15891;    6979
COFFEE C - COFFEE SUGAR AND COCOA EXCHANGE ;2003.07.29;   94413;    9669;   23813;   24031;   42777;   38523;   76476;   86367;   17937;    8046
COFFEE C - COFFEE SUGAR AND COCOA EXCHANGE ;2003.07.22;   91200;    9400;   26492;   19730;   44872;   37480;   74001;   83701;   17199;    7499
COFFEE C - COFFEE SUGAR AND COCOA EXCHANGE ;2003.07.15;   88268;    9924;   22843;   19236;   42313;   39284;   71474;   81363;   16794;    6905
COFFEE C - COFFEE SUGAR AND COCOA EXCHANGE ;2003.07.08;   91944;   10221;   26252;   19623;   43956;   38169;   73800;   84044;   18144;    7900
COFFEE C - COFFEE SUGAR AND COCOA EXCHANGE ;2003.07.01;   91303;    9166;   31757;   18656;   48109;   35408;   75932;   85822;   15371;    5481
COFFEE C - COFFEE SUGAR AND COCOA EXCHANGE ;2003.06.24;   88535;    9578;   30897;   17524;   46049;   32609;   73150;   81029;   15385;    7506
COFFEE C - COFFEE SUGAR AND COCOA EXCHANGE ;2003.06.17;   86591;    9026;   25703;   16937;   42273;   35400;   68237;   78040;   18354;    8550
COFFEE C - COFFEE SUGAR AND COCOA EXCHANGE ;2003.06.10;   98955;    9506;   25267;   23674;   48057;   41675;   81237;   90616;   17718;    8339
COFFEE C - COFFEE SUGAR AND COCOA EXCHANGE ;2003.06.03;   98212;    8914;   22177;   24392;   47558;   43549;   80865;   90118;   17347;    8094
COFFEE C - COFFEE SUGAR AND COCOA EXCHANGE ;2003.05.27;   96792;   12010;   14817;   23533;   42245;   49667;   77789;   88017;   19003;    8775
COFFEE C - COFFEE SUGAR AND COCOA EXCHANGE ;2003.05.20;   96915;   15499;   12545;   24094;   39949;   53755;   79542;   90394;   17373;    6521
COFFEE C - COFFEE SUGAR AND COCOA EXCHANGE ;2003.05.13;   96019;   14817;   11623;   24579;   40126;   53467;   79522;   89669;   16497;    6350
COFFEE C - COFFEE SUGAR AND COCOA EXCHANGE ;2003.05.06;  100213;   15179;   12606;   25817;   42814;   54803;   83810;   93226;   16403;    6987
COFFEE C - COFFEE SUGAR AND COCOA EXCHANGE ;2003.04.29;   96525;   12368;   16972;   23492;   45036;   49178;   80897;   89643;   15629;    6882
COFFEE C - COFFEE SUGAR AND COCOA EXCHANGE ;2003.04.22;   99516;   13598;   20609;   23159;   46857;   47851;   83615;   91620;   15901;    7896
COFFEE C - COFFEE SUGAR AND COCOA EXCHANGE ;2003.04.15;  102078;    9170;   22124;   25723;   50267;   45631;   85160;   93478;   16918;    8600
COFFEE C - COFFEE SUGAR AND COCOA EXCHANGE ;2003.04.08;  103498;    9660;   20279;   26861;   49715;   47449;   86236;   94589;   17262;    8910
COFFEE C - COFFEE SUGAR AND COCOA EXCHANGE ;2003.04.01;  104049;    8000;   24171;   25364;   53529;   45185;   86893;   94720;   17157;    9329
COFFEE C - COFFEE SUGAR AND COCOA EXCHANGE ;2003.03.25;  101818;    8625;   22692;   24954;   51375;   45090;   84953;   92736;   16864;    9082
COFFEE C - COFFEE SUGAR AND COCOA EXCHANGE ;2003.03.18;   99551;    8720;   22730;   24123;   50536;   43787;   83379;   90640;   16172;    8911
COFFEE C - COFFEE SUGAR AND COCOA EXCHANGE ;2003.03.11;   98526;    8983;   22436;   23682;   48899;   43415;   81564;   89534;   16962;    8992
COFFEE C - COFFEE SUGAR AND COCOA EXCHANGE ;2003.03.04;   96565;    8500;   20357;   24034;   48027;   43781;   80561;   88171;   16003;    8393
COFFEE C - COFFEE SUGAR AND COCOA EXCHANGE ;2003.02.25;   91499;   11887;   14810;   21466;   43064;   47342;   76417;   83618;   15082;    7880
COFFEE C - COFFEE SUGAR AND COCOA EXCHANGE ;2004.12.28;  156467;   50969;   10254;   43609;   49488;   96022;  144067;  149885;   12401;    6582
COFFEE C - COFFEE SUGAR AND COCOA EXCHANGE ;2004.12.21;  157674;   53048;    9706;   42530;   48770;   97366;  144348;  149603;   13325;    8071
COFFEE C - COFFEE SUGAR AND COCOA EXCHANGE ;2004.12.14;  141085;   49230;    8663;   34198;   45006;   91235;  128434;  134095;   12651;    6990
COFFEE C - COFFEE SUGAR AND COCOA EXCHANGE ;2004.12.07;  147863;   51521;    9505;   39482;   43253;   91469;  134256;  140456;   13607;    7407
COFFEE C - COFFEE SUGAR AND COCOA EXCHANGE ;2004.11.30;  137269;   46169;    8529;   34839;   42055;   86157;  123063;  129524;   14206;    7745
COFFEE C - COFFEE SUGAR AND COCOA EXCHANGE ;2004.11.23;  123220;   39297;    7880;   29545;   40622;   78638;  109464;  116063;   13756;    7157
COFFEE C - COFFEE SUGAR AND COCOA EXCHANGE ;2004.11.16;  121350;   33854;    7283;   26876;   45797;   78574;  106527;  112733;   14823;    8617
COFFEE C - COFFEE SUGAR AND COCOA EXCHANGE ;2004.11.09;  112364;   21915;    7289;   31302;   44664;   65283;   97881;  103874;   14483;    8490
COFFEE C - COFFEE SUGAR AND COCOA EXCHANGE ;2004.11.02;  107189;   20037;   10565;   29407;   45247;   59371;   94691;   99343;   12497;    7846
COFFEE C - COFFEE SUGAR AND COCOA EXCHANGE ;2004.10.26;  101797;   19254;    9052;   27497;   42824;   57194;   89576;   93744;   12222;    8054
COFFEE C - COFFEE SUGAR AND COCOA EXCHANGE ;2004.10.19;  106329;   17769;   16899;   28445;   47768;   53579;   93982;   98924;   12347;    7405
COFFEE C - COFFEE SUGAR AND COCOA EXCHANGE ;2004.10.12;  107013;   20985;   15134;   26640;   47163;   58244;   94788;  100017;   12225;    6996
COFFEE C - COFFEE SUGAR AND COCOA EXCHANGE ;2004.10.05;  114862;   23772;   13608;   30635;   46593;   63041;  101000;  107284;   13861;    7578
COFFEE C - COFFEE SUGAR AND COCOA EXCHANGE ;2004.09.28;  122328;   27769;   15457;   32915;   47290;   65308;  107973;  113679;   14355;    8649
COFFEE C - COFFEE SUGAR AND COCOA EXCHANGE ;2004.09.21;  115017;   21658;   18635;   29306;   49836;   59084;  100801;  107025;   14216;    7992
COFFEE C - COFFEE SUGAR AND COCOA EXCHANGE ;2004.09.14;  109559;   18407;   23550;   25469;   52069;   53076;   95945;  102095;   13614;    7464
COFFEE C - COFFEE SUGAR AND COCOA EXCHANGE ;2004.09.07;  104414;   14903;   29792;   21622;   54161;   45832;   90687;   97245;   13727;    7168
COFFEE C - COFFEE SUGAR AND COCOA EXCHANGE ;2004.08.31;  105102;   15760;   30104;   22156;   53698;   46274;   91614;   98534;   13488;    6569
COFFEE C - COFFEE SUGAR AND COCOA EXCHANGE ;2004.08.24;  104597;   16210;   30482;   20961;   53625;   46106;   90797;   97549;   13800;    7047
COFFEE C - COFFEE SUGAR AND COCOA EXCHANGE ;2004.08.17;  112198;   15625;   31089;   21042;   62034;   52953;   98701;  105084;   13497;    7114
COFFEE C - COFFEE SUGAR AND COCOA EXCHANGE ;2004.08.10;  127314;   16362;   33898;   30163;   67791;   57097;  114316;  121157;   12997;    6157
COFFEE C - COFFEE SUGAR AND COCOA EXCHANGE ;2004.08.03;  124635;   16790;   31517;   29450;   64003;   55882;  110243;  116849;   14392;    7786
COFFEE C - COFFEE SUGAR AND COCOA EXCHANGE ;2004.07.27;  119231;   17395;   22474;   27524;   59201;   60535;  104120;  110533;   15111;    8698
COFFEE C - COFFEE SUGAR AND COCOA EXCHANGE ;2004.07.20;  118070;   20411;   19996;   26348;   55331;   63901;  102090;  110245;   15981;    7825
COFFEE C - COFFEE SUGAR AND COCOA EXCHANGE ;2004.07.13;  114156;   18415;   20025;   23409;   55974;   62543;   97798;  105976;   16358;    8179
COFFEE C - COFFEE SUGAR AND COCOA EXCHANGE ;2004.07.06;  117665;   20769;   17604;   26202;   54316;   65032;  101287;  108838;   16378;    8827
COFFEE C - COFFEE SUGAR AND COCOA EXCHANGE ;2004.06.29;  115732;   22907;   14219;   26649;   51108;   68496;  100664;  109364;   15068;    6368
COFFEE C - COFFEE SUGAR AND COCOA EXCHANGE ;2004.06.22;  120067;   28118;   12580;   28345;   48548;   73000;  105011;  113925;   15056;    6141
COFFEE C - COFFEE SUGAR AND COCOA EXCHANGE ;2004.06.15;  131944;   40109;   14734;   26720;   50236;   83509;  117065;  124963;   14879;    6981
COFFEE C - COFFEE SUGAR AND COCOA EXCHANGE ;2004.06.08;  159726;   44964;   18059;   44170;   54869;   89271;  144003;  151500;   15723;    8226
COFFEE C - COFFEE SUGAR AND COCOA EXCHANGE ;2004.06.01;  159164;   41538;   18523;   42787;   59000;   89912;  143325;  151222;   15839;    7942
COFFEE C - COFFEE SUGAR AND COCOA EXCHANGE ;2004.05.25;  129466;   25021;   14485;   31746;   57357;   75645;  114124;  121876;   15341;    7590
COFFEE C - COFFEE SUGAR AND COCOA EXCHANGE ;2004.05.18;  125629;   22177;   23097;   28691;   59271;   65312;  110139;  117100;   15490;    8529
COFFEE C - COFFEE SUGAR AND COCOA EXCHANGE ;2004.05.11;  126434;   23284;   23907;   27724;   59995;   66589;  111002;  118220;   15432;    8214
COFFEE C - COFFEE SUGAR AND COCOA EXCHANGE ;2004.05.04;  123079;   23872;   26333;   25194;   57741;   63446;  106808;  114973;   16271;    8105
COFFEE C - COFFEE SUGAR AND COCOA EXCHANGE ;2004.04.27;  115633;   23798;   23910;   21215;   54859;   62841;   99872;  107966;   15761;    7667
COFFEE C - COFFEE SUGAR AND COCOA EXCHANGE ;2004.04.20;  119270;   25827;   20358;   20603;   56639;   70876;  103069;  111837;   16200;    7433
COFFEE C - COFFEE SUGAR AND COCOA EXCHANGE ;2004.04.12;  120015;   30020;   14806;   19270;   54459;   79111;  103749;  113187;   16266;    6828
COFFEE C - COFFEE SUGAR AND COCOA EXCHANGE ;2004.04.06;  130054;   30851;   13695;   25031;   53265;   79857;  109147;  118583;   20907;   11470
COFFEE C - COFFEE SUGAR AND COCOA EXCHANGE ;2004.03.30;  128597;   33271;   13550;   24816;   50887;   81954;  108974;  120320;   19623;    8277
COFFEE C - COFFEE SUGAR AND COCOA EXCHANGE ;2004.03.23;  135970;   40827;   10693;   25647;   48517;   92396;  114991;  128736;   20979;    7234
COFFEE C - COFFEE SUGAR AND COCOA EXCHANGE ;2004.03.16;  135003;   42150;   11141;   24204;   49356;   93858;  115710;  129203;   19293;    5800
COFFEE C - COFFEE SUGAR AND COCOA EXCHANGE ;2004.03.09;  123701;   35314;    9453;   23342;   47443;   84513;  106099;  117307;   17602;    6394
COFFEE C - COFFEE SUGAR AND COCOA EXCHANGE ;2004.03.02;  123926;   37797;   10355;   22317;   45052;   84687;  105166;  117359;   18760;    6567
COFFEE C - COFFEE SUGAR AND COCOA EXCHANGE ;2004.02.24;  118744;   33611;   10516;   21289;   44696;   80163;   99596;  111968;   19149;    6776
COFFEE C - COFFEE SUGAR AND COCOA EXCHANGE ;2004.02.17;  134334;   43950;   14690;   23539;   45458;   87644;  112948;  125873;   21386;    8461
COFFEE C - COFFEE SUGAR AND COCOA EXCHANGE ;2004.02.10;  144397;   42917;   15361;   32579;   47566;   88279;  123062;  136219;   21335;    8179
COFFEE C - COFFEE SUGAR AND COCOA EXCHANGE ;2004.02.03;  146620;   46488;   16261;   34986;   44579;   86811;  126053;  138058;   20567;    8562
COFFEE C - COFFEE SUGAR AND COCOA EXCHANGE ;2004.01.27;  146325;   47033;   18021;   34107;   47883;   88181;  129023;  140310;   17302;    6015
COFFEE C - COFFEE SUGAR AND COCOA EXCHANGE ;2004.01.20;  126074;   31375;   17223;   29545;   46996;   73389;  107916;  120157;   18158;    5917
COFFEE C - COFFEE SUGAR AND COCOA EXCHANGE ;2004.01.13;  112934;   27017;   17403;   25826;   43255;   64789;   96098;  108018;   16835;    4916
COFFEE C - COFFEE SUGAR AND COCOA EXCHANGE ;2004.01.06;  110024;   19843;   16609;   27204;   42339;   58456;   89386;  102269;   20638;    7755
COFFEE C - COFFEE SUGAR AND COCOA EXCHANGE ;2003.12.30;   99929;   15793;   24594;   22340;   44575;   46288;   82708;   93222;   17222;    6707
COFFEE C - COFFEE SUGAR AND COCOA EXCHANGE ;2003.12.22;  100091;   15742;   24190;   21439;   46756;   48304;   83937;   93933;   16154;    6158
COFFEE C - COFFEE SUGAR AND COCOA EXCHANGE ;2003.12.16;   97135;   15140;   25293;   20561;   45826;   45772;   81528;   91626;   15607;    5508
COFFEE C - COFFEE SUGAR AND COCOA EXCHANGE ;2003.12.09;   98387;   16022;   23007;   22334;   44087;   47634;   82444;   92976;   15943;    5411
COFFEE C - COFFEE SUGAR AND COCOA EXCHANGE ;2003.12.02;   98972;   14121;   32345;   20058;   45982;   38748;   80160;   91151;   18812;    7821
COFFEE C - COFFEE SUGAR AND COCOA EXCHANGE ;2003.11.25;   99160;   14290;   38050;   19171;   47048;   31856;   80510;   89077;   18650;   10083
COFFEE C - COFFEE SUGAR AND COCOA EXCHANGE ;2003.11.18;   90419;   16021;   29465;   17729;   39633;   35192;   73383;   82387;   17036;    8033
COFFEE C - COFFEE SUGAR AND COCOA EXCHANGE ;2003.11.11;   97193;   17557;   30875;   17933;   43804;   40852;   79293;   89660;   17900;    7534
COFFEE C - COFFEE SUGAR AND COCOA EXCHANGE ;2003.11.04;  110598;   14458;   31015;   28495;   50144;   41859;   93096;  101369;   17502;    9230
COFFEE C - COFFEE SUGAR AND COCOA EXCHANGE ;2003.10.28;  105937;   15219;   20894;   28558;   43863;   48826;   87641;   98277;   18296;    7659
COFFEE C - COFFEE SUGAR AND COCOA EXCHANGE ;2003.10.21;  103911;   12596;   25151;   28166;   46007;   41711;   86769;   95028;   17142;    8883
COFFEE C - COFFEE SUGAR AND COCOA EXCHANGE ;2003.10.14;   98617;   12340;   22578;   26106;   43723;   40689;   82169;   89373;   16449;    9245
COFFEE C - COFFEE SUGAR AND COCOA EXCHANGE ;2003.10.07;   98948;   14419;   15788;   28836;   38633;   45468;   81888;   90091;   17061;    8857
COFFEE C - COFFEE SUGAR AND COCOA EXCHANGE ;2003.09.30;   95973;   16240;   16709;   25840;   38089;   45553;   80170;   88102;   15803;    7870
COFFEE C - COFFEE SUGAR AND COCOA EXCHANGE ;2003.09.23;   94268;   16745;   14227;   24871;   37120;   46455;   78736;   85553;   15532;    8715
COFFEE C - COFFEE SUGAR AND COCOA EXCHANGE ;2003.09.16;   91362;   19210;   13139;   21085;   33897;   49203;   74191;   83427;   17171;    7936
COFFEE C - COFFEE SUGAR AND COCOA EXCHANGE ;2003.09.09;   98819;   24775;   17368;   22904;   35052;   51560;   82731;   91832;   16088;    6987
COFFEE C - COFFEE SUGAR AND COCOA EXCHANGE ;2003.09.02;   84787;   11054;   25323;   18040;   38509;   34377;   67603;   77740;   17184;    7047
COFFEE C - COFFEE SUGAR AND COCOA EXCHANGE ;2003.08.26;   82817;   11264;   22687;   18727;   36973;   34567;   66964;   75981;   15853;    6836
COFFEE C - COFFEE SUGAR AND COCOA EXCHANGE ;2003.08.19;   84496;   11393;   21326;   19668;   36362;   35555;   67423;   76549;   17073;    7947
COFFEE C - COFFEE SUGAR AND COCOA EXCHANGE ;2003.08.12;   79840;   10162;   15706;   18062;   35062;   37498;   63285;   71266;   16555;    8574
COFFEE C - COFFEE SUGAR AND COCOA EXCHANGE ;2003.08.05;   90597;   12170;   16580;   23453;   39084;   43586;   74706;   83618;   15891;    6979
COFFEE C - COFFEE SUGAR AND COCOA EXCHANGE ;2003.07.29;   94413;    9669;   23813;   24031;   42777;   38523;   76476;   86367;   17937;    8046
COFFEE C - COFFEE SUGAR AND COCOA EXCHANGE ;2003.07.22;   91200;    9400;   26492;   19730;   44872;   37480;   74001;   83701;   17199;    7499
COFFEE C - COFFEE SUGAR AND COCOA EXCHANGE ;2003.07.15;   88268;    9924;   22843;   19236;   42313;   39284;   71474;   81363;   16794;    6905
COFFEE C - COFFEE SUGAR AND COCOA EXCHANGE ;2003.07.08;   91944;   10221;   26252;   19623;   43956;   38169;   73800;   84044;   18144;    7900
COFFEE C - COFFEE SUGAR AND COCOA EXCHANGE ;2003.07.01;   91303;    9166;   31757;   18656;   48109;   35408;   75932;   85822;   15371;    5481
COFFEE C - COFFEE SUGAR AND COCOA EXCHANGE ;2003.06.24;   88535;    9578;   30897;   17524;   46049;   32609;   73150;   81029;   15385;    7506
COFFEE C - COFFEE SUGAR AND COCOA EXCHANGE ;2003.06.17;   86591;    9026;   25703;   16937;   42273;   35400;   68237;   78040;   18354;    8550
COFFEE C - COFFEE SUGAR AND COCOA EXCHANGE ;2003.06.10;   98955;    9506;   25267;   23674;   48057;   41675;   81237;   90616;   17718;    8339
COFFEE C - COFFEE SUGAR AND COCOA EXCHANGE ;2003.06.03;   98212;    8914;   22177;   24392;   47558;   43549;   80865;   90118;   17347;    8094
COFFEE C - COFFEE SUGAR AND COCOA EXCHANGE ;2003.05.27;   96792;   12010;   14817;   23533;   42245;   49667;   77789;   88017;   19003;    8775
COFFEE C - COFFEE SUGAR AND COCOA EXCHANGE ;2003.05.20;   96915;   15499;   12545;   24094;   39949;   53755;   79542;   90394;   17373;    6521
COFFEE C - COFFEE SUGAR AND COCOA EXCHANGE ;2003.05.13;   96019;   14817;   11623;   24579;   40126;   53467;   79522;   89669;   16497;    6350
COFFEE C - COFFEE SUGAR AND COCOA EXCHANGE ;2003.05.06;  100213;   15179;   12606;   25817;   42814;   54803;   83810;   93226;   16403;    6987
COFFEE C - COFFEE SUGAR AND COCOA EXCHANGE ;2003.04.29;   96525;   12368;   16972;   23492;   45036;   49178;   80897;   89643;   15629;    6882
COFFEE C - COFFEE SUGAR AND COCOA EXCHANGE ;2003.04.22;   99516;   13598;   20609;   23159;   46857;   47851;   83615;   91620;   15901;    7896
COFFEE C - COFFEE SUGAR AND COCOA EXCHANGE ;2003.04.15;  102078;    9170;   22124;   25723;   50267;   45631;   85160;   93478;   16918;    8600
COFFEE C - COFFEE SUGAR AND COCOA EXCHANGE ;2003.04.08;  103498;    9660;   20279;   26861;   49715;   47449;   86236;   94589;   17262;    8910
COFFEE C - COFFEE SUGAR AND COCOA EXCHANGE ;2003.04.01;  104049;    8000;   24171;   25364;   53529;   45185;   86893;   94720;   17157;    9329
COFFEE C - COFFEE SUGAR AND COCOA EXCHANGE ;2003.03.25;  101818;    8625;   22692;   24954;   51375;   45090;   84953;   92736;   16864;    9082
COFFEE C - COFFEE SUGAR AND COCOA EXCHANGE ;2003.03.18;   99551;    8720;   22730;   24123;   50536;   43787;   83379;   90640;   16172;    8911
COFFEE C - COFFEE SUGAR AND COCOA EXCHANGE ;2003.03.11;   98526;    8983;   22436;   23682;   48899;   43415;   81564;   89534;   16962;    8992
COFFEE C - COFFEE SUGAR AND COCOA EXCHANGE ;2003.03.04;   96565;    8500;   20357;   24034;   48027;   43781;   80561;   88171;   16003;    8393
COFFEE C - COFFEE SUGAR AND COCOA EXCHANGE ;2003.02.25;   91499;   11887;   14810;   21466;   43064;   47342;   76417;   83618;   15082;    7880
