AUSSIE-KIWI XRATE - NEW YORK COTTON EXCHANGE ;2000.03.07;    2262;       0;     685;       0;    2201;    1026;    2201;    1711;      61;     551
AUSSIE-KIWI XRATE - NEW YORK COTTON EXCHANGE ;2000.02.29;    1269;     315;       0;       0;     559;    1021;     874;    1021;     395;     248
AUSSIE-KIWI XRATE - NEW YORK COTTON EXCHANGE ;1999.12.07;    2203;       0;     394;       0;    2136;    1489;    2136;    1883;      67;     320
AUSSIE-KIWI XRATE - NEW YORK COTTON EXCHANGE ;1999.11.09;    1886;     336;       0;       0;    1068;    1882;    1404;    1882;     482;       4
AUSSIE-KIWI XRATE - NEW YORK COTTON EXCHANGE ;1999.11.02;    2319;     597;       0;       0;    1066;    2319;    1663;    2319;     656;       0
AUSSIE-KIWI XRATE - NEW YORK COTTON EXCHANGE ;1999.10.26;    2464;     933;       0;       0;     850;    2323;    1783;    2323;     681;     141
AUSSIE-KIWI XRATE - NEW YORK COTTON EXCHANGE ;1999.10.19;    2483;     932;       0;       0;     851;    2317;    1783;    2317;     700;     166
AUSSIE-KIWI XRATE - NEW YORK COTTON EXCHANGE ;1999.10.05;    2234;     597;     306;       0;    1091;    1699;    1688;    2005;     546;     229
AUSSIE-KIWI XRATE - NEW YORK COTTON EXCHANGE ;1999.09.07;    2174;       0;       0;       0;    1848;    1876;    1848;    1876;     326;     298
AUSSIE-KIWI XRATE - NEW YORK COTTON EXCHANGE ;2000.03.07;    2262;       0;     685;       0;    2201;    1026;    2201;    1711;      61;     551
AUSSIE-KIWI XRATE - NEW YORK COTTON EXCHANGE ;2000.02.29;    1269;     315;       0;       0;     559;    1021;     874;    1021;     395;     248
AUSSIE-KIWI XRATE - NEW YORK COTTON EXCHANGE ;1999.12.07;    2203;       0;     394;       0;    2136;    1489;    2136;    1883;      67;     320
AUSSIE-KIWI XRATE - NEW YORK COTTON EXCHANGE ;1999.11.09;    1886;     336;       0;       0;    1068;    1882;    1404;    1882;     482;       4
AUSSIE-KIWI XRATE - NEW YORK COTTON EXCHANGE ;1999.11.02;    2319;     597;       0;       0;    1066;    2319;    1663;    2319;     656;       0
AUSSIE-KIWI XRATE - NEW YORK COTTON EXCHANGE ;1999.10.26;    2464;     933;       0;       0;     850;    2323;    1783;    2323;     681;     141
AUSSIE-KIWI XRATE - NEW YORK COTTON EXCHANGE ;1999.10.19;    2483;     932;       0;       0;     851;    2317;    1783;    2317;     700;     166
AUSSIE-KIWI XRATE - NEW YORK COTTON EXCHANGE ;1999.10.05;    2234;     597;     306;       0;    1091;    1699;    1688;    2005;     546;     229
AUSSIE-KIWI XRATE - NEW YORK COTTON EXCHANGE ;1999.09.07;    2174;       0;       0;       0;    1848;    1876;    1848;    1876;     326;     298
AUSSIE-KIWI XRATE - NEW YORK COTTON EXCHANGE ;2000.03.07;    2262;       0;     685;       0;    2201;    1026;    2201;    1711;      61;     551
AUSSIE-KIWI XRATE - NEW YORK COTTON EXCHANGE ;2000.02.29;    1269;     315;       0;       0;     559;    1021;     874;    1021;     395;     248
AUSSIE-KIWI XRATE - NEW YORK COTTON EXCHANGE ;1999.12.07;    2203;       0;     394;       0;    2136;    1489;    2136;    1883;      67;     320
AUSSIE-KIWI XRATE - NEW YORK COTTON EXCHANGE ;1999.11.09;    1886;     336;       0;       0;    1068;    1882;    1404;    1882;     482;       4
AUSSIE-KIWI XRATE - NEW YORK COTTON EXCHANGE ;1999.11.02;    2319;     597;       0;       0;    1066;    2319;    1663;    2319;     656;       0
AUSSIE-KIWI XRATE - NEW YORK COTTON EXCHANGE ;1999.10.26;    2464;     933;       0;       0;     850;    2323;    1783;    2323;     681;     141
AUSSIE-KIWI XRATE - NEW YORK COTTON EXCHANGE ;1999.10.19;    2483;     932;       0;       0;     851;    2317;    1783;    2317;     700;     166
AUSSIE-KIWI XRATE - NEW YORK COTTON EXCHANGE ;1999.10.05;    2234;     597;     306;       0;    1091;    1699;    1688;    2005;     546;     229
AUSSIE-KIWI XRATE - NEW YORK COTTON EXCHANGE ;1999.09.07;    2174;       0;       0;       0;    1848;    1876;    1848;    1876;     326;     298
