U.S. TREASURY BONDS - MCE TREASURY BONDS ;1995.04.11;   13777;    3633;    3616;       0;    1082;    2620;    4715;    6236;    9062;    7541
U.S. TREASURY BONDS - MCE TREASURY BONDS ;1995.04.04;   13488;    2874;    3844;       0;    1081;    3293;    3955;    7137;    9533;    6351
U.S. TREASURY BONDS - MCE TREASURY BONDS ;1995.03.28;   11762;    2070;    3977;      48;    1955;    1480;    4073;    5505;    7689;    6257
U.S. TREASURY BONDS - MCE TREASURY BONDS ;1995.03.21;   10914;    1748;    1795;       4;     885;    1299;    2637;    3098;    8277;    7816
U.S. TREASURY BONDS - MCE TREASURY BONDS ;1995.04.11;   13777;    3633;    3616;       0;    1082;    2620;    4715;    6236;    9062;    7541
U.S. TREASURY BONDS - MCE TREASURY BONDS ;1995.04.04;   13488;    2874;    3844;       0;    1081;    3293;    3955;    7137;    9533;    6351
U.S. TREASURY BONDS - MCE TREASURY BONDS ;1995.03.28;   11762;    2070;    3977;      48;    1955;    1480;    4073;    5505;    7689;    6257
U.S. TREASURY BONDS - MCE TREASURY BONDS ;1995.03.21;   10914;    1748;    1795;       4;     885;    1299;    2637;    3098;    8277;    7816
U.S. TREASURY BONDS - MCE TREASURY BONDS ;1995.04.11;   13777;    3633;    3616;       0;    1082;    2620;    4715;    6236;    9062;    7541
U.S. TREASURY BONDS - MCE TREASURY BONDS ;1995.04.04;   13488;    2874;    3844;       0;    1081;    3293;    3955;    7137;    9533;    6351
U.S. TREASURY BONDS - MCE TREASURY BONDS ;1995.03.28;   11762;    2070;    3977;      48;    1955;    1480;    4073;    5505;    7689;    6257
U.S. TREASURY BONDS - MCE TREASURY BONDS ;1995.03.21;   10914;    1748;    1795;       4;     885;    1299;    2637;    3098;    8277;    7816
