ALBERTA NATURAL GAS - NEW YORK MERCANTILE EXCHANGE ;1996.10.29;     952;       0;       0;       0;     489;     740;     489;     740;     463;     212
ALBERTA NATURAL GAS - NEW YORK MERCANTILE EXCHANGE ;1996.10.29;     952;       0;       0;       0;     489;     740;     489;     740;     463;     212
ALBERTA NATURAL GAS - NEW YORK MERCANTILE EXCHANGE ;1996.10.29;     952;       0;       0;       0;     489;     740;     489;     740;     463;     212
