COT - SOFT AGREGATION;2011.07.12;358020;65438;39770;84464;189987;220404;339890;344637;18130;13383
COT - SOFT AGREGATION;2011.07.12;358020;65438;39770;84464;189987;220404;339890;344637;18130;13383
COT - SOFT AGREGATION;2010.12.28;357864;86338;31414;81293;170547;233933;338177;346640;19686;11224
COT - SOFT AGREGATION;2010.12.21;351163;85344;32695;76237;170270;229376;331851;338308;19311;12855
COT - SOFT AGREGATION;2010.12.14;332234;83823;33911;65406;163728;219855;312957;319173;19278;13062
COT - SOFT AGREGATION;2010.12.07;326988;82906;36466;65046;160586;213141;308538;314653;18450;12335
COT - SOFT AGREGATION;2010.11.30;315138;74978;42168;61317;161915;198887;298211;302372;16927;12766
COT - SOFT AGREGATION;2010.11.23;318179;76826;41771;61914;162632;201299;301371;304983;16808;13196
COT - SOFT AGREGATION;2010.11.16;320258;73828;46875;62030;169903;199035;305761;307940;14497;12318
COT - SOFT AGREGATION;2010.11.09;385798;82618;46477;98481;185794;227930;366892;372888;18905;12909
COT - SOFT AGREGATION;2010.11.02;379927;79729;45251;94421;187280;227117;361431;366788;18497;13139
COT - SOFT AGREGATION;2010.10.26;377359;82412;47446;96975;179767;220229;359153;364648;18206;12711
COT - SOFT AGREGATION;2010.10.19;358879;76465;47765;89312;176205;207176;341981;344252;16898;14627
COT - SOFT AGREGATION;2010.10.12;346912;71532;48416;86828;169192;195773;327552;331017;19360;15895
COT - SOFT AGREGATION;2010.10.05;342480;69462;48452;89823;164643;188284;323928;326558;18552;15921
COT - SOFT AGREGATION;2010.09.28;348530;79224;48278;88370;159597;194703;327190;331351;21339;17178
COT - SOFT AGREGATION;2010.09.21;342127;79040;47922;84307;158849;193064;322198;325294;19929;16833
COT - SOFT AGREGATION;2010.09.14;346695;80817;49147;86667;160433;193558;327918;329373;18777;17321
COT - SOFT AGREGATION;2010.09.07;344283;80815;47177;89394;156324;190411;326533;326982;17750;17301
COT - SOFT AGREGATION;2010.08.31;327665;76525;42674;83550;151913;185578;311987;311803;15677;15862
COT - SOFT AGREGATION;2010.08.24;320842;79113;33246;79331;145772;190750;304216;303327;16625;17515
COT - SOFT AGREGATION;2010.08.17;334106;88556;29681;83142;145037;206572;316736;319396;17371;14710
COT - SOFT AGREGATION;2010.08.10;360452;90011;26337;99520;152806;221141;342338;346998;18114;13454
COT - SOFT AGREGATION;2010.08.03;370530;93440;23965;104596;152107;227747;350144;356309;20386;14221
COT - SOFT AGREGATION;2010.07.27;366377;91006;23816;100579;154863;226625;346448;351022;19930;15356
COT - SOFT AGREGATION;2010.07.20;368601;94625;24179;100598;153460;229767;348683;354544;19917;14057
COT - SOFT AGREGATION;2010.07.13;366935;93013;24533;100224;153805;228273;347042;353029;19893;13905
COT - SOFT AGREGATION;2010.07.06;363643;91983;23425;100576;153007;226270;345566;350272;18077;13371
COT - SOFT AGREGATION;2010.06.29;362567;90372;22170;101222;151398;225282;342992;348674;19575;13892
COT - SOFT AGREGATION;2010.06.22;348857;88281;23804;94526;145628;214163;328435;332493;20423;16364
COT - SOFT AGREGATION;2010.06.15;335816;80670;24814;92636;142184;198748;315489;316197;20327;19619
COT - SOFT AGREGATION;2010.06.08;321072;68842;31697;84494;148108;187117;301444;303307;19628;17765
COT - SOFT AGREGATION;2010.06.01;324839;75104;36467;79076;151918;191260;306097;306804;18742;18035
COT - SOFT AGREGATION;2010.05.25;326651;73768;42146;75985;158853;189904;308606;308035;18045;18616
COT - SOFT AGREGATION;2010.05.18;313813;72173;34678;73493;150114;188274;295781;296445;18033;17367
COT - SOFT AGREGATION;2010.05.11;320039;77911;32936;72170;145684;192600;295765;297706;24274;22334
COT - SOFT AGREGATION;2010.05.04;317838;86555;39902;68496;140821;190378;295871;298776;21967;19063
COT - SOFT AGREGATION;2010.04.27;314816;84435;49442;64666;146729;185539;295828;299645;18988;15171
COT - SOFT AGREGATION;2010.04.20;297009;77400;42692;55309;146182;183261;278891;281262;18118;15747
COT - SOFT AGREGATION;2010.04.13;292734;71727;32675;56169;148062;189856;275958;278699;16775;14034
COT - SOFT AGREGATION;2010.04.06;311801;75475;31012;66922;150017;198056;292415;295990;19388;15811
COT - SOFT AGREGATION;2010.03.30;310655;76131;31839;68142;147317;194949;291591;294930;19064;15726
COT - SOFT AGREGATION;2010.03.23;299650;70673;35369;64419;147203;184206;282294;283994;17355;15656
COT - SOFT AGREGATION;2010.03.16;293758;68204;38920;62595;146532;176702;277331;278217;16428;15543
COT - SOFT AGREGATION;2010.03.09;293935;65570;35511;64148;145501;176678;275220;276338;18715;17597
COT - SOFT AGREGATION;2010.03.02;285007;67563;32828;60157;140179;176925;267900;269910;17107;15096
COT - SOFT AGREGATION;2010.02.23;278731;69377;30030;54667;136796;179111;260841;263808;17890;14923
COT - SOFT AGREGATION;2010.02.16;282565;71695;29372;53004;141234;185456;265934;267833;16632;14733
COT - SOFT AGREGATION;2010.02.09;303538;71698;27527;63303;146419;194758;281421;285589;22116;17949
COT - SOFT AGREGATION;2010.02.02;309064;79887;21475;70969;139456;202113;290312;294558;18751;14506
COT - SOFT AGREGATION;2010.01.26;309718;85834;16142;70113;132885;211522;288832;297777;20886;11941
COT - SOFT AGREGATION;2010.01.19;307581;89930;19617;63150;130497;212239;283577;295006;24004;12575
COT - SOFT AGREGATION;2010.01.12;298279;85409;21142;60055;130773;206417;276236;287614;22043;10665
COT - SOFT AGREGATION;2010.01.05;293867;82340;20759;58892;130002;202693;271234;282343;22633;11524
COT - SOFT AGREGATION;2009.12.29;289532;85013;18134;54202;128450;204891;267665;277227;21867;12305
COT - SOFT AGREGATION;2009.12.22;298607;93497;19887;56101;126582;210563;276180;286552;22428;12055
COT - SOFT AGREGATION;2009.12.15;296962;97265;20490;53007;123903;211475;274175;284971;22787;11992
COT - SOFT AGREGATION;2009.12.08;283608;89014;18721;51446;121211;200738;261670;270906;21938;12702
COT - SOFT AGREGATION;2009.12.01;271693;82963;18509;47563;119233;193628;249760;259700;21934;11993
COT - SOFT AGREGATION;2009.11.24;260696;75889;18564;44792;120109;186409;240790;249765;19906;10932
COT - SOFT AGREGATION;2009.11.17;264350;73787;18331;44712;125587;189290;244086;252333;20264;12017
COT - SOFT AGREGATION;2009.11.09;302774;91714;20994;60800;125908;205756;278420;287549;24354;15225
COT - SOFT AGREGATION;2009.11.03;324861;96555;30337;73987;127386;203228;297928;307552;26933;17309
COT - SOFT AGREGATION;2009.10.27;314275;94643;32728;66032;130163;202397;290838;301158;23437;13118
COT - SOFT AGREGATION;2009.10.20;309040;89879;30976;65799;129322;199329;285000;296103;24041;12936
COT - SOFT AGREGATION;2009.10.13;287213;77768;26559;61609;124448;184608;263824;272775;23388;14439
COT - SOFT AGREGATION;2009.10.06;278353;73598;30283;56672;126100;179011;256371;265968;21982;12385
COT - SOFT AGREGATION;2009.09.29;265481;70746;27759;52649;121662;172346;245057;252753;20424;12728
COT - SOFT AGREGATION;2009.09.22;271880;73762;29764;54163;123284;175315;251209;259241;20672;12639
COT - SOFT AGREGATION;2009.09.15;262528;69558;33839;48666;124158;168833;242381;251337;20146;11190
COT - SOFT AGREGATION;2009.09.08;249637;61574;33193;45119;123856;158989;230549;237300;19088;12337
COT - SOFT AGREGATION;2009.09.01;244337;59188;29682;44380;122730;157516;226298;231579;18039;12759
COT - SOFT AGREGATION;2009.08.25;239344;61918;25365;41485;117422;160349;220825;227200;18519;12143
COT - SOFT AGREGATION;2009.08.18;243509;64272;20509;42327;120190;168574;226788;231410;16720;12098
COT - SOFT AGREGATION;2009.08.11;266966;68787;25051;49758;126196;178251;244741;253060;22225;13905
COT - SOFT AGREGATION;2009.08.04;266945;66272;27948;52333;126745;172597;245350;252878;21596;14067
COT - SOFT AGREGATION;2009.07.28;263868;60967;32041;49303;132769;168177;243039;249520;20829;14348
COT - SOFT AGREGATION;2009.07.21;263787;58268;34459;47862;135889;167189;242020;249511;21766;14275
COT - SOFT AGREGATION;2009.07.14;255841;54162;34706;44981;138674;163602;237817;243290;18024;12551
COT - SOFT AGREGATION;2009.07.07;260566;56199;30760;50707;137166;165402;244073;246869;16493;13697
COT - SOFT AGREGATION;2009.06.30;259830;57226;28753;49409;137248;169888;243881;248050;15949;11782
COT - SOFT AGREGATION;2009.06.23;262257;59204;24616;49046;137022;175139;245271;248801;16986;13456
COT - SOFT AGREGATION;2009.06.16;280675;71996;27966;50992;138431;189976;261420;268934;19255;11741
COT - SOFT AGREGATION;2009.06.09;308873;81928;28362;63765;141249;203565;286942;295692;21931;13181
COT - SOFT AGREGATION;2009.06.02;325172;78891;28767;76479;148504;205888;303875;311134;21297;14038
COT - SOFT AGREGATION;2009.05.26;317165;68485;26805;78394;149434;194850;296312;300048;20853;17117
COT - SOFT AGREGATION;2009.05.19;307564;63914;24180;75368;147210;190806;286491;290354;21074;17211
COT - SOFT AGREGATION;2009.05.12;297385;62048;25392;69841;146295;187361;278183;282595;19201;14790
COT - SOFT AGREGATION;2009.05.05;288452;60637;28572;68129;142181;176858;270948;273558;17505;14894
COT - SOFT AGREGATION;2009.04.28;279371;59355;31490;63373;141140;170280;263868;265144;15503;14227
COT - SOFT AGREGATION;2009.04.21;280073;59767;33104;63363;141736;170525;264867;266992;15206;13081
COT - SOFT AGREGATION;2009.04.14;294652;63551;28751;63006;151364;189527;277922;281286;16731;13366
COT - SOFT AGREGATION;2009.04.07;300780;65733;27897;70332;146339;190680;282403;288907;18377;11873
COT - SOFT AGREGATION;2009.03.31;303506;62196;29841;75592;149079;187187;286865;292620;16640;10887
COT - SOFT AGREGATION;2009.03.24;301812;59082;31977;77337;145893;177815;282313;287130;19499;14680
COT - SOFT AGREGATION;2009.03.17;300734;57353;37682;80403;146745;168874;284502;286961;16232;13773
COT - SOFT AGREGATION;2009.03.10;298771;58762;42712;80781;143106;159309;282650;282802;16120;15969
COT - SOFT AGREGATION;2009.03.03;291171;58419;42599;77491;139299;156520;275209;276610;15962;14560
COT - SOFT AGREGATION;2009.02.24;283550;62372;38291;69232;134723;157711;266328;265235;17222;18316
COT - SOFT AGREGATION;2009.02.17;283903;63562;35639;62601;140167;173502;266329;271742;17574;12161
COT - SOFT AGREGATION;2009.02.10;309483;63651;29005;76889;146570;187677;287110;293571;22373;15913
COT - SOFT AGREGATION;2009.02.03;316623;62208;30371;83056;150590;189307;295853;302734;20770;13888
COT - SOFT AGREGATION;2009.01.27;309737;59074;29364;81426;149482;184777;289981;295566;19756;14171
COT - SOFT AGREGATION;2009.01.20;296592;56391;35454;74872;147182;173141;278445;283468;18147;13124
COT - SOFT AGREGATION;2009.01.13;303647;59167;38134;73940;147884;172578;280991;284652;22657;18996
COT - SOFT AGREGATION;2009.01.06;296667;53732;40153;69958;153144;170957;276834;281068;19833;15599
COT - SOFT AGREGATION;2008.12.30;291408;52186;45457;67894;154336;164165;274418;277516;16990;13892
COT - SOFT AGREGATION;2008.12.22;285917;50060;43378;65479;155010;163988;270549;272845;15368;13073
COT - SOFT AGREGATION;2008.12.16;279688;46638;42708;63115;153688;159673;263441;265497;16248;14192
COT - SOFT AGREGATION;2008.12.09;276729;46345;48332;60038;155924;154022;262308;262393;14421;14336
COT - SOFT AGREGATION;2008.12.02;264374;46611;45554;53056;150242;150678;249910;249288;14464;15084
COT - SOFT AGREGATION;2008.11.25;259810;47470;44846;50530;148105;150554;246105;245929;13706;13882
COT - SOFT AGREGATION;2008.11.18;260400;46504;44870;49497;150542;150849;246542;245216;13857;15184
COT - SOFT AGREGATION;2008.11.11;317834;48865;50386;84131;172588;169877;305585;304394;12249;13440
COT - SOFT AGREGATION;2008.11.04;359149;48480;47776;107531;192450;192946;348462;348254;10687;10895
COT - SOFT AGREGATION;2008.10.28;366628;48070;51195;112492;197259;192337;357822;356024;8805;10603
COT - SOFT AGREGATION;2008.10.21;344754;45542;51035;100057;188893;182327;334490;333419;10263;11335
COT - SOFT AGREGATION;2008.10.14;332604;43289;47575;92769;186669;182017;322727;322361;9878;10243
COT - SOFT AGREGATION;2008.10.07;345987;45011;49257;99189;188768;186335;332968;334781;13019;11206
COT - SOFT AGREGATION;2008.09.30;332119;59638;46426;77433;180487;196462;317558;320320;14561;11799
COT - SOFT AGREGATION;2008.09.23;316999;63570;50361;71003;167046;185144;301618;306508;15381;10491
COT - SOFT AGREGATION;2008.09.16;319912;66459;51007;66714;169895;189829;303069;307549;16843;12362
COT - SOFT AGREGATION;2008.09.09;316600;73554;45547;64313;162957;197788;300825;307647;15775;8953
COT - SOFT AGREGATION;2008.09.02;317782;79435;45199;62454;158503;202289;300391;309942;17390;7839
COT - SOFT AGREGATION;2008.08.26;317350;78335;48541;60630;159290;199543;298255;308714;19096;8637
COT - SOFT AGREGATION;2008.08.19;315371;72134;49554;61065;166524;188263;299723;298884;15649;16488
COT - SOFT AGREGATION;2008.08.12;322331;77679;43472;60524;164124;205868;302327;309864;20004;12468
COT - SOFT AGREGATION;2008.08.05;353132;82578;43208;74881;176790;222408;334249;340497;18883;12634
COT - SOFT AGREGATION;2008.07.29;369387;82727;44779;87490;176833;225131;347051;357401;22336;11987
COT - SOFT AGREGATION;2008.07.22;365943;91149;41526;85778;166998;226726;343925;354031;22018;11912
COT - SOFT AGREGATION;2008.07.15;363170;95794;41810;81127;160028;226468;336950;349405;26220;13765
COT - SOFT AGREGATION;2008.07.08;374094;104156;41869;87330;156105;223080;347591;352279;26504;21816
COT - SOFT AGREGATION;2008.07.01;388553;118453;46765;82897;157480;237662;358829;367323;29724;21231
COT - SOFT AGREGATION;2008.06.24;374890;110555;47163;78590;156301;227372;345447;353126;29443;21764
COT - SOFT AGREGATION;2008.06.17;366943;103732;47069;73295;164624;226765;341652;347129;25290;19813
COT - SOFT AGREGATION;2008.06.10;387898;95451;45565;96036;174733;228340;366220;369941;21678;17957
COT - SOFT AGREGATION;2008.06.03;393802;91986;45245;101163;178362;228341;371511;374748;22290;19053
COT - SOFT AGREGATION;2008.05.27;381022;86764;43563;94944;177163;229639;358870;368147;22150;12875
COT - SOFT AGREGATION;2008.05.20;380020;89826;40756;91366;176724;235712;357916;367835;22104;12185
COT - SOFT AGREGATION;2008.05.13;372099;92370;39540;84763;173289;233314;350422;357618;21678;14482
COT - SOFT AGREGATION;2008.05.06;369357;92764;39590;84584;170518;233113;347866;357287;21491;12070
COT - SOFT AGREGATION;2008.04.29;368536;97428;36755;82124;168812;238315;348365;357194;20171;11341
COT - SOFT AGREGATION;2008.04.22;370393;94797;31171;81880;171853;243983;348528;357034;21864;13358
COT - SOFT AGREGATION;2008.04.15;375916;90763;26150;80979;179992;255112;351734;362241;24182;13675
COT - SOFT AGREGATION;2008.04.08;393668;87351;26717;104541;181639;251368;373532;382626;20137;11042
COT - SOFT AGREGATION;2008.04.01;414482;85609;25428;118237;190498;258344;394344;402009;20138;12472
COT - SOFT AGREGATION;2008.03.25;431284;90177;23017;126739;188938;267796;405853;417552;25431;13733
COT - SOFT AGREGATION;2008.03.18;450935;111457;30312;123632;188204;282490;423293;436434;27642;14501
COT - SOFT AGREGATION;2008.03.11;469203;137345;37188;123801;179292;294280;440437;455268;28767;13935
COT - SOFT AGREGATION;2008.03.04;482534;150873;41456;125155;175949;301185;451976;467797;30557;14738
COT - SOFT AGREGATION;2008.02.26;470455;159586;45905;108528;173340;302684;441455;457117;29001;13338
COT - SOFT AGREGATION;2008.02.19;471474;166524;45696;99868;175028;311314;441420;456878;30055;14596
COT - SOFT AGREGATION;2008.02.12;459739;167302;44324;92303;169366;301836;428971;438463;30768;21276
COT - SOFT AGREGATION;2008.02.05;458659;160452;42141;103779;169728;300186;433960;446106;24698;12553
COT - SOFT AGREGATION;2008.01.29;449569;144145;42334;102814;171653;287015;418611;432163;30958;17406
COT - SOFT AGREGATION;2008.01.22;437307;142980;40425;96360;163938;278706;403279;415491;34028;21814
COT - SOFT AGREGATION;2008.01.15;443545;157866;49389;94750;157836;283179;410452;427317;33094;16228
COT - SOFT AGREGATION;2008.01.08;422782;152164;46835;90692;148741;270459;391598;407987;31184;14795
COT - SOFT AGREGATION;2007.12.31;406084;145895;43009;84132;146705;265269;376731;392410;29351;13674
COT - SOFT AGREGATION;2007.12.24;402357;148729;45582;81111;144506;261885;374346;388577;28011;13781
COT - SOFT AGREGATION;2007.12.18;393130;144003;44212;75854;143121;258524;362978;378589;30152;14540
COT - SOFT AGREGATION;2007.12.11;381703;138291;43350;72761;141778;251766;352830;367877;28872;13826
COT - SOFT AGREGATION;2007.12.04;362070;128721;37603;68506;137931;242968;335158;349077;26912;12992
COT - SOFT AGREGATION;2007.11.27;339936;117067;32040;64036;135500;231172;316603;327246;23332;12689
COT - SOFT AGREGATION;2007.11.20;341596;118031;30678;62660;138656;235488;319346;328827;22250;12769
COT - SOFT AGREGATION;2007.11.13;339970;114292;30058;62643;141471;232525;318405;325226;21565;14744
COT - SOFT AGREGATION;2007.11.06;358666;114119;28621;80302;141489;233547;335909;342470;22757;16196
COT - SOFT AGREGATION;2007.10.30;366124;107886;27215;86044;149834;238167;343764;351426;22361;14699
COT - SOFT AGREGATION;2007.10.23;368891;110510;27176;90191;145818;237838;346520;355205;22371;13686
COT - SOFT AGREGATION;2007.10.16;373811;114353;28027;89948;145234;241980;349536;359955;24276;13857
COT - SOFT AGREGATION;2007.10.09;381312;112529;29115;99097;145786;240248;357412;368460;23900;12852
COT - SOFT AGREGATION;2007.10.02;375659;115832;28795;94451;140814;240655;351097;363901;24562;11758
COT - SOFT AGREGATION;2007.09.25;363739;106172;29690;87674;145367;231852;339213;349216;24526;14523
COT - SOFT AGREGATION;2007.09.18;347592;93609;39202;83405;147072;209790;324085;332397;23507;15194
COT - SOFT AGREGATION;2007.09.11;331866;87464;45420;76677;146450;196227;310592;318325;21274;13541
COT - SOFT AGREGATION;2007.09.04;332596;84130;44269;76135;150753;197883;311018;318287;21578;14309
COT - SOFT AGREGATION;2011.07.12;358020;65438;39770;84464;189987;220404;339890;344637;18130;13383
COT - SOFT AGREGATION;2011.07.05;357475;65728;40252;83619;189152;218270;338500;342140;18975;15335
COT - SOFT AGREGATION;2011.06.28;344660;59045;42663;80440;188703;205482;328186;328584;16475;16077
COT - SOFT AGREGATION;2011.06.21;343813;58074;45967;80185;189077;200807;327336;326960;16477;16853
COT - SOFT AGREGATION;2011.06.14;335244;62806;44519;74343;181476;202341;318624;321202;16620;14042
COT - SOFT AGREGATION;2011.06.07;358519;60070;45609;84684;196804;213295;341558;343589;16961;14930
COT - SOFT AGREGATION;2011.05.31;370550;64125;43597;95229;190914;214808;350268;353635;20281;16914
COT - SOFT AGREGATION;2011.05.24;369844;65633;46289;93375;189465;212522;348473;352187;21371;17658
COT - SOFT AGREGATION;2011.05.17;359588;71884;44236;82908;184909;218583;339702;345727;19886;13860
COT - SOFT AGREGATION;2011.05.10;365143;85401;40736;79459;179676;231459;344537;351656;20606;13488
COT - SOFT AGREGATION;2011.05.03;368849;91203;40778;78259;176636;238306;346099;357343;22751;11506
COT - SOFT AGREGATION;2011.04.26;354909;89534;40219;68300;176769;234742;334603;343261;20307;11648
COT - SOFT AGREGATION;2011.04.19;351322;87500;38082;66400;177550;234695;331450;339176;19872;12145
COT - SOFT AGREGATION;2011.04.12;354564;80997;36116;67465;185548;237140;334012;340722;20553;13842
COT - SOFT AGREGATION;2011.04.05;382018;77703;34973;91142;192676;243255;361522;369371;20496;12646
COT - SOFT AGREGATION;2011.03.29;375128;78882;34039;89308;183382;238312;351572;361660;23555;13468
COT - SOFT AGREGATION;2011.03.22;367277;82215;31164;84089;176946;239500;343250;354753;24027;12524
COT - SOFT AGREGATION;2011.03.15;367345;85414;30310;79778;177042;242329;342233;352417;25111;14927
COT - SOFT AGREGATION;2011.03.08;380402;99662;30257;81039;172090;254353;352792;365650;27611;14753
COT - SOFT AGREGATION;2011.03.01;358965;93219;28262;72628;168588;245369;334436;346259;24530;12706
COT - SOFT AGREGATION;2011.02.22;356088;96035;26331;67103;169530;250472;332668;343906;23421;12182
COT - SOFT AGREGATION;2011.02.15;347417;92703;25599;62267;169582;247854;324552;335721;22866;11696
COT - SOFT AGREGATION;2011.02.08;398891;88693;25458;92377;191888;267265;372957;385100;25934;13792
COT - SOFT AGREGATION;2011.02.01;410098;90351;24150;107798;188700;266918;386849;398864;23249;11234
COT - SOFT AGREGATION;2011.01.25;377462;82800;24900;90775;184491;251435;358066;367110;19396;10352
COT - SOFT AGREGATION;2011.01.18;363024;87959;32545;80391;173024;235293;341374;348230;21650;14795
COT - SOFT AGREGATION;2011.01.11;360964;89432;34032;80706;169788;231416;339927;346154;21037;14809
COT - SOFT AGREGATION;2011.01.04;361017;88513;32600;80337;172061;235111;340910;348048;20107;12969
COT - SOFT AGREGATION;2007.08.28;331332;84474;39976;74485;153335;204777;312295;319240;19036;12091
COT - SOFT AGREGATION;2007.08.21;341897;89394;36638;74081;155177;216085;318652;326804;23244;15093
COT - SOFT AGREGATION;2007.08.14;349586;106025;44946;70805;149789;222034;326617;337784;22968;11802
COT - SOFT AGREGATION;2007.08.07;368537;102743;46773;81006;156762;224244;340511;352022;28026;16516
COT - SOFT AGREGATION;2007.07.31;387359;108322;51733;86110;168417;236226;362850;374069;24508;13289
COT - SOFT AGREGATION;2007.07.24;397186;121470;59104;82912;166215;240996;370597;383013;26589;14174
COT - SOFT AGREGATION;2007.07.17;392085;121064;64237;74361;169501;237499;364925;376097;27160;15987
COT - SOFT AGREGATION;2007.07.10;390599;121198;61162;74725;170301;241040;366224;376927;24375;13672
COT - SOFT AGREGATION;2007.07.03;381723;117739;57050;72539;167801;238953;358079;368542;23643;13180
COT - SOFT AGREGATION;2007.06.26;358754;105827;49732;66923;160919;228456;333669;345111;25085;13642
COT - SOFT AGREGATION;2007.06.19;346294;100166;46007;63286;161301;226053;324753;335346;21541;10948
COT - SOFT AGREGATION;2007.06.12;352212;94984;46146;70391;161189;221337;326563;337873;25647;14338
COT - SOFT AGREGATION;2007.06.05;368809;95438;48127;82900;168202;226766;346540;357793;22269;11016
COT - SOFT AGREGATION;2007.05.29;379531;99820;62156;85292;170181;219719;355293;367167;24238;12364
COT - SOFT AGREGATION;2007.05.22;377654;97227;65156;84982;174266;218125;356475;368263;21178;9391
COT - SOFT AGREGATION;2007.05.15;375248;95934;71929;78543;178073;212544;352548;363016;22699;12233
COT - SOFT AGREGATION;2007.05.08;370787;94024;67619;79062;175452;212553;348539;359233;22249;11554
COT - SOFT AGREGATION;2007.05.01;362972;93416;63146;76240;171724;211797;341380;351184;21593;11789
COT - SOFT AGREGATION;2007.04.24;343739;93849;52784;64691;161709;214253;320250;331728;23489;12011
COT - SOFT AGREGATION;2007.04.17;346353;100664;49347;60195;159570;223025;320429;332566;25923;13787
COT - SOFT AGREGATION;2007.04.10;368781;98820;49738;72821;168792;229902;340433;352460;28350;16322
COT - SOFT AGREGATION;2007.04.03;384790;99063;48856;84100;170444;232444;353606;365400;31183;19389
COT - SOFT AGREGATION;2007.03.27;388782;108701;52264;80748;170729;238036;360178;371049;28604;17733
COT - SOFT AGREGATION;2007.03.20;370652;99577;50483;72122;171601;232375;343299;354979;27352;15672
COT - SOFT AGREGATION;2007.03.13;357713;96409;44978;66180;169479;232030;332068;343190;25646;14523
COT - SOFT AGREGATION;2007.03.06;350110;96822;39543;62131;165663;233114;324615;334788;25495;15322
COT - SOFT AGREGATION;2007.02.27;338378;96334;36507;58891;156216;228072;311441;323469;26936;14909
COT - SOFT AGREGATION;2007.02.20;334372;96172;40717;51310;158325;224186;305807;316212;28565;18159
COT - SOFT AGREGATION;2007.02.13;316356;89134;34164;44086;159918;225078;293138;303329;23219;13029
COT - SOFT AGREGATION;2007.02.06;333109;82262;32105;62225;160823;222624;305310;316955;27799;16154
COT - SOFT AGREGATION;2007.01.30;325005;77647;34531;62861;159921;214155;300429;311548;24576;13458
COT - SOFT AGREGATION;2007.01.23;321996;76931;33416;60021;159500;215247;296452;308684;25544;13312
COT - SOFT AGREGATION;2007.01.16;326459;82722;29842;60643;155509;221702;298875;312187;27584;14272
COT - SOFT AGREGATION;2007.01.09;330141;86180;29770;59793;154765;223187;300739;312751;29401;17389
COT - SOFT AGREGATION;2007.01.03;339940;97576;30694;64105;149946;230313;311627;325113;28313;14827
COT - SOFT AGREGATION;2006.12.26;330403;93297;30174;61049;148116;223256;302461;314479;27941;15925
COT - SOFT AGREGATION;2006.12.19;325135;91861;30910;58619;146578;218627;297057;308154;28078;16981
COT - SOFT AGREGATION;2006.12.12;318627;88576;30917;56768;145164;213943;290509;301628;28118;16999
COT - SOFT AGREGATION;2006.12.05;316006;83551;45299;59494;146219;195837;289264;300631;26743;15376
COT - SOFT AGREGATION;2006.11.28;302371;76357;48311;54337;147137;185206;277831;287855;24542;14517
COT - SOFT AGREGATION;2006.11.21;291578;73337;44331;51288;144003;181457;268628;277077;22950;14501
COT - SOFT AGREGATION;2006.11.14;288649;74185;41681;50900;138857;180424;263942;273004;24707;15644
COT - SOFT AGREGATION;2006.11.07;317564;70230;52787;62521;158877;187193;291627;302501;25937;15063
COT - SOFT AGREGATION;2006.10.31;317330;64259;64281;57641;168492;179702;290391;301624;26937;15705
COT - SOFT AGREGATION;2006.10.24;317238;61718;75200;51167;177217;174546;290102;300913;27136;16326
COT - SOFT AGREGATION;2006.10.17;307729;56553;76554;47549;178121;168030;282223;292134;25505;15594
COT - SOFT AGREGATION;2006.10.10;299069;55405;63122;49111;169992;169786;274508;282019;24561;17050
COT - SOFT AGREGATION;2006.10.03;299931;55539;59175;49479;167298;168937;272316;277591;27615;22340
COT - SOFT AGREGATION;2006.09.26;287501;54031;54197;47432;162579;168386;264042;270015;23459;17486
COT - SOFT AGREGATION;2006.09.19;295059;55252;65820;48635;167524;163292;271411;277747;23648;17312
COT - SOFT AGREGATION;2006.09.12;280141;58228;54217;43232;155412;166571;256872;264020;23269;16121
COT - SOFT AGREGATION;2006.09.05;276598;60008;47960;44333;148732;169407;253074;261702;23524;14897
COT - SOFT AGREGATION;2006.08.29;269051;59157;44897;44076;142843;165674;246076;254647;22976;14404
COT - SOFT AGREGATION;2006.08.22;272145;71585;37524;46030;131712;174539;249328;258093;22817;14052
COT - SOFT AGREGATION;2006.08.15;276451;72697;36961;42470;137199;182425;252366;261854;24085;14595
COT - SOFT AGREGATION;2006.08.08;304005;73188;39353;58775;145859;190878;277822;289005;26184;15000
COT - SOFT AGREGATION;2006.08.01;309865;69911;50842;58388;154203;184112;282502;293342;27364;16523
COT - SOFT AGREGATION;2006.07.25;314874;71248;50416;61744;155475;187393;288468;299553;26406;15322
COT - SOFT AGREGATION;2006.07.18;323684;82865;46202;62496;149868;198033;295231;306732;28454;16953
COT - SOFT AGREGATION;2006.07.11;329172;90327;47141;60014;150543;204095;300884;311248;28289;17924
COT - SOFT AGREGATION;2006.07.03;302755;69236;54094;57805;148740;175600;275781;287500;26974;15255
COT - SOFT AGREGATION;2006.06.27;295519;64836;68763;50591;156054;161025;271482;280379;24037;15140
COT - SOFT AGREGATION;2006.06.20;300468;64272;68905;48269;165399;169363;277940;286537;22528;13931
COT - SOFT AGREGATION;2006.06.13;314850;62377;71718;47158;180075;177833;289610;296709;25240;18141
COT - SOFT AGREGATION;2006.06.06;315823;60569;67554;52360;177118;176220;290047;296135;25776;19688
COT - SOFT AGREGATION;2006.05.30;302198;59091;60239;53981;165013;171771;278085;285991;24113;16207
COT - SOFT AGREGATION;2006.05.23;285869;61059;48514;51115;148738;170105;260912;269733;24957;16135
COT - SOFT AGREGATION;2006.05.16;275248;62073;45652;47635;138908;164893;248616;258180;26632;17068
COT - SOFT AGREGATION;2006.05.09;269893;63982;47087;45799;134021;161057;243803;253943;26090;15950
COT - SOFT AGREGATION;2006.05.02;273453;62798;50945;47444;137977;159835;248219;258224;25233;15229
COT - SOFT AGREGATION;2006.04.25;272183;61160;55218;44075;142035;157318;247270;256610;24913;15573
COT - SOFT AGREGATION;2006.04.18;269979;61098;59409;43100;143269;150395;247467;252905;22513;17074
COT - SOFT AGREGATION;2006.04.11;280013;58015;48801;52695;145692;161133;256402;262629;23611;17384
COT - SOFT AGREGATION;2006.04.04;282979;57385;40406;56689;144328;168589;258402;265684;24577;17294
COT - SOFT AGREGATION;2006.03.28;277488;52119;38488;53333;150220;168056;255673;259877;21815;17611
COT - SOFT AGREGATION;2006.03.21;273954;50078;36069;50980;151960;172408;253017;259458;20937;14496
COT - SOFT AGREGATION;2006.03.14;268797;49952;38488;48159;150243;168359;248354;255005;20444;13792
COT - SOFT AGREGATION;2006.03.07;269214;50533;38452;49139;148159;168935;247833;256527;21382;12688
COT - SOFT AGREGATION;2006.02.28;263240;52589;34463;46561;142172;169717;241323;250741;21917;12498
COT - SOFT AGREGATION;2006.02.21;260535;53017;26857;47180;138183;173074;238380;247111;22154;13424
COT - SOFT AGREGATION;2006.02.14;260319;60990;22374;45463;132186;180496;238639;248332;21678;11986
COT - SOFT AGREGATION;2006.02.07;289853;68162;22053;54225;139552;197753;261941;274031;27912;15822
COT - SOFT AGREGATION;2006.01.31;296666;66395;19069;63651;139377;198351;269422;281070;27244;15596
COT - SOFT AGREGATION;2006.01.24;292852;70873;19709;62918;133058;194332;266851;276959;26001;15893
COT - SOFT AGREGATION;2006.01.17;283653;68777;21833;57883;129431;187930;256091;267646;27562;16007
COT - SOFT AGREGATION;2006.01.10;279046;64974;20764;59789;128907;183775;253669;264328;25376;14718
COT - SOFT AGREGATION;2006.01.03;258214;52348;26271;45688;133412;169903;231449;241862;26766;16351
COT - SOFT AGREGATION;2005.12.27;248750;49449;30178;42795;134431;161778;226675;234751;22075;13999
COT - SOFT AGREGATION;2005.12.20;243690;46367;32152;42360;133827;156316;222554;230827;21136;12863
COT - SOFT AGREGATION;2005.12.13;242995;44562;35451;40687;135644;152846;220893;228985;22101;14010
COT - SOFT AGREGATION;2005.12.06;238145;40499;36199;41836;137703;148622;220037;226655;18108;11489
COT - SOFT AGREGATION;2005.11.29;235402;41124;38950;39616;135923;144040;216664;222606;18738;12796
COT - SOFT AGREGATION;2005.11.22;232241;42617;38913;39302;131341;141481;213260;219695;18983;12547
COT - SOFT AGREGATION;2005.11.15;245673;42390;49023;39055;142507;143203;223952;231282;21721;14391
COT - SOFT AGREGATION;2005.11.08;264937;46791;48476;49834;147737;154833;244364;253144;20573;11793
COT - SOFT AGREGATION;2005.11.01;280396;44040;44252;53456;161899;168968;259394;266675;21001;13721
COT - SOFT AGREGATION;2005.10.25;273590;45433;44022;53965;152244;161734;251643;259720;21948;13869
COT - SOFT AGREGATION;2005.10.18;274027;43281;43687;53711;152226;159924;249218;257322;24810;16707
COT - SOFT AGREGATION;2005.10.11;273072;41946;47466;56077;153134;153434;251157;256976;21915;16096
COT - SOFT AGREGATION;2005.10.04;266318;40220;48823;54124;150652;146277;244996;249224;21322;17094
COT - SOFT AGREGATION;2005.09.27;265818;40586;50632;53198;150840;145827;244625;249657;21194;16161
COT - SOFT AGREGATION;2005.09.20;252133;39579;41360;50030;143859;146861;233469;238252;18664;13881
COT - SOFT AGREGATION;2005.09.13;243328;40198;36367;44280;141329;149908;225807;230555;17520;12773
COT - SOFT AGREGATION;2005.09.06;246775;38823;38664;43401;144314;150165;226538;232229;20237;14546
COT - SOFT AGREGATION;2005.08.30;259617;42754;57930;42917;153656;142259;239327;243105;20290;16512
COT - SOFT AGREGATION;2005.08.23;254659;44904;56888;39642;149281;143716;233826;240245;20833;14414
COT - SOFT AGREGATION;2005.08.16;261737;46265;54465;37801;156857;153889;240923;246154;20814;15583
COT - SOFT AGREGATION;2005.08.09;260514;44487;37046;42237;153881;167750;240607;247033;19907;13481
COT - SOFT AGREGATION;2005.08.02;268072;43924;38639;44566;156634;170684;245124;253889;22948;14183
COT - SOFT AGREGATION;2005.07.26;269961;44379;41628;44270;158596;169019;247246;254917;22714;15044
COT - SOFT AGREGATION;2005.07.19;268425;44478;40710;43444;156488;167372;244409;251528;24015;16897
COT - SOFT AGREGATION;2005.07.12;262507;47297;38016;40513;153063;169307;240873;247837;21634;14670
COT - SOFT AGREGATION;2005.07.05;252256;47113;29768;38611;147109;168011;232833;236389;19423;15868
COT - SOFT AGREGATION;2005.06.28;252106;45484;27066;40565;145418;172679;231468;240311;20637;11795
COT - SOFT AGREGATION;2005.06.21;251306;44738;30569;39103;146915;168101;230757;237773;20548;13533
COT - SOFT AGREGATION;2005.06.14;269133;48425;33424;39828;159374;183811;247627;257063;21507;12071
COT - SOFT AGREGATION;2005.06.07;283345;57523;34956;49174;156479;188168;263176;272299;20169;11046
COT - SOFT AGREGATION;2005.05.31;273410;52749;33148;47597;153288;180173;253633;260918;19777;12492
COT - SOFT AGREGATION;2005.05.24;268926;52684;31178;46063;150318;179539;249065;256781;19861;12146
COT - SOFT AGREGATION;2005.05.17;266726;51315;30756;45259;148033;176765;244607;252780;22119;13946
COT - SOFT AGREGATION;2005.05.10;266828;54494;26916;47131;140914;179932;242540;253978;24289;12850
COT - SOFT AGREGATION;2005.05.03;267336;57503;23999;47056;138737;183219;243296;254274;24040;13062
COT - SOFT AGREGATION;2005.04.26;272074;57798;22746;52286;137707;183319;247792;258351;24283;13723
COT - SOFT AGREGATION;2005.04.19;261042;54543;14570;44946;137557;189618;237046;249133;23996;11908
COT - SOFT AGREGATION;2005.04.12;276967;66407;11573;44896;140118;206371;251420;262840;25547;14127
COT - SOFT AGREGATION;2005.04.05;304107;77653;12290;61591;137317;213267;276561;287146;27546;16961
COT - SOFT AGREGATION;2005.03.29;306891;80779;12002;61359;136732;217436;278870;290797;28021;16094
COT - SOFT AGREGATION;2005.03.22;334834;102844;16571;67571;135188;233919;305602;318061;29232;16773
COT - SOFT AGREGATION;2005.03.15;334983;105254;17251;64442;135630;236423;305325;318116;29658;16868
COT - SOFT AGREGATION;2005.03.08;324753;104323;17710;60726;131402;229148;296452;307584;28302;17170
COT - SOFT AGREGATION;2005.03.01;299127;92960;16707;48731;130565;220320;272257;285758;26871;13369
COT - SOFT AGREGATION;2005.02.22;266955;76316;17741;38039;128417;201080;242772;256860;24183;10095
COT - SOFT AGREGATION;2005.02.15;267675;76836;18098;37553;127779;198134;242168;253785;25506;13890
COT - SOFT AGREGATION;2005.02.08;273691;69719;18971;48034;130281;195674;248035;262680;25657;11011
COT - SOFT AGREGATION;2005.02.01;273333;62319;21195;50314;138016;191378;250649;262887;22683;10446
COT - SOFT AGREGATION;2005.01.25;273481;58977;23189;51456;141697;190372;252130;265017;21351;8464
COT - SOFT AGREGATION;2005.01.18;270207;57568;21755;49755;142246;190204;249570;261715;20637;8492
COT - SOFT AGREGATION;2005.01.11;268337;53914;20215;47815;147178;192389;248905;260418;19431;7920
COT - SOFT AGREGATION;2005.01.04;280733;63037;14013;50405;148430;207487;261872;271904;18861;8829
COT - SOFT AGREGATION;2004.12.28;283017;66676;13209;50831;145586;210248;263094;274287;19924;8730
COT - SOFT AGREGATION;2004.12.21;287346;71142;12023;49618;145255;215134;266015;276776;21330;10570
COT - SOFT AGREGATION;2004.12.14;269601;67463;10860;40954;139576;206600;247993;258412;21608;11188
COT - SOFT AGREGATION;2004.12.07;277882;70266;12254;46884;136776;207442;253926;266580;23957;11302
COT - SOFT AGREGATION;2004.11.30;264356;63449;11199;42786;133721;198479;239956;252463;24400;11893
COT - SOFT AGREGATION;2004.11.23;250800;59413;10824;37499;131002;191363;227914;239686;22886;11114
COT - SOFT AGREGATION;2004.11.16;249548;56394;9824;34704;133733;191814;224831;236342;24716;13206
COT - SOFT AGREGATION;2004.11.09;239951;40386;11471;39587;136020;175702;215993;226761;23958;13190
COT - SOFT AGREGATION;2004.11.02;243336;34062;22170;37922;150649;169772;222633;229864;20703;13472
COT - SOFT AGREGATION;2004.10.26;234366;32577;20727;36099;146107;164687;214785;221514;19582;12853
COT - SOFT AGREGATION;2004.10.19;237951;30358;28306;37785;150025;159559;218168;225651;19783;12301
COT - SOFT AGREGATION;2004.10.12;237651;33175;26495;36424;148132;163202;217731;226119;19920;11531
COT - SOFT AGREGATION;2004.10.05;234722;35639;23741;40067;139838;160423;215545;224231;19176;10491
COT - SOFT AGREGATION;2004.09.28;234095;37747;24747;42517;136189;156793;216452;224057;17643;10039
COT - SOFT AGREGATION;2004.09.21;225612;31442;27678;38333;136992;150475;206767;216485;18845;9127
COT - SOFT AGREGATION;2004.09.14;219143;29501;30295;34584;136223;145691;200309;210571;18834;8572
COT - SOFT AGREGATION;2004.09.07;217063;29441;34878;30910;137047;141389;197400;207176;19663;9886
COT - SOFT AGREGATION;2004.08.31;225744;37635;37927;32777;134656;145249;205068;215954;20675;9791
COT - SOFT AGREGATION;2004.08.24;224905;38334;38683;31204;133073;144171;202612;214058;22294;10846
COT - SOFT AGREGATION;2004.08.17;229828;38085;39511;30774;138695;147962;207555;218248;22274;11581
COT - SOFT AGREGATION;2004.08.10;253552;41043;42725;40753;150085;159130;231881;242606;21671;10946
COT - SOFT AGREGATION;2004.08.03;259513;39397;41287;45359;150545;159421;235301;246068;24212;13445
COT - SOFT AGREGATION;2004.07.27;237820;33607;28037;40594;139462;154479;213664;223111;24156;14709
COT - SOFT AGREGATION;2004.07.20;231839;34425;31236;37024;135615;149535;207064;217794;24776;14045
COT - SOFT AGREGATION;2004.07.13;223858;29071;38787;31698;137078;136455;197847;206939;26011;16918
COT - SOFT AGREGATION;2004.07.06;232888;32119;48553;35145;139086;130369;206351;214067;26538;18821
COT - SOFT AGREGATION;2004.06.29;221463;34652;38969;34795;127816;133756;197263;207520;24200;13944
COT - SOFT AGREGATION;2004.06.22;224451;39658;38698;36412;126452;137404;202523;212515;21928;11936
COT - SOFT AGREGATION;2004.06.15;240389;50872;40609;36291;130362;149059;217525;225958;22865;14431
COT - SOFT AGREGATION;2004.06.08;269828;55246;43661;54146;137579;158011;246972;255819;22856;14009
COT - SOFT AGREGATION;2004.06.01;274922;51639;41347;54763;144237;164131;250638;260241;24284;14681
COT - SOFT AGREGATION;2004.05.25;247518;34191;44531;44691;145856;144816;224737;234037;22779;13480
COT - SOFT AGREGATION;2004.05.18;248607;31961;57394;40846;152364;134244;225171;232484;23436;16123
COT - SOFT AGREGATION;2004.05.11;241425;29482;50048;37683;151095;137991;218259;225722;23166;15703
COT - SOFT AGREGATION;2004.05.04;236599;29031;52666;35490;148222;133081;212744;221237;23855;15362
COT - SOFT AGREGATION;2004.04.27;229692;28908;50462;31712;145883;133190;206503;215364;23189;14328
COT - SOFT AGREGATION;2004.04.20;230712;31193;46078;31768;143734;138233;206696;216078;24016;14634
COT - SOFT AGREGATION;2004.04.12;223608;34602;32767;28994;134594;147169;198190;208930;25418;14679
COT - SOFT AGREGATION;2004.04.06;231437;36254;28651;33416;132230;150532;201900;212598;29537;18838
COT - SOFT AGREGATION;2004.03.30;241108;37254;32967;36849;139264;156526;213367;226342;27742;14766
COT - SOFT AGREGATION;2004.03.23;246498;44208;30038;36511;136688;166406;217407;232955;29091;13543
COT - SOFT AGREGATION;2004.03.16;247614;45884;32932;35096;139649;167828;220629;235856;26984;11758
COT - SOFT AGREGATION;2004.03.09;230265;39496;25061;33250;133360;159959;206107;218269;24158;11996
COT - SOFT AGREGATION;2004.03.02;219938;41519;21141;33142;120975;154299;195636;208582;24302;11356
COT - SOFT AGREGATION;2004.02.24;215574;37389;27936;32545;120718;142743;190652;203223;24923;12351
COT - SOFT AGREGATION;2004.02.17;221352;48071;24970;33632;112762;150246;194467;208848;26885;12505
COT - SOFT AGREGATION;2004.02.10;234030;47018;26076;41990;116925;152649;205933;220716;28096;13315
COT - SOFT AGREGATION;2004.02.03;243150;50762;23266;48958;115026;156839;214745;229063;28404;14087
COT - SOFT AGREGATION;2004.01.27;242567;54613;28713;45482;116164;156427;216259;230623;26307;11944
COT - SOFT AGREGATION;2004.01.20;220906;37505;28443;40358;114521;139995;192384;208796;28522;12110
COT - SOFT AGREGATION;2004.01.13;215315;32832;28330;37179;121632;141060;191643;206569;23671;8746
COT - SOFT AGREGATION;2004.01.06;209078;24125;27199;38919;118287;130989;181330;197106;27747;11971
COT - SOFT AGREGATION;2003.12.30;200026;24044;35085;34356;117475;120237;175874;189678;24153;10348
COT - SOFT AGREGATION;2003.12.22;200924;23763;32965;34400;119613;123847;177775;191212;23149;9712
COT - SOFT AGREGATION;2003.12.16;203307;24232;33893;35759;120300;124183;180292;193834;23015;9471
COT - SOFT AGREGATION;2003.12.09;206285;26887;32184;38098;117441;126037;182428;196320;23857;9965
COT - SOFT AGREGATION;2003.12.02;200241;17084;39798;39250;117925;109037;174258;188085;25983;12156
COT - SOFT AGREGATION;2003.11.25;200979;16871;46352;38750;119933;100263;175555;185366;25424;15613
COT - SOFT AGREGATION;2003.11.18;191222;20273;39414;35734;111187;103669;167194;178818;24029;12406
COT - SOFT AGREGATION;2003.11.11;209358;22474;51896;37555;123313;105086;183340;194537;26018;14822
COT - SOFT AGREGATION;2003.11.04;238747;18841;54591;56816;135611;107604;211268;219012;27479;19736
COT - SOFT AGREGATION;2003.10.28;220572;19076;44377;55178;120896;104548;195150;204102;25422;16469
COT - SOFT AGREGATION;2003.10.21;206168;15660;47553;45713;121633;96496;183006;189762;23162;16406
COT - SOFT AGREGATION;2003.10.14;191981;18101;38545;40471;111006;98057;169578;177073;22404;14909
COT - SOFT AGREGATION;2003.10.07;188618;23446;29350;39361;101492;104610;164298;173320;24320;15298
COT - SOFT AGREGATION;2003.09.30;186013;24741;29486;37086;100915;106812;162742;173384;23270;12627
COT - SOFT AGREGATION;2003.09.23;184162;25898;26816;36085;100331;107335;162314;170236;21849;13926
COT - SOFT AGREGATION;2003.09.16;179458;28888;27421;31871;95201;107526;155959;166818;23499;12640
COT - SOFT AGREGATION;2003.09.09;190669;40006;30234;33395;94622;116393;168023;180023;22646;10646
COT - SOFT AGREGATION;2003.09.02;172782;27722;37860;27354;94290;96194;149365;161408;23417;11374
COT - SOFT AGREGATION;2003.08.26;174098;27232;37966;28521;94852;95552;150605;162038;23494;12060
COT - SOFT AGREGATION;2003.08.19;171148;17360;40612;30332;99285;85973;146977;156918;24170;14230
COT - SOFT AGREGATION;2003.08.12;168439;13749;36268;29689;100819;86228;144256;152186;24182;16253
COT - SOFT AGREGATION;2003.08.05;179802;16025;38174;36989;107308;93622;160321;168784;19482;11019
COT - SOFT AGREGATION;2003.07.29;200825;13567;45346;49061;114077;90935;176705;185343;24120;15483
COT - SOFT AGREGATION;2003.07.22;200562;12618;46592;44651;119241;93435;176509;184676;24054;15886
COT - SOFT AGREGATION;2003.07.15;197208;12692;42677;43890;118230;97582;174813;184148;22395;13060
COT - SOFT AGREGATION;2003.07.08;198371;13098;42820;43225;118429;98711;174752;184757;23618;13614
COT - SOFT AGREGATION;2003.07.01;199942;11822;48371;45026;122941;95771;179790;189169;20152;10773
COT - SOFT AGREGATION;2003.06.24;201250;11599;50122;44556;126096;95189;182250;189865;18999;11385
COT - SOFT AGREGATION;2003.06.17;199794;11325;45494;43646;122762;98423;177733;187563;22061;12230
COT - SOFT AGREGATION;2003.06.10;214639;11145;53071;50750;131072;96665;192967;200486;21673;14153
COT - SOFT AGREGATION;2003.06.03;224124;11318;52397;56231;133648;99790;201197;208417;22927;15708
COT - SOFT AGREGATION;2003.05.27;222597;15900;44227;52016;129929;110243;197846;206487;24751;16111
COT - SOFT AGREGATION;2003.05.20;216486;19660;41522;48925;126044;113826;194629;204273;21857;12213
COT - SOFT AGREGATION;2003.05.13;204450;18832;43340;41201;122172;106832;182205;191372;22244;13077
COT - SOFT AGREGATION;2003.05.06;202235;20564;38634;38857;121127;112285;180548;189776;21687;12459
COT - SOFT AGREGATION;2003.04.29;194609;16951;41895;36838;118754;103842;172544;182576;22066;12033
COT - SOFT AGREGATION;2003.04.22;192067;16576;48528;35483;118620;94773;170680;178784;21387;13283
COT - SOFT AGREGATION;2003.04.15;192586;11499;52235;38144;121891;88348;171535;178727;21052;13859
COT - SOFT AGREGATION;2003.04.08;194531;14294;48428;37322;120771;94777;172387;180527;22144;14005
COT - SOFT AGREGATION;2003.04.01;207154;10892;51449;41799;131500;97228;184191;190477;22964;16677
COT - SOFT AGREGATION;2003.03.25;202858;11830;49015;39932;128476;97757;180237;186704;22620;16154
COT - SOFT AGREGATION;2003.03.18;198324;12673;48108;36695;126110;98055;175479;182859;22845;15465
COT - SOFT AGREGATION;2003.03.11;197310;13368;46848;37589;123467;97138;174424;181576;22885;15733
COT - SOFT AGREGATION;2003.03.04;197287;13565;44569;39067;122254;98276;174886;181912;22400;15374
COT - SOFT AGREGATION;2003.02.25;193136;18978;38838;35421;115806;103042;170205;177301;22932;15835
COT - SOFT AGREGATION;2003.02.14;199766;27981;36370;33919;112595;114944;174496;185233;25270;14532
COT - SOFT AGREGATION;2003.02.11;207370;30711;33999;40616;110942;118333;182269;192948;25101;14423
COT - SOFT AGREGATION;2003.02.04;233834;30280;38345;53732;121418;125144;205429;217221;28405;16613
COT - SOFT AGREGATION;2003.01.28;227060;25896;30227;57313;117698;124397;200907;211937;26152;15123
COT - SOFT AGREGATION;2003.01.21;218394;21095;28630;55829;116011;119719;192936;204178;25458;14216
COT - SOFT AGREGATION;2003.01.14;216668;20472;29840;54979;115956;116963;191408;201782;25261;14887
COT - SOFT AGREGATION;2003.01.07;217101;19752;32276;54743;116488;116425;190983;203444;26117;13657
COT - SOFT AGREGATION;2002.12.31;210452;16086;31118;54237;117861;111207;188185;196562;22266;13888
COT - SOFT AGREGATION;2002.12.23;205695;15534;29673;51055;115882;111336;182472;192065;23224;13631
COT - SOFT AGREGATION;2002.12.17;204502;15408;29310;50570;115507;110476;181487;190358;23015;14144
COT - SOFT AGREGATION;2002.12.10;210657;23740;29706;49043;110608;115013;183390;193762;27267;16895
COT - SOFT AGREGATION;2002.12.03;207476;29615;27435;47202;107633;119757;184450;194395;23026;13081
COT - SOFT AGREGATION;2002.11.26;202258;26624;27323;46619;107752;116233;180994;190175;21264;12082
COT - SOFT AGREGATION;2002.11.19;201755;27588;32171;40849;112218;115873;180654;188892;21101;12863
COT - SOFT AGREGATION;2002.11.12;201108;26128;32702;39729;113273;114780;179131;187211;21977;13897
COT - SOFT AGREGATION;2002.11.05;218514;26306;31401;49089;120960;125874;196356;206364;22159;12150
COT - SOFT AGREGATION;2002.10.29;234186;27573;31728;51070;132759;138093;211401;220892;22785;13294
COT - SOFT AGREGATION;2002.10.22;236842;29219;32829;48637;135229;142398;213085;223863;23757;12979
COT - SOFT AGREGATION;2002.10.15;248526;35962;36580;46750;136809;151467;219521;234798;29005;13728
COT - SOFT AGREGATION;2002.10.08;240244;32786;43780;42909;137325;140544;213020;227233;27224;13011
COT - SOFT AGREGATION;2002.10.01;241479;32956;44992;41947;141369;141964;216271;228902;25208;12577
COT - SOFT AGREGATION;2002.09.24;231022;32692;39536;39408;134466;138730;206565;217674;24458;13348
COT - SOFT AGREGATION;2002.09.17;231619;39715;38114;38756;127599;140828;206070;217697;25549;13922
COT - SOFT AGREGATION;2002.09.10;224974;33153;36948;36814;128889;136042;198856;209804;26118;15170
COT - SOFT AGREGATION;2002.09.03;218704;27198;46005;27265;126967;118801;181430;192072;37274;26632
COT - SOFT AGREGATION;2002.08.27;213615;26572;47131;33370;130210;118533;190151;199034;23465;14580
COT - SOFT AGREGATION;2002.08.20;207282;26430;44769;30339;126128;117069;182897;192175;24385;15106
COT - SOFT AGREGATION;2002.08.13;207414;23242;46159;30322;127994;116159;181558;192640;25856;14773
COT - SOFT AGREGATION;2002.08.06;216170;23497;47286;34769;132432;118770;190698;200825;25474;15346
COT - SOFT AGREGATION;2002.07.30;229649;27425;47084;41931;135123;125199;204481;214214;25168;15435
COT - SOFT AGREGATION;2002.07.23;225324;30362;46749;37902;129933;124987;198197;209638;27127;15686
COT - SOFT AGREGATION;2002.07.16;223274;31401;43602;35823;129128;128990;196352;208416;26922;14858
COT - SOFT AGREGATION;2002.07.09;216815;29181;45128;33363;127803;124319;190347;202810;26469;14005
COT - SOFT AGREGATION;2002.07.02;213143;26700;44633;32169;127582;122394;186451;199194;26692;13949
COT - SOFT AGREGATION;2002.06.25;205337;23969;44299;30679;127099;117068;181748;192046;23590;13292
COT - SOFT AGREGATION;2002.06.18;197913;16170;41703;28853;128541;113303;173563;183859;24350;14054
COT - SOFT AGREGATION;2002.06.11;204326;18959;35138;31123;128102;123198;178185;189460;26141;14866
COT - SOFT AGREGATION;2002.06.04;226069;29243;32820;40318;128454;136864;198014;210001;28056;16067
COT - SOFT AGREGATION;2002.05.28;225596;29109;33274;39523;130700;138080;199332;210878;26263;14717
COT - SOFT AGREGATION;2002.05.21;222197;28107;32934;38958;128558;136367;195622;208260;26575;13938
COT - SOFT AGREGATION;2002.05.14;212659;23404;33403;36662;128881;130199;188947;200264;23712;12395
COT - SOFT AGREGATION;2002.05.07;207903;21616;30232;37564;125133;127504;184313;195300;23589;12603
COT - SOFT AGREGATION;2002.04.30;203329;25480;27527;34545;119543;128000;179568;190073;23761;13256
COT - SOFT AGREGATION;2002.04.23;204864;35781;24694;31572;111532;134976;178884;191241;25981;13623
COT - SOFT AGREGATION;2002.04.16;198541;33206;25481;29787;110628;130810;173621;186079;24920;12462
COT - SOFT AGREGATION;2002.04.09;207468;36317;24456;33421;109251;135471;178990;193349;28478;14120
COT - SOFT AGREGATION;2002.04.02;220002;44039;25592;36309;111496;142635;191844;204536;28158;15467
COT - SOFT AGREGATION;2002.03.26;212552;40517;26628;34262;110975;137731;185754;198621;26798;13931
COT - SOFT AGREGATION;2002.03.19;207095;41673;26963;31897;107300;134552;180870;193412;26224;13682
COT - SOFT AGREGATION;2002.03.12;207660;40396;26879;31878;106996;134215;179270;192972;28390;14688
COT - SOFT AGREGATION;2002.03.05;197457;32529;33109;29084;108785;121310;170398;183502;27060;13955
COT - SOFT AGREGATION;2002.02.26;195401;32410;32918;28040;109155;120618;169604;181576;25797;13825
COT - SOFT AGREGATION;2002.02.19;199862;33760;38156;26944;114816;121751;175520;186851;24342;13011
COT - SOFT AGREGATION;2002.02.12;199782;34339;39880;26779;112369;120460;173487;187118;26295;12664
COT - SOFT AGREGATION;2002.02.05;199797;31724;37142;26624;113826;121484;172174;185251;27623;14546
COT - SOFT AGREGATION;2002.01.29;203947;28971;33691;30948;117060;125498;176978;190138;26969;13811
COT - SOFT AGREGATION;2002.01.22;195722;27815;28281;30254;117277;130342;175347;188877;20375;6845
COT - SOFT AGREGATION;2002.01.15;194399;29229;27874;29965;113576;130603;172768;188442;21631;5957
COT - SOFT AGREGATION;2002.01.08;195430;32119;30961;29571;111691;126854;173381;187386;22048;8044
COT - SOFT AGREGATION;2001.12.28;183574;30735;31705;26139;107664;118945;164538;176790;19036;6784
COT - SOFT AGREGATION;2001.12.21;184317;29740;31549;25860;107460;118236;163060;175645;21257;8671
COT - SOFT AGREGATION;2001.12.18;182113;29503;35304;25512;107049;112965;162064;173780;20049;8332
COT - SOFT AGREGATION;2001.12.11;184640;30169;34441;25768;108499;115850;164434;176059;20205;8581
COT - SOFT AGREGATION;2001.12.04;183502;31049;34503;27133;105768;113354;163951;174991;19553;8512
COT - SOFT AGREGATION;2001.11.27;177386;31060;30697;25050;101901;113708;158013;169456;19374;7930
COT - SOFT AGREGATION;2001.11.20;175676;31814;26681;24839;97312;114387;153964;165906;21711;9770
COT - SOFT AGREGATION;2001.11.13;177344;26140;33533;22841;107145;112335;156127;168711;21217;8633
COT - SOFT AGREGATION;2001.11.06;184401;19097;33992;26394;115394;111605;160885;171989;23517;12413
COT - SOFT AGREGATION;2001.10.30;183908;19927;37211;24779;119986;111381;164694;173373;19215;10536
COT - SOFT AGREGATION;2001.10.23;186270;23710;36295;24183;119515;117607;167407;178085;18863;8185
COT - SOFT AGREGATION;2001.10.16;183621;24218;35182;22742;115166;114708;162128;172633;21493;10988
COT - SOFT AGREGATION;2001.10.09;180217;24769;34546;21876;113020;114557;159666;170979;20550;9237
COT - SOFT AGREGATION;2001.10.02;174977;22361;36199;21297;110625;108839;154283;166335;20695;8642
COT - SOFT AGREGATION;2001.09.25;168365;14466;35290;18456;114765;103037;147686;156783;20679;11582
COT - SOFT AGREGATION;2001.09.18;170664;14791;38340;19072;114924;101471;148788;158884;21876;11780
COT - SOFT AGREGATION;2001.09.04;164895;16451;32108;18672;106343;102705;141466;153485;23429;11410
COT - SOFT AGREGATION;2001.08.28;165396;23161;28306;18770;99137;107978;141068;155054;24327;10341
COT - SOFT AGREGATION;2001.08.21;166289;23692;26958;20590;97820;108206;142101;155753;24188;10536
COT - SOFT AGREGATION;2001.08.14;175988;23368;35167;19850;109274;111685;152492;166702;23495;9286
COT - SOFT AGREGATION;2001.08.07;182543;18914;33960;25667;113700;111316;158281;170943;24262;11600
COT - SOFT AGREGATION;2001.07.31;183963;15700;38485;26044;119630;107291;161373;171819;22589;12144
COT - SOFT AGREGATION;2001.07.24;181373;15199;38614;23987;119857;107446;159044;170047;22330;11327
COT - SOFT AGREGATION;2001.07.17;182049;14119;40782;24372;122150;104694;160641;169848;21407;12200
COT - SOFT AGREGATION;2001.07.10;183294;14749;39934;25243;121276;105967;161269;171144;22025;12149
COT - SOFT AGREGATION;2001.07.03;183604;14048;39347;25136;120627;105756;159811;170238;23792;13365
COT - SOFT AGREGATION;2001.06.26;189617;12263;40188;30169;124974;106967;167405;177323;22212;12294
COT - SOFT AGREGATION;2001.06.19;190124;15301;38415;29355;122654;108857;167311;176627;22814;13496
COT - SOFT AGREGATION;2001.06.12;190524;14720;35098;28643;127386;115011;170749;178751;19774;11771
COT - SOFT AGREGATION;2001.06.05;193891;16542;28109;32612;121557;118782;170710;179501;23180;14390
COT - SOFT AGREGATION;2001.05.29;191743;20492;22963;32729;116498;125029;169720;180720;22023;11023
COT - SOFT AGREGATION;2001.05.22;187986;21955;20577;32188;108644;123669;162788;176434;25198;11552
COT - SOFT AGREGATION;2001.05.15;180741;17203;20174;31079;109272;118915;157555;170169;23186;10572
COT - SOFT AGREGATION;2001.05.08;183629;17079;22548;31797;110956;117477;159833;171822;23797;11807
COT - SOFT AGREGATION;2001.05.01;174676;17291;24101;26404;108933;111802;152628;162307;22049;12369
COT - SOFT AGREGATION;2001.04.24;176189;15481;26237;28819;112639;110308;156940;165363;19249;10826
COT - SOFT AGREGATION;2001.04.17;177167;14532;28616;28623;114549;107893;157703;165131;19463;12035
COT - SOFT AGREGATION;2001.04.10;187488;15201;28227;31723;122846;118117;169770;178067;17717;9421
COT - SOFT AGREGATION;2001.04.03;196837;17362;27821;34246;122625;122210;174233;184278;22604;12559
COT - SOFT AGREGATION;2001.03.27;196652;18231;26633;31941;124054;125500;174225;184075;22427;12577
COT - SOFT AGREGATION;2001.03.20;199466;20635;31577;31847;124714;123043;177196;186468;22270;12997
COT - SOFT AGREGATION;2001.03.13;199460;22782;29657;31459;118737;124562;172978;185678;26482;13782
COT - SOFT AGREGATION;2001.03.06;198492;23467;28730;31172;116931;127245;171570;187147;26922;11344
COT - SOFT AGREGATION;2001.02.27;195925;25924;29140;30422;113610;125925;169955;185487;25970;10438
COT - SOFT AGREGATION;2001.02.20;195866;26342;30858;29097;112594;123186;168033;183141;27833;12725
COT - SOFT AGREGATION;2001.02.13;195857;25765;28804;29272;113658;125366;168696;183443;27162;12414
COT - SOFT AGREGATION;2001.02.06;206133;25958;32347;33307;117907;128061;177171;193716;28961;12417
COT - SOFT AGREGATION;2001.01.30;209990;24405;30258;36196;118703;129653;179305;196108;30685;13882
COT - SOFT AGREGATION;2001.01.23;215292;22531;31030;34331;125898;137758;182759;203119;32533;12173
COT - SOFT AGREGATION;2001.01.16;216427;17139;39193;30327;131250;133585;178716;203105;37711;13322
COT - SOFT AGREGATION;2001.01.09;212218;15806;43858;27174;132472;127780;175453;198813;36765;13404
COT - SOFT AGREGATION;2001.01.02;199330;17682;47282;22985;122250;118341;162917;188607;36412;10723
COT - SOFT AGREGATION;2000.12.26;209212;15503;47319;26870;128725;123908;171097;198095;38114;11117
COT - SOFT AGREGATION;2000.12.19;206872;15453;48589;24874;131926;122589;172253;196054;34618;10818
COT - SOFT AGREGATION;2000.12.12;204657;16098;46572;23073;130634;123086;169805;192731;34851;11925
COT - SOFT AGREGATION;2000.12.05;204384;15777;44894;22359;129018;123324;167155;190578;37229;13807
COT - SOFT AGREGATION;2000.11.28;200259;16891;43341;21395;126787;122956;165073;187691;35186;12568
COT - SOFT AGREGATION;2000.11.21;197022;15555;43743;20879;126700;120232;163135;184853;33886;12168
COT - SOFT AGREGATION;2000.11.14;194167;14624;42441;20828;126508;118167;161960;181436;32207;12730
COT - SOFT AGREGATION;2000.11.07;207735;13688;39250;24785;129692;127287;168165;191322;39570;16414
COT - SOFT AGREGATION;2000.10.31;212065;13876;35204;27098;137007;137058;177981;199362;34084;12703
COT - SOFT AGREGATION;2000.10.24;207497;13342;26033;30003;129607;139961;172952;195997;34544;11499
COT - SOFT AGREGATION;2000.10.17;206818;15607;23036;28634;128173;144831;172412;196499;34405;10319
COT - SOFT AGREGATION;2000.10.10;203089;12716;26228;26997;130641;140295;170353;193520;32736;9569
COT - SOFT AGREGATION;2000.10.03;199673;13415;34708;27612;126342;128911;167368;191230;32305;8443
COT - SOFT AGREGATION;2000.09.26;186840;13501;33813;22003;118191;120228;153694;176043;33146;10796
COT - SOFT AGREGATION;2000.09.19;183390;14493;32008;19970;115096;121542;149559;173519;33832;9871
COT - SOFT AGREGATION;2000.09.12;181496;14564;32555;19079;113962;118904;147607;170538;33890;10958
COT - SOFT AGREGATION;2000.09.05;181394;14317;34076;19445;113541;115827;147302;169348;34092;12046
COT - SOFT AGREGATION;2000.08.29;178278;14178;33790;17795;113288;114255;145261;165840;33017;12438
COT - SOFT AGREGATION;2000.08.22;173160;13360;30947;17505;110395;112328;141260;160780;31900;12381
COT - SOFT AGREGATION;2000.08.15;171219;13187;30916;15476;110681;114243;139344;160633;31874;10585
COT - SOFT AGREGATION;2000.08.08;178970;12936;29152;20841;110627;116934;144404;166928;34567;12043
COT - SOFT AGREGATION;2000.08.01;179940;11790;23228;24735;110376;121762;146903;169726;33038;10215
COT - SOFT AGREGATION;2000.07.25;174675;12526;19500;22497;109137;123148;144159;165145;30516;9530
COT - SOFT AGREGATION;2000.07.18;189917;15786;24313;26319;115967;131211;158072;181842;31846;8074
COT - SOFT AGREGATION;2000.07.11;184753;13273;29506;23857;114186;121017;151316;174379;33437;10373
COT - SOFT AGREGATION;2000.07.05;178201;15450;31002;18874;110513;116727;144837;166604;33364;11598
COT - SOFT AGREGATION;2000.06.27;180201;15190;29604;21188;109936;119977;146314;170768;33887;9433
COT - SOFT AGREGATION;2000.06.20;181155;17356;35006;21603;108188;112166;147146;168776;34009;12380
COT - SOFT AGREGATION;2000.06.13;182840;17622;30688;20959;106495;119334;145077;170980;37764;11860
COT - SOFT AGREGATION;2000.06.06;190454;18343;34952;23917;106746;117233;149007;176102;41447;14352
COT - SOFT AGREGATION;2000.05.30;186140;18440;32404;24963;101028;116803;144430;174171;41710;11970
COT - SOFT AGREGATION;2000.05.23;187214;15773;33469;25281;103335;117574;144390;176323;42824;10891
COT - SOFT AGREGATION;2000.05.16;191091;16615;41499;23991;106280;113683;146886;179174;44205;11917
COT - SOFT AGREGATION;2000.05.09;185506;15977;38053;23233;106577;113214;145788;174500;39719;11006
COT - SOFT AGREGATION;2000.05.02;182451;15438;37644;23324;106078;111635;144839;172602;37612;9850
COT - SOFT AGREGATION;2000.04.25;173831;13163;34716;21085;104091;107177;138338;162977;35493;10855
COT - SOFT AGREGATION;2000.04.18;172689;14382;32094;18249;104444;113109;137075;163453;35615;9237
COT - SOFT AGREGATION;2000.04.11;180316;15010;30954;23839;107871;115558;146719;170349;33597;9966
COT - SOFT AGREGATION;2000.04.04;180255;14917;26250;24267;105151;117832;144336;168349;35920;11906
COT - SOFT AGREGATION;2000.03.28;181459;16475;24691;24664;104919;121223;146057;170577;35403;10882
COT - SOFT AGREGATION;2000.03.21;179785;21172;23209;22828;101594;122740;145594;168778;34191;11007
COT - SOFT AGREGATION;2000.03.14;176251;15775;26273;21004;102584;117515;139363;164792;36887;11459
COT - SOFT AGREGATION;2000.03.07;178195;15427;28230;21599;103487;117031;140513;166861;37682;11333
COT - SOFT AGREGATION;2000.02.29;183145;16471;33095;23024;103838;113191;143333;169310;39811;13835
COT - SOFT AGREGATION;2000.02.22;181234;18920;28619;21886;103993;118032;144799;168536;36435;12697
COT - SOFT AGREGATION;2000.02.15;189772;18727;27823;23890;106134;123463;148751;175175;41021;14598
COT - SOFT AGREGATION;2000.02.08;196084;18833;27186;30321;102975;125914;152129;183422;43955;12662
COT - SOFT AGREGATION;2000.02.01;200591;19725;22571;35759;102136;128597;157620;186926;42971;13665
COT - SOFT AGREGATION;2000.01.25;189906;18846;17435;34351;97902;128778;151099;180564;38807;9342
COT - SOFT AGREGATION;2000.01.18;189047;20271;16510;35269;96144;127121;151685;178900;37361;10146
COT - SOFT AGREGATION;2000.01.11;178591;20657;13537;31503;89142;124057;141301;169098;37289;9492
COT - SOFT AGREGATION;2000.01.04;178315;20238;11117;34258;87561;121941;142057;167316;36258;10998
COT - SOFT AGREGATION;1999.12.28;176148;20638;10187;33977;85726;121995;140342;166160;35806;9989
COT - SOFT AGREGATION;1999.12.21;180053;21569;11317;33984;86433;124329;141987;169631;38066;10423
