SILVER - CEI SILVER ;1995.04.04;  165761;   22346;    4461;   41967;   49411;   93823;  113724;  140251;   52037;   25510
SILVER - CEI SILVER ;1995.03.28;  155258;   20577;   12566;   35863;   51031;   85899;  107471;  134328;   47787;   20930
SILVER - CEI SILVER ;1995.03.21;  149974;   19220;   12895;   33917;   50240;   81997;  103377;  128809;   46596;   21165
SILVER - CEI SILVER ;1995.04.04;  165761;   22346;    4461;   41967;   49411;   93823;  113724;  140251;   52037;   25510
SILVER - CEI SILVER ;1995.03.28;  155258;   20577;   12566;   35863;   51031;   85899;  107471;  134328;   47787;   20930
SILVER - CEI SILVER ;1995.03.21;  149974;   19220;   12895;   33917;   50240;   81997;  103377;  128809;   46596;   21165
SILVER - CEI SILVER ;1995.04.04;  165761;   22346;    4461;   41967;   49411;   93823;  113724;  140251;   52037;   25510
SILVER - CEI SILVER ;1995.03.28;  155258;   20577;   12566;   35863;   51031;   85899;  107471;  134328;   47787;   20930
SILVER - CEI SILVER ;1995.03.21;  149974;   19220;   12895;   33917;   50240;   81997;  103377;  128809;   46596;   21165
