GASOIL AVG PRICE OPTIONS - NEW YORK MERCANTILE EXCHANGE ;2010.12.28;    3539;     155;       0;     458;    2623;    2785;    3235;    3243;     303;     296
GASOIL AVG PRICE OPTIONS - NEW YORK MERCANTILE EXCHANGE ;2010.12.21;    3492;     154;       0;     448;    2588;    2751;    3191;    3199;     301;     293
GASOIL AVG PRICE OPTIONS - NEW YORK MERCANTILE EXCHANGE ;2010.12.14;    3561;     152;       0;     455;    2651;    2813;    3258;    3268;     303;     293
GASOIL AVG PRICE OPTIONS - NEW YORK MERCANTILE EXCHANGE ;2010.06.08;    3369;     188;       0;     280;    2639;    2758;    3107;    3038;     263;     331
GASOIL AVG PRICE OPTIONS - NEW YORK MERCANTILE EXCHANGE ;2010.12.28;    3539;     155;       0;     458;    2623;    2785;    3235;    3243;     303;     296
GASOIL AVG PRICE OPTIONS - NEW YORK MERCANTILE EXCHANGE ;2010.12.21;    3492;     154;       0;     448;    2588;    2751;    3191;    3199;     301;     293
GASOIL AVG PRICE OPTIONS - NEW YORK MERCANTILE EXCHANGE ;2010.12.14;    3561;     152;       0;     455;    2651;    2813;    3258;    3268;     303;     293
GASOIL AVG PRICE OPTIONS - NEW YORK MERCANTILE EXCHANGE ;2010.06.08;    3369;     188;       0;     280;    2639;    2758;    3107;    3038;     263;     331
GASOIL AVG PRICE OPTIONS - NEW YORK MERCANTILE EXCHANGE ;2010.12.28;    3539;     155;       0;     458;    2623;    2785;    3235;    3243;     303;     296
GASOIL AVG PRICE OPTIONS - NEW YORK MERCANTILE EXCHANGE ;2010.12.21;    3492;     154;       0;     448;    2588;    2751;    3191;    3199;     301;     293
GASOIL AVG PRICE OPTIONS - NEW YORK MERCANTILE EXCHANGE ;2010.12.14;    3561;     152;       0;     455;    2651;    2813;    3258;    3268;     303;     293
GASOIL AVG PRICE OPTIONS - NEW YORK MERCANTILE EXCHANGE ;2010.06.08;    3369;     188;       0;     280;    2639;    2758;    3107;    3038;     263;     331
