COCOA - CSCE COCOA ;1995.04.04;   92061;    8228;   10335;    6425;   57394;   62628;   72047;   79388;   20014;   12673
COCOA - CSCE COCOA ;1995.03.28;   86831;    7887;    8139;    6503;   53189;   60382;   67579;   75024;   19251;   11806
COCOA - CSCE COCOA ;1995.03.21;   86659;    9321;    4888;    6397;   52019;   64699;   67736;   75984;   18923;   10676
COCOA - CSCE COCOA ;1995.04.04;   92061;    8228;   10335;    6425;   57394;   62628;   72047;   79388;   20014;   12673
COCOA - CSCE COCOA ;1995.03.28;   86831;    7887;    8139;    6503;   53189;   60382;   67579;   75024;   19251;   11806
COCOA - CSCE COCOA ;1995.03.21;   86659;    9321;    4888;    6397;   52019;   64699;   67736;   75984;   18923;   10676
COCOA - CSCE COCOA ;1995.04.04;   92061;    8228;   10335;    6425;   57394;   62628;   72047;   79388;   20014;   12673
COCOA - CSCE COCOA ;1995.03.28;   86831;    7887;    8139;    6503;   53189;   60382;   67579;   75024;   19251;   11806
COCOA - CSCE COCOA ;1995.03.21;   86659;    9321;    4888;    6397;   52019;   64699;   67736;   75984;   18923;   10676
