AEP DAYTON CAL MONTH LMP SWAP - NEW YORK MERCANTILE EXCHANGE ;2005.12.27;    5540;     100;    1680;    1540;    3580;    2040;    5220;    5260;     320;     280
AEP DAYTON CAL MONTH LMP SWAP - NEW YORK MERCANTILE EXCHANGE ;2005.11.29;    5600;     360;    1080;    1920;    3020;    2360;    5300;    5360;     300;     240
AEP DAYTON CAL MONTH LMP SWAP - NEW YORK MERCANTILE EXCHANGE ;2011.06.28;   11679;      48;     668;     572;   10039;    9219;   10659;   10459;    1020;    1220
AEP DAYTON CAL MONTH LMP SWAP - NEW YORK MERCANTILE EXCHANGE ;2005.12.27;    5540;     100;    1680;    1540;    3580;    2040;    5220;    5260;     320;     280
AEP DAYTON CAL MONTH LMP SWAP - NEW YORK MERCANTILE EXCHANGE ;2005.11.29;    5600;     360;    1080;    1920;    3020;    2360;    5300;    5360;     300;     240
AEP DAYTON CAL MONTH LMP SWAP - NEW YORK MERCANTILE EXCHANGE ;2011.06.28;   11679;      48;     668;     572;   10039;    9219;   10659;   10459;    1020;    1220
AEP DAYTON CAL MONTH LMP SWAP - NEW YORK MERCANTILE EXCHANGE ;2011.06.28;   11679;      48;     668;     572;   10039;    9219;   10659;   10459;    1020;    1220
AEP DAYTON CAL MONTH LMP SWAP - NEW YORK MERCANTILE EXCHANGE ;2005.12.27;    5540;     100;    1680;    1540;    3580;    2040;    5220;    5260;     320;     280
AEP DAYTON CAL MONTH LMP SWAP - NEW YORK MERCANTILE EXCHANGE ;2005.11.29;    5600;     360;    1080;    1920;    3020;    2360;    5300;    5360;     300;     240
