MW CINERGY OFF PEAK CAL MONTH - NEW YORK MERCANTILE EXCHANGE ;2011.07.12;  347224;    4800;       0;       0;  342424;  347224;  347224;  347224;       0;       0
MW CINERGY OFF PEAK CAL MONTH - NEW YORK MERCANTILE EXCHANGE ;2011.07.12;  347224;    4800;       0;       0;  342424;  347224;  347224;  347224;       0;       0
MW CINERGY OFF PEAK CAL MONTH - NEW YORK MERCANTILE EXCHANGE ;2011.07.12;  347224;    4800;       0;       0;  342424;  347224;  347224;  347224;       0;       0
MW CINERGY OFF PEAK CAL MONTH - NEW YORK MERCANTILE EXCHANGE ;2011.07.05;  346816;    4800;       0;       0;  342016;  346816;  346816;  346816;       0;       0
MW CINERGY OFF PEAK CAL MONTH - NEW YORK MERCANTILE EXCHANGE ;2011.06.28;  372064;    4800;       0;       0;  367264;  372064;  372064;  372064;       0;       0
MW CINERGY OFF PEAK CAL MONTH - NEW YORK MERCANTILE EXCHANGE ;2011.05.31;  342392;       0;       0;       0;  342392;  342392;  342392;  342392;       0;       0
MW CINERGY OFF PEAK CAL MONTH - NEW YORK MERCANTILE EXCHANGE ;2011.05.24;  341968;       0;       0;       0;  341968;  341968;  341968;  341968;       0;       0
MW CINERGY OFF PEAK CAL MONTH - NEW YORK MERCANTILE EXCHANGE ;2011.07.12;  347224;    4800;       0;       0;  342424;  347224;  347224;  347224;       0;       0
MW CINERGY OFF PEAK CAL MONTH - NEW YORK MERCANTILE EXCHANGE ;2011.07.12;  347224;    4800;       0;       0;  342424;  347224;  347224;  347224;       0;       0
MW CINERGY OFF PEAK CAL MONTH - NEW YORK MERCANTILE EXCHANGE ;2011.07.05;  346816;    4800;       0;       0;  342016;  346816;  346816;  346816;       0;       0
MW CINERGY OFF PEAK CAL MONTH - NEW YORK MERCANTILE EXCHANGE ;2011.06.28;  372064;    4800;       0;       0;  367264;  372064;  372064;  372064;       0;       0
MW CINERGY OFF PEAK CAL MONTH - NEW YORK MERCANTILE EXCHANGE ;2011.05.31;  342392;       0;       0;       0;  342392;  342392;  342392;  342392;       0;       0
MW CINERGY OFF PEAK CAL MONTH - NEW YORK MERCANTILE EXCHANGE ;2011.05.24;  341968;       0;       0;       0;  341968;  341968;  341968;  341968;       0;       0
MW CINERGY OFF PEAK CAL MONTH - NEW YORK MERCANTILE EXCHANGE ;2011.07.12;  347224;    4800;       0;       0;  342424;  347224;  347224;  347224;       0;       0
MW CINERGY OFF PEAK CAL MONTH - NEW YORK MERCANTILE EXCHANGE ;2011.07.05;  346816;    4800;       0;       0;  342016;  346816;  346816;  346816;       0;       0
MW CINERGY OFF PEAK CAL MONTH - NEW YORK MERCANTILE EXCHANGE ;2011.06.28;  372064;    4800;       0;       0;  367264;  372064;  372064;  372064;       0;       0
MW CINERGY OFF PEAK CAL MONTH - NEW YORK MERCANTILE EXCHANGE ;2011.05.31;  342392;       0;       0;       0;  342392;  342392;  342392;  342392;       0;       0
MW CINERGY OFF PEAK CAL MONTH - NEW YORK MERCANTILE EXCHANGE ;2011.05.24;  341968;       0;       0;       0;  341968;  341968;  341968;  341968;       0;       0
MW CINERGY OFF PEAK CAL MONTH - NEW YORK MERCANTILE EXCHANGE ;2011.07.12;  347224;    4800;       0;       0;  342424;  347224;  347224;  347224;       0;       0
