CME MILK IV - CHICAGO MERCANTILE EXCHANGE ;2011.07.12;    4155;    1928;      54;      36;    1997;    3317;    3961;    3407;     194;     748
CME MILK IV - CHICAGO MERCANTILE EXCHANGE ;2011.07.12;    4155;    1928;      54;      36;    1997;    3317;    3961;    3407;     194;     748
CME MILK IV - CHICAGO MERCANTILE EXCHANGE ;2011.07.12;    4155;    1928;      54;      36;    1997;    3317;    3961;    3407;     194;     748
CME MILK IV - CHICAGO MERCANTILE EXCHANGE ;2011.07.05;    4091;    1934;       0;      38;    1922;    3286;    3894;    3324;     197;     767
CME MILK IV - CHICAGO MERCANTILE EXCHANGE ;2011.06.28;    4697;    2430;       0;      40;    2053;    3733;    4523;    3774;     174;     923
CME MILK IV - CHICAGO MERCANTILE EXCHANGE ;2011.06.21;    4598;    2421;       0;       0;    1977;    3673;    4398;    3673;     200;     925
CME MILK IV - CHICAGO MERCANTILE EXCHANGE ;2011.06.14;    4567;    2390;       0;       0;    1977;    3645;    4368;    3645;     199;     922
CME MILK IV - CHICAGO MERCANTILE EXCHANGE ;2011.07.12;    4155;    1928;      54;      36;    1997;    3317;    3961;    3407;     194;     748
CME MILK IV - CHICAGO MERCANTILE EXCHANGE ;2011.07.12;    4155;    1928;      54;      36;    1997;    3317;    3961;    3407;     194;     748
CME MILK IV - CHICAGO MERCANTILE EXCHANGE ;2011.07.05;    4091;    1934;       0;      38;    1922;    3286;    3894;    3324;     197;     767
CME MILK IV - CHICAGO MERCANTILE EXCHANGE ;2011.06.28;    4697;    2430;       0;      40;    2053;    3733;    4523;    3774;     174;     923
CME MILK IV - CHICAGO MERCANTILE EXCHANGE ;2011.06.21;    4598;    2421;       0;       0;    1977;    3673;    4398;    3673;     200;     925
CME MILK IV - CHICAGO MERCANTILE EXCHANGE ;2011.06.14;    4567;    2390;       0;       0;    1977;    3645;    4368;    3645;     199;     922
CME MILK IV - CHICAGO MERCANTILE EXCHANGE ;2011.07.12;    4155;    1928;      54;      36;    1997;    3317;    3961;    3407;     194;     748
CME MILK IV - CHICAGO MERCANTILE EXCHANGE ;2011.07.05;    4091;    1934;       0;      38;    1922;    3286;    3894;    3324;     197;     767
CME MILK IV - CHICAGO MERCANTILE EXCHANGE ;2011.06.28;    4697;    2430;       0;      40;    2053;    3733;    4523;    3774;     174;     923
CME MILK IV - CHICAGO MERCANTILE EXCHANGE ;2011.06.21;    4598;    2421;       0;       0;    1977;    3673;    4398;    3673;     200;     925
CME MILK IV - CHICAGO MERCANTILE EXCHANGE ;2011.06.14;    4567;    2390;       0;       0;    1977;    3645;    4368;    3645;     199;     922
CME MILK IV - CHICAGO MERCANTILE EXCHANGE ;2011.07.12;    4155;    1928;      54;      36;    1997;    3317;    3961;    3407;     194;     748
