RANDOM LENGTH LUMBER - CME LUMBER ;1995.04.11;    2798;     358;     874;     165;      83;     136;     606;    1176;    2192;    1622
RANDOM LENGTH LUMBER - CME LUMBER ;1995.04.04;    2557;     326;     711;     153;     112;      57;     591;     921;    1967;    1637
RANDOM LENGTH LUMBER - CME LUMBER ;1995.03.28;    2443;     220;     767;     146;     151;      74;     517;     988;    1926;    1456
RANDOM LENGTH LUMBER - CME LUMBER ;1995.03.21;    2346;     235;     709;     125;     122;      83;     482;     917;    1864;    1428
RANDOM LENGTH LUMBER - CME LUMBER ;1995.04.11;    2798;     358;     874;     165;      83;     136;     606;    1176;    2192;    1622
RANDOM LENGTH LUMBER - CME LUMBER ;1995.04.04;    2557;     326;     711;     153;     112;      57;     591;     921;    1967;    1637
RANDOM LENGTH LUMBER - CME LUMBER ;1995.03.28;    2443;     220;     767;     146;     151;      74;     517;     988;    1926;    1456
RANDOM LENGTH LUMBER - CME LUMBER ;1995.03.21;    2346;     235;     709;     125;     122;      83;     482;     917;    1864;    1428
RANDOM LENGTH LUMBER - CME LUMBER ;1995.04.11;    2798;     358;     874;     165;      83;     136;     606;    1176;    2192;    1622
RANDOM LENGTH LUMBER - CME LUMBER ;1995.04.04;    2557;     326;     711;     153;     112;      57;     591;     921;    1967;    1637
RANDOM LENGTH LUMBER - CME LUMBER ;1995.03.28;    2443;     220;     767;     146;     151;      74;     517;     988;    1926;    1456
RANDOM LENGTH LUMBER - CME LUMBER ;1995.03.21;    2346;     235;     709;     125;     122;      83;     482;     917;    1864;    1428
