MILK - COFFEE SUGAR & COCOA EXCHANGE ;1996.08.06;     452;      32;      52;       0;      25;      68;      57;     120;     395;     332
MILK - COFFEE SUGAR & COCOA EXCHANGE ;1996.07.30;     478;      56;      57;       0;      25;      50;      81;     107;     397;     371
MILK - COFFEE SUGAR & COCOA EXCHANGE ;1996.07.09;     515;      25;      33;       0;       0;     140;      25;     173;     490;     342
MILK - COFFEE SUGAR & COCOA EXCHANGE ;1996.05.14;     433;      38;       0;      31;      86;     201;     154;     232;     279;     202
MILK - COFFEE SUGAR & COCOA EXCHANGE ;1996.05.07;     390;      39;       0;      28;      83;     195;     150;     223;     240;     167
MILK - COFFEE SUGAR & COCOA EXCHANGE ;1996.08.06;     452;      32;      52;       0;      25;      68;      57;     120;     395;     332
MILK - COFFEE SUGAR & COCOA EXCHANGE ;1996.07.30;     478;      56;      57;       0;      25;      50;      81;     107;     397;     371
MILK - COFFEE SUGAR & COCOA EXCHANGE ;1996.07.09;     515;      25;      33;       0;       0;     140;      25;     173;     490;     342
MILK - COFFEE SUGAR & COCOA EXCHANGE ;1996.05.14;     433;      38;       0;      31;      86;     201;     154;     232;     279;     202
MILK - COFFEE SUGAR & COCOA EXCHANGE ;1996.05.07;     390;      39;       0;      28;      83;     195;     150;     223;     240;     167
MILK - COFFEE SUGAR & COCOA EXCHANGE ;1996.08.06;     452;      32;      52;       0;      25;      68;      57;     120;     395;     332
MILK - COFFEE SUGAR & COCOA EXCHANGE ;1996.07.30;     478;      56;      57;       0;      25;      50;      81;     107;     397;     371
MILK - COFFEE SUGAR & COCOA EXCHANGE ;1996.07.09;     515;      25;      33;       0;       0;     140;      25;     173;     490;     342
MILK - COFFEE SUGAR & COCOA EXCHANGE ;1996.05.14;     433;      38;       0;      31;      86;     201;     154;     232;     279;     202
MILK - COFFEE SUGAR & COCOA EXCHANGE ;1996.05.07;     390;      39;       0;      28;      83;     195;     150;     223;     240;     167
