COFFEE C - CSCE COFFEE C ;1995.04.04;   48904;    5628;    1665;   10372;   20121;   27631;   36120;   39669;   12783;    9235
COFFEE C - CSCE COFFEE C ;1995.03.28;   49624;    6068;     867;   10414;   20338;   29493;   36820;   40774;   12804;    8850
COFFEE C - CSCE COFFEE C ;1995.03.21;   50392;    8212;     748;   10708;   18702;   30194;   37622;   41649;   12770;    8743
COFFEE C - CSCE COFFEE C ;1995.04.04;   48904;    5628;    1665;   10372;   20121;   27631;   36120;   39669;   12783;    9235
COFFEE C - CSCE COFFEE C ;1995.03.28;   49624;    6068;     867;   10414;   20338;   29493;   36820;   40774;   12804;    8850
COFFEE C - CSCE COFFEE C ;1995.03.21;   50392;    8212;     748;   10708;   18702;   30194;   37622;   41649;   12770;    8743
COFFEE C - CSCE COFFEE C ;1995.04.04;   48904;    5628;    1665;   10372;   20121;   27631;   36120;   39669;   12783;    9235
COFFEE C - CSCE COFFEE C ;1995.03.28;   49624;    6068;     867;   10414;   20338;   29493;   36820;   40774;   12804;    8850
COFFEE C - CSCE COFFEE C ;1995.03.21;   50392;    8212;     748;   10708;   18702;   30194;   37622;   41649;   12770;    8743
