RBOB UP-DOWN CAL SWAP - NEW YORK MERCANTILE EXCHANGE ;2010.09.28;   18798;     150;     115;     392;   17261;   17975;   17803;   18482;     995;     316
RBOB UP-DOWN CAL SWAP - NEW YORK MERCANTILE EXCHANGE ;2010.09.21;   18403;     150;     115;     392;   16876;   17375;   17418;   17882;     985;     521
RBOB UP-DOWN CAL SWAP - NEW YORK MERCANTILE EXCHANGE ;2010.09.14;   17423;     150;     115;     392;   15946;   16470;   16488;   16977;     935;     446
RBOB UP-DOWN CAL SWAP - NEW YORK MERCANTILE EXCHANGE ;2010.09.07;   17711;     225;     115;     392;   16494;   16820;   17111;   17327;     600;     384
RBOB UP-DOWN CAL SWAP - NEW YORK MERCANTILE EXCHANGE ;2010.08.31;   20238;     590;       0;     400;   18248;   19551;   19238;   19951;    1000;     287
RBOB UP-DOWN CAL SWAP - NEW YORK MERCANTILE EXCHANGE ;2010.08.24;   20353;     640;       0;     400;   18313;   19836;   19353;   20236;    1000;     117
RBOB UP-DOWN CAL SWAP - NEW YORK MERCANTILE EXCHANGE ;2010.08.17;   20253;     640;       0;     400;   18413;   19736;   19453;   20136;     800;     117
RBOB UP-DOWN CAL SWAP - NEW YORK MERCANTILE EXCHANGE ;2010.08.10;   19578;     640;       0;     400;   17713;   19061;   18753;   19461;     825;     117
RBOB UP-DOWN CAL SWAP - NEW YORK MERCANTILE EXCHANGE ;2010.08.03;   17853;     640;       0;     400;   15913;   17336;   16953;   17736;     900;     117
RBOB UP-DOWN CAL SWAP - NEW YORK MERCANTILE EXCHANGE ;2010.07.27;   19672;     290;       0;     750;   17312;   18641;   18352;   19391;    1320;     281
RBOB UP-DOWN CAL SWAP - NEW YORK MERCANTILE EXCHANGE ;2010.07.20;   18450;     290;       0;     750;   16165;   17481;   17205;   18231;    1245;     219
RBOB UP-DOWN CAL SWAP - NEW YORK MERCANTILE EXCHANGE ;2010.07.13;   18075;     250;     510;     770;   15935;   16551;   16955;   17831;    1120;     244
RBOB UP-DOWN CAL SWAP - NEW YORK MERCANTILE EXCHANGE ;2010.07.06;   17538;     250;     680;     770;   15548;   15856;   16568;   17306;     970;     232
RBOB UP-DOWN CAL SWAP - NEW YORK MERCANTILE EXCHANGE ;2010.06.29;   19411;     250;    1550;     300;   17776;   17136;   18326;   18986;    1085;     425
RBOB UP-DOWN CAL SWAP - NEW YORK MERCANTILE EXCHANGE ;2010.06.22;   19169;     250;    1550;     300;   17549;   16894;   18099;   18744;    1070;     425
RBOB UP-DOWN CAL SWAP - NEW YORK MERCANTILE EXCHANGE ;2010.06.15;   18607;     250;    1550;     300;   17207;   16423;   17757;   18273;     850;     334
RBOB UP-DOWN CAL SWAP - NEW YORK MERCANTILE EXCHANGE ;2010.06.01;   20347;     250;    1750;     300;   18862;   17783;   19412;   19833;     935;     514
RBOB UP-DOWN CAL SWAP - NEW YORK MERCANTILE EXCHANGE ;2010.05.25;   20207;     250;    1750;     300;   18947;   17705;   19497;   19755;     710;     452
RBOB UP-DOWN CAL SWAP - NEW YORK MERCANTILE EXCHANGE ;2010.05.18;   19710;     250;    1750;     300;   18415;   17250;   18965;   19300;     745;     410
RBOB UP-DOWN CAL SWAP - NEW YORK MERCANTILE EXCHANGE ;2010.05.11;   19310;     250;    1750;     300;   17990;   16875;   18540;   18925;     770;     385
RBOB UP-DOWN CAL SWAP - NEW YORK MERCANTILE EXCHANGE ;2008.12.30;   15937;    1162;       0;     150;   13666;   14465;   14978;   14615;     959;    1322
RBOB UP-DOWN CAL SWAP - NEW YORK MERCANTILE EXCHANGE ;2008.12.22;   15453;    1462;       0;     150;   13002;   13806;   14614;   13956;     839;    1497
RBOB UP-DOWN CAL SWAP - NEW YORK MERCANTILE EXCHANGE ;2008.12.16;   14876;    1462;       0;     150;   12465;   13686;   14077;   13836;     799;    1040
RBOB UP-DOWN CAL SWAP - NEW YORK MERCANTILE EXCHANGE ;2008.12.09;   14690;    1340;       0;     150;   12511;   13610;   14001;   13760;     689;     930
RBOB UP-DOWN CAL SWAP - NEW YORK MERCANTILE EXCHANGE ;2008.12.02;   14085;    1850;       0;       0;   11311;   13305;   13161;   13305;     924;     780
RBOB UP-DOWN CAL SWAP - NEW YORK MERCANTILE EXCHANGE ;2008.11.25;   12631;    2505;       0;       0;    8883;   11606;   11388;   11606;    1243;    1025
RBOB UP-DOWN CAL SWAP - NEW YORK MERCANTILE EXCHANGE ;2010.09.28;   18798;     150;     115;     392;   17261;   17975;   17803;   18482;     995;     316
RBOB UP-DOWN CAL SWAP - NEW YORK MERCANTILE EXCHANGE ;2010.09.21;   18403;     150;     115;     392;   16876;   17375;   17418;   17882;     985;     521
RBOB UP-DOWN CAL SWAP - NEW YORK MERCANTILE EXCHANGE ;2010.09.14;   17423;     150;     115;     392;   15946;   16470;   16488;   16977;     935;     446
RBOB UP-DOWN CAL SWAP - NEW YORK MERCANTILE EXCHANGE ;2010.09.07;   17711;     225;     115;     392;   16494;   16820;   17111;   17327;     600;     384
RBOB UP-DOWN CAL SWAP - NEW YORK MERCANTILE EXCHANGE ;2010.08.31;   20238;     590;       0;     400;   18248;   19551;   19238;   19951;    1000;     287
RBOB UP-DOWN CAL SWAP - NEW YORK MERCANTILE EXCHANGE ;2010.08.24;   20353;     640;       0;     400;   18313;   19836;   19353;   20236;    1000;     117
RBOB UP-DOWN CAL SWAP - NEW YORK MERCANTILE EXCHANGE ;2010.08.17;   20253;     640;       0;     400;   18413;   19736;   19453;   20136;     800;     117
RBOB UP-DOWN CAL SWAP - NEW YORK MERCANTILE EXCHANGE ;2010.08.10;   19578;     640;       0;     400;   17713;   19061;   18753;   19461;     825;     117
RBOB UP-DOWN CAL SWAP - NEW YORK MERCANTILE EXCHANGE ;2010.08.03;   17853;     640;       0;     400;   15913;   17336;   16953;   17736;     900;     117
RBOB UP-DOWN CAL SWAP - NEW YORK MERCANTILE EXCHANGE ;2010.07.27;   19672;     290;       0;     750;   17312;   18641;   18352;   19391;    1320;     281
RBOB UP-DOWN CAL SWAP - NEW YORK MERCANTILE EXCHANGE ;2010.07.20;   18450;     290;       0;     750;   16165;   17481;   17205;   18231;    1245;     219
RBOB UP-DOWN CAL SWAP - NEW YORK MERCANTILE EXCHANGE ;2010.07.13;   18075;     250;     510;     770;   15935;   16551;   16955;   17831;    1120;     244
RBOB UP-DOWN CAL SWAP - NEW YORK MERCANTILE EXCHANGE ;2010.07.06;   17538;     250;     680;     770;   15548;   15856;   16568;   17306;     970;     232
RBOB UP-DOWN CAL SWAP - NEW YORK MERCANTILE EXCHANGE ;2010.06.29;   19411;     250;    1550;     300;   17776;   17136;   18326;   18986;    1085;     425
RBOB UP-DOWN CAL SWAP - NEW YORK MERCANTILE EXCHANGE ;2010.06.22;   19169;     250;    1550;     300;   17549;   16894;   18099;   18744;    1070;     425
RBOB UP-DOWN CAL SWAP - NEW YORK MERCANTILE EXCHANGE ;2010.06.15;   18607;     250;    1550;     300;   17207;   16423;   17757;   18273;     850;     334
RBOB UP-DOWN CAL SWAP - NEW YORK MERCANTILE EXCHANGE ;2010.06.01;   20347;     250;    1750;     300;   18862;   17783;   19412;   19833;     935;     514
RBOB UP-DOWN CAL SWAP - NEW YORK MERCANTILE EXCHANGE ;2010.05.25;   20207;     250;    1750;     300;   18947;   17705;   19497;   19755;     710;     452
RBOB UP-DOWN CAL SWAP - NEW YORK MERCANTILE EXCHANGE ;2010.05.18;   19710;     250;    1750;     300;   18415;   17250;   18965;   19300;     745;     410
RBOB UP-DOWN CAL SWAP - NEW YORK MERCANTILE EXCHANGE ;2010.05.11;   19310;     250;    1750;     300;   17990;   16875;   18540;   18925;     770;     385
RBOB UP-DOWN CAL SWAP - NEW YORK MERCANTILE EXCHANGE ;2008.12.30;   15937;    1162;       0;     150;   13666;   14465;   14978;   14615;     959;    1322
RBOB UP-DOWN CAL SWAP - NEW YORK MERCANTILE EXCHANGE ;2008.12.22;   15453;    1462;       0;     150;   13002;   13806;   14614;   13956;     839;    1497
RBOB UP-DOWN CAL SWAP - NEW YORK MERCANTILE EXCHANGE ;2008.12.16;   14876;    1462;       0;     150;   12465;   13686;   14077;   13836;     799;    1040
RBOB UP-DOWN CAL SWAP - NEW YORK MERCANTILE EXCHANGE ;2008.12.09;   14690;    1340;       0;     150;   12511;   13610;   14001;   13760;     689;     930
RBOB UP-DOWN CAL SWAP - NEW YORK MERCANTILE EXCHANGE ;2008.12.02;   14085;    1850;       0;       0;   11311;   13305;   13161;   13305;     924;     780
RBOB UP-DOWN CAL SWAP - NEW YORK MERCANTILE EXCHANGE ;2008.11.25;   12631;    2505;       0;       0;    8883;   11606;   11388;   11606;    1243;    1025
RBOB UP-DOWN CAL SWAP - NEW YORK MERCANTILE EXCHANGE ;2010.09.28;   18798;     150;     115;     392;   17261;   17975;   17803;   18482;     995;     316
RBOB UP-DOWN CAL SWAP - NEW YORK MERCANTILE EXCHANGE ;2010.09.21;   18403;     150;     115;     392;   16876;   17375;   17418;   17882;     985;     521
RBOB UP-DOWN CAL SWAP - NEW YORK MERCANTILE EXCHANGE ;2010.09.14;   17423;     150;     115;     392;   15946;   16470;   16488;   16977;     935;     446
RBOB UP-DOWN CAL SWAP - NEW YORK MERCANTILE EXCHANGE ;2010.09.07;   17711;     225;     115;     392;   16494;   16820;   17111;   17327;     600;     384
RBOB UP-DOWN CAL SWAP - NEW YORK MERCANTILE EXCHANGE ;2010.08.31;   20238;     590;       0;     400;   18248;   19551;   19238;   19951;    1000;     287
RBOB UP-DOWN CAL SWAP - NEW YORK MERCANTILE EXCHANGE ;2010.08.24;   20353;     640;       0;     400;   18313;   19836;   19353;   20236;    1000;     117
RBOB UP-DOWN CAL SWAP - NEW YORK MERCANTILE EXCHANGE ;2010.08.17;   20253;     640;       0;     400;   18413;   19736;   19453;   20136;     800;     117
RBOB UP-DOWN CAL SWAP - NEW YORK MERCANTILE EXCHANGE ;2010.08.10;   19578;     640;       0;     400;   17713;   19061;   18753;   19461;     825;     117
RBOB UP-DOWN CAL SWAP - NEW YORK MERCANTILE EXCHANGE ;2010.08.03;   17853;     640;       0;     400;   15913;   17336;   16953;   17736;     900;     117
RBOB UP-DOWN CAL SWAP - NEW YORK MERCANTILE EXCHANGE ;2010.07.27;   19672;     290;       0;     750;   17312;   18641;   18352;   19391;    1320;     281
RBOB UP-DOWN CAL SWAP - NEW YORK MERCANTILE EXCHANGE ;2010.07.20;   18450;     290;       0;     750;   16165;   17481;   17205;   18231;    1245;     219
RBOB UP-DOWN CAL SWAP - NEW YORK MERCANTILE EXCHANGE ;2010.07.13;   18075;     250;     510;     770;   15935;   16551;   16955;   17831;    1120;     244
RBOB UP-DOWN CAL SWAP - NEW YORK MERCANTILE EXCHANGE ;2010.07.06;   17538;     250;     680;     770;   15548;   15856;   16568;   17306;     970;     232
RBOB UP-DOWN CAL SWAP - NEW YORK MERCANTILE EXCHANGE ;2010.06.29;   19411;     250;    1550;     300;   17776;   17136;   18326;   18986;    1085;     425
RBOB UP-DOWN CAL SWAP - NEW YORK MERCANTILE EXCHANGE ;2010.06.22;   19169;     250;    1550;     300;   17549;   16894;   18099;   18744;    1070;     425
RBOB UP-DOWN CAL SWAP - NEW YORK MERCANTILE EXCHANGE ;2010.06.15;   18607;     250;    1550;     300;   17207;   16423;   17757;   18273;     850;     334
RBOB UP-DOWN CAL SWAP - NEW YORK MERCANTILE EXCHANGE ;2010.06.01;   20347;     250;    1750;     300;   18862;   17783;   19412;   19833;     935;     514
RBOB UP-DOWN CAL SWAP - NEW YORK MERCANTILE EXCHANGE ;2010.05.25;   20207;     250;    1750;     300;   18947;   17705;   19497;   19755;     710;     452
RBOB UP-DOWN CAL SWAP - NEW YORK MERCANTILE EXCHANGE ;2010.05.18;   19710;     250;    1750;     300;   18415;   17250;   18965;   19300;     745;     410
RBOB UP-DOWN CAL SWAP - NEW YORK MERCANTILE EXCHANGE ;2010.05.11;   19310;     250;    1750;     300;   17990;   16875;   18540;   18925;     770;     385
RBOB UP-DOWN CAL SWAP - NEW YORK MERCANTILE EXCHANGE ;2008.12.30;   15937;    1162;       0;     150;   13666;   14465;   14978;   14615;     959;    1322
RBOB UP-DOWN CAL SWAP - NEW YORK MERCANTILE EXCHANGE ;2008.12.22;   15453;    1462;       0;     150;   13002;   13806;   14614;   13956;     839;    1497
RBOB UP-DOWN CAL SWAP - NEW YORK MERCANTILE EXCHANGE ;2008.12.16;   14876;    1462;       0;     150;   12465;   13686;   14077;   13836;     799;    1040
RBOB UP-DOWN CAL SWAP - NEW YORK MERCANTILE EXCHANGE ;2008.12.09;   14690;    1340;       0;     150;   12511;   13610;   14001;   13760;     689;     930
RBOB UP-DOWN CAL SWAP - NEW YORK MERCANTILE EXCHANGE ;2008.12.02;   14085;    1850;       0;       0;   11311;   13305;   13161;   13305;     924;     780
RBOB UP-DOWN CAL SWAP - NEW YORK MERCANTILE EXCHANGE ;2008.11.25;   12631;    2505;       0;       0;    8883;   11606;   11388;   11606;    1243;    1025
