SOYBEAN CSO - CHICAGO BOARD OF TRADE ;2011.06.21;   15056;    1651;    9730;    4561;    8339;     461;   14551;   14752;     505;     304
SOYBEAN CSO - CHICAGO BOARD OF TRADE ;2011.06.14;   14820;    1612;    9515;    4427;    8349;     606;   14388;   14547;     432;     272
SOYBEAN CSO - CHICAGO BOARD OF TRADE ;2011.06.07;   13639;    1184;    8982;    3744;    8324;     632;   13252;   13358;     387;     281
SOYBEAN CSO - CHICAGO BOARD OF TRADE ;2011.05.31;   12972;     888;    8454;    3437;    8261;     820;   12586;   12711;     386;     260
SOYBEAN CSO - CHICAGO BOARD OF TRADE ;2011.05.24;   12962;     674;    8601;    3483;    8401;     647;   12558;   12731;     404;     230
SOYBEAN CSO - CHICAGO BOARD OF TRADE ;2011.05.17;   12641;     643;    8165;    3660;    7918;     609;   12221;   12434;     420;     208
SOYBEAN CSO - CHICAGO BOARD OF TRADE ;2011.05.10;   12282;     517;    8576;    2817;    8147;     562;   11481;   11956;     800;     326
SOYBEAN CSO - CHICAGO BOARD OF TRADE ;2011.05.03;   12234;     967;    9019;    2310;    8122;     560;   11399;   11889;     835;     345
SOYBEAN CSO - CHICAGO BOARD OF TRADE ;2011.04.26;   12150;     966;    8906;    2452;    7931;     495;   11349;   11853;     800;     296
SOYBEAN CSO - CHICAGO BOARD OF TRADE ;2011.04.19;   12017;    1061;    9183;    2139;    8038;     383;   11238;   11705;     779;     313
SOYBEAN CSO - CHICAGO BOARD OF TRADE ;2011.04.12;   12099;     912;    9894;    1501;    9057;     392;   11470;   11787;     629;     312
SOYBEAN CSO - CHICAGO BOARD OF TRADE ;2011.04.05;   11989;     988;    9589;    1582;    8802;     518;   11372;   11690;     617;     300
SOYBEAN CSO - CHICAGO BOARD OF TRADE ;2011.06.21;   15056;    1651;    9730;    4561;    8339;     461;   14551;   14752;     505;     304
SOYBEAN CSO - CHICAGO BOARD OF TRADE ;2011.06.14;   14820;    1612;    9515;    4427;    8349;     606;   14388;   14547;     432;     272
SOYBEAN CSO - CHICAGO BOARD OF TRADE ;2011.06.07;   13639;    1184;    8982;    3744;    8324;     632;   13252;   13358;     387;     281
SOYBEAN CSO - CHICAGO BOARD OF TRADE ;2011.05.31;   12972;     888;    8454;    3437;    8261;     820;   12586;   12711;     386;     260
SOYBEAN CSO - CHICAGO BOARD OF TRADE ;2011.05.24;   12962;     674;    8601;    3483;    8401;     647;   12558;   12731;     404;     230
SOYBEAN CSO - CHICAGO BOARD OF TRADE ;2011.05.17;   12641;     643;    8165;    3660;    7918;     609;   12221;   12434;     420;     208
SOYBEAN CSO - CHICAGO BOARD OF TRADE ;2011.05.10;   12282;     517;    8576;    2817;    8147;     562;   11481;   11956;     800;     326
SOYBEAN CSO - CHICAGO BOARD OF TRADE ;2011.05.03;   12234;     967;    9019;    2310;    8122;     560;   11399;   11889;     835;     345
SOYBEAN CSO - CHICAGO BOARD OF TRADE ;2011.04.26;   12150;     966;    8906;    2452;    7931;     495;   11349;   11853;     800;     296
SOYBEAN CSO - CHICAGO BOARD OF TRADE ;2011.04.19;   12017;    1061;    9183;    2139;    8038;     383;   11238;   11705;     779;     313
SOYBEAN CSO - CHICAGO BOARD OF TRADE ;2011.04.12;   12099;     912;    9894;    1501;    9057;     392;   11470;   11787;     629;     312
SOYBEAN CSO - CHICAGO BOARD OF TRADE ;2011.04.05;   11989;     988;    9589;    1582;    8802;     518;   11372;   11690;     617;     300
SOYBEAN CSO - CHICAGO BOARD OF TRADE ;2011.06.21;   15056;    1651;    9730;    4561;    8339;     461;   14551;   14752;     505;     304
SOYBEAN CSO - CHICAGO BOARD OF TRADE ;2011.06.14;   14820;    1612;    9515;    4427;    8349;     606;   14388;   14547;     432;     272
SOYBEAN CSO - CHICAGO BOARD OF TRADE ;2011.06.07;   13639;    1184;    8982;    3744;    8324;     632;   13252;   13358;     387;     281
SOYBEAN CSO - CHICAGO BOARD OF TRADE ;2011.05.31;   12972;     888;    8454;    3437;    8261;     820;   12586;   12711;     386;     260
SOYBEAN CSO - CHICAGO BOARD OF TRADE ;2011.05.24;   12962;     674;    8601;    3483;    8401;     647;   12558;   12731;     404;     230
SOYBEAN CSO - CHICAGO BOARD OF TRADE ;2011.05.17;   12641;     643;    8165;    3660;    7918;     609;   12221;   12434;     420;     208
SOYBEAN CSO - CHICAGO BOARD OF TRADE ;2011.05.10;   12282;     517;    8576;    2817;    8147;     562;   11481;   11956;     800;     326
SOYBEAN CSO - CHICAGO BOARD OF TRADE ;2011.05.03;   12234;     967;    9019;    2310;    8122;     560;   11399;   11889;     835;     345
SOYBEAN CSO - CHICAGO BOARD OF TRADE ;2011.04.26;   12150;     966;    8906;    2452;    7931;     495;   11349;   11853;     800;     296
SOYBEAN CSO - CHICAGO BOARD OF TRADE ;2011.04.19;   12017;    1061;    9183;    2139;    8038;     383;   11238;   11705;     779;     313
SOYBEAN CSO - CHICAGO BOARD OF TRADE ;2011.04.12;   12099;     912;    9894;    1501;    9057;     392;   11470;   11787;     629;     312
SOYBEAN CSO - CHICAGO BOARD OF TRADE ;2011.04.05;   11989;     988;    9589;    1582;    8802;     518;   11372;   11690;     617;     300
