TEN-YEAR AGENCY NOTE - CHICAGO MERCANTILE EXCHANGE ;2000.05.02;    3704;    1616;     693;       0;    2074;    2980;    3690;    3673;      14;      31
TEN-YEAR AGENCY NOTE - CHICAGO MERCANTILE EXCHANGE ;2000.04.25;    3709;    1616;     693;       0;    2074;    2980;    3690;    3673;      19;      36
TEN-YEAR AGENCY NOTE - CHICAGO MERCANTILE EXCHANGE ;2000.04.18;    3819;    1616;     818;       0;    2164;    2930;    3780;    3748;      39;      71
TEN-YEAR AGENCY NOTE - CHICAGO MERCANTILE EXCHANGE ;2000.04.11;    4132;    1421;     497;       0;    2664;    3373;    4085;    3870;      47;     262
TEN-YEAR AGENCY NOTE - CHICAGO MERCANTILE EXCHANGE ;2000.04.04;    4804;    3828;    3371;     823;       0;       0;    4651;    4194;     153;     610
TEN-YEAR AGENCY NOTE - CHICAGO MERCANTILE EXCHANGE ;2000.03.28;    6262;    5347;    5018;     630;       0;       0;    5977;    5648;     285;     614
TEN-YEAR AGENCY NOTE - CHICAGO MERCANTILE EXCHANGE ;2000.03.21;    4032;    3453;    3122;     150;       0;       0;    3603;    3272;     429;     760
TEN-YEAR AGENCY NOTE - CHICAGO MERCANTILE EXCHANGE ;2000.03.14;    2614;    1899;    2059;       0;       0;       0;    1899;    2059;     715;     555
TEN-YEAR AGENCY NOTE - CHICAGO MERCANTILE EXCHANGE ;2000.05.02;    3704;    1616;     693;       0;    2074;    2980;    3690;    3673;      14;      31
TEN-YEAR AGENCY NOTE - CHICAGO MERCANTILE EXCHANGE ;2000.04.25;    3709;    1616;     693;       0;    2074;    2980;    3690;    3673;      19;      36
TEN-YEAR AGENCY NOTE - CHICAGO MERCANTILE EXCHANGE ;2000.04.18;    3819;    1616;     818;       0;    2164;    2930;    3780;    3748;      39;      71
TEN-YEAR AGENCY NOTE - CHICAGO MERCANTILE EXCHANGE ;2000.04.11;    4132;    1421;     497;       0;    2664;    3373;    4085;    3870;      47;     262
TEN-YEAR AGENCY NOTE - CHICAGO MERCANTILE EXCHANGE ;2000.04.04;    4804;    3828;    3371;     823;       0;       0;    4651;    4194;     153;     610
TEN-YEAR AGENCY NOTE - CHICAGO MERCANTILE EXCHANGE ;2000.03.28;    6262;    5347;    5018;     630;       0;       0;    5977;    5648;     285;     614
TEN-YEAR AGENCY NOTE - CHICAGO MERCANTILE EXCHANGE ;2000.03.21;    4032;    3453;    3122;     150;       0;       0;    3603;    3272;     429;     760
TEN-YEAR AGENCY NOTE - CHICAGO MERCANTILE EXCHANGE ;2000.03.14;    2614;    1899;    2059;       0;       0;       0;    1899;    2059;     715;     555
TEN-YEAR AGENCY NOTE - CHICAGO MERCANTILE EXCHANGE ;2000.05.02;    3704;    1616;     693;       0;    2074;    2980;    3690;    3673;      14;      31
TEN-YEAR AGENCY NOTE - CHICAGO MERCANTILE EXCHANGE ;2000.04.25;    3709;    1616;     693;       0;    2074;    2980;    3690;    3673;      19;      36
TEN-YEAR AGENCY NOTE - CHICAGO MERCANTILE EXCHANGE ;2000.04.18;    3819;    1616;     818;       0;    2164;    2930;    3780;    3748;      39;      71
TEN-YEAR AGENCY NOTE - CHICAGO MERCANTILE EXCHANGE ;2000.04.11;    4132;    1421;     497;       0;    2664;    3373;    4085;    3870;      47;     262
TEN-YEAR AGENCY NOTE - CHICAGO MERCANTILE EXCHANGE ;2000.04.04;    4804;    3828;    3371;     823;       0;       0;    4651;    4194;     153;     610
TEN-YEAR AGENCY NOTE - CHICAGO MERCANTILE EXCHANGE ;2000.03.28;    6262;    5347;    5018;     630;       0;       0;    5977;    5648;     285;     614
TEN-YEAR AGENCY NOTE - CHICAGO MERCANTILE EXCHANGE ;2000.03.21;    4032;    3453;    3122;     150;       0;       0;    3603;    3272;     429;     760
TEN-YEAR AGENCY NOTE - CHICAGO MERCANTILE EXCHANGE ;2000.03.14;    2614;    1899;    2059;       0;       0;       0;    1899;    2059;     715;     555
