MT BELVIEU PROPANE (OPIS) SWAP - NEW YORK MERCANTILE EXCHANGE ;2011.07.12;   21524;      57;      10;      60;   21106;   21137;   21223;   21207;     301;     317
MT BELVIEU PROPANE (OPIS) SWAP - NEW YORK MERCANTILE EXCHANGE ;2011.07.12;   21524;      57;      10;      60;   21106;   21137;   21223;   21207;     301;     317
MT BELVIEU PROPANE (OPIS) SWAP - NEW YORK MERCANTILE EXCHANGE ;2010.12.28;   28116;     482;       0;     491;   26758;   27319;   27731;   27810;     385;     306
MT BELVIEU PROPANE (OPIS) SWAP - NEW YORK MERCANTILE EXCHANGE ;2010.12.21;   28175;     482;       0;     541;   26792;   27353;   27815;   27894;     360;     281
MT BELVIEU PROPANE (OPIS) SWAP - NEW YORK MERCANTILE EXCHANGE ;2010.12.14;   27112;     140;       0;     375;   25724;   26343;   26239;   26718;     873;     394
MT BELVIEU PROPANE (OPIS) SWAP - NEW YORK MERCANTILE EXCHANGE ;2010.12.07;   26676;     140;       0;     375;   25370;   25809;   25885;   26184;     791;     492
MT BELVIEU PROPANE (OPIS) SWAP - NEW YORK MERCANTILE EXCHANGE ;2010.11.30;   26515;     135;       0;     300;   25103;   25701;   25538;   26001;     977;     514
MT BELVIEU PROPANE (OPIS) SWAP - NEW YORK MERCANTILE EXCHANGE ;2010.11.23;   26172;     120;       0;     300;   24513;   25411;   24933;   25711;    1239;     461
MT BELVIEU PROPANE (OPIS) SWAP - NEW YORK MERCANTILE EXCHANGE ;2010.11.16;   26087;      45;     126;     300;   24463;   25308;   24808;   25734;    1279;     353
MT BELVIEU PROPANE (OPIS) SWAP - NEW YORK MERCANTILE EXCHANGE ;2010.11.09;   26238;     105;     126;     500;   24374;   25259;   24979;   25885;    1259;     353
MT BELVIEU PROPANE (OPIS) SWAP - NEW YORK MERCANTILE EXCHANGE ;2010.11.02;   28237;     140;       0;     626;   26249;   27275;   27015;   27901;    1222;     336
MT BELVIEU PROPANE (OPIS) SWAP - NEW YORK MERCANTILE EXCHANGE ;2010.10.26;   27689;      80;       0;     626;   25998;   26754;   26704;   27380;     985;     309
MT BELVIEU PROPANE (OPIS) SWAP - NEW YORK MERCANTILE EXCHANGE ;2010.10.19;   27429;     274;       0;     631;   25524;   26513;   26429;   27144;    1000;     285
MT BELVIEU PROPANE (OPIS) SWAP - NEW YORK MERCANTILE EXCHANGE ;2010.10.12;   26245;     249;       0;     643;   24348;   25302;   25240;   25945;    1005;     300
MT BELVIEU PROPANE (OPIS) SWAP - NEW YORK MERCANTILE EXCHANGE ;2010.10.05;   25818;     179;     470;    1129;   23494;   23918;   24802;   25517;    1016;     301
MT BELVIEU PROPANE (OPIS) SWAP - NEW YORK MERCANTILE EXCHANGE ;2010.09.28;   26853;     120;     275;    1144;   24741;   25232;   26005;   26651;     848;     202
MT BELVIEU PROPANE (OPIS) SWAP - NEW YORK MERCANTILE EXCHANGE ;2010.09.21;   26205;     230;      50;    1146;   24006;   24810;   25382;   26006;     823;     199
MT BELVIEU PROPANE (OPIS) SWAP - NEW YORK MERCANTILE EXCHANGE ;2010.09.14;   25113;     324;       0;     899;   23066;   24013;   24289;   24912;     824;     201
MT BELVIEU PROPANE (OPIS) SWAP - NEW YORK MERCANTILE EXCHANGE ;2010.09.07;   24513;     188;       0;     610;   22690;   23491;   23488;   24101;    1025;     412
MT BELVIEU PROPANE (OPIS) SWAP - NEW YORK MERCANTILE EXCHANGE ;2010.08.31;   25485;     128;     530;      82;   24242;   24586;   24452;   25198;    1033;     287
MT BELVIEU PROPANE (OPIS) SWAP - NEW YORK MERCANTILE EXCHANGE ;2010.08.24;   24557;     123;     430;     102;   23374;   23843;   23599;   24375;     958;     182
MT BELVIEU PROPANE (OPIS) SWAP - NEW YORK MERCANTILE EXCHANGE ;2010.08.17;   24588;     193;     220;      73;   23410;   24083;   23676;   24376;     912;     212
MT BELVIEU PROPANE (OPIS) SWAP - NEW YORK MERCANTILE EXCHANGE ;2010.08.10;   24512;     208;     180;      73;   23265;   23982;   23546;   24235;     966;     277
MT BELVIEU PROPANE (OPIS) SWAP - NEW YORK MERCANTILE EXCHANGE ;2010.08.03;   25272;     139;       0;      83;   24025;   24899;   24247;   24982;    1025;     290
MT BELVIEU PROPANE (OPIS) SWAP - NEW YORK MERCANTILE EXCHANGE ;2010.07.27;   21974;     109;       0;     170;   20845;   21574;   21124;   21744;     850;     230
MT BELVIEU PROPANE (OPIS) SWAP - NEW YORK MERCANTILE EXCHANGE ;2010.07.20;   21247;      94;       0;     180;   20158;   20897;   20432;   21077;     815;     170
MT BELVIEU PROPANE (OPIS) SWAP - NEW YORK MERCANTILE EXCHANGE ;2010.07.13;   21121;      60;      21;     158;   20041;   20735;   20259;   20914;     862;     207
MT BELVIEU PROPANE (OPIS) SWAP - NEW YORK MERCANTILE EXCHANGE ;2010.07.06;   20551;      64;       0;     130;   19490;   20335;   19684;   20465;     867;      86
MT BELVIEU PROPANE (OPIS) SWAP - NEW YORK MERCANTILE EXCHANGE ;2010.06.29;   22285;      35;      28;     125;   21233;   21911;   21393;   22064;     892;     221
MT BELVIEU PROPANE (OPIS) SWAP - NEW YORK MERCANTILE EXCHANGE ;2010.06.22;   22147;      35;      28;     124;   21156;   21774;   21315;   21926;     832;     221
MT BELVIEU PROPANE (OPIS) SWAP - NEW YORK MERCANTILE EXCHANGE ;2010.06.15;   20996;      35;      28;     116;   20037;   20727;   20188;   20871;     808;     125
MT BELVIEU PROPANE (OPIS) SWAP - NEW YORK MERCANTILE EXCHANGE ;2010.06.08;   19747;      95;      28;     197;   18652;   19447;   18944;   19672;     803;      75
MT BELVIEU PROPANE (OPIS) SWAP - NEW YORK MERCANTILE EXCHANGE ;2010.06.01;   21571;      70;      56;     222;   20630;   21003;   20922;   21281;     649;     290
MT BELVIEU PROPANE (OPIS) SWAP - NEW YORK MERCANTILE EXCHANGE ;2010.05.25;   21207;      70;      66;     249;   20329;   20647;   20648;   20962;     559;     245
MT BELVIEU PROPANE (OPIS) SWAP - NEW YORK MERCANTILE EXCHANGE ;2010.05.18;   21250;      70;      50;     249;   20417;   20709;   20736;   21008;     514;     242
MT BELVIEU PROPANE (OPIS) SWAP - NEW YORK MERCANTILE EXCHANGE ;2010.05.11;   21128;      70;     115;     249;   20230;   20522;   20549;   20886;     579;     242
MT BELVIEU PROPANE (OPIS) SWAP - NEW YORK MERCANTILE EXCHANGE ;2010.05.04;   22530;      60;      62;     313;   21600;   22010;   21973;   22385;     557;     145
MT BELVIEU PROPANE (OPIS) SWAP - NEW YORK MERCANTILE EXCHANGE ;2010.04.27;   21768;       0;      77;     232;   20999;   21364;   21231;   21673;     537;      95
MT BELVIEU PROPANE (OPIS) SWAP - NEW YORK MERCANTILE EXCHANGE ;2011.07.12;   21524;      57;      10;      60;   21106;   21137;   21223;   21207;     301;     317
MT BELVIEU PROPANE (OPIS) SWAP - NEW YORK MERCANTILE EXCHANGE ;2011.07.05;   22621;      67;      40;      30;   22171;   22127;   22268;   22197;     353;     424
MT BELVIEU PROPANE (OPIS) SWAP - NEW YORK MERCANTILE EXCHANGE ;2011.06.28;   22118;      67;      40;      30;   21673;   21536;   21770;   21606;     348;     512
MT BELVIEU PROPANE (OPIS) SWAP - NEW YORK MERCANTILE EXCHANGE ;2011.06.21;   22383;      67;      70;      20;   21896;   21786;   21983;   21876;     400;     507
MT BELVIEU PROPANE (OPIS) SWAP - NEW YORK MERCANTILE EXCHANGE ;2011.06.14;   22661;      67;      70;      20;   22240;   22068;   22327;   22158;     334;     503
MT BELVIEU PROPANE (OPIS) SWAP - NEW YORK MERCANTILE EXCHANGE ;2011.06.07;   21539;      62;      70;      20;   21048;   21061;   21130;   21151;     409;     388
MT BELVIEU PROPANE (OPIS) SWAP - NEW YORK MERCANTILE EXCHANGE ;2011.05.31;   23105;      86;      70;      20;   22669;   22650;   22775;   22740;     330;     365
MT BELVIEU PROPANE (OPIS) SWAP - NEW YORK MERCANTILE EXCHANGE ;2011.05.24;   22890;      81;      70;      20;   22265;   22390;   22366;   22480;     524;     410
MT BELVIEU PROPANE (OPIS) SWAP - NEW YORK MERCANTILE EXCHANGE ;2011.05.17;   22833;      81;      70;      20;   22333;   22348;   22434;   22438;     399;     395
MT BELVIEU PROPANE (OPIS) SWAP - NEW YORK MERCANTILE EXCHANGE ;2011.05.10;   23726;     211;      70;      68;   23143;   23193;   23422;   23331;     304;     395
MT BELVIEU PROPANE (OPIS) SWAP - NEW YORK MERCANTILE EXCHANGE ;2011.05.03;   25542;     299;      70;      23;   24991;   25034;   25313;   25127;     229;     415
MT BELVIEU PROPANE (OPIS) SWAP - NEW YORK MERCANTILE EXCHANGE ;2011.04.26;   24762;     279;      70;      23;   24171;   24194;   24473;   24287;     289;     475
MT BELVIEU PROPANE (OPIS) SWAP - NEW YORK MERCANTILE EXCHANGE ;2011.04.19;   24481;     299;      70;      23;   23939;   23913;   24261;   24006;     220;     475
MT BELVIEU PROPANE (OPIS) SWAP - NEW YORK MERCANTILE EXCHANGE ;2011.04.12;   23472;     274;      70;      34;   22959;   22893;   23267;   22997;     205;     475
MT BELVIEU PROPANE (OPIS) SWAP - NEW YORK MERCANTILE EXCHANGE ;2011.04.05;   22507;     284;      70;      24;   21992;   21918;   22300;   22012;     207;     495
MT BELVIEU PROPANE (OPIS) SWAP - NEW YORK MERCANTILE EXCHANGE ;2011.03.29;   23254;     414;     140;      19;   22623;   22571;   23056;   22730;     198;     524
MT BELVIEU PROPANE (OPIS) SWAP - NEW YORK MERCANTILE EXCHANGE ;2011.03.22;   22801;     379;     140;      26;   22163;   22014;   22568;   22180;     233;     621
MT BELVIEU PROPANE (OPIS) SWAP - NEW YORK MERCANTILE EXCHANGE ;2011.03.15;   22488;     379;     140;      36;   21750;   21901;   22165;   22077;     323;     411
MT BELVIEU PROPANE (OPIS) SWAP - NEW YORK MERCANTILE EXCHANGE ;2011.03.08;   22267;     424;     140;      31;   21480;   21841;   21935;   22012;     332;     255
MT BELVIEU PROPANE (OPIS) SWAP - NEW YORK MERCANTILE EXCHANGE ;2011.03.01;   24162;     656;     140;      15;   23213;   23697;   23884;   23852;     278;     310
MT BELVIEU PROPANE (OPIS) SWAP - NEW YORK MERCANTILE EXCHANGE ;2011.02.22;   23706;     621;      30;      35;   22772;   23331;   23428;   23396;     278;     310
MT BELVIEU PROPANE (OPIS) SWAP - NEW YORK MERCANTILE EXCHANGE ;2011.02.15;   23708;     491;      30;      41;   22723;   23287;   23255;   23358;     453;     350
MT BELVIEU PROPANE (OPIS) SWAP - NEW YORK MERCANTILE EXCHANGE ;2011.02.08;   23751;     526;      25;     106;   22701;   23370;   23333;   23501;     418;     250
MT BELVIEU PROPANE (OPIS) SWAP - NEW YORK MERCANTILE EXCHANGE ;2011.02.01;   27977;     739;       0;      73;   26777;   27613;   27589;   27686;     388;     291
MT BELVIEU PROPANE (OPIS) SWAP - NEW YORK MERCANTILE EXCHANGE ;2011.01.25;   27194;     724;       0;      81;   26016;   26822;   26821;   26903;     373;     291
MT BELVIEU PROPANE (OPIS) SWAP - NEW YORK MERCANTILE EXCHANGE ;2011.01.18;   26953;     479;       0;     101;   26000;   26586;   26580;   26687;     373;     266
MT BELVIEU PROPANE (OPIS) SWAP - NEW YORK MERCANTILE EXCHANGE ;2011.01.11;   26391;     509;       0;      98;   25411;   26027;   26018;   26125;     373;     266
MT BELVIEU PROPANE (OPIS) SWAP - NEW YORK MERCANTILE EXCHANGE ;2011.01.04;   28238;     672;     300;     148;   27013;   27484;   27833;   27932;     405;     306
MT BELVIEU PROPANE (OPIS) SWAP - NEW YORK MERCANTILE EXCHANGE ;2011.07.12;   21524;      57;      10;      60;   21106;   21137;   21223;   21207;     301;     317
MT BELVIEU PROPANE (OPIS) SWAP - NEW YORK MERCANTILE EXCHANGE ;2010.12.28;   28116;     482;       0;     491;   26758;   27319;   27731;   27810;     385;     306
MT BELVIEU PROPANE (OPIS) SWAP - NEW YORK MERCANTILE EXCHANGE ;2010.12.21;   28175;     482;       0;     541;   26792;   27353;   27815;   27894;     360;     281
MT BELVIEU PROPANE (OPIS) SWAP - NEW YORK MERCANTILE EXCHANGE ;2010.12.14;   27112;     140;       0;     375;   25724;   26343;   26239;   26718;     873;     394
MT BELVIEU PROPANE (OPIS) SWAP - NEW YORK MERCANTILE EXCHANGE ;2010.12.07;   26676;     140;       0;     375;   25370;   25809;   25885;   26184;     791;     492
MT BELVIEU PROPANE (OPIS) SWAP - NEW YORK MERCANTILE EXCHANGE ;2010.11.30;   26515;     135;       0;     300;   25103;   25701;   25538;   26001;     977;     514
MT BELVIEU PROPANE (OPIS) SWAP - NEW YORK MERCANTILE EXCHANGE ;2010.11.23;   26172;     120;       0;     300;   24513;   25411;   24933;   25711;    1239;     461
MT BELVIEU PROPANE (OPIS) SWAP - NEW YORK MERCANTILE EXCHANGE ;2010.11.16;   26087;      45;     126;     300;   24463;   25308;   24808;   25734;    1279;     353
MT BELVIEU PROPANE (OPIS) SWAP - NEW YORK MERCANTILE EXCHANGE ;2010.11.09;   26238;     105;     126;     500;   24374;   25259;   24979;   25885;    1259;     353
MT BELVIEU PROPANE (OPIS) SWAP - NEW YORK MERCANTILE EXCHANGE ;2010.11.02;   28237;     140;       0;     626;   26249;   27275;   27015;   27901;    1222;     336
MT BELVIEU PROPANE (OPIS) SWAP - NEW YORK MERCANTILE EXCHANGE ;2010.10.26;   27689;      80;       0;     626;   25998;   26754;   26704;   27380;     985;     309
MT BELVIEU PROPANE (OPIS) SWAP - NEW YORK MERCANTILE EXCHANGE ;2010.10.19;   27429;     274;       0;     631;   25524;   26513;   26429;   27144;    1000;     285
MT BELVIEU PROPANE (OPIS) SWAP - NEW YORK MERCANTILE EXCHANGE ;2010.10.12;   26245;     249;       0;     643;   24348;   25302;   25240;   25945;    1005;     300
MT BELVIEU PROPANE (OPIS) SWAP - NEW YORK MERCANTILE EXCHANGE ;2010.10.05;   25818;     179;     470;    1129;   23494;   23918;   24802;   25517;    1016;     301
MT BELVIEU PROPANE (OPIS) SWAP - NEW YORK MERCANTILE EXCHANGE ;2010.09.28;   26853;     120;     275;    1144;   24741;   25232;   26005;   26651;     848;     202
MT BELVIEU PROPANE (OPIS) SWAP - NEW YORK MERCANTILE EXCHANGE ;2010.09.21;   26205;     230;      50;    1146;   24006;   24810;   25382;   26006;     823;     199
MT BELVIEU PROPANE (OPIS) SWAP - NEW YORK MERCANTILE EXCHANGE ;2010.09.14;   25113;     324;       0;     899;   23066;   24013;   24289;   24912;     824;     201
MT BELVIEU PROPANE (OPIS) SWAP - NEW YORK MERCANTILE EXCHANGE ;2010.09.07;   24513;     188;       0;     610;   22690;   23491;   23488;   24101;    1025;     412
MT BELVIEU PROPANE (OPIS) SWAP - NEW YORK MERCANTILE EXCHANGE ;2010.08.31;   25485;     128;     530;      82;   24242;   24586;   24452;   25198;    1033;     287
MT BELVIEU PROPANE (OPIS) SWAP - NEW YORK MERCANTILE EXCHANGE ;2010.08.24;   24557;     123;     430;     102;   23374;   23843;   23599;   24375;     958;     182
MT BELVIEU PROPANE (OPIS) SWAP - NEW YORK MERCANTILE EXCHANGE ;2010.08.17;   24588;     193;     220;      73;   23410;   24083;   23676;   24376;     912;     212
MT BELVIEU PROPANE (OPIS) SWAP - NEW YORK MERCANTILE EXCHANGE ;2010.08.10;   24512;     208;     180;      73;   23265;   23982;   23546;   24235;     966;     277
MT BELVIEU PROPANE (OPIS) SWAP - NEW YORK MERCANTILE EXCHANGE ;2010.08.03;   25272;     139;       0;      83;   24025;   24899;   24247;   24982;    1025;     290
MT BELVIEU PROPANE (OPIS) SWAP - NEW YORK MERCANTILE EXCHANGE ;2010.07.27;   21974;     109;       0;     170;   20845;   21574;   21124;   21744;     850;     230
MT BELVIEU PROPANE (OPIS) SWAP - NEW YORK MERCANTILE EXCHANGE ;2010.07.20;   21247;      94;       0;     180;   20158;   20897;   20432;   21077;     815;     170
MT BELVIEU PROPANE (OPIS) SWAP - NEW YORK MERCANTILE EXCHANGE ;2010.07.13;   21121;      60;      21;     158;   20041;   20735;   20259;   20914;     862;     207
MT BELVIEU PROPANE (OPIS) SWAP - NEW YORK MERCANTILE EXCHANGE ;2010.07.06;   20551;      64;       0;     130;   19490;   20335;   19684;   20465;     867;      86
MT BELVIEU PROPANE (OPIS) SWAP - NEW YORK MERCANTILE EXCHANGE ;2010.06.29;   22285;      35;      28;     125;   21233;   21911;   21393;   22064;     892;     221
MT BELVIEU PROPANE (OPIS) SWAP - NEW YORK MERCANTILE EXCHANGE ;2010.06.22;   22147;      35;      28;     124;   21156;   21774;   21315;   21926;     832;     221
MT BELVIEU PROPANE (OPIS) SWAP - NEW YORK MERCANTILE EXCHANGE ;2010.06.15;   20996;      35;      28;     116;   20037;   20727;   20188;   20871;     808;     125
MT BELVIEU PROPANE (OPIS) SWAP - NEW YORK MERCANTILE EXCHANGE ;2010.06.08;   19747;      95;      28;     197;   18652;   19447;   18944;   19672;     803;      75
MT BELVIEU PROPANE (OPIS) SWAP - NEW YORK MERCANTILE EXCHANGE ;2010.06.01;   21571;      70;      56;     222;   20630;   21003;   20922;   21281;     649;     290
MT BELVIEU PROPANE (OPIS) SWAP - NEW YORK MERCANTILE EXCHANGE ;2010.05.25;   21207;      70;      66;     249;   20329;   20647;   20648;   20962;     559;     245
MT BELVIEU PROPANE (OPIS) SWAP - NEW YORK MERCANTILE EXCHANGE ;2010.05.18;   21250;      70;      50;     249;   20417;   20709;   20736;   21008;     514;     242
MT BELVIEU PROPANE (OPIS) SWAP - NEW YORK MERCANTILE EXCHANGE ;2010.05.11;   21128;      70;     115;     249;   20230;   20522;   20549;   20886;     579;     242
MT BELVIEU PROPANE (OPIS) SWAP - NEW YORK MERCANTILE EXCHANGE ;2010.05.04;   22530;      60;      62;     313;   21600;   22010;   21973;   22385;     557;     145
MT BELVIEU PROPANE (OPIS) SWAP - NEW YORK MERCANTILE EXCHANGE ;2010.04.27;   21768;       0;      77;     232;   20999;   21364;   21231;   21673;     537;      95
MT BELVIEU PROPANE (OPIS) SWAP - NEW YORK MERCANTILE EXCHANGE ;2011.07.12;   21524;      57;      10;      60;   21106;   21137;   21223;   21207;     301;     317
MT BELVIEU PROPANE (OPIS) SWAP - NEW YORK MERCANTILE EXCHANGE ;2011.07.05;   22621;      67;      40;      30;   22171;   22127;   22268;   22197;     353;     424
MT BELVIEU PROPANE (OPIS) SWAP - NEW YORK MERCANTILE EXCHANGE ;2011.06.28;   22118;      67;      40;      30;   21673;   21536;   21770;   21606;     348;     512
MT BELVIEU PROPANE (OPIS) SWAP - NEW YORK MERCANTILE EXCHANGE ;2011.06.21;   22383;      67;      70;      20;   21896;   21786;   21983;   21876;     400;     507
MT BELVIEU PROPANE (OPIS) SWAP - NEW YORK MERCANTILE EXCHANGE ;2011.06.14;   22661;      67;      70;      20;   22240;   22068;   22327;   22158;     334;     503
MT BELVIEU PROPANE (OPIS) SWAP - NEW YORK MERCANTILE EXCHANGE ;2011.06.07;   21539;      62;      70;      20;   21048;   21061;   21130;   21151;     409;     388
MT BELVIEU PROPANE (OPIS) SWAP - NEW YORK MERCANTILE EXCHANGE ;2011.05.31;   23105;      86;      70;      20;   22669;   22650;   22775;   22740;     330;     365
MT BELVIEU PROPANE (OPIS) SWAP - NEW YORK MERCANTILE EXCHANGE ;2011.05.24;   22890;      81;      70;      20;   22265;   22390;   22366;   22480;     524;     410
MT BELVIEU PROPANE (OPIS) SWAP - NEW YORK MERCANTILE EXCHANGE ;2011.05.17;   22833;      81;      70;      20;   22333;   22348;   22434;   22438;     399;     395
MT BELVIEU PROPANE (OPIS) SWAP - NEW YORK MERCANTILE EXCHANGE ;2011.05.10;   23726;     211;      70;      68;   23143;   23193;   23422;   23331;     304;     395
MT BELVIEU PROPANE (OPIS) SWAP - NEW YORK MERCANTILE EXCHANGE ;2011.05.03;   25542;     299;      70;      23;   24991;   25034;   25313;   25127;     229;     415
MT BELVIEU PROPANE (OPIS) SWAP - NEW YORK MERCANTILE EXCHANGE ;2011.04.26;   24762;     279;      70;      23;   24171;   24194;   24473;   24287;     289;     475
MT BELVIEU PROPANE (OPIS) SWAP - NEW YORK MERCANTILE EXCHANGE ;2011.04.19;   24481;     299;      70;      23;   23939;   23913;   24261;   24006;     220;     475
MT BELVIEU PROPANE (OPIS) SWAP - NEW YORK MERCANTILE EXCHANGE ;2011.04.12;   23472;     274;      70;      34;   22959;   22893;   23267;   22997;     205;     475
MT BELVIEU PROPANE (OPIS) SWAP - NEW YORK MERCANTILE EXCHANGE ;2011.04.05;   22507;     284;      70;      24;   21992;   21918;   22300;   22012;     207;     495
MT BELVIEU PROPANE (OPIS) SWAP - NEW YORK MERCANTILE EXCHANGE ;2011.03.29;   23254;     414;     140;      19;   22623;   22571;   23056;   22730;     198;     524
MT BELVIEU PROPANE (OPIS) SWAP - NEW YORK MERCANTILE EXCHANGE ;2011.03.22;   22801;     379;     140;      26;   22163;   22014;   22568;   22180;     233;     621
MT BELVIEU PROPANE (OPIS) SWAP - NEW YORK MERCANTILE EXCHANGE ;2011.03.15;   22488;     379;     140;      36;   21750;   21901;   22165;   22077;     323;     411
MT BELVIEU PROPANE (OPIS) SWAP - NEW YORK MERCANTILE EXCHANGE ;2011.03.08;   22267;     424;     140;      31;   21480;   21841;   21935;   22012;     332;     255
MT BELVIEU PROPANE (OPIS) SWAP - NEW YORK MERCANTILE EXCHANGE ;2011.03.01;   24162;     656;     140;      15;   23213;   23697;   23884;   23852;     278;     310
MT BELVIEU PROPANE (OPIS) SWAP - NEW YORK MERCANTILE EXCHANGE ;2011.02.22;   23706;     621;      30;      35;   22772;   23331;   23428;   23396;     278;     310
MT BELVIEU PROPANE (OPIS) SWAP - NEW YORK MERCANTILE EXCHANGE ;2011.02.15;   23708;     491;      30;      41;   22723;   23287;   23255;   23358;     453;     350
MT BELVIEU PROPANE (OPIS) SWAP - NEW YORK MERCANTILE EXCHANGE ;2011.02.08;   23751;     526;      25;     106;   22701;   23370;   23333;   23501;     418;     250
MT BELVIEU PROPANE (OPIS) SWAP - NEW YORK MERCANTILE EXCHANGE ;2011.02.01;   27977;     739;       0;      73;   26777;   27613;   27589;   27686;     388;     291
MT BELVIEU PROPANE (OPIS) SWAP - NEW YORK MERCANTILE EXCHANGE ;2011.01.25;   27194;     724;       0;      81;   26016;   26822;   26821;   26903;     373;     291
MT BELVIEU PROPANE (OPIS) SWAP - NEW YORK MERCANTILE EXCHANGE ;2011.01.18;   26953;     479;       0;     101;   26000;   26586;   26580;   26687;     373;     266
MT BELVIEU PROPANE (OPIS) SWAP - NEW YORK MERCANTILE EXCHANGE ;2011.01.11;   26391;     509;       0;      98;   25411;   26027;   26018;   26125;     373;     266
MT BELVIEU PROPANE (OPIS) SWAP - NEW YORK MERCANTILE EXCHANGE ;2011.01.04;   28238;     672;     300;     148;   27013;   27484;   27833;   27932;     405;     306
MT BELVIEU PROPANE (OPIS) SWAP - NEW YORK MERCANTILE EXCHANGE ;2011.07.12;   21524;      57;      10;      60;   21106;   21137;   21223;   21207;     301;     317
MT BELVIEU PROPANE (OPIS) SWAP - NEW YORK MERCANTILE EXCHANGE ;2011.07.05;   22621;      67;      40;      30;   22171;   22127;   22268;   22197;     353;     424
MT BELVIEU PROPANE (OPIS) SWAP - NEW YORK MERCANTILE EXCHANGE ;2011.06.28;   22118;      67;      40;      30;   21673;   21536;   21770;   21606;     348;     512
MT BELVIEU PROPANE (OPIS) SWAP - NEW YORK MERCANTILE EXCHANGE ;2011.06.21;   22383;      67;      70;      20;   21896;   21786;   21983;   21876;     400;     507
MT BELVIEU PROPANE (OPIS) SWAP - NEW YORK MERCANTILE EXCHANGE ;2011.06.14;   22661;      67;      70;      20;   22240;   22068;   22327;   22158;     334;     503
MT BELVIEU PROPANE (OPIS) SWAP - NEW YORK MERCANTILE EXCHANGE ;2011.06.07;   21539;      62;      70;      20;   21048;   21061;   21130;   21151;     409;     388
MT BELVIEU PROPANE (OPIS) SWAP - NEW YORK MERCANTILE EXCHANGE ;2011.05.31;   23105;      86;      70;      20;   22669;   22650;   22775;   22740;     330;     365
MT BELVIEU PROPANE (OPIS) SWAP - NEW YORK MERCANTILE EXCHANGE ;2011.05.24;   22890;      81;      70;      20;   22265;   22390;   22366;   22480;     524;     410
MT BELVIEU PROPANE (OPIS) SWAP - NEW YORK MERCANTILE EXCHANGE ;2011.05.17;   22833;      81;      70;      20;   22333;   22348;   22434;   22438;     399;     395
MT BELVIEU PROPANE (OPIS) SWAP - NEW YORK MERCANTILE EXCHANGE ;2011.05.10;   23726;     211;      70;      68;   23143;   23193;   23422;   23331;     304;     395
MT BELVIEU PROPANE (OPIS) SWAP - NEW YORK MERCANTILE EXCHANGE ;2011.05.03;   25542;     299;      70;      23;   24991;   25034;   25313;   25127;     229;     415
MT BELVIEU PROPANE (OPIS) SWAP - NEW YORK MERCANTILE EXCHANGE ;2011.04.26;   24762;     279;      70;      23;   24171;   24194;   24473;   24287;     289;     475
MT BELVIEU PROPANE (OPIS) SWAP - NEW YORK MERCANTILE EXCHANGE ;2011.04.19;   24481;     299;      70;      23;   23939;   23913;   24261;   24006;     220;     475
MT BELVIEU PROPANE (OPIS) SWAP - NEW YORK MERCANTILE EXCHANGE ;2011.04.12;   23472;     274;      70;      34;   22959;   22893;   23267;   22997;     205;     475
MT BELVIEU PROPANE (OPIS) SWAP - NEW YORK MERCANTILE EXCHANGE ;2011.04.05;   22507;     284;      70;      24;   21992;   21918;   22300;   22012;     207;     495
MT BELVIEU PROPANE (OPIS) SWAP - NEW YORK MERCANTILE EXCHANGE ;2011.03.29;   23254;     414;     140;      19;   22623;   22571;   23056;   22730;     198;     524
MT BELVIEU PROPANE (OPIS) SWAP - NEW YORK MERCANTILE EXCHANGE ;2011.03.22;   22801;     379;     140;      26;   22163;   22014;   22568;   22180;     233;     621
MT BELVIEU PROPANE (OPIS) SWAP - NEW YORK MERCANTILE EXCHANGE ;2011.03.15;   22488;     379;     140;      36;   21750;   21901;   22165;   22077;     323;     411
MT BELVIEU PROPANE (OPIS) SWAP - NEW YORK MERCANTILE EXCHANGE ;2011.03.08;   22267;     424;     140;      31;   21480;   21841;   21935;   22012;     332;     255
MT BELVIEU PROPANE (OPIS) SWAP - NEW YORK MERCANTILE EXCHANGE ;2011.03.01;   24162;     656;     140;      15;   23213;   23697;   23884;   23852;     278;     310
MT BELVIEU PROPANE (OPIS) SWAP - NEW YORK MERCANTILE EXCHANGE ;2011.02.22;   23706;     621;      30;      35;   22772;   23331;   23428;   23396;     278;     310
MT BELVIEU PROPANE (OPIS) SWAP - NEW YORK MERCANTILE EXCHANGE ;2011.02.15;   23708;     491;      30;      41;   22723;   23287;   23255;   23358;     453;     350
MT BELVIEU PROPANE (OPIS) SWAP - NEW YORK MERCANTILE EXCHANGE ;2011.02.08;   23751;     526;      25;     106;   22701;   23370;   23333;   23501;     418;     250
MT BELVIEU PROPANE (OPIS) SWAP - NEW YORK MERCANTILE EXCHANGE ;2011.02.01;   27977;     739;       0;      73;   26777;   27613;   27589;   27686;     388;     291
MT BELVIEU PROPANE (OPIS) SWAP - NEW YORK MERCANTILE EXCHANGE ;2011.01.25;   27194;     724;       0;      81;   26016;   26822;   26821;   26903;     373;     291
MT BELVIEU PROPANE (OPIS) SWAP - NEW YORK MERCANTILE EXCHANGE ;2011.01.18;   26953;     479;       0;     101;   26000;   26586;   26580;   26687;     373;     266
MT BELVIEU PROPANE (OPIS) SWAP - NEW YORK MERCANTILE EXCHANGE ;2011.01.11;   26391;     509;       0;      98;   25411;   26027;   26018;   26125;     373;     266
MT BELVIEU PROPANE (OPIS) SWAP - NEW YORK MERCANTILE EXCHANGE ;2011.01.04;   28238;     672;     300;     148;   27013;   27484;   27833;   27932;     405;     306
MT BELVIEU PROPANE (OPIS) SWAP - NEW YORK MERCANTILE EXCHANGE ;2010.12.28;   28116;     482;       0;     491;   26758;   27319;   27731;   27810;     385;     306
MT BELVIEU PROPANE (OPIS) SWAP - NEW YORK MERCANTILE EXCHANGE ;2010.12.21;   28175;     482;       0;     541;   26792;   27353;   27815;   27894;     360;     281
MT BELVIEU PROPANE (OPIS) SWAP - NEW YORK MERCANTILE EXCHANGE ;2010.12.14;   27112;     140;       0;     375;   25724;   26343;   26239;   26718;     873;     394
MT BELVIEU PROPANE (OPIS) SWAP - NEW YORK MERCANTILE EXCHANGE ;2010.12.07;   26676;     140;       0;     375;   25370;   25809;   25885;   26184;     791;     492
MT BELVIEU PROPANE (OPIS) SWAP - NEW YORK MERCANTILE EXCHANGE ;2010.11.30;   26515;     135;       0;     300;   25103;   25701;   25538;   26001;     977;     514
MT BELVIEU PROPANE (OPIS) SWAP - NEW YORK MERCANTILE EXCHANGE ;2010.11.23;   26172;     120;       0;     300;   24513;   25411;   24933;   25711;    1239;     461
MT BELVIEU PROPANE (OPIS) SWAP - NEW YORK MERCANTILE EXCHANGE ;2010.11.16;   26087;      45;     126;     300;   24463;   25308;   24808;   25734;    1279;     353
MT BELVIEU PROPANE (OPIS) SWAP - NEW YORK MERCANTILE EXCHANGE ;2010.11.09;   26238;     105;     126;     500;   24374;   25259;   24979;   25885;    1259;     353
MT BELVIEU PROPANE (OPIS) SWAP - NEW YORK MERCANTILE EXCHANGE ;2010.11.02;   28237;     140;       0;     626;   26249;   27275;   27015;   27901;    1222;     336
MT BELVIEU PROPANE (OPIS) SWAP - NEW YORK MERCANTILE EXCHANGE ;2010.10.26;   27689;      80;       0;     626;   25998;   26754;   26704;   27380;     985;     309
MT BELVIEU PROPANE (OPIS) SWAP - NEW YORK MERCANTILE EXCHANGE ;2010.10.19;   27429;     274;       0;     631;   25524;   26513;   26429;   27144;    1000;     285
MT BELVIEU PROPANE (OPIS) SWAP - NEW YORK MERCANTILE EXCHANGE ;2010.10.12;   26245;     249;       0;     643;   24348;   25302;   25240;   25945;    1005;     300
MT BELVIEU PROPANE (OPIS) SWAP - NEW YORK MERCANTILE EXCHANGE ;2010.10.05;   25818;     179;     470;    1129;   23494;   23918;   24802;   25517;    1016;     301
MT BELVIEU PROPANE (OPIS) SWAP - NEW YORK MERCANTILE EXCHANGE ;2010.09.28;   26853;     120;     275;    1144;   24741;   25232;   26005;   26651;     848;     202
MT BELVIEU PROPANE (OPIS) SWAP - NEW YORK MERCANTILE EXCHANGE ;2010.09.21;   26205;     230;      50;    1146;   24006;   24810;   25382;   26006;     823;     199
MT BELVIEU PROPANE (OPIS) SWAP - NEW YORK MERCANTILE EXCHANGE ;2010.09.14;   25113;     324;       0;     899;   23066;   24013;   24289;   24912;     824;     201
MT BELVIEU PROPANE (OPIS) SWAP - NEW YORK MERCANTILE EXCHANGE ;2010.09.07;   24513;     188;       0;     610;   22690;   23491;   23488;   24101;    1025;     412
MT BELVIEU PROPANE (OPIS) SWAP - NEW YORK MERCANTILE EXCHANGE ;2010.08.31;   25485;     128;     530;      82;   24242;   24586;   24452;   25198;    1033;     287
MT BELVIEU PROPANE (OPIS) SWAP - NEW YORK MERCANTILE EXCHANGE ;2010.08.24;   24557;     123;     430;     102;   23374;   23843;   23599;   24375;     958;     182
MT BELVIEU PROPANE (OPIS) SWAP - NEW YORK MERCANTILE EXCHANGE ;2010.08.17;   24588;     193;     220;      73;   23410;   24083;   23676;   24376;     912;     212
MT BELVIEU PROPANE (OPIS) SWAP - NEW YORK MERCANTILE EXCHANGE ;2010.08.10;   24512;     208;     180;      73;   23265;   23982;   23546;   24235;     966;     277
MT BELVIEU PROPANE (OPIS) SWAP - NEW YORK MERCANTILE EXCHANGE ;2010.08.03;   25272;     139;       0;      83;   24025;   24899;   24247;   24982;    1025;     290
MT BELVIEU PROPANE (OPIS) SWAP - NEW YORK MERCANTILE EXCHANGE ;2010.07.27;   21974;     109;       0;     170;   20845;   21574;   21124;   21744;     850;     230
MT BELVIEU PROPANE (OPIS) SWAP - NEW YORK MERCANTILE EXCHANGE ;2010.07.20;   21247;      94;       0;     180;   20158;   20897;   20432;   21077;     815;     170
MT BELVIEU PROPANE (OPIS) SWAP - NEW YORK MERCANTILE EXCHANGE ;2010.07.13;   21121;      60;      21;     158;   20041;   20735;   20259;   20914;     862;     207
MT BELVIEU PROPANE (OPIS) SWAP - NEW YORK MERCANTILE EXCHANGE ;2010.07.06;   20551;      64;       0;     130;   19490;   20335;   19684;   20465;     867;      86
MT BELVIEU PROPANE (OPIS) SWAP - NEW YORK MERCANTILE EXCHANGE ;2010.06.29;   22285;      35;      28;     125;   21233;   21911;   21393;   22064;     892;     221
MT BELVIEU PROPANE (OPIS) SWAP - NEW YORK MERCANTILE EXCHANGE ;2010.06.22;   22147;      35;      28;     124;   21156;   21774;   21315;   21926;     832;     221
MT BELVIEU PROPANE (OPIS) SWAP - NEW YORK MERCANTILE EXCHANGE ;2010.06.15;   20996;      35;      28;     116;   20037;   20727;   20188;   20871;     808;     125
MT BELVIEU PROPANE (OPIS) SWAP - NEW YORK MERCANTILE EXCHANGE ;2010.06.08;   19747;      95;      28;     197;   18652;   19447;   18944;   19672;     803;      75
MT BELVIEU PROPANE (OPIS) SWAP - NEW YORK MERCANTILE EXCHANGE ;2010.06.01;   21571;      70;      56;     222;   20630;   21003;   20922;   21281;     649;     290
MT BELVIEU PROPANE (OPIS) SWAP - NEW YORK MERCANTILE EXCHANGE ;2010.05.25;   21207;      70;      66;     249;   20329;   20647;   20648;   20962;     559;     245
MT BELVIEU PROPANE (OPIS) SWAP - NEW YORK MERCANTILE EXCHANGE ;2010.05.18;   21250;      70;      50;     249;   20417;   20709;   20736;   21008;     514;     242
MT BELVIEU PROPANE (OPIS) SWAP - NEW YORK MERCANTILE EXCHANGE ;2010.05.11;   21128;      70;     115;     249;   20230;   20522;   20549;   20886;     579;     242
MT BELVIEU PROPANE (OPIS) SWAP - NEW YORK MERCANTILE EXCHANGE ;2010.05.04;   22530;      60;      62;     313;   21600;   22010;   21973;   22385;     557;     145
MT BELVIEU PROPANE (OPIS) SWAP - NEW YORK MERCANTILE EXCHANGE ;2010.04.27;   21768;       0;      77;     232;   20999;   21364;   21231;   21673;     537;      95
MT BELVIEU PROPANE (OPIS) SWAP - NEW YORK MERCANTILE EXCHANGE ;2011.07.12;   21524;      57;      10;      60;   21106;   21137;   21223;   21207;     301;     317
