U.S. DOLLAR-EURO - NEW YORK FUTURES EXCHANGE ;1999.03.23;    2014;       0;       0;       0;    1629;     455;    1629;     455;     385;    1559
U.S. DOLLAR-EURO - NEW YORK FUTURES EXCHANGE ;1999.03.16;    1899;       0;       0;       0;    1628;     518;    1628;     518;     271;    1381
U.S. DOLLAR-EURO - NEW YORK FUTURES EXCHANGE ;1999.03.02;    1748;     594;     254;       0;     700;    1046;    1294;    1300;     454;     448
U.S. DOLLAR-EURO - NEW YORK FUTURES EXCHANGE ;1999.03.23;    2014;       0;       0;       0;    1629;     455;    1629;     455;     385;    1559
U.S. DOLLAR-EURO - NEW YORK FUTURES EXCHANGE ;1999.03.16;    1899;       0;       0;       0;    1628;     518;    1628;     518;     271;    1381
U.S. DOLLAR-EURO - NEW YORK FUTURES EXCHANGE ;1999.03.02;    1748;     594;     254;       0;     700;    1046;    1294;    1300;     454;     448
U.S. DOLLAR-EURO - NEW YORK FUTURES EXCHANGE ;1999.03.23;    2014;       0;       0;       0;    1629;     455;    1629;     455;     385;    1559
U.S. DOLLAR-EURO - NEW YORK FUTURES EXCHANGE ;1999.03.16;    1899;       0;       0;       0;    1628;     518;    1628;     518;     271;    1381
U.S. DOLLAR-EURO - NEW YORK FUTURES EXCHANGE ;1999.03.02;    1748;     594;     254;       0;     700;    1046;    1294;    1300;     454;     448
