SUGAR NO. 11 OPTS ON FUT SPRDS - ICE FUTURES U.S. ;2011.02.08;   17139;     212;    7649;    2145;   13317;    5200;   15674;   14993;    1465;    2146
SUGAR NO. 11 OPTS ON FUT SPRDS - ICE FUTURES U.S. ;2011.02.01;   19617;      96;    8547;    2887;   15080;    6145;   18064;   17579;    1554;    2039
SUGAR NO. 11 OPTS ON FUT SPRDS - ICE FUTURES U.S. ;2011.01.25;   19622;       0;    8558;    2841;   15455;    5968;   18295;   17367;    1326;    2255
SUGAR NO. 11 OPTS ON FUT SPRDS - ICE FUTURES U.S. ;2011.02.08;   17139;     212;    7649;    2145;   13317;    5200;   15674;   14993;    1465;    2146
SUGAR NO. 11 OPTS ON FUT SPRDS - ICE FUTURES U.S. ;2011.02.01;   19617;      96;    8547;    2887;   15080;    6145;   18064;   17579;    1554;    2039
SUGAR NO. 11 OPTS ON FUT SPRDS - ICE FUTURES U.S. ;2011.01.25;   19622;       0;    8558;    2841;   15455;    5968;   18295;   17367;    1326;    2255
SUGAR NO. 11 OPTS ON FUT SPRDS - ICE FUTURES U.S. ;2011.02.08;   17139;     212;    7649;    2145;   13317;    5200;   15674;   14993;    1465;    2146
SUGAR NO. 11 OPTS ON FUT SPRDS - ICE FUTURES U.S. ;2011.02.01;   19617;      96;    8547;    2887;   15080;    6145;   18064;   17579;    1554;    2039
SUGAR NO. 11 OPTS ON FUT SPRDS - ICE FUTURES U.S. ;2011.01.25;   19622;       0;    8558;    2841;   15455;    5968;   18295;   17367;    1326;    2255
