SPREADS UNLEADED GAS TO CRUDE - NYME UG/CO OPTIONS ;1995.04.04;    2721;    1260;    1263;    1196;       0;       0;    2455;    2459;     265;     262
SPREADS UNLEADED GAS TO CRUDE - NYME UG/CO OPTIONS ;1995.03.28;    2571;    1169;    1189;    1255;       0;       0;    2424;    2444;     147;     127
SPREADS UNLEADED GAS TO CRUDE - NYME UG/CO OPTIONS ;1995.03.21;    1881;     867;     838;     940;       0;       0;    1807;    1778;      74;     103
SPREADS UNLEADED GAS TO CRUDE - NYME UG/CO OPTIONS ;1995.04.04;    2721;    1260;    1263;    1196;       0;       0;    2455;    2459;     265;     262
SPREADS UNLEADED GAS TO CRUDE - NYME UG/CO OPTIONS ;1995.03.28;    2571;    1169;    1189;    1255;       0;       0;    2424;    2444;     147;     127
SPREADS UNLEADED GAS TO CRUDE - NYME UG/CO OPTIONS ;1995.03.21;    1881;     867;     838;     940;       0;       0;    1807;    1778;      74;     103
SPREADS UNLEADED GAS TO CRUDE - NYME UG/CO OPTIONS ;1995.04.04;    2721;    1260;    1263;    1196;       0;       0;    2455;    2459;     265;     262
SPREADS UNLEADED GAS TO CRUDE - NYME UG/CO OPTIONS ;1995.03.28;    2571;    1169;    1189;    1255;       0;       0;    2424;    2444;     147;     127
SPREADS UNLEADED GAS TO CRUDE - NYME UG/CO OPTIONS ;1995.03.21;    1881;     867;     838;     940;       0;       0;    1807;    1778;      74;     103
