EUR STYLE NATURAL GAS OPTIONS - NEW YORK MERCANTILE EXCHANGE ;2011.07.12; 1645851;   91293;   85024;  508522; 1039718; 1047964; 1639533; 1641509;    6317;    4341
EUR STYLE NATURAL GAS OPTIONS - NEW YORK MERCANTILE EXCHANGE ;2011.07.12; 1645851;   91293;   85024;  508522; 1039718; 1047964; 1639533; 1641509;    6317;    4341
EUR STYLE NATURAL GAS OPTIONS - NEW YORK MERCANTILE EXCHANGE ;2010.12.28; 1610418;   77170;   97796;  541604;  985213;  965626; 1603988; 1605026;    6430;    5392
EUR STYLE NATURAL GAS OPTIONS - NEW YORK MERCANTILE EXCHANGE ;2010.12.21; 1796677;   94773;  129646;  621992; 1073502; 1039018; 1790267; 1790656;    6410;    6021
EUR STYLE NATURAL GAS OPTIONS - NEW YORK MERCANTILE EXCHANGE ;2010.12.14; 1750328;   95636;  132384;  594202; 1052659; 1016777; 1742497; 1743362;    7831;    6966
EUR STYLE NATURAL GAS OPTIONS - NEW YORK MERCANTILE EXCHANGE ;2010.12.07; 1716743;   89858;  128252;  578903; 1040496; 1002375; 1709257; 1709530;    7487;    7213
EUR STYLE NATURAL GAS OPTIONS - NEW YORK MERCANTILE EXCHANGE ;2010.11.30; 1705943;   82709;  122495;  571877; 1044368; 1004450; 1698954; 1698823;    6988;    7120
EUR STYLE NATURAL GAS OPTIONS - NEW YORK MERCANTILE EXCHANGE ;2010.11.23; 1656875;   76823;  107513;  553254; 1019643;  989138; 1649720; 1649905;    7155;    6970
EUR STYLE NATURAL GAS OPTIONS - NEW YORK MERCANTILE EXCHANGE ;2010.11.16; 1779092;   82921;  124262;  600414; 1089293; 1048040; 1772627; 1772715;    6465;    6377
EUR STYLE NATURAL GAS OPTIONS - NEW YORK MERCANTILE EXCHANGE ;2010.11.09; 1725906;   75448;  113945;  580803; 1063494; 1025770; 1719745; 1720518;    6160;    5388
EUR STYLE NATURAL GAS OPTIONS - NEW YORK MERCANTILE EXCHANGE ;2010.11.02; 1700307;   68347;  101075;  568727; 1057141; 1024826; 1694216; 1694629;    6091;    5678
EUR STYLE NATURAL GAS OPTIONS - NEW YORK MERCANTILE EXCHANGE ;2010.10.26; 1687362;   70107;   95440;  562006; 1047693; 1024174; 1679806; 1681620;    7556;    5742
EUR STYLE NATURAL GAS OPTIONS - NEW YORK MERCANTILE EXCHANGE ;2010.10.19; 1769698;   78830;  102013;  598691; 1085387; 1062977; 1762908; 1763682;    6790;    6017
EUR STYLE NATURAL GAS OPTIONS - NEW YORK MERCANTILE EXCHANGE ;2010.10.12; 1716232;   76692;   98540;  571026; 1061524; 1040463; 1709241; 1710029;    6991;    6204
EUR STYLE NATURAL GAS OPTIONS - NEW YORK MERCANTILE EXCHANGE ;2010.10.05; 1676395;   71340;   99845;  551535; 1046704; 1019163; 1669579; 1670543;    6816;    5853
EUR STYLE NATURAL GAS OPTIONS - NEW YORK MERCANTILE EXCHANGE ;2010.09.28; 1612792;   64229;   98745;  520745; 1021063;  986918; 1606037; 1606407;    6755;    6384
EUR STYLE NATURAL GAS OPTIONS - NEW YORK MERCANTILE EXCHANGE ;2010.09.21; 1806130;   94217;  107787;  598122; 1107305; 1093700; 1799644; 1799609;    6486;    6521
EUR STYLE NATURAL GAS OPTIONS - NEW YORK MERCANTILE EXCHANGE ;2010.09.14; 1767863;   88651;  100491;  581089; 1092114; 1080202; 1761853; 1761781;    6010;    6082
EUR STYLE NATURAL GAS OPTIONS - NEW YORK MERCANTILE EXCHANGE ;2010.09.07; 1747806;   86513;   97634;  568129; 1083028; 1071350; 1737671; 1737113;   10135;   10692
EUR STYLE NATURAL GAS OPTIONS - NEW YORK MERCANTILE EXCHANGE ;2010.08.31; 1714471;   80007;   91303;  552256; 1076392; 1064339; 1708655; 1707898;    5817;    6573
EUR STYLE NATURAL GAS OPTIONS - NEW YORK MERCANTILE EXCHANGE ;2010.08.24; 1808051;   81419;  102365;  592983; 1128080; 1105044; 1802482; 1800392;    5569;    7659
EUR STYLE NATURAL GAS OPTIONS - NEW YORK MERCANTILE EXCHANGE ;2010.08.17; 1728352;   75816;   99261;  552689; 1095059; 1069749; 1723564; 1721699;    4789;    6653
EUR STYLE NATURAL GAS OPTIONS - NEW YORK MERCANTILE EXCHANGE ;2010.08.10; 1694005;   77884;   98762;  534998; 1076087; 1053420; 1688970; 1687181;    5036;    6825
EUR STYLE NATURAL GAS OPTIONS - NEW YORK MERCANTILE EXCHANGE ;2010.08.03; 1641749;   69254;   96453;  515430; 1051513; 1023150; 1636197; 1635033;    5553;    6716
EUR STYLE NATURAL GAS OPTIONS - NEW YORK MERCANTILE EXCHANGE ;2010.07.27; 1614813;   67442;   96026;  504851; 1037406; 1007091; 1609699; 1607968;    5114;    6845
EUR STYLE NATURAL GAS OPTIONS - NEW YORK MERCANTILE EXCHANGE ;2010.07.20; 1723971;   72340;  105346;  550116; 1096151; 1060932; 1718606; 1716393;    5365;    7577
EUR STYLE NATURAL GAS OPTIONS - NEW YORK MERCANTILE EXCHANGE ;2010.07.13; 1705620;   75438;  100989;  543020; 1082514; 1054675; 1700973; 1698685;    4648;    6935
EUR STYLE NATURAL GAS OPTIONS - NEW YORK MERCANTILE EXCHANGE ;2010.07.06; 1698957;   67822;   98250;  547232; 1078255; 1045453; 1693309; 1690935;    5648;    8022
EUR STYLE NATURAL GAS OPTIONS - NEW YORK MERCANTILE EXCHANGE ;2010.06.29; 1683052;   68445;   96108;  540889; 1067638; 1037681; 1676972; 1674678;    6080;    8374
EUR STYLE NATURAL GAS OPTIONS - NEW YORK MERCANTILE EXCHANGE ;2010.06.22; 1798134;   77873;  109030;  594593; 1119404; 1085461; 1791870; 1789083;    6264;    9051
EUR STYLE NATURAL GAS OPTIONS - NEW YORK MERCANTILE EXCHANGE ;2010.06.15; 1767217;   74860;  110020;  587018; 1101364; 1063901; 1763242; 1760939;    3974;    6277
EUR STYLE NATURAL GAS OPTIONS - NEW YORK MERCANTILE EXCHANGE ;2010.06.08; 1700177;   72894;   98167;  577252; 1043676; 1015864; 1693822; 1691282;    6355;    8895
EUR STYLE NATURAL GAS OPTIONS - NEW YORK MERCANTILE EXCHANGE ;2010.06.01; 1625989;   74018;   94357;  538140; 1007806;  984674; 1619964; 1617171;    6024;    8818
EUR STYLE NATURAL GAS OPTIONS - NEW YORK MERCANTILE EXCHANGE ;2010.05.25; 1600569;   81147;   92181;  523890;  989205;  975822; 1594243; 1591893;    6326;    8677
EUR STYLE NATURAL GAS OPTIONS - NEW YORK MERCANTILE EXCHANGE ;2010.05.18; 1695987;   84244;  106913;  559999; 1044973; 1019587; 1689217; 1686499;    6770;    9487
EUR STYLE NATURAL GAS OPTIONS - NEW YORK MERCANTILE EXCHANGE ;2010.05.11; 1690501;   88003;   99072;  557690; 1037857; 1024606; 1683550; 1681368;    6951;    9132
EUR STYLE NATURAL GAS OPTIONS - NEW YORK MERCANTILE EXCHANGE ;2010.05.04; 1646022;   82306;  102974;  534011; 1022756;  999792; 1639073; 1636778;    6949;    9244
EUR STYLE NATURAL GAS OPTIONS - NEW YORK MERCANTILE EXCHANGE ;2010.04.27; 1592819;   76308;  103850;  517852;  991479;  962095; 1585639; 1583796;    7181;    9023
EUR STYLE NATURAL GAS OPTIONS - NEW YORK MERCANTILE EXCHANGE ;2010.04.20; 1737035;   89804;  114117;  586158; 1053907; 1027610; 1729869; 1727884;    7166;    9151
EUR STYLE NATURAL GAS OPTIONS - NEW YORK MERCANTILE EXCHANGE ;2010.04.13; 1703069;   85254;  116001;  574296; 1036499; 1004029; 1696050; 1694326;    7020;    8743
EUR STYLE NATURAL GAS OPTIONS - NEW YORK MERCANTILE EXCHANGE ;2010.04.06; 1661924;   82277;  109516;  555110; 1017031;  988108; 1654418; 1652735;    7506;    9189
EUR STYLE NATURAL GAS OPTIONS - NEW YORK MERCANTILE EXCHANGE ;2010.03.30; 1626073;   82931;  108343;  534881; 1000589;  973487; 1618402; 1616712;    7671;    9362
EUR STYLE NATURAL GAS OPTIONS - NEW YORK MERCANTILE EXCHANGE ;2010.03.23; 1769575;   99264;  106057;  624841; 1038373; 1029398; 1762478; 1760296;    7098;    9280
EUR STYLE NATURAL GAS OPTIONS - NEW YORK MERCANTILE EXCHANGE ;2010.03.16; 1675179;   93917;  105552;  567681; 1006627;  993306; 1668225; 1666539;    6955;    8640
EUR STYLE NATURAL GAS OPTIONS - NEW YORK MERCANTILE EXCHANGE ;2010.03.09; 1615465;   83961;  109597;  534896;  989960;  962674; 1608817; 1607167;    6648;    8298
EUR STYLE NATURAL GAS OPTIONS - NEW YORK MERCANTILE EXCHANGE ;2010.03.02; 1558332;   75830;  104417;  509259;  966932;  936992; 1552022; 1550669;    6310;    7663
EUR STYLE NATURAL GAS OPTIONS - NEW YORK MERCANTILE EXCHANGE ;2010.02.23; 1524892;   71919;   99855;  488770;  957828;  928421; 1518517; 1517047;    6374;    7845
EUR STYLE NATURAL GAS OPTIONS - NEW YORK MERCANTILE EXCHANGE ;2010.02.16; 1586949;   64389;  108654;  515604; 1001990;  956418; 1581983; 1580676;    4966;    6273
EUR STYLE NATURAL GAS OPTIONS - NEW YORK MERCANTILE EXCHANGE ;2010.02.09; 1585865;   62755;  107599;  514029; 1003880;  957145; 1580664; 1578773;    5202;    7093
EUR STYLE NATURAL GAS OPTIONS - NEW YORK MERCANTILE EXCHANGE ;2010.02.02; 1559532;   59509;  101005;  505119;  989451;  947811; 1554079; 1553934;    5453;    5598
EUR STYLE NATURAL GAS OPTIONS - NEW YORK MERCANTILE EXCHANGE ;2010.01.26; 1530017;   56426;   98603;  489362;  977700;  935312; 1523488; 1523277;    6529;    6739
EUR STYLE NATURAL GAS OPTIONS - NEW YORK MERCANTILE EXCHANGE ;2010.01.19; 1609592;   62295;  105242;  521588; 1020366;  977090; 1604249; 1603919;    5343;    5673
EUR STYLE NATURAL GAS OPTIONS - NEW YORK MERCANTILE EXCHANGE ;2010.01.12; 1622017;   56628;  106673;  527061; 1033385;  982869; 1617074; 1616604;    4943;    5414
EUR STYLE NATURAL GAS OPTIONS - NEW YORK MERCANTILE EXCHANGE ;2010.01.05; 1578696;   53549;  102302;  511768; 1009524;  960301; 1574841; 1574372;    3855;    4324
EUR STYLE NATURAL GAS OPTIONS - NEW YORK MERCANTILE EXCHANGE ;2009.12.29; 1556341;   52618;   96816;  500465;  997967;  953376; 1551050; 1550657;    5291;    5684
EUR STYLE NATURAL GAS OPTIONS - NEW YORK MERCANTILE EXCHANGE ;2009.12.22; 1683653;   53584;  106512;  553144; 1071812; 1018279; 1678540; 1677934;    5113;    5719
EUR STYLE NATURAL GAS OPTIONS - NEW YORK MERCANTILE EXCHANGE ;2009.12.15; 1660522;   49364;   98512;  542319; 1064441; 1014634; 1656124; 1655466;    4399;    5057
EUR STYLE NATURAL GAS OPTIONS - NEW YORK MERCANTILE EXCHANGE ;2009.12.08; 1613547;   51519;  105631;  509853; 1047293;  992546; 1608665; 1608030;    4882;    5517
EUR STYLE NATURAL GAS OPTIONS - NEW YORK MERCANTILE EXCHANGE ;2009.12.01; 1559614;   49500;  113914;  474953; 1030337;  965089; 1554790; 1553956;    4824;    5658
EUR STYLE NATURAL GAS OPTIONS - NEW YORK MERCANTILE EXCHANGE ;2009.11.24; 1532122;   47443;  118848;  463271; 1016210;  944389; 1526924; 1526509;    5198;    5613
EUR STYLE NATURAL GAS OPTIONS - NEW YORK MERCANTILE EXCHANGE ;2009.11.17; 1655638;   49002;  128830;  521190; 1079848;  999907; 1650039; 1649927;    5598;    5710
EUR STYLE NATURAL GAS OPTIONS - NEW YORK MERCANTILE EXCHANGE ;2009.11.09; 1606198;   47269;  123167;  501186; 1052688;  976521; 1601143; 1600874;    5055;    5324
EUR STYLE NATURAL GAS OPTIONS - NEW YORK MERCANTILE EXCHANGE ;2009.11.03; 1566599;   42297;  120469;  487121; 1032226;  953666; 1561645; 1561256;    4954;    5343
EUR STYLE NATURAL GAS OPTIONS - NEW YORK MERCANTILE EXCHANGE ;2009.10.27; 1540678;   41594;  110880;  478610; 1014203;  944595; 1534408; 1534086;    6270;    6593
EUR STYLE NATURAL GAS OPTIONS - NEW YORK MERCANTILE EXCHANGE ;2009.10.20; 1664835;   48511;  119265;  527690; 1076905; 1014034; 1653106; 1660989;   11729;    3846
EUR STYLE NATURAL GAS OPTIONS - NEW YORK MERCANTILE EXCHANGE ;2009.10.13; 1644200;   53649;  119662;  517099; 1069644; 1003975; 1640392; 1640736;    3808;    3464
EUR STYLE NATURAL GAS OPTIONS - NEW YORK MERCANTILE EXCHANGE ;2009.10.06; 1641036;   53684;  116624;  514075; 1068419; 1005720; 1636178; 1636419;    4858;    4617
EUR STYLE NATURAL GAS OPTIONS - NEW YORK MERCANTILE EXCHANGE ;2009.09.29; 1605962;   51223;  110450;  499208; 1052097;  993269; 1602529; 1602928;    3433;    3034
EUR STYLE NATURAL GAS OPTIONS - NEW YORK MERCANTILE EXCHANGE ;2009.09.22; 1889368;   57902;  141206;  623156; 1205999; 1123102; 1887057; 1887463;    2311;    1905
EUR STYLE NATURAL GAS OPTIONS - NEW YORK MERCANTILE EXCHANGE ;2009.09.15; 1893949;   57822;  128740;  625190; 1208557; 1137812; 1891570; 1891742;    2379;    2207
EUR STYLE NATURAL GAS OPTIONS - NEW YORK MERCANTILE EXCHANGE ;2009.09.08; 1874096;   60839;  139377;  607913; 1202753; 1123836; 1871505; 1871125;    2592;    2971
EUR STYLE NATURAL GAS OPTIONS - NEW YORK MERCANTILE EXCHANGE ;2009.09.01; 1826013;   55143;  130773;  589888; 1176890; 1101485; 1821922; 1822146;    4091;    3867
EUR STYLE NATURAL GAS OPTIONS - NEW YORK MERCANTILE EXCHANGE ;2009.08.25; 2008095;   58772;  148950;  679588; 1265875; 1175715; 2004234; 2004253;    3861;    3842
EUR STYLE NATURAL GAS OPTIONS - NEW YORK MERCANTILE EXCHANGE ;2009.08.18; 1953915;   49173;  145395;  659696; 1240201; 1144343; 1949070; 1949435;    4845;    4481
EUR STYLE NATURAL GAS OPTIONS - NEW YORK MERCANTILE EXCHANGE ;2009.08.11; 1893771;   36552;  134777;  638930; 1213801; 1116498; 1889283; 1890204;    4488;    3567
EUR STYLE NATURAL GAS OPTIONS - NEW YORK MERCANTILE EXCHANGE ;2009.08.04; 1863218;   33501;  122478;  629554; 1195831; 1107926; 1858887; 1859958;    4332;    3260
EUR STYLE NATURAL GAS OPTIONS - NEW YORK MERCANTILE EXCHANGE ;2009.07.28; 1853351;   33475;  136024;  618166; 1197097; 1095542; 1848738; 1849732;    4613;    3619
EUR STYLE NATURAL GAS OPTIONS - NEW YORK MERCANTILE EXCHANGE ;2009.07.21; 2003743;   30518;  148259;  682746; 1285851; 1169691; 1999115; 2000696;    4629;    3048
EUR STYLE NATURAL GAS OPTIONS - NEW YORK MERCANTILE EXCHANGE ;2009.07.14; 2005408;   32664;  155513;  682497; 1285670; 1164194; 2000831; 2002205;    4577;    3204
EUR STYLE NATURAL GAS OPTIONS - NEW YORK MERCANTILE EXCHANGE ;2009.07.07; 1880740;   32693;  140634;  639720; 1203690; 1096319; 1876103; 1876674;    4636;    4066
EUR STYLE NATURAL GAS OPTIONS - NEW YORK MERCANTILE EXCHANGE ;2009.06.30; 1826259;   28391;  126697;  618887; 1174834; 1077390; 1822112; 1822974;    4147;    3285
EUR STYLE NATURAL GAS OPTIONS - NEW YORK MERCANTILE EXCHANGE ;2009.06.23; 1997277;   20227;  148970;  706749; 1265855; 1137588; 1992831; 1993308;    4445;    3968
EUR STYLE NATURAL GAS OPTIONS - NEW YORK MERCANTILE EXCHANGE ;2009.06.16; 2015830;   21925;  130009;  719799; 1268309; 1160255; 2010033; 2010063;    5797;    5767
EUR STYLE NATURAL GAS OPTIONS - NEW YORK MERCANTILE EXCHANGE ;2009.06.09; 1988389;   25354;  135293;  699669; 1249372; 1136293; 1974394; 1971255;   13995;   17135
EUR STYLE NATURAL GAS OPTIONS - NEW YORK MERCANTILE EXCHANGE ;2009.06.02; 1945039;   22039;  136084;  678512; 1240033; 1126046; 1940584; 1940643;    4455;    4396
EUR STYLE NATURAL GAS OPTIONS - NEW YORK MERCANTILE EXCHANGE ;2009.05.26; 1934929;   24178;  148100;  665319; 1239522; 1114008; 1929020; 1927427;    5909;    7502
EUR STYLE NATURAL GAS OPTIONS - NEW YORK MERCANTILE EXCHANGE ;2009.05.19; 2130124;   27777;  153821;  738562; 1358566; 1232736; 2124906; 2125118;    5218;    5005
EUR STYLE NATURAL GAS OPTIONS - NEW YORK MERCANTILE EXCHANGE ;2009.05.12; 2113473;   19179;  126175;  746121; 1343542; 1236864; 2108843; 2109160;    4630;    4313
EUR STYLE NATURAL GAS OPTIONS - NEW YORK MERCANTILE EXCHANGE ;2009.05.05; 2080089;   25952;  157234;  715814; 1333140; 1203007; 2074905; 2076056;    5184;    4033
EUR STYLE NATURAL GAS OPTIONS - NEW YORK MERCANTILE EXCHANGE ;2009.04.28; 2077565;   23717;  160712;  715510; 1334849; 1197635; 2074076; 2073857;    3490;    3709
EUR STYLE NATURAL GAS OPTIONS - NEW YORK MERCANTILE EXCHANGE ;2009.04.21; 2216191;   28828;  164304;  774580; 1406409; 1271435; 2209817; 2210320;    6374;    5872
EUR STYLE NATURAL GAS OPTIONS - NEW YORK MERCANTILE EXCHANGE ;2009.04.14; 2176426;   27963;  155081;  760900; 1381827; 1255053; 2170689; 2171034;    5737;    5392
EUR STYLE NATURAL GAS OPTIONS - NEW YORK MERCANTILE EXCHANGE ;2009.04.07; 2173882;   28197;  162446;  757583; 1382072; 1248046; 2167853; 2168075;    6029;    5807
EUR STYLE NATURAL GAS OPTIONS - NEW YORK MERCANTILE EXCHANGE ;2009.03.31; 2118050;   22588;  151744;  737739; 1352072; 1223079; 2112398; 2112561;    5652;    5489
EUR STYLE NATURAL GAS OPTIONS - NEW YORK MERCANTILE EXCHANGE ;2009.03.24; 2329477;   35292;  139501;  891583; 1397894; 1293732; 2324770; 2324816;    4708;    4661
EUR STYLE NATURAL GAS OPTIONS - NEW YORK MERCANTILE EXCHANGE ;2009.03.17; 2323668;   40628;  170790;  876016; 1400582; 1270803; 2317226; 2317609;    6442;    6058
EUR STYLE NATURAL GAS OPTIONS - NEW YORK MERCANTILE EXCHANGE ;2009.03.10; 2278912;   76771;  163676;  925543; 1270424; 1184363; 2272738; 2273582;    6174;    5331
EUR STYLE NATURAL GAS OPTIONS - NEW YORK MERCANTILE EXCHANGE ;2009.03.03; 2159235;   78608;  155390;  883069; 1189517; 1116705; 2151194; 2155164;    8041;    4071
EUR STYLE NATURAL GAS OPTIONS - NEW YORK MERCANTILE EXCHANGE ;2009.02.24; 2118731;   80425;  152087;  870427; 1162494; 1092566; 2113347; 2115080;    5385;    3651
EUR STYLE NATURAL GAS OPTIONS - NEW YORK MERCANTILE EXCHANGE ;2009.02.17; 2349217;   92357;  153926;  999715; 1249697; 1189304; 2341768; 2342944;    7449;    6273
EUR STYLE NATURAL GAS OPTIONS - NEW YORK MERCANTILE EXCHANGE ;2009.02.10; 2255246;   91475;  138038;  961771; 1195962; 1150166; 2249207; 2249974;    6039;    5272
EUR STYLE NATURAL GAS OPTIONS - NEW YORK MERCANTILE EXCHANGE ;2009.02.03; 2239855;   91983;  125088;  959465; 1182819; 1150555; 2234267; 2235108;    5588;    4747
EUR STYLE NATURAL GAS OPTIONS - NEW YORK MERCANTILE EXCHANGE ;2009.01.27; 2202803;   92447;  119995;  934993; 1170173; 1143284; 2197613; 2198272;    5190;    4531
EUR STYLE NATURAL GAS OPTIONS - NEW YORK MERCANTILE EXCHANGE ;2009.01.20; 2300894;   84253;  121463;  979113; 1231831; 1195685; 2295197; 2296260;    5697;    4634
EUR STYLE NATURAL GAS OPTIONS - NEW YORK MERCANTILE EXCHANGE ;2009.01.13; 2177599;   82590;  104577;  927315; 1162311; 1141119; 2172216; 2173012;    5383;    4588
EUR STYLE NATURAL GAS OPTIONS - NEW YORK MERCANTILE EXCHANGE ;2009.01.06; 2056969;   82131;   84611;  883813; 1085981; 1084071; 2051925; 2052495;    5044;    4473
EUR STYLE NATURAL GAS OPTIONS - NEW YORK MERCANTILE EXCHANGE ;2008.12.30; 2032518;   84209;   97384;  867142; 1076109; 1063612; 2027459; 2028138;    5058;    4380
EUR STYLE NATURAL GAS OPTIONS - NEW YORK MERCANTILE EXCHANGE ;2008.12.22; 2358119;   85062;  111880; 1042684; 1224021; 1198762; 2351766; 2353326;    6353;    4793
EUR STYLE NATURAL GAS OPTIONS - NEW YORK MERCANTILE EXCHANGE ;2008.12.16; 2247221;   90518;   90468;  994471; 1157258; 1158252; 2242246; 2243190;    4975;    4031
EUR STYLE NATURAL GAS OPTIONS - NEW YORK MERCANTILE EXCHANGE ;2008.12.09; 2220522;   92702;   91417;  979946; 1142713; 1145487; 2215361; 2216850;    5162;    3672
EUR STYLE NATURAL GAS OPTIONS - NEW YORK MERCANTILE EXCHANGE ;2008.12.02; 2080449;  101132;   73975;  919354; 1055048; 1083318; 2075535; 2076646;    4914;    3802
EUR STYLE NATURAL GAS OPTIONS - NEW YORK MERCANTILE EXCHANGE ;2008.11.25; 2059861;  102605;   74803;  908411; 1044154; 1072999; 2055170; 2056213;    4691;    3649
EUR STYLE NATURAL GAS OPTIONS - NEW YORK MERCANTILE EXCHANGE ;2008.11.18; 2269841;  117495;   71039; 1030331; 1116979; 1164425; 2264805; 2265795;    5036;    4046
EUR STYLE NATURAL GAS OPTIONS - NEW YORK MERCANTILE EXCHANGE ;2008.11.11; 2195271;  109176;   60181; 1000349; 1080778; 1130598; 2190302; 2191128;    4969;    4143
EUR STYLE NATURAL GAS OPTIONS - NEW YORK MERCANTILE EXCHANGE ;2008.11.04; 2137449;  111479;   30312;  985646; 1035664; 1117447; 2132788; 2133404;    4660;    4044
EUR STYLE NATURAL GAS OPTIONS - NEW YORK MERCANTILE EXCHANGE ;2008.10.28; 2142535;  107593;   69820;  961150; 1068833; 1107478; 2137576; 2138447;    4959;    4087
EUR STYLE NATURAL GAS OPTIONS - NEW YORK MERCANTILE EXCHANGE ;2008.10.21; 2217870;  126656;   65011; 1005790; 1080598; 1143365; 2213044; 2214167;    4826;    3703
EUR STYLE NATURAL GAS OPTIONS - NEW YORK MERCANTILE EXCHANGE ;2008.10.14; 2162098;  120812;   65898;  988871; 1047597; 1103388; 2157281; 2158157;    4817;    3941
EUR STYLE NATURAL GAS OPTIONS - NEW YORK MERCANTILE EXCHANGE ;2008.10.07; 2102541;  130074;   57155;  961381; 1006668; 1080127; 2098123; 2098663;    4418;    3878
EUR STYLE NATURAL GAS OPTIONS - NEW YORK MERCANTILE EXCHANGE ;2008.09.30; 1994812;  143105;   35084;  914014;  932223; 1041378; 1989342; 1990476;    5470;    4336
EUR STYLE NATURAL GAS OPTIONS - NEW YORK MERCANTILE EXCHANGE ;2008.09.23; 2267280;  188369;   28010; 1083351;  989309; 1151198; 2261028; 2262559;    6251;    4721
EUR STYLE NATURAL GAS OPTIONS - NEW YORK MERCANTILE EXCHANGE ;2008.09.16; 2301279;  158250;   25513; 1103750; 1022681; 1157648; 2284682; 2286912;   16598;   14368
EUR STYLE NATURAL GAS OPTIONS - NEW YORK MERCANTILE EXCHANGE ;2008.09.09; 2201789;  181895;   21284; 1039347;  974178; 1137030; 2195419; 2197661;    6370;    4128
EUR STYLE NATURAL GAS OPTIONS - NEW YORK MERCANTILE EXCHANGE ;2008.09.02; 2148238;  172929;   20005; 1005997;  962952; 1117753; 2141878; 2143755;    6360;    4482
EUR STYLE NATURAL GAS OPTIONS - NEW YORK MERCANTILE EXCHANGE ;2008.08.26; 2061615;  206620;   17883;  933820;  914761; 1105402; 2055202; 2057106;    6413;    4509
EUR STYLE NATURAL GAS OPTIONS - NEW YORK MERCANTILE EXCHANGE ;2008.08.19; 2200536;  174550;   14114; 1030799;  989799; 1152144; 2195148; 2197058;    5388;    3478
EUR STYLE NATURAL GAS OPTIONS - NEW YORK MERCANTILE EXCHANGE ;2008.08.12; 2124291;  181337;   10364;  984053;  954144; 1126749; 2119534; 2121166;    4757;    3125
EUR STYLE NATURAL GAS OPTIONS - NEW YORK MERCANTILE EXCHANGE ;2008.08.05; 2080169;  207112;   10656;  944727;  922858; 1121484; 2074697; 2076867;    5472;    3302
EUR STYLE NATURAL GAS OPTIONS - NEW YORK MERCANTILE EXCHANGE ;2008.07.29; 2026221;  207686;   11502;  914639;  898284; 1096711; 2020609; 2022852;    5612;    3369
EUR STYLE NATURAL GAS OPTIONS - NEW YORK MERCANTILE EXCHANGE ;2008.07.22; 2179622;  267112;   15561;  977267;  930089; 1184012; 2174468; 2176841;    5154;    2781
EUR STYLE NATURAL GAS OPTIONS - NEW YORK MERCANTILE EXCHANGE ;2008.07.15; 2123662;  313859;   19165;  872743;  931563; 1228899; 2118165; 2120807;    5497;    2854
EUR STYLE NATURAL GAS OPTIONS - NEW YORK MERCANTILE EXCHANGE ;2008.07.08; 2112989;  316132;   22554;  859556;  930754; 1226617; 2106443; 2108727;    6546;    4261
EUR STYLE NATURAL GAS OPTIONS - NEW YORK MERCANTILE EXCHANGE ;2008.07.01; 2147010;  327057;   26149;  870462;  943933; 1246722; 2141452; 2143333;    5558;    3677
EUR STYLE NATURAL GAS OPTIONS - NEW YORK MERCANTILE EXCHANGE ;2008.06.24; 2232363;  344095;   33433;  899836;  982049; 1294263; 2225981; 2227532;    6382;    4832
EUR STYLE NATURAL GAS OPTIONS - NEW YORK MERCANTILE EXCHANGE ;2008.06.17; 2188284;  326392;   33484;  887561;  968045; 1261928; 2181998; 2182973;    6286;    5311
EUR STYLE NATURAL GAS OPTIONS - NEW YORK MERCANTILE EXCHANGE ;2008.06.10; 2109293;  304871;   32634;  856119;  942766; 1215475; 2103756; 2104228;    5537;    5065
EUR STYLE NATURAL GAS OPTIONS - NEW YORK MERCANTILE EXCHANGE ;2008.06.03; 2069582;  304243;   26485;  843609;  917110; 1194893; 2064962; 2064987;    4619;    4595
EUR STYLE NATURAL GAS OPTIONS - NEW YORK MERCANTILE EXCHANGE ;2008.05.27; 1998963;  305710;   24555;  807989;  880260; 1160830; 1993959; 1993374;    5004;    5589
EUR STYLE NATURAL GAS OPTIONS - NEW YORK MERCANTILE EXCHANGE ;2008.05.20; 2094957;  335812;   24712;  844389;  909525; 1220026; 2089726; 2089127;    5231;    5829
EUR STYLE NATURAL GAS OPTIONS - NEW YORK MERCANTILE EXCHANGE ;2008.05.13; 2041402;  311529;   26497;  831685;  892697; 1176957; 2035911; 2035140;    5490;    6262
EUR STYLE NATURAL GAS OPTIONS - NEW YORK MERCANTILE EXCHANGE ;2008.05.06; 1999396;  289715;   25785;  824567;  878841; 1142358; 1993123; 1992709;    6273;    6687
EUR STYLE NATURAL GAS OPTIONS - NEW YORK MERCANTILE EXCHANGE ;2008.04.29; 1950059;  266222;   23947;  815076;  860041; 1102675; 1941339; 1941699;    8720;    8361
EUR STYLE NATURAL GAS OPTIONS - NEW YORK MERCANTILE EXCHANGE ;2011.07.12; 1645851;   91293;   85024;  508522; 1039718; 1047964; 1639533; 1641509;    6317;    4341
EUR STYLE NATURAL GAS OPTIONS - NEW YORK MERCANTILE EXCHANGE ;2011.07.05; 1589060;   81884;   75151;  486261; 1014537; 1023363; 1582682; 1584775;    6378;    4285
EUR STYLE NATURAL GAS OPTIONS - NEW YORK MERCANTILE EXCHANGE ;2011.06.28; 1588458;   80865;   72234;  487289; 1014762; 1025145; 1582916; 1584669;    5542;    3789
EUR STYLE NATURAL GAS OPTIONS - NEW YORK MERCANTILE EXCHANGE ;2011.06.21; 1689378;   90351;   89362;  532211; 1059767; 1062869; 1682329; 1684442;    7049;    4936
EUR STYLE NATURAL GAS OPTIONS - NEW YORK MERCANTILE EXCHANGE ;2011.06.14; 1661842;   92180;   87961;  519568; 1043252; 1049488; 1655000; 1657017;    6842;    4826
EUR STYLE NATURAL GAS OPTIONS - NEW YORK MERCANTILE EXCHANGE ;2011.06.07; 1675722;   89532;   81865;  530604; 1048005; 1058368; 1668141; 1670837;    7581;    4885
EUR STYLE NATURAL GAS OPTIONS - NEW YORK MERCANTILE EXCHANGE ;2011.05.31; 1649681;   82982;   82017;  513014; 1046501; 1049585; 1642497; 1644616;    7184;    5065
EUR STYLE NATURAL GAS OPTIONS - NEW YORK MERCANTILE EXCHANGE ;2011.05.24; 1722082;   99654;  107414;  530169; 1084787; 1078414; 1714610; 1715997;    7472;    6084
EUR STYLE NATURAL GAS OPTIONS - NEW YORK MERCANTILE EXCHANGE ;2011.05.17; 1699619;  101926;  105873;  521912; 1068703; 1065602; 1692542; 1693387;    7077;    6232
EUR STYLE NATURAL GAS OPTIONS - NEW YORK MERCANTILE EXCHANGE ;2011.05.10; 1695038;  101654;  102954;  522847; 1063478; 1063054; 1687979; 1688855;    7059;    6184
EUR STYLE NATURAL GAS OPTIONS - NEW YORK MERCANTILE EXCHANGE ;2011.05.03; 1687305;   93796;   93139;  523993; 1061584; 1064256; 1679373; 1681389;    7932;    5917
EUR STYLE NATURAL GAS OPTIONS - NEW YORK MERCANTILE EXCHANGE ;2011.04.26; 1638628;   80252;   87434;  508651; 1042098; 1036929; 1631001; 1633014;    7627;    5614
EUR STYLE NATURAL GAS OPTIONS - NEW YORK MERCANTILE EXCHANGE ;2011.04.19; 1726917;   80756;   93745;  549666; 1089031; 1077357; 1719453; 1720768;    7464;    6149
EUR STYLE NATURAL GAS OPTIONS - NEW YORK MERCANTILE EXCHANGE ;2011.04.12; 1712078;   78728;   86356;  549411; 1076515; 1070299; 1704655; 1706066;    7423;    6011
EUR STYLE NATURAL GAS OPTIONS - NEW YORK MERCANTILE EXCHANGE ;2011.04.05; 1682910;   73136;   87257;  535337; 1064920; 1054000; 1673392; 1676594;    9518;    6316
EUR STYLE NATURAL GAS OPTIONS - NEW YORK MERCANTILE EXCHANGE ;2011.03.29; 1635746;   67787;   82305;  518169; 1041355; 1028971; 1627310; 1629445;    8436;    6301
EUR STYLE NATURAL GAS OPTIONS - NEW YORK MERCANTILE EXCHANGE ;2011.03.22; 1771395;   71121;   95786;  590175; 1101766; 1078691; 1763062; 1764652;    8333;    6743
EUR STYLE NATURAL GAS OPTIONS - NEW YORK MERCANTILE EXCHANGE ;2011.03.15; 1757335;   75862;   92828;  578117; 1094545; 1078673; 1748523; 1749618;    8812;    7717
EUR STYLE NATURAL GAS OPTIONS - NEW YORK MERCANTILE EXCHANGE ;2011.03.08; 1742197;   71147;   88241;  577301; 1085567; 1069169; 1734015; 1734711;    8181;    7486
EUR STYLE NATURAL GAS OPTIONS - NEW YORK MERCANTILE EXCHANGE ;2011.03.01; 1674735;   67154;   86525;  549563; 1050784; 1031299; 1667500; 1667387;    7234;    7348
EUR STYLE NATURAL GAS OPTIONS - NEW YORK MERCANTILE EXCHANGE ;2011.02.22; 1817671;   89397;  111174;  615835; 1105840; 1082700; 1811073; 1809709;    6598;    7962
EUR STYLE NATURAL GAS OPTIONS - NEW YORK MERCANTILE EXCHANGE ;2011.02.15; 1778432;   84467;  108986;  599232; 1088120; 1062497; 1771818; 1770715;    6614;    7717
EUR STYLE NATURAL GAS OPTIONS - NEW YORK MERCANTILE EXCHANGE ;2011.02.08; 1728979;   80965;  108675;  576809; 1064738; 1036284; 1722511; 1721767;    6468;    7212
EUR STYLE NATURAL GAS OPTIONS - NEW YORK MERCANTILE EXCHANGE ;2011.02.01; 1665411;   73265;  102091;  556256; 1029487; 1000363; 1659008; 1658710;    6403;    6701
EUR STYLE NATURAL GAS OPTIONS - NEW YORK MERCANTILE EXCHANGE ;2011.01.25; 1722084;   77503;  103506;  596596; 1040730; 1015344; 1714830; 1715447;    7255;    6637
EUR STYLE NATURAL GAS OPTIONS - NEW YORK MERCANTILE EXCHANGE ;2011.01.18; 1665692;   79430;  104247;  566859; 1012632;  988085; 1658921; 1659191;    6771;    6501
EUR STYLE NATURAL GAS OPTIONS - NEW YORK MERCANTILE EXCHANGE ;2011.01.11; 1663979;   80892;  104557;  561149; 1015931;  992026; 1657971; 1657732;    6008;    6247
EUR STYLE NATURAL GAS OPTIONS - NEW YORK MERCANTILE EXCHANGE ;2011.01.04; 1649254;   82392;  102148;  562485;  997398;  978148; 1642275; 1642781;    6979;    6473
EUR STYLE NATURAL GAS OPTIONS - NEW YORK MERCANTILE EXCHANGE ;2011.07.12; 1645851;   91293;   85024;  508522; 1039718; 1047964; 1639533; 1641509;    6317;    4341
EUR STYLE NATURAL GAS OPTIONS - NEW YORK MERCANTILE EXCHANGE ;2010.12.28; 1610418;   77170;   97796;  541604;  985213;  965626; 1603988; 1605026;    6430;    5392
EUR STYLE NATURAL GAS OPTIONS - NEW YORK MERCANTILE EXCHANGE ;2010.12.21; 1796677;   94773;  129646;  621992; 1073502; 1039018; 1790267; 1790656;    6410;    6021
EUR STYLE NATURAL GAS OPTIONS - NEW YORK MERCANTILE EXCHANGE ;2010.12.14; 1750328;   95636;  132384;  594202; 1052659; 1016777; 1742497; 1743362;    7831;    6966
EUR STYLE NATURAL GAS OPTIONS - NEW YORK MERCANTILE EXCHANGE ;2010.12.07; 1716743;   89858;  128252;  578903; 1040496; 1002375; 1709257; 1709530;    7487;    7213
EUR STYLE NATURAL GAS OPTIONS - NEW YORK MERCANTILE EXCHANGE ;2010.11.30; 1705943;   82709;  122495;  571877; 1044368; 1004450; 1698954; 1698823;    6988;    7120
EUR STYLE NATURAL GAS OPTIONS - NEW YORK MERCANTILE EXCHANGE ;2010.11.23; 1656875;   76823;  107513;  553254; 1019643;  989138; 1649720; 1649905;    7155;    6970
EUR STYLE NATURAL GAS OPTIONS - NEW YORK MERCANTILE EXCHANGE ;2010.11.16; 1779092;   82921;  124262;  600414; 1089293; 1048040; 1772627; 1772715;    6465;    6377
EUR STYLE NATURAL GAS OPTIONS - NEW YORK MERCANTILE EXCHANGE ;2010.11.09; 1725906;   75448;  113945;  580803; 1063494; 1025770; 1719745; 1720518;    6160;    5388
EUR STYLE NATURAL GAS OPTIONS - NEW YORK MERCANTILE EXCHANGE ;2010.11.02; 1700307;   68347;  101075;  568727; 1057141; 1024826; 1694216; 1694629;    6091;    5678
EUR STYLE NATURAL GAS OPTIONS - NEW YORK MERCANTILE EXCHANGE ;2010.10.26; 1687362;   70107;   95440;  562006; 1047693; 1024174; 1679806; 1681620;    7556;    5742
EUR STYLE NATURAL GAS OPTIONS - NEW YORK MERCANTILE EXCHANGE ;2010.10.19; 1769698;   78830;  102013;  598691; 1085387; 1062977; 1762908; 1763682;    6790;    6017
EUR STYLE NATURAL GAS OPTIONS - NEW YORK MERCANTILE EXCHANGE ;2010.10.12; 1716232;   76692;   98540;  571026; 1061524; 1040463; 1709241; 1710029;    6991;    6204
EUR STYLE NATURAL GAS OPTIONS - NEW YORK MERCANTILE EXCHANGE ;2010.10.05; 1676395;   71340;   99845;  551535; 1046704; 1019163; 1669579; 1670543;    6816;    5853
EUR STYLE NATURAL GAS OPTIONS - NEW YORK MERCANTILE EXCHANGE ;2010.09.28; 1612792;   64229;   98745;  520745; 1021063;  986918; 1606037; 1606407;    6755;    6384
EUR STYLE NATURAL GAS OPTIONS - NEW YORK MERCANTILE EXCHANGE ;2010.09.21; 1806130;   94217;  107787;  598122; 1107305; 1093700; 1799644; 1799609;    6486;    6521
EUR STYLE NATURAL GAS OPTIONS - NEW YORK MERCANTILE EXCHANGE ;2010.09.14; 1767863;   88651;  100491;  581089; 1092114; 1080202; 1761853; 1761781;    6010;    6082
EUR STYLE NATURAL GAS OPTIONS - NEW YORK MERCANTILE EXCHANGE ;2010.09.07; 1747806;   86513;   97634;  568129; 1083028; 1071350; 1737671; 1737113;   10135;   10692
EUR STYLE NATURAL GAS OPTIONS - NEW YORK MERCANTILE EXCHANGE ;2010.08.31; 1714471;   80007;   91303;  552256; 1076392; 1064339; 1708655; 1707898;    5817;    6573
EUR STYLE NATURAL GAS OPTIONS - NEW YORK MERCANTILE EXCHANGE ;2010.08.24; 1808051;   81419;  102365;  592983; 1128080; 1105044; 1802482; 1800392;    5569;    7659
EUR STYLE NATURAL GAS OPTIONS - NEW YORK MERCANTILE EXCHANGE ;2010.08.17; 1728352;   75816;   99261;  552689; 1095059; 1069749; 1723564; 1721699;    4789;    6653
EUR STYLE NATURAL GAS OPTIONS - NEW YORK MERCANTILE EXCHANGE ;2010.08.10; 1694005;   77884;   98762;  534998; 1076087; 1053420; 1688970; 1687181;    5036;    6825
EUR STYLE NATURAL GAS OPTIONS - NEW YORK MERCANTILE EXCHANGE ;2010.08.03; 1641749;   69254;   96453;  515430; 1051513; 1023150; 1636197; 1635033;    5553;    6716
EUR STYLE NATURAL GAS OPTIONS - NEW YORK MERCANTILE EXCHANGE ;2010.07.27; 1614813;   67442;   96026;  504851; 1037406; 1007091; 1609699; 1607968;    5114;    6845
EUR STYLE NATURAL GAS OPTIONS - NEW YORK MERCANTILE EXCHANGE ;2010.07.20; 1723971;   72340;  105346;  550116; 1096151; 1060932; 1718606; 1716393;    5365;    7577
EUR STYLE NATURAL GAS OPTIONS - NEW YORK MERCANTILE EXCHANGE ;2010.07.13; 1705620;   75438;  100989;  543020; 1082514; 1054675; 1700973; 1698685;    4648;    6935
EUR STYLE NATURAL GAS OPTIONS - NEW YORK MERCANTILE EXCHANGE ;2010.07.06; 1698957;   67822;   98250;  547232; 1078255; 1045453; 1693309; 1690935;    5648;    8022
EUR STYLE NATURAL GAS OPTIONS - NEW YORK MERCANTILE EXCHANGE ;2010.06.29; 1683052;   68445;   96108;  540889; 1067638; 1037681; 1676972; 1674678;    6080;    8374
EUR STYLE NATURAL GAS OPTIONS - NEW YORK MERCANTILE EXCHANGE ;2010.06.22; 1798134;   77873;  109030;  594593; 1119404; 1085461; 1791870; 1789083;    6264;    9051
EUR STYLE NATURAL GAS OPTIONS - NEW YORK MERCANTILE EXCHANGE ;2010.06.15; 1767217;   74860;  110020;  587018; 1101364; 1063901; 1763242; 1760939;    3974;    6277
EUR STYLE NATURAL GAS OPTIONS - NEW YORK MERCANTILE EXCHANGE ;2010.06.08; 1700177;   72894;   98167;  577252; 1043676; 1015864; 1693822; 1691282;    6355;    8895
EUR STYLE NATURAL GAS OPTIONS - NEW YORK MERCANTILE EXCHANGE ;2010.06.01; 1625989;   74018;   94357;  538140; 1007806;  984674; 1619964; 1617171;    6024;    8818
EUR STYLE NATURAL GAS OPTIONS - NEW YORK MERCANTILE EXCHANGE ;2010.05.25; 1600569;   81147;   92181;  523890;  989205;  975822; 1594243; 1591893;    6326;    8677
EUR STYLE NATURAL GAS OPTIONS - NEW YORK MERCANTILE EXCHANGE ;2010.05.18; 1695987;   84244;  106913;  559999; 1044973; 1019587; 1689217; 1686499;    6770;    9487
EUR STYLE NATURAL GAS OPTIONS - NEW YORK MERCANTILE EXCHANGE ;2010.05.11; 1690501;   88003;   99072;  557690; 1037857; 1024606; 1683550; 1681368;    6951;    9132
EUR STYLE NATURAL GAS OPTIONS - NEW YORK MERCANTILE EXCHANGE ;2010.05.04; 1646022;   82306;  102974;  534011; 1022756;  999792; 1639073; 1636778;    6949;    9244
EUR STYLE NATURAL GAS OPTIONS - NEW YORK MERCANTILE EXCHANGE ;2010.04.27; 1592819;   76308;  103850;  517852;  991479;  962095; 1585639; 1583796;    7181;    9023
EUR STYLE NATURAL GAS OPTIONS - NEW YORK MERCANTILE EXCHANGE ;2010.04.20; 1737035;   89804;  114117;  586158; 1053907; 1027610; 1729869; 1727884;    7166;    9151
EUR STYLE NATURAL GAS OPTIONS - NEW YORK MERCANTILE EXCHANGE ;2010.04.13; 1703069;   85254;  116001;  574296; 1036499; 1004029; 1696050; 1694326;    7020;    8743
EUR STYLE NATURAL GAS OPTIONS - NEW YORK MERCANTILE EXCHANGE ;2010.04.06; 1661924;   82277;  109516;  555110; 1017031;  988108; 1654418; 1652735;    7506;    9189
EUR STYLE NATURAL GAS OPTIONS - NEW YORK MERCANTILE EXCHANGE ;2010.03.30; 1626073;   82931;  108343;  534881; 1000589;  973487; 1618402; 1616712;    7671;    9362
EUR STYLE NATURAL GAS OPTIONS - NEW YORK MERCANTILE EXCHANGE ;2010.03.23; 1769575;   99264;  106057;  624841; 1038373; 1029398; 1762478; 1760296;    7098;    9280
EUR STYLE NATURAL GAS OPTIONS - NEW YORK MERCANTILE EXCHANGE ;2010.03.16; 1675179;   93917;  105552;  567681; 1006627;  993306; 1668225; 1666539;    6955;    8640
EUR STYLE NATURAL GAS OPTIONS - NEW YORK MERCANTILE EXCHANGE ;2010.03.09; 1615465;   83961;  109597;  534896;  989960;  962674; 1608817; 1607167;    6648;    8298
EUR STYLE NATURAL GAS OPTIONS - NEW YORK MERCANTILE EXCHANGE ;2010.03.02; 1558332;   75830;  104417;  509259;  966932;  936992; 1552022; 1550669;    6310;    7663
EUR STYLE NATURAL GAS OPTIONS - NEW YORK MERCANTILE EXCHANGE ;2010.02.23; 1524892;   71919;   99855;  488770;  957828;  928421; 1518517; 1517047;    6374;    7845
EUR STYLE NATURAL GAS OPTIONS - NEW YORK MERCANTILE EXCHANGE ;2010.02.16; 1586949;   64389;  108654;  515604; 1001990;  956418; 1581983; 1580676;    4966;    6273
EUR STYLE NATURAL GAS OPTIONS - NEW YORK MERCANTILE EXCHANGE ;2010.02.09; 1585865;   62755;  107599;  514029; 1003880;  957145; 1580664; 1578773;    5202;    7093
EUR STYLE NATURAL GAS OPTIONS - NEW YORK MERCANTILE EXCHANGE ;2010.02.02; 1559532;   59509;  101005;  505119;  989451;  947811; 1554079; 1553934;    5453;    5598
EUR STYLE NATURAL GAS OPTIONS - NEW YORK MERCANTILE EXCHANGE ;2010.01.26; 1530017;   56426;   98603;  489362;  977700;  935312; 1523488; 1523277;    6529;    6739
EUR STYLE NATURAL GAS OPTIONS - NEW YORK MERCANTILE EXCHANGE ;2010.01.19; 1609592;   62295;  105242;  521588; 1020366;  977090; 1604249; 1603919;    5343;    5673
EUR STYLE NATURAL GAS OPTIONS - NEW YORK MERCANTILE EXCHANGE ;2010.01.12; 1622017;   56628;  106673;  527061; 1033385;  982869; 1617074; 1616604;    4943;    5414
EUR STYLE NATURAL GAS OPTIONS - NEW YORK MERCANTILE EXCHANGE ;2010.01.05; 1578696;   53549;  102302;  511768; 1009524;  960301; 1574841; 1574372;    3855;    4324
EUR STYLE NATURAL GAS OPTIONS - NEW YORK MERCANTILE EXCHANGE ;2009.12.29; 1556341;   52618;   96816;  500465;  997967;  953376; 1551050; 1550657;    5291;    5684
EUR STYLE NATURAL GAS OPTIONS - NEW YORK MERCANTILE EXCHANGE ;2009.12.22; 1683653;   53584;  106512;  553144; 1071812; 1018279; 1678540; 1677934;    5113;    5719
EUR STYLE NATURAL GAS OPTIONS - NEW YORK MERCANTILE EXCHANGE ;2009.12.15; 1660522;   49364;   98512;  542319; 1064441; 1014634; 1656124; 1655466;    4399;    5057
EUR STYLE NATURAL GAS OPTIONS - NEW YORK MERCANTILE EXCHANGE ;2009.12.08; 1613547;   51519;  105631;  509853; 1047293;  992546; 1608665; 1608030;    4882;    5517
EUR STYLE NATURAL GAS OPTIONS - NEW YORK MERCANTILE EXCHANGE ;2009.12.01; 1559614;   49500;  113914;  474953; 1030337;  965089; 1554790; 1553956;    4824;    5658
EUR STYLE NATURAL GAS OPTIONS - NEW YORK MERCANTILE EXCHANGE ;2009.11.24; 1532122;   47443;  118848;  463271; 1016210;  944389; 1526924; 1526509;    5198;    5613
EUR STYLE NATURAL GAS OPTIONS - NEW YORK MERCANTILE EXCHANGE ;2009.11.17; 1655638;   49002;  128830;  521190; 1079848;  999907; 1650039; 1649927;    5598;    5710
EUR STYLE NATURAL GAS OPTIONS - NEW YORK MERCANTILE EXCHANGE ;2009.11.09; 1606198;   47269;  123167;  501186; 1052688;  976521; 1601143; 1600874;    5055;    5324
EUR STYLE NATURAL GAS OPTIONS - NEW YORK MERCANTILE EXCHANGE ;2009.11.03; 1566599;   42297;  120469;  487121; 1032226;  953666; 1561645; 1561256;    4954;    5343
EUR STYLE NATURAL GAS OPTIONS - NEW YORK MERCANTILE EXCHANGE ;2009.10.27; 1540678;   41594;  110880;  478610; 1014203;  944595; 1534408; 1534086;    6270;    6593
EUR STYLE NATURAL GAS OPTIONS - NEW YORK MERCANTILE EXCHANGE ;2009.10.20; 1664835;   48511;  119265;  527690; 1076905; 1014034; 1653106; 1660989;   11729;    3846
EUR STYLE NATURAL GAS OPTIONS - NEW YORK MERCANTILE EXCHANGE ;2009.10.13; 1644200;   53649;  119662;  517099; 1069644; 1003975; 1640392; 1640736;    3808;    3464
EUR STYLE NATURAL GAS OPTIONS - NEW YORK MERCANTILE EXCHANGE ;2009.10.06; 1641036;   53684;  116624;  514075; 1068419; 1005720; 1636178; 1636419;    4858;    4617
EUR STYLE NATURAL GAS OPTIONS - NEW YORK MERCANTILE EXCHANGE ;2009.09.29; 1605962;   51223;  110450;  499208; 1052097;  993269; 1602529; 1602928;    3433;    3034
EUR STYLE NATURAL GAS OPTIONS - NEW YORK MERCANTILE EXCHANGE ;2009.09.22; 1889368;   57902;  141206;  623156; 1205999; 1123102; 1887057; 1887463;    2311;    1905
EUR STYLE NATURAL GAS OPTIONS - NEW YORK MERCANTILE EXCHANGE ;2009.09.15; 1893949;   57822;  128740;  625190; 1208557; 1137812; 1891570; 1891742;    2379;    2207
EUR STYLE NATURAL GAS OPTIONS - NEW YORK MERCANTILE EXCHANGE ;2009.09.08; 1874096;   60839;  139377;  607913; 1202753; 1123836; 1871505; 1871125;    2592;    2971
EUR STYLE NATURAL GAS OPTIONS - NEW YORK MERCANTILE EXCHANGE ;2009.09.01; 1826013;   55143;  130773;  589888; 1176890; 1101485; 1821922; 1822146;    4091;    3867
EUR STYLE NATURAL GAS OPTIONS - NEW YORK MERCANTILE EXCHANGE ;2009.08.25; 2008095;   58772;  148950;  679588; 1265875; 1175715; 2004234; 2004253;    3861;    3842
EUR STYLE NATURAL GAS OPTIONS - NEW YORK MERCANTILE EXCHANGE ;2009.08.18; 1953915;   49173;  145395;  659696; 1240201; 1144343; 1949070; 1949435;    4845;    4481
EUR STYLE NATURAL GAS OPTIONS - NEW YORK MERCANTILE EXCHANGE ;2009.08.11; 1893771;   36552;  134777;  638930; 1213801; 1116498; 1889283; 1890204;    4488;    3567
EUR STYLE NATURAL GAS OPTIONS - NEW YORK MERCANTILE EXCHANGE ;2009.08.04; 1863218;   33501;  122478;  629554; 1195831; 1107926; 1858887; 1859958;    4332;    3260
EUR STYLE NATURAL GAS OPTIONS - NEW YORK MERCANTILE EXCHANGE ;2009.07.28; 1853351;   33475;  136024;  618166; 1197097; 1095542; 1848738; 1849732;    4613;    3619
EUR STYLE NATURAL GAS OPTIONS - NEW YORK MERCANTILE EXCHANGE ;2009.07.21; 2003743;   30518;  148259;  682746; 1285851; 1169691; 1999115; 2000696;    4629;    3048
EUR STYLE NATURAL GAS OPTIONS - NEW YORK MERCANTILE EXCHANGE ;2009.07.14; 2005408;   32664;  155513;  682497; 1285670; 1164194; 2000831; 2002205;    4577;    3204
EUR STYLE NATURAL GAS OPTIONS - NEW YORK MERCANTILE EXCHANGE ;2009.07.07; 1880740;   32693;  140634;  639720; 1203690; 1096319; 1876103; 1876674;    4636;    4066
EUR STYLE NATURAL GAS OPTIONS - NEW YORK MERCANTILE EXCHANGE ;2009.06.30; 1826259;   28391;  126697;  618887; 1174834; 1077390; 1822112; 1822974;    4147;    3285
EUR STYLE NATURAL GAS OPTIONS - NEW YORK MERCANTILE EXCHANGE ;2009.06.23; 1997277;   20227;  148970;  706749; 1265855; 1137588; 1992831; 1993308;    4445;    3968
EUR STYLE NATURAL GAS OPTIONS - NEW YORK MERCANTILE EXCHANGE ;2009.06.16; 2015830;   21925;  130009;  719799; 1268309; 1160255; 2010033; 2010063;    5797;    5767
EUR STYLE NATURAL GAS OPTIONS - NEW YORK MERCANTILE EXCHANGE ;2009.06.09; 1988389;   25354;  135293;  699669; 1249372; 1136293; 1974394; 1971255;   13995;   17135
EUR STYLE NATURAL GAS OPTIONS - NEW YORK MERCANTILE EXCHANGE ;2009.06.02; 1945039;   22039;  136084;  678512; 1240033; 1126046; 1940584; 1940643;    4455;    4396
EUR STYLE NATURAL GAS OPTIONS - NEW YORK MERCANTILE EXCHANGE ;2009.05.26; 1934929;   24178;  148100;  665319; 1239522; 1114008; 1929020; 1927427;    5909;    7502
EUR STYLE NATURAL GAS OPTIONS - NEW YORK MERCANTILE EXCHANGE ;2009.05.19; 2130124;   27777;  153821;  738562; 1358566; 1232736; 2124906; 2125118;    5218;    5005
EUR STYLE NATURAL GAS OPTIONS - NEW YORK MERCANTILE EXCHANGE ;2009.05.12; 2113473;   19179;  126175;  746121; 1343542; 1236864; 2108843; 2109160;    4630;    4313
EUR STYLE NATURAL GAS OPTIONS - NEW YORK MERCANTILE EXCHANGE ;2009.05.05; 2080089;   25952;  157234;  715814; 1333140; 1203007; 2074905; 2076056;    5184;    4033
EUR STYLE NATURAL GAS OPTIONS - NEW YORK MERCANTILE EXCHANGE ;2009.04.28; 2077565;   23717;  160712;  715510; 1334849; 1197635; 2074076; 2073857;    3490;    3709
EUR STYLE NATURAL GAS OPTIONS - NEW YORK MERCANTILE EXCHANGE ;2009.04.21; 2216191;   28828;  164304;  774580; 1406409; 1271435; 2209817; 2210320;    6374;    5872
EUR STYLE NATURAL GAS OPTIONS - NEW YORK MERCANTILE EXCHANGE ;2009.04.14; 2176426;   27963;  155081;  760900; 1381827; 1255053; 2170689; 2171034;    5737;    5392
EUR STYLE NATURAL GAS OPTIONS - NEW YORK MERCANTILE EXCHANGE ;2009.04.07; 2173882;   28197;  162446;  757583; 1382072; 1248046; 2167853; 2168075;    6029;    5807
EUR STYLE NATURAL GAS OPTIONS - NEW YORK MERCANTILE EXCHANGE ;2009.03.31; 2118050;   22588;  151744;  737739; 1352072; 1223079; 2112398; 2112561;    5652;    5489
EUR STYLE NATURAL GAS OPTIONS - NEW YORK MERCANTILE EXCHANGE ;2009.03.24; 2329477;   35292;  139501;  891583; 1397894; 1293732; 2324770; 2324816;    4708;    4661
EUR STYLE NATURAL GAS OPTIONS - NEW YORK MERCANTILE EXCHANGE ;2009.03.17; 2323668;   40628;  170790;  876016; 1400582; 1270803; 2317226; 2317609;    6442;    6058
EUR STYLE NATURAL GAS OPTIONS - NEW YORK MERCANTILE EXCHANGE ;2009.03.10; 2278912;   76771;  163676;  925543; 1270424; 1184363; 2272738; 2273582;    6174;    5331
EUR STYLE NATURAL GAS OPTIONS - NEW YORK MERCANTILE EXCHANGE ;2009.03.03; 2159235;   78608;  155390;  883069; 1189517; 1116705; 2151194; 2155164;    8041;    4071
EUR STYLE NATURAL GAS OPTIONS - NEW YORK MERCANTILE EXCHANGE ;2009.02.24; 2118731;   80425;  152087;  870427; 1162494; 1092566; 2113347; 2115080;    5385;    3651
EUR STYLE NATURAL GAS OPTIONS - NEW YORK MERCANTILE EXCHANGE ;2009.02.17; 2349217;   92357;  153926;  999715; 1249697; 1189304; 2341768; 2342944;    7449;    6273
EUR STYLE NATURAL GAS OPTIONS - NEW YORK MERCANTILE EXCHANGE ;2009.02.10; 2255246;   91475;  138038;  961771; 1195962; 1150166; 2249207; 2249974;    6039;    5272
EUR STYLE NATURAL GAS OPTIONS - NEW YORK MERCANTILE EXCHANGE ;2009.02.03; 2239855;   91983;  125088;  959465; 1182819; 1150555; 2234267; 2235108;    5588;    4747
EUR STYLE NATURAL GAS OPTIONS - NEW YORK MERCANTILE EXCHANGE ;2009.01.27; 2202803;   92447;  119995;  934993; 1170173; 1143284; 2197613; 2198272;    5190;    4531
EUR STYLE NATURAL GAS OPTIONS - NEW YORK MERCANTILE EXCHANGE ;2009.01.20; 2300894;   84253;  121463;  979113; 1231831; 1195685; 2295197; 2296260;    5697;    4634
EUR STYLE NATURAL GAS OPTIONS - NEW YORK MERCANTILE EXCHANGE ;2009.01.13; 2177599;   82590;  104577;  927315; 1162311; 1141119; 2172216; 2173012;    5383;    4588
EUR STYLE NATURAL GAS OPTIONS - NEW YORK MERCANTILE EXCHANGE ;2009.01.06; 2056969;   82131;   84611;  883813; 1085981; 1084071; 2051925; 2052495;    5044;    4473
EUR STYLE NATURAL GAS OPTIONS - NEW YORK MERCANTILE EXCHANGE ;2008.12.30; 2032518;   84209;   97384;  867142; 1076109; 1063612; 2027459; 2028138;    5058;    4380
EUR STYLE NATURAL GAS OPTIONS - NEW YORK MERCANTILE EXCHANGE ;2008.12.22; 2358119;   85062;  111880; 1042684; 1224021; 1198762; 2351766; 2353326;    6353;    4793
EUR STYLE NATURAL GAS OPTIONS - NEW YORK MERCANTILE EXCHANGE ;2008.12.16; 2247221;   90518;   90468;  994471; 1157258; 1158252; 2242246; 2243190;    4975;    4031
EUR STYLE NATURAL GAS OPTIONS - NEW YORK MERCANTILE EXCHANGE ;2008.12.09; 2220522;   92702;   91417;  979946; 1142713; 1145487; 2215361; 2216850;    5162;    3672
EUR STYLE NATURAL GAS OPTIONS - NEW YORK MERCANTILE EXCHANGE ;2008.12.02; 2080449;  101132;   73975;  919354; 1055048; 1083318; 2075535; 2076646;    4914;    3802
EUR STYLE NATURAL GAS OPTIONS - NEW YORK MERCANTILE EXCHANGE ;2008.11.25; 2059861;  102605;   74803;  908411; 1044154; 1072999; 2055170; 2056213;    4691;    3649
EUR STYLE NATURAL GAS OPTIONS - NEW YORK MERCANTILE EXCHANGE ;2008.11.18; 2269841;  117495;   71039; 1030331; 1116979; 1164425; 2264805; 2265795;    5036;    4046
EUR STYLE NATURAL GAS OPTIONS - NEW YORK MERCANTILE EXCHANGE ;2008.11.11; 2195271;  109176;   60181; 1000349; 1080778; 1130598; 2190302; 2191128;    4969;    4143
EUR STYLE NATURAL GAS OPTIONS - NEW YORK MERCANTILE EXCHANGE ;2008.11.04; 2137449;  111479;   30312;  985646; 1035664; 1117447; 2132788; 2133404;    4660;    4044
EUR STYLE NATURAL GAS OPTIONS - NEW YORK MERCANTILE EXCHANGE ;2008.10.28; 2142535;  107593;   69820;  961150; 1068833; 1107478; 2137576; 2138447;    4959;    4087
EUR STYLE NATURAL GAS OPTIONS - NEW YORK MERCANTILE EXCHANGE ;2008.10.21; 2217870;  126656;   65011; 1005790; 1080598; 1143365; 2213044; 2214167;    4826;    3703
EUR STYLE NATURAL GAS OPTIONS - NEW YORK MERCANTILE EXCHANGE ;2008.10.14; 2162098;  120812;   65898;  988871; 1047597; 1103388; 2157281; 2158157;    4817;    3941
EUR STYLE NATURAL GAS OPTIONS - NEW YORK MERCANTILE EXCHANGE ;2008.10.07; 2102541;  130074;   57155;  961381; 1006668; 1080127; 2098123; 2098663;    4418;    3878
EUR STYLE NATURAL GAS OPTIONS - NEW YORK MERCANTILE EXCHANGE ;2008.09.30; 1994812;  143105;   35084;  914014;  932223; 1041378; 1989342; 1990476;    5470;    4336
EUR STYLE NATURAL GAS OPTIONS - NEW YORK MERCANTILE EXCHANGE ;2008.09.23; 2267280;  188369;   28010; 1083351;  989309; 1151198; 2261028; 2262559;    6251;    4721
EUR STYLE NATURAL GAS OPTIONS - NEW YORK MERCANTILE EXCHANGE ;2008.09.16; 2301279;  158250;   25513; 1103750; 1022681; 1157648; 2284682; 2286912;   16598;   14368
EUR STYLE NATURAL GAS OPTIONS - NEW YORK MERCANTILE EXCHANGE ;2008.09.09; 2201789;  181895;   21284; 1039347;  974178; 1137030; 2195419; 2197661;    6370;    4128
EUR STYLE NATURAL GAS OPTIONS - NEW YORK MERCANTILE EXCHANGE ;2008.09.02; 2148238;  172929;   20005; 1005997;  962952; 1117753; 2141878; 2143755;    6360;    4482
EUR STYLE NATURAL GAS OPTIONS - NEW YORK MERCANTILE EXCHANGE ;2008.08.26; 2061615;  206620;   17883;  933820;  914761; 1105402; 2055202; 2057106;    6413;    4509
EUR STYLE NATURAL GAS OPTIONS - NEW YORK MERCANTILE EXCHANGE ;2008.08.19; 2200536;  174550;   14114; 1030799;  989799; 1152144; 2195148; 2197058;    5388;    3478
EUR STYLE NATURAL GAS OPTIONS - NEW YORK MERCANTILE EXCHANGE ;2008.08.12; 2124291;  181337;   10364;  984053;  954144; 1126749; 2119534; 2121166;    4757;    3125
EUR STYLE NATURAL GAS OPTIONS - NEW YORK MERCANTILE EXCHANGE ;2008.08.05; 2080169;  207112;   10656;  944727;  922858; 1121484; 2074697; 2076867;    5472;    3302
EUR STYLE NATURAL GAS OPTIONS - NEW YORK MERCANTILE EXCHANGE ;2008.07.29; 2026221;  207686;   11502;  914639;  898284; 1096711; 2020609; 2022852;    5612;    3369
EUR STYLE NATURAL GAS OPTIONS - NEW YORK MERCANTILE EXCHANGE ;2008.07.22; 2179622;  267112;   15561;  977267;  930089; 1184012; 2174468; 2176841;    5154;    2781
EUR STYLE NATURAL GAS OPTIONS - NEW YORK MERCANTILE EXCHANGE ;2008.07.15; 2123662;  313859;   19165;  872743;  931563; 1228899; 2118165; 2120807;    5497;    2854
EUR STYLE NATURAL GAS OPTIONS - NEW YORK MERCANTILE EXCHANGE ;2008.07.08; 2112989;  316132;   22554;  859556;  930754; 1226617; 2106443; 2108727;    6546;    4261
EUR STYLE NATURAL GAS OPTIONS - NEW YORK MERCANTILE EXCHANGE ;2008.07.01; 2147010;  327057;   26149;  870462;  943933; 1246722; 2141452; 2143333;    5558;    3677
EUR STYLE NATURAL GAS OPTIONS - NEW YORK MERCANTILE EXCHANGE ;2008.06.24; 2232363;  344095;   33433;  899836;  982049; 1294263; 2225981; 2227532;    6382;    4832
EUR STYLE NATURAL GAS OPTIONS - NEW YORK MERCANTILE EXCHANGE ;2008.06.17; 2188284;  326392;   33484;  887561;  968045; 1261928; 2181998; 2182973;    6286;    5311
EUR STYLE NATURAL GAS OPTIONS - NEW YORK MERCANTILE EXCHANGE ;2008.06.10; 2109293;  304871;   32634;  856119;  942766; 1215475; 2103756; 2104228;    5537;    5065
EUR STYLE NATURAL GAS OPTIONS - NEW YORK MERCANTILE EXCHANGE ;2008.06.03; 2069582;  304243;   26485;  843609;  917110; 1194893; 2064962; 2064987;    4619;    4595
EUR STYLE NATURAL GAS OPTIONS - NEW YORK MERCANTILE EXCHANGE ;2008.05.27; 1998963;  305710;   24555;  807989;  880260; 1160830; 1993959; 1993374;    5004;    5589
EUR STYLE NATURAL GAS OPTIONS - NEW YORK MERCANTILE EXCHANGE ;2008.05.20; 2094957;  335812;   24712;  844389;  909525; 1220026; 2089726; 2089127;    5231;    5829
EUR STYLE NATURAL GAS OPTIONS - NEW YORK MERCANTILE EXCHANGE ;2008.05.13; 2041402;  311529;   26497;  831685;  892697; 1176957; 2035911; 2035140;    5490;    6262
EUR STYLE NATURAL GAS OPTIONS - NEW YORK MERCANTILE EXCHANGE ;2008.05.06; 1999396;  289715;   25785;  824567;  878841; 1142358; 1993123; 1992709;    6273;    6687
EUR STYLE NATURAL GAS OPTIONS - NEW YORK MERCANTILE EXCHANGE ;2008.04.29; 1950059;  266222;   23947;  815076;  860041; 1102675; 1941339; 1941699;    8720;    8361
EUR STYLE NATURAL GAS OPTIONS - NEW YORK MERCANTILE EXCHANGE ;2011.07.12; 1645851;   91293;   85024;  508522; 1039718; 1047964; 1639533; 1641509;    6317;    4341
EUR STYLE NATURAL GAS OPTIONS - NEW YORK MERCANTILE EXCHANGE ;2011.07.05; 1589060;   81884;   75151;  486261; 1014537; 1023363; 1582682; 1584775;    6378;    4285
EUR STYLE NATURAL GAS OPTIONS - NEW YORK MERCANTILE EXCHANGE ;2011.06.28; 1588458;   80865;   72234;  487289; 1014762; 1025145; 1582916; 1584669;    5542;    3789
EUR STYLE NATURAL GAS OPTIONS - NEW YORK MERCANTILE EXCHANGE ;2011.06.21; 1689378;   90351;   89362;  532211; 1059767; 1062869; 1682329; 1684442;    7049;    4936
EUR STYLE NATURAL GAS OPTIONS - NEW YORK MERCANTILE EXCHANGE ;2011.06.14; 1661842;   92180;   87961;  519568; 1043252; 1049488; 1655000; 1657017;    6842;    4826
EUR STYLE NATURAL GAS OPTIONS - NEW YORK MERCANTILE EXCHANGE ;2011.06.07; 1675722;   89532;   81865;  530604; 1048005; 1058368; 1668141; 1670837;    7581;    4885
EUR STYLE NATURAL GAS OPTIONS - NEW YORK MERCANTILE EXCHANGE ;2011.05.31; 1649681;   82982;   82017;  513014; 1046501; 1049585; 1642497; 1644616;    7184;    5065
EUR STYLE NATURAL GAS OPTIONS - NEW YORK MERCANTILE EXCHANGE ;2011.05.24; 1722082;   99654;  107414;  530169; 1084787; 1078414; 1714610; 1715997;    7472;    6084
EUR STYLE NATURAL GAS OPTIONS - NEW YORK MERCANTILE EXCHANGE ;2011.05.17; 1699619;  101926;  105873;  521912; 1068703; 1065602; 1692542; 1693387;    7077;    6232
EUR STYLE NATURAL GAS OPTIONS - NEW YORK MERCANTILE EXCHANGE ;2011.05.10; 1695038;  101654;  102954;  522847; 1063478; 1063054; 1687979; 1688855;    7059;    6184
EUR STYLE NATURAL GAS OPTIONS - NEW YORK MERCANTILE EXCHANGE ;2011.05.03; 1687305;   93796;   93139;  523993; 1061584; 1064256; 1679373; 1681389;    7932;    5917
EUR STYLE NATURAL GAS OPTIONS - NEW YORK MERCANTILE EXCHANGE ;2011.04.26; 1638628;   80252;   87434;  508651; 1042098; 1036929; 1631001; 1633014;    7627;    5614
EUR STYLE NATURAL GAS OPTIONS - NEW YORK MERCANTILE EXCHANGE ;2011.04.19; 1726917;   80756;   93745;  549666; 1089031; 1077357; 1719453; 1720768;    7464;    6149
EUR STYLE NATURAL GAS OPTIONS - NEW YORK MERCANTILE EXCHANGE ;2011.04.12; 1712078;   78728;   86356;  549411; 1076515; 1070299; 1704655; 1706066;    7423;    6011
EUR STYLE NATURAL GAS OPTIONS - NEW YORK MERCANTILE EXCHANGE ;2011.04.05; 1682910;   73136;   87257;  535337; 1064920; 1054000; 1673392; 1676594;    9518;    6316
EUR STYLE NATURAL GAS OPTIONS - NEW YORK MERCANTILE EXCHANGE ;2011.03.29; 1635746;   67787;   82305;  518169; 1041355; 1028971; 1627310; 1629445;    8436;    6301
EUR STYLE NATURAL GAS OPTIONS - NEW YORK MERCANTILE EXCHANGE ;2011.03.22; 1771395;   71121;   95786;  590175; 1101766; 1078691; 1763062; 1764652;    8333;    6743
EUR STYLE NATURAL GAS OPTIONS - NEW YORK MERCANTILE EXCHANGE ;2011.03.15; 1757335;   75862;   92828;  578117; 1094545; 1078673; 1748523; 1749618;    8812;    7717
EUR STYLE NATURAL GAS OPTIONS - NEW YORK MERCANTILE EXCHANGE ;2011.03.08; 1742197;   71147;   88241;  577301; 1085567; 1069169; 1734015; 1734711;    8181;    7486
EUR STYLE NATURAL GAS OPTIONS - NEW YORK MERCANTILE EXCHANGE ;2011.03.01; 1674735;   67154;   86525;  549563; 1050784; 1031299; 1667500; 1667387;    7234;    7348
EUR STYLE NATURAL GAS OPTIONS - NEW YORK MERCANTILE EXCHANGE ;2011.02.22; 1817671;   89397;  111174;  615835; 1105840; 1082700; 1811073; 1809709;    6598;    7962
EUR STYLE NATURAL GAS OPTIONS - NEW YORK MERCANTILE EXCHANGE ;2011.02.15; 1778432;   84467;  108986;  599232; 1088120; 1062497; 1771818; 1770715;    6614;    7717
EUR STYLE NATURAL GAS OPTIONS - NEW YORK MERCANTILE EXCHANGE ;2011.02.08; 1728979;   80965;  108675;  576809; 1064738; 1036284; 1722511; 1721767;    6468;    7212
EUR STYLE NATURAL GAS OPTIONS - NEW YORK MERCANTILE EXCHANGE ;2011.02.01; 1665411;   73265;  102091;  556256; 1029487; 1000363; 1659008; 1658710;    6403;    6701
EUR STYLE NATURAL GAS OPTIONS - NEW YORK MERCANTILE EXCHANGE ;2011.01.25; 1722084;   77503;  103506;  596596; 1040730; 1015344; 1714830; 1715447;    7255;    6637
EUR STYLE NATURAL GAS OPTIONS - NEW YORK MERCANTILE EXCHANGE ;2011.01.18; 1665692;   79430;  104247;  566859; 1012632;  988085; 1658921; 1659191;    6771;    6501
EUR STYLE NATURAL GAS OPTIONS - NEW YORK MERCANTILE EXCHANGE ;2011.01.11; 1663979;   80892;  104557;  561149; 1015931;  992026; 1657971; 1657732;    6008;    6247
EUR STYLE NATURAL GAS OPTIONS - NEW YORK MERCANTILE EXCHANGE ;2011.01.04; 1649254;   82392;  102148;  562485;  997398;  978148; 1642275; 1642781;    6979;    6473
EUR STYLE NATURAL GAS OPTIONS - NEW YORK MERCANTILE EXCHANGE ;2011.07.12; 1645851;   91293;   85024;  508522; 1039718; 1047964; 1639533; 1641509;    6317;    4341
EUR STYLE NATURAL GAS OPTIONS - NEW YORK MERCANTILE EXCHANGE ;2011.07.05; 1589060;   81884;   75151;  486261; 1014537; 1023363; 1582682; 1584775;    6378;    4285
EUR STYLE NATURAL GAS OPTIONS - NEW YORK MERCANTILE EXCHANGE ;2011.06.28; 1588458;   80865;   72234;  487289; 1014762; 1025145; 1582916; 1584669;    5542;    3789
EUR STYLE NATURAL GAS OPTIONS - NEW YORK MERCANTILE EXCHANGE ;2011.06.21; 1689378;   90351;   89362;  532211; 1059767; 1062869; 1682329; 1684442;    7049;    4936
EUR STYLE NATURAL GAS OPTIONS - NEW YORK MERCANTILE EXCHANGE ;2011.06.14; 1661842;   92180;   87961;  519568; 1043252; 1049488; 1655000; 1657017;    6842;    4826
EUR STYLE NATURAL GAS OPTIONS - NEW YORK MERCANTILE EXCHANGE ;2011.06.07; 1675722;   89532;   81865;  530604; 1048005; 1058368; 1668141; 1670837;    7581;    4885
EUR STYLE NATURAL GAS OPTIONS - NEW YORK MERCANTILE EXCHANGE ;2011.05.31; 1649681;   82982;   82017;  513014; 1046501; 1049585; 1642497; 1644616;    7184;    5065
EUR STYLE NATURAL GAS OPTIONS - NEW YORK MERCANTILE EXCHANGE ;2011.05.24; 1722082;   99654;  107414;  530169; 1084787; 1078414; 1714610; 1715997;    7472;    6084
EUR STYLE NATURAL GAS OPTIONS - NEW YORK MERCANTILE EXCHANGE ;2011.05.17; 1699619;  101926;  105873;  521912; 1068703; 1065602; 1692542; 1693387;    7077;    6232
EUR STYLE NATURAL GAS OPTIONS - NEW YORK MERCANTILE EXCHANGE ;2011.05.10; 1695038;  101654;  102954;  522847; 1063478; 1063054; 1687979; 1688855;    7059;    6184
EUR STYLE NATURAL GAS OPTIONS - NEW YORK MERCANTILE EXCHANGE ;2011.05.03; 1687305;   93796;   93139;  523993; 1061584; 1064256; 1679373; 1681389;    7932;    5917
EUR STYLE NATURAL GAS OPTIONS - NEW YORK MERCANTILE EXCHANGE ;2011.04.26; 1638628;   80252;   87434;  508651; 1042098; 1036929; 1631001; 1633014;    7627;    5614
EUR STYLE NATURAL GAS OPTIONS - NEW YORK MERCANTILE EXCHANGE ;2011.04.19; 1726917;   80756;   93745;  549666; 1089031; 1077357; 1719453; 1720768;    7464;    6149
EUR STYLE NATURAL GAS OPTIONS - NEW YORK MERCANTILE EXCHANGE ;2011.04.12; 1712078;   78728;   86356;  549411; 1076515; 1070299; 1704655; 1706066;    7423;    6011
EUR STYLE NATURAL GAS OPTIONS - NEW YORK MERCANTILE EXCHANGE ;2011.04.05; 1682910;   73136;   87257;  535337; 1064920; 1054000; 1673392; 1676594;    9518;    6316
EUR STYLE NATURAL GAS OPTIONS - NEW YORK MERCANTILE EXCHANGE ;2011.03.29; 1635746;   67787;   82305;  518169; 1041355; 1028971; 1627310; 1629445;    8436;    6301
EUR STYLE NATURAL GAS OPTIONS - NEW YORK MERCANTILE EXCHANGE ;2011.03.22; 1771395;   71121;   95786;  590175; 1101766; 1078691; 1763062; 1764652;    8333;    6743
EUR STYLE NATURAL GAS OPTIONS - NEW YORK MERCANTILE EXCHANGE ;2011.03.15; 1757335;   75862;   92828;  578117; 1094545; 1078673; 1748523; 1749618;    8812;    7717
EUR STYLE NATURAL GAS OPTIONS - NEW YORK MERCANTILE EXCHANGE ;2011.03.08; 1742197;   71147;   88241;  577301; 1085567; 1069169; 1734015; 1734711;    8181;    7486
EUR STYLE NATURAL GAS OPTIONS - NEW YORK MERCANTILE EXCHANGE ;2011.03.01; 1674735;   67154;   86525;  549563; 1050784; 1031299; 1667500; 1667387;    7234;    7348
EUR STYLE NATURAL GAS OPTIONS - NEW YORK MERCANTILE EXCHANGE ;2011.02.22; 1817671;   89397;  111174;  615835; 1105840; 1082700; 1811073; 1809709;    6598;    7962
EUR STYLE NATURAL GAS OPTIONS - NEW YORK MERCANTILE EXCHANGE ;2011.02.15; 1778432;   84467;  108986;  599232; 1088120; 1062497; 1771818; 1770715;    6614;    7717
EUR STYLE NATURAL GAS OPTIONS - NEW YORK MERCANTILE EXCHANGE ;2011.02.08; 1728979;   80965;  108675;  576809; 1064738; 1036284; 1722511; 1721767;    6468;    7212
EUR STYLE NATURAL GAS OPTIONS - NEW YORK MERCANTILE EXCHANGE ;2011.02.01; 1665411;   73265;  102091;  556256; 1029487; 1000363; 1659008; 1658710;    6403;    6701
EUR STYLE NATURAL GAS OPTIONS - NEW YORK MERCANTILE EXCHANGE ;2011.01.25; 1722084;   77503;  103506;  596596; 1040730; 1015344; 1714830; 1715447;    7255;    6637
EUR STYLE NATURAL GAS OPTIONS - NEW YORK MERCANTILE EXCHANGE ;2011.01.18; 1665692;   79430;  104247;  566859; 1012632;  988085; 1658921; 1659191;    6771;    6501
EUR STYLE NATURAL GAS OPTIONS - NEW YORK MERCANTILE EXCHANGE ;2011.01.11; 1663979;   80892;  104557;  561149; 1015931;  992026; 1657971; 1657732;    6008;    6247
EUR STYLE NATURAL GAS OPTIONS - NEW YORK MERCANTILE EXCHANGE ;2011.01.04; 1649254;   82392;  102148;  562485;  997398;  978148; 1642275; 1642781;    6979;    6473
EUR STYLE NATURAL GAS OPTIONS - NEW YORK MERCANTILE EXCHANGE ;2010.12.28; 1610418;   77170;   97796;  541604;  985213;  965626; 1603988; 1605026;    6430;    5392
EUR STYLE NATURAL GAS OPTIONS - NEW YORK MERCANTILE EXCHANGE ;2010.12.21; 1796677;   94773;  129646;  621992; 1073502; 1039018; 1790267; 1790656;    6410;    6021
EUR STYLE NATURAL GAS OPTIONS - NEW YORK MERCANTILE EXCHANGE ;2010.12.14; 1750328;   95636;  132384;  594202; 1052659; 1016777; 1742497; 1743362;    7831;    6966
EUR STYLE NATURAL GAS OPTIONS - NEW YORK MERCANTILE EXCHANGE ;2010.12.07; 1716743;   89858;  128252;  578903; 1040496; 1002375; 1709257; 1709530;    7487;    7213
EUR STYLE NATURAL GAS OPTIONS - NEW YORK MERCANTILE EXCHANGE ;2010.11.30; 1705943;   82709;  122495;  571877; 1044368; 1004450; 1698954; 1698823;    6988;    7120
EUR STYLE NATURAL GAS OPTIONS - NEW YORK MERCANTILE EXCHANGE ;2010.11.23; 1656875;   76823;  107513;  553254; 1019643;  989138; 1649720; 1649905;    7155;    6970
EUR STYLE NATURAL GAS OPTIONS - NEW YORK MERCANTILE EXCHANGE ;2010.11.16; 1779092;   82921;  124262;  600414; 1089293; 1048040; 1772627; 1772715;    6465;    6377
EUR STYLE NATURAL GAS OPTIONS - NEW YORK MERCANTILE EXCHANGE ;2010.11.09; 1725906;   75448;  113945;  580803; 1063494; 1025770; 1719745; 1720518;    6160;    5388
EUR STYLE NATURAL GAS OPTIONS - NEW YORK MERCANTILE EXCHANGE ;2010.11.02; 1700307;   68347;  101075;  568727; 1057141; 1024826; 1694216; 1694629;    6091;    5678
EUR STYLE NATURAL GAS OPTIONS - NEW YORK MERCANTILE EXCHANGE ;2010.10.26; 1687362;   70107;   95440;  562006; 1047693; 1024174; 1679806; 1681620;    7556;    5742
EUR STYLE NATURAL GAS OPTIONS - NEW YORK MERCANTILE EXCHANGE ;2010.10.19; 1769698;   78830;  102013;  598691; 1085387; 1062977; 1762908; 1763682;    6790;    6017
EUR STYLE NATURAL GAS OPTIONS - NEW YORK MERCANTILE EXCHANGE ;2010.10.12; 1716232;   76692;   98540;  571026; 1061524; 1040463; 1709241; 1710029;    6991;    6204
EUR STYLE NATURAL GAS OPTIONS - NEW YORK MERCANTILE EXCHANGE ;2010.10.05; 1676395;   71340;   99845;  551535; 1046704; 1019163; 1669579; 1670543;    6816;    5853
EUR STYLE NATURAL GAS OPTIONS - NEW YORK MERCANTILE EXCHANGE ;2010.09.28; 1612792;   64229;   98745;  520745; 1021063;  986918; 1606037; 1606407;    6755;    6384
EUR STYLE NATURAL GAS OPTIONS - NEW YORK MERCANTILE EXCHANGE ;2010.09.21; 1806130;   94217;  107787;  598122; 1107305; 1093700; 1799644; 1799609;    6486;    6521
EUR STYLE NATURAL GAS OPTIONS - NEW YORK MERCANTILE EXCHANGE ;2010.09.14; 1767863;   88651;  100491;  581089; 1092114; 1080202; 1761853; 1761781;    6010;    6082
EUR STYLE NATURAL GAS OPTIONS - NEW YORK MERCANTILE EXCHANGE ;2010.09.07; 1747806;   86513;   97634;  568129; 1083028; 1071350; 1737671; 1737113;   10135;   10692
EUR STYLE NATURAL GAS OPTIONS - NEW YORK MERCANTILE EXCHANGE ;2010.08.31; 1714471;   80007;   91303;  552256; 1076392; 1064339; 1708655; 1707898;    5817;    6573
EUR STYLE NATURAL GAS OPTIONS - NEW YORK MERCANTILE EXCHANGE ;2010.08.24; 1808051;   81419;  102365;  592983; 1128080; 1105044; 1802482; 1800392;    5569;    7659
EUR STYLE NATURAL GAS OPTIONS - NEW YORK MERCANTILE EXCHANGE ;2010.08.17; 1728352;   75816;   99261;  552689; 1095059; 1069749; 1723564; 1721699;    4789;    6653
EUR STYLE NATURAL GAS OPTIONS - NEW YORK MERCANTILE EXCHANGE ;2010.08.10; 1694005;   77884;   98762;  534998; 1076087; 1053420; 1688970; 1687181;    5036;    6825
EUR STYLE NATURAL GAS OPTIONS - NEW YORK MERCANTILE EXCHANGE ;2010.08.03; 1641749;   69254;   96453;  515430; 1051513; 1023150; 1636197; 1635033;    5553;    6716
EUR STYLE NATURAL GAS OPTIONS - NEW YORK MERCANTILE EXCHANGE ;2010.07.27; 1614813;   67442;   96026;  504851; 1037406; 1007091; 1609699; 1607968;    5114;    6845
EUR STYLE NATURAL GAS OPTIONS - NEW YORK MERCANTILE EXCHANGE ;2010.07.20; 1723971;   72340;  105346;  550116; 1096151; 1060932; 1718606; 1716393;    5365;    7577
EUR STYLE NATURAL GAS OPTIONS - NEW YORK MERCANTILE EXCHANGE ;2010.07.13; 1705620;   75438;  100989;  543020; 1082514; 1054675; 1700973; 1698685;    4648;    6935
EUR STYLE NATURAL GAS OPTIONS - NEW YORK MERCANTILE EXCHANGE ;2010.07.06; 1698957;   67822;   98250;  547232; 1078255; 1045453; 1693309; 1690935;    5648;    8022
EUR STYLE NATURAL GAS OPTIONS - NEW YORK MERCANTILE EXCHANGE ;2010.06.29; 1683052;   68445;   96108;  540889; 1067638; 1037681; 1676972; 1674678;    6080;    8374
EUR STYLE NATURAL GAS OPTIONS - NEW YORK MERCANTILE EXCHANGE ;2010.06.22; 1798134;   77873;  109030;  594593; 1119404; 1085461; 1791870; 1789083;    6264;    9051
EUR STYLE NATURAL GAS OPTIONS - NEW YORK MERCANTILE EXCHANGE ;2010.06.15; 1767217;   74860;  110020;  587018; 1101364; 1063901; 1763242; 1760939;    3974;    6277
EUR STYLE NATURAL GAS OPTIONS - NEW YORK MERCANTILE EXCHANGE ;2010.06.08; 1700177;   72894;   98167;  577252; 1043676; 1015864; 1693822; 1691282;    6355;    8895
EUR STYLE NATURAL GAS OPTIONS - NEW YORK MERCANTILE EXCHANGE ;2010.06.01; 1625989;   74018;   94357;  538140; 1007806;  984674; 1619964; 1617171;    6024;    8818
EUR STYLE NATURAL GAS OPTIONS - NEW YORK MERCANTILE EXCHANGE ;2010.05.25; 1600569;   81147;   92181;  523890;  989205;  975822; 1594243; 1591893;    6326;    8677
EUR STYLE NATURAL GAS OPTIONS - NEW YORK MERCANTILE EXCHANGE ;2010.05.18; 1695987;   84244;  106913;  559999; 1044973; 1019587; 1689217; 1686499;    6770;    9487
EUR STYLE NATURAL GAS OPTIONS - NEW YORK MERCANTILE EXCHANGE ;2010.05.11; 1690501;   88003;   99072;  557690; 1037857; 1024606; 1683550; 1681368;    6951;    9132
EUR STYLE NATURAL GAS OPTIONS - NEW YORK MERCANTILE EXCHANGE ;2010.05.04; 1646022;   82306;  102974;  534011; 1022756;  999792; 1639073; 1636778;    6949;    9244
EUR STYLE NATURAL GAS OPTIONS - NEW YORK MERCANTILE EXCHANGE ;2010.04.27; 1592819;   76308;  103850;  517852;  991479;  962095; 1585639; 1583796;    7181;    9023
EUR STYLE NATURAL GAS OPTIONS - NEW YORK MERCANTILE EXCHANGE ;2010.04.20; 1737035;   89804;  114117;  586158; 1053907; 1027610; 1729869; 1727884;    7166;    9151
EUR STYLE NATURAL GAS OPTIONS - NEW YORK MERCANTILE EXCHANGE ;2010.04.13; 1703069;   85254;  116001;  574296; 1036499; 1004029; 1696050; 1694326;    7020;    8743
EUR STYLE NATURAL GAS OPTIONS - NEW YORK MERCANTILE EXCHANGE ;2010.04.06; 1661924;   82277;  109516;  555110; 1017031;  988108; 1654418; 1652735;    7506;    9189
EUR STYLE NATURAL GAS OPTIONS - NEW YORK MERCANTILE EXCHANGE ;2010.03.30; 1626073;   82931;  108343;  534881; 1000589;  973487; 1618402; 1616712;    7671;    9362
EUR STYLE NATURAL GAS OPTIONS - NEW YORK MERCANTILE EXCHANGE ;2010.03.23; 1769575;   99264;  106057;  624841; 1038373; 1029398; 1762478; 1760296;    7098;    9280
EUR STYLE NATURAL GAS OPTIONS - NEW YORK MERCANTILE EXCHANGE ;2010.03.16; 1675179;   93917;  105552;  567681; 1006627;  993306; 1668225; 1666539;    6955;    8640
EUR STYLE NATURAL GAS OPTIONS - NEW YORK MERCANTILE EXCHANGE ;2010.03.09; 1615465;   83961;  109597;  534896;  989960;  962674; 1608817; 1607167;    6648;    8298
EUR STYLE NATURAL GAS OPTIONS - NEW YORK MERCANTILE EXCHANGE ;2010.03.02; 1558332;   75830;  104417;  509259;  966932;  936992; 1552022; 1550669;    6310;    7663
EUR STYLE NATURAL GAS OPTIONS - NEW YORK MERCANTILE EXCHANGE ;2010.02.23; 1524892;   71919;   99855;  488770;  957828;  928421; 1518517; 1517047;    6374;    7845
EUR STYLE NATURAL GAS OPTIONS - NEW YORK MERCANTILE EXCHANGE ;2010.02.16; 1586949;   64389;  108654;  515604; 1001990;  956418; 1581983; 1580676;    4966;    6273
EUR STYLE NATURAL GAS OPTIONS - NEW YORK MERCANTILE EXCHANGE ;2010.02.09; 1585865;   62755;  107599;  514029; 1003880;  957145; 1580664; 1578773;    5202;    7093
EUR STYLE NATURAL GAS OPTIONS - NEW YORK MERCANTILE EXCHANGE ;2010.02.02; 1559532;   59509;  101005;  505119;  989451;  947811; 1554079; 1553934;    5453;    5598
EUR STYLE NATURAL GAS OPTIONS - NEW YORK MERCANTILE EXCHANGE ;2010.01.26; 1530017;   56426;   98603;  489362;  977700;  935312; 1523488; 1523277;    6529;    6739
EUR STYLE NATURAL GAS OPTIONS - NEW YORK MERCANTILE EXCHANGE ;2010.01.19; 1609592;   62295;  105242;  521588; 1020366;  977090; 1604249; 1603919;    5343;    5673
EUR STYLE NATURAL GAS OPTIONS - NEW YORK MERCANTILE EXCHANGE ;2010.01.12; 1622017;   56628;  106673;  527061; 1033385;  982869; 1617074; 1616604;    4943;    5414
EUR STYLE NATURAL GAS OPTIONS - NEW YORK MERCANTILE EXCHANGE ;2010.01.05; 1578696;   53549;  102302;  511768; 1009524;  960301; 1574841; 1574372;    3855;    4324
EUR STYLE NATURAL GAS OPTIONS - NEW YORK MERCANTILE EXCHANGE ;2009.12.29; 1556341;   52618;   96816;  500465;  997967;  953376; 1551050; 1550657;    5291;    5684
EUR STYLE NATURAL GAS OPTIONS - NEW YORK MERCANTILE EXCHANGE ;2009.12.22; 1683653;   53584;  106512;  553144; 1071812; 1018279; 1678540; 1677934;    5113;    5719
EUR STYLE NATURAL GAS OPTIONS - NEW YORK MERCANTILE EXCHANGE ;2009.12.15; 1660522;   49364;   98512;  542319; 1064441; 1014634; 1656124; 1655466;    4399;    5057
EUR STYLE NATURAL GAS OPTIONS - NEW YORK MERCANTILE EXCHANGE ;2009.12.08; 1613547;   51519;  105631;  509853; 1047293;  992546; 1608665; 1608030;    4882;    5517
EUR STYLE NATURAL GAS OPTIONS - NEW YORK MERCANTILE EXCHANGE ;2009.12.01; 1559614;   49500;  113914;  474953; 1030337;  965089; 1554790; 1553956;    4824;    5658
EUR STYLE NATURAL GAS OPTIONS - NEW YORK MERCANTILE EXCHANGE ;2009.11.24; 1532122;   47443;  118848;  463271; 1016210;  944389; 1526924; 1526509;    5198;    5613
EUR STYLE NATURAL GAS OPTIONS - NEW YORK MERCANTILE EXCHANGE ;2009.11.17; 1655638;   49002;  128830;  521190; 1079848;  999907; 1650039; 1649927;    5598;    5710
EUR STYLE NATURAL GAS OPTIONS - NEW YORK MERCANTILE EXCHANGE ;2009.11.09; 1606198;   47269;  123167;  501186; 1052688;  976521; 1601143; 1600874;    5055;    5324
EUR STYLE NATURAL GAS OPTIONS - NEW YORK MERCANTILE EXCHANGE ;2009.11.03; 1566599;   42297;  120469;  487121; 1032226;  953666; 1561645; 1561256;    4954;    5343
EUR STYLE NATURAL GAS OPTIONS - NEW YORK MERCANTILE EXCHANGE ;2009.10.27; 1540678;   41594;  110880;  478610; 1014203;  944595; 1534408; 1534086;    6270;    6593
EUR STYLE NATURAL GAS OPTIONS - NEW YORK MERCANTILE EXCHANGE ;2009.10.20; 1664835;   48511;  119265;  527690; 1076905; 1014034; 1653106; 1660989;   11729;    3846
EUR STYLE NATURAL GAS OPTIONS - NEW YORK MERCANTILE EXCHANGE ;2009.10.13; 1644200;   53649;  119662;  517099; 1069644; 1003975; 1640392; 1640736;    3808;    3464
EUR STYLE NATURAL GAS OPTIONS - NEW YORK MERCANTILE EXCHANGE ;2009.10.06; 1641036;   53684;  116624;  514075; 1068419; 1005720; 1636178; 1636419;    4858;    4617
EUR STYLE NATURAL GAS OPTIONS - NEW YORK MERCANTILE EXCHANGE ;2009.09.29; 1605962;   51223;  110450;  499208; 1052097;  993269; 1602529; 1602928;    3433;    3034
EUR STYLE NATURAL GAS OPTIONS - NEW YORK MERCANTILE EXCHANGE ;2009.09.22; 1889368;   57902;  141206;  623156; 1205999; 1123102; 1887057; 1887463;    2311;    1905
EUR STYLE NATURAL GAS OPTIONS - NEW YORK MERCANTILE EXCHANGE ;2009.09.15; 1893949;   57822;  128740;  625190; 1208557; 1137812; 1891570; 1891742;    2379;    2207
EUR STYLE NATURAL GAS OPTIONS - NEW YORK MERCANTILE EXCHANGE ;2009.09.08; 1874096;   60839;  139377;  607913; 1202753; 1123836; 1871505; 1871125;    2592;    2971
EUR STYLE NATURAL GAS OPTIONS - NEW YORK MERCANTILE EXCHANGE ;2009.09.01; 1826013;   55143;  130773;  589888; 1176890; 1101485; 1821922; 1822146;    4091;    3867
EUR STYLE NATURAL GAS OPTIONS - NEW YORK MERCANTILE EXCHANGE ;2009.08.25; 2008095;   58772;  148950;  679588; 1265875; 1175715; 2004234; 2004253;    3861;    3842
EUR STYLE NATURAL GAS OPTIONS - NEW YORK MERCANTILE EXCHANGE ;2009.08.18; 1953915;   49173;  145395;  659696; 1240201; 1144343; 1949070; 1949435;    4845;    4481
EUR STYLE NATURAL GAS OPTIONS - NEW YORK MERCANTILE EXCHANGE ;2009.08.11; 1893771;   36552;  134777;  638930; 1213801; 1116498; 1889283; 1890204;    4488;    3567
EUR STYLE NATURAL GAS OPTIONS - NEW YORK MERCANTILE EXCHANGE ;2009.08.04; 1863218;   33501;  122478;  629554; 1195831; 1107926; 1858887; 1859958;    4332;    3260
EUR STYLE NATURAL GAS OPTIONS - NEW YORK MERCANTILE EXCHANGE ;2009.07.28; 1853351;   33475;  136024;  618166; 1197097; 1095542; 1848738; 1849732;    4613;    3619
EUR STYLE NATURAL GAS OPTIONS - NEW YORK MERCANTILE EXCHANGE ;2009.07.21; 2003743;   30518;  148259;  682746; 1285851; 1169691; 1999115; 2000696;    4629;    3048
EUR STYLE NATURAL GAS OPTIONS - NEW YORK MERCANTILE EXCHANGE ;2009.07.14; 2005408;   32664;  155513;  682497; 1285670; 1164194; 2000831; 2002205;    4577;    3204
EUR STYLE NATURAL GAS OPTIONS - NEW YORK MERCANTILE EXCHANGE ;2009.07.07; 1880740;   32693;  140634;  639720; 1203690; 1096319; 1876103; 1876674;    4636;    4066
EUR STYLE NATURAL GAS OPTIONS - NEW YORK MERCANTILE EXCHANGE ;2009.06.30; 1826259;   28391;  126697;  618887; 1174834; 1077390; 1822112; 1822974;    4147;    3285
EUR STYLE NATURAL GAS OPTIONS - NEW YORK MERCANTILE EXCHANGE ;2009.06.23; 1997277;   20227;  148970;  706749; 1265855; 1137588; 1992831; 1993308;    4445;    3968
EUR STYLE NATURAL GAS OPTIONS - NEW YORK MERCANTILE EXCHANGE ;2009.06.16; 2015830;   21925;  130009;  719799; 1268309; 1160255; 2010033; 2010063;    5797;    5767
EUR STYLE NATURAL GAS OPTIONS - NEW YORK MERCANTILE EXCHANGE ;2009.06.09; 1988389;   25354;  135293;  699669; 1249372; 1136293; 1974394; 1971255;   13995;   17135
EUR STYLE NATURAL GAS OPTIONS - NEW YORK MERCANTILE EXCHANGE ;2009.06.02; 1945039;   22039;  136084;  678512; 1240033; 1126046; 1940584; 1940643;    4455;    4396
EUR STYLE NATURAL GAS OPTIONS - NEW YORK MERCANTILE EXCHANGE ;2009.05.26; 1934929;   24178;  148100;  665319; 1239522; 1114008; 1929020; 1927427;    5909;    7502
EUR STYLE NATURAL GAS OPTIONS - NEW YORK MERCANTILE EXCHANGE ;2009.05.19; 2130124;   27777;  153821;  738562; 1358566; 1232736; 2124906; 2125118;    5218;    5005
EUR STYLE NATURAL GAS OPTIONS - NEW YORK MERCANTILE EXCHANGE ;2009.05.12; 2113473;   19179;  126175;  746121; 1343542; 1236864; 2108843; 2109160;    4630;    4313
EUR STYLE NATURAL GAS OPTIONS - NEW YORK MERCANTILE EXCHANGE ;2009.05.05; 2080089;   25952;  157234;  715814; 1333140; 1203007; 2074905; 2076056;    5184;    4033
EUR STYLE NATURAL GAS OPTIONS - NEW YORK MERCANTILE EXCHANGE ;2009.04.28; 2077565;   23717;  160712;  715510; 1334849; 1197635; 2074076; 2073857;    3490;    3709
EUR STYLE NATURAL GAS OPTIONS - NEW YORK MERCANTILE EXCHANGE ;2009.04.21; 2216191;   28828;  164304;  774580; 1406409; 1271435; 2209817; 2210320;    6374;    5872
EUR STYLE NATURAL GAS OPTIONS - NEW YORK MERCANTILE EXCHANGE ;2009.04.14; 2176426;   27963;  155081;  760900; 1381827; 1255053; 2170689; 2171034;    5737;    5392
EUR STYLE NATURAL GAS OPTIONS - NEW YORK MERCANTILE EXCHANGE ;2009.04.07; 2173882;   28197;  162446;  757583; 1382072; 1248046; 2167853; 2168075;    6029;    5807
EUR STYLE NATURAL GAS OPTIONS - NEW YORK MERCANTILE EXCHANGE ;2009.03.31; 2118050;   22588;  151744;  737739; 1352072; 1223079; 2112398; 2112561;    5652;    5489
EUR STYLE NATURAL GAS OPTIONS - NEW YORK MERCANTILE EXCHANGE ;2009.03.24; 2329477;   35292;  139501;  891583; 1397894; 1293732; 2324770; 2324816;    4708;    4661
EUR STYLE NATURAL GAS OPTIONS - NEW YORK MERCANTILE EXCHANGE ;2009.03.17; 2323668;   40628;  170790;  876016; 1400582; 1270803; 2317226; 2317609;    6442;    6058
EUR STYLE NATURAL GAS OPTIONS - NEW YORK MERCANTILE EXCHANGE ;2009.03.10; 2278912;   76771;  163676;  925543; 1270424; 1184363; 2272738; 2273582;    6174;    5331
EUR STYLE NATURAL GAS OPTIONS - NEW YORK MERCANTILE EXCHANGE ;2009.03.03; 2159235;   78608;  155390;  883069; 1189517; 1116705; 2151194; 2155164;    8041;    4071
EUR STYLE NATURAL GAS OPTIONS - NEW YORK MERCANTILE EXCHANGE ;2009.02.24; 2118731;   80425;  152087;  870427; 1162494; 1092566; 2113347; 2115080;    5385;    3651
EUR STYLE NATURAL GAS OPTIONS - NEW YORK MERCANTILE EXCHANGE ;2009.02.17; 2349217;   92357;  153926;  999715; 1249697; 1189304; 2341768; 2342944;    7449;    6273
EUR STYLE NATURAL GAS OPTIONS - NEW YORK MERCANTILE EXCHANGE ;2009.02.10; 2255246;   91475;  138038;  961771; 1195962; 1150166; 2249207; 2249974;    6039;    5272
EUR STYLE NATURAL GAS OPTIONS - NEW YORK MERCANTILE EXCHANGE ;2009.02.03; 2239855;   91983;  125088;  959465; 1182819; 1150555; 2234267; 2235108;    5588;    4747
EUR STYLE NATURAL GAS OPTIONS - NEW YORK MERCANTILE EXCHANGE ;2009.01.27; 2202803;   92447;  119995;  934993; 1170173; 1143284; 2197613; 2198272;    5190;    4531
EUR STYLE NATURAL GAS OPTIONS - NEW YORK MERCANTILE EXCHANGE ;2009.01.20; 2300894;   84253;  121463;  979113; 1231831; 1195685; 2295197; 2296260;    5697;    4634
EUR STYLE NATURAL GAS OPTIONS - NEW YORK MERCANTILE EXCHANGE ;2009.01.13; 2177599;   82590;  104577;  927315; 1162311; 1141119; 2172216; 2173012;    5383;    4588
EUR STYLE NATURAL GAS OPTIONS - NEW YORK MERCANTILE EXCHANGE ;2009.01.06; 2056969;   82131;   84611;  883813; 1085981; 1084071; 2051925; 2052495;    5044;    4473
EUR STYLE NATURAL GAS OPTIONS - NEW YORK MERCANTILE EXCHANGE ;2008.12.30; 2032518;   84209;   97384;  867142; 1076109; 1063612; 2027459; 2028138;    5058;    4380
EUR STYLE NATURAL GAS OPTIONS - NEW YORK MERCANTILE EXCHANGE ;2008.12.22; 2358119;   85062;  111880; 1042684; 1224021; 1198762; 2351766; 2353326;    6353;    4793
EUR STYLE NATURAL GAS OPTIONS - NEW YORK MERCANTILE EXCHANGE ;2008.12.16; 2247221;   90518;   90468;  994471; 1157258; 1158252; 2242246; 2243190;    4975;    4031
EUR STYLE NATURAL GAS OPTIONS - NEW YORK MERCANTILE EXCHANGE ;2008.12.09; 2220522;   92702;   91417;  979946; 1142713; 1145487; 2215361; 2216850;    5162;    3672
EUR STYLE NATURAL GAS OPTIONS - NEW YORK MERCANTILE EXCHANGE ;2008.12.02; 2080449;  101132;   73975;  919354; 1055048; 1083318; 2075535; 2076646;    4914;    3802
EUR STYLE NATURAL GAS OPTIONS - NEW YORK MERCANTILE EXCHANGE ;2008.11.25; 2059861;  102605;   74803;  908411; 1044154; 1072999; 2055170; 2056213;    4691;    3649
EUR STYLE NATURAL GAS OPTIONS - NEW YORK MERCANTILE EXCHANGE ;2008.11.18; 2269841;  117495;   71039; 1030331; 1116979; 1164425; 2264805; 2265795;    5036;    4046
EUR STYLE NATURAL GAS OPTIONS - NEW YORK MERCANTILE EXCHANGE ;2008.11.11; 2195271;  109176;   60181; 1000349; 1080778; 1130598; 2190302; 2191128;    4969;    4143
EUR STYLE NATURAL GAS OPTIONS - NEW YORK MERCANTILE EXCHANGE ;2008.11.04; 2137449;  111479;   30312;  985646; 1035664; 1117447; 2132788; 2133404;    4660;    4044
EUR STYLE NATURAL GAS OPTIONS - NEW YORK MERCANTILE EXCHANGE ;2008.10.28; 2142535;  107593;   69820;  961150; 1068833; 1107478; 2137576; 2138447;    4959;    4087
EUR STYLE NATURAL GAS OPTIONS - NEW YORK MERCANTILE EXCHANGE ;2008.10.21; 2217870;  126656;   65011; 1005790; 1080598; 1143365; 2213044; 2214167;    4826;    3703
EUR STYLE NATURAL GAS OPTIONS - NEW YORK MERCANTILE EXCHANGE ;2008.10.14; 2162098;  120812;   65898;  988871; 1047597; 1103388; 2157281; 2158157;    4817;    3941
EUR STYLE NATURAL GAS OPTIONS - NEW YORK MERCANTILE EXCHANGE ;2008.10.07; 2102541;  130074;   57155;  961381; 1006668; 1080127; 2098123; 2098663;    4418;    3878
EUR STYLE NATURAL GAS OPTIONS - NEW YORK MERCANTILE EXCHANGE ;2008.09.30; 1994812;  143105;   35084;  914014;  932223; 1041378; 1989342; 1990476;    5470;    4336
EUR STYLE NATURAL GAS OPTIONS - NEW YORK MERCANTILE EXCHANGE ;2008.09.23; 2267280;  188369;   28010; 1083351;  989309; 1151198; 2261028; 2262559;    6251;    4721
EUR STYLE NATURAL GAS OPTIONS - NEW YORK MERCANTILE EXCHANGE ;2008.09.16; 2301279;  158250;   25513; 1103750; 1022681; 1157648; 2284682; 2286912;   16598;   14368
EUR STYLE NATURAL GAS OPTIONS - NEW YORK MERCANTILE EXCHANGE ;2008.09.09; 2201789;  181895;   21284; 1039347;  974178; 1137030; 2195419; 2197661;    6370;    4128
EUR STYLE NATURAL GAS OPTIONS - NEW YORK MERCANTILE EXCHANGE ;2008.09.02; 2148238;  172929;   20005; 1005997;  962952; 1117753; 2141878; 2143755;    6360;    4482
EUR STYLE NATURAL GAS OPTIONS - NEW YORK MERCANTILE EXCHANGE ;2008.08.26; 2061615;  206620;   17883;  933820;  914761; 1105402; 2055202; 2057106;    6413;    4509
EUR STYLE NATURAL GAS OPTIONS - NEW YORK MERCANTILE EXCHANGE ;2008.08.19; 2200536;  174550;   14114; 1030799;  989799; 1152144; 2195148; 2197058;    5388;    3478
EUR STYLE NATURAL GAS OPTIONS - NEW YORK MERCANTILE EXCHANGE ;2008.08.12; 2124291;  181337;   10364;  984053;  954144; 1126749; 2119534; 2121166;    4757;    3125
EUR STYLE NATURAL GAS OPTIONS - NEW YORK MERCANTILE EXCHANGE ;2008.08.05; 2080169;  207112;   10656;  944727;  922858; 1121484; 2074697; 2076867;    5472;    3302
EUR STYLE NATURAL GAS OPTIONS - NEW YORK MERCANTILE EXCHANGE ;2008.07.29; 2026221;  207686;   11502;  914639;  898284; 1096711; 2020609; 2022852;    5612;    3369
EUR STYLE NATURAL GAS OPTIONS - NEW YORK MERCANTILE EXCHANGE ;2008.07.22; 2179622;  267112;   15561;  977267;  930089; 1184012; 2174468; 2176841;    5154;    2781
EUR STYLE NATURAL GAS OPTIONS - NEW YORK MERCANTILE EXCHANGE ;2008.07.15; 2123662;  313859;   19165;  872743;  931563; 1228899; 2118165; 2120807;    5497;    2854
EUR STYLE NATURAL GAS OPTIONS - NEW YORK MERCANTILE EXCHANGE ;2008.07.08; 2112989;  316132;   22554;  859556;  930754; 1226617; 2106443; 2108727;    6546;    4261
EUR STYLE NATURAL GAS OPTIONS - NEW YORK MERCANTILE EXCHANGE ;2008.07.01; 2147010;  327057;   26149;  870462;  943933; 1246722; 2141452; 2143333;    5558;    3677
EUR STYLE NATURAL GAS OPTIONS - NEW YORK MERCANTILE EXCHANGE ;2008.06.24; 2232363;  344095;   33433;  899836;  982049; 1294263; 2225981; 2227532;    6382;    4832
EUR STYLE NATURAL GAS OPTIONS - NEW YORK MERCANTILE EXCHANGE ;2008.06.17; 2188284;  326392;   33484;  887561;  968045; 1261928; 2181998; 2182973;    6286;    5311
EUR STYLE NATURAL GAS OPTIONS - NEW YORK MERCANTILE EXCHANGE ;2008.06.10; 2109293;  304871;   32634;  856119;  942766; 1215475; 2103756; 2104228;    5537;    5065
EUR STYLE NATURAL GAS OPTIONS - NEW YORK MERCANTILE EXCHANGE ;2008.06.03; 2069582;  304243;   26485;  843609;  917110; 1194893; 2064962; 2064987;    4619;    4595
EUR STYLE NATURAL GAS OPTIONS - NEW YORK MERCANTILE EXCHANGE ;2008.05.27; 1998963;  305710;   24555;  807989;  880260; 1160830; 1993959; 1993374;    5004;    5589
EUR STYLE NATURAL GAS OPTIONS - NEW YORK MERCANTILE EXCHANGE ;2008.05.20; 2094957;  335812;   24712;  844389;  909525; 1220026; 2089726; 2089127;    5231;    5829
EUR STYLE NATURAL GAS OPTIONS - NEW YORK MERCANTILE EXCHANGE ;2008.05.13; 2041402;  311529;   26497;  831685;  892697; 1176957; 2035911; 2035140;    5490;    6262
EUR STYLE NATURAL GAS OPTIONS - NEW YORK MERCANTILE EXCHANGE ;2008.05.06; 1999396;  289715;   25785;  824567;  878841; 1142358; 1993123; 1992709;    6273;    6687
EUR STYLE NATURAL GAS OPTIONS - NEW YORK MERCANTILE EXCHANGE ;2008.04.29; 1950059;  266222;   23947;  815076;  860041; 1102675; 1941339; 1941699;    8720;    8361
EUR STYLE NATURAL GAS OPTIONS - NEW YORK MERCANTILE EXCHANGE ;2011.07.12; 1645851;   91293;   85024;  508522; 1039718; 1047964; 1639533; 1641509;    6317;    4341
