VALUE LINE STOCK INDEX - KCBT STOCK INDEX VLA ;1995.04.11;     775;       0;     215;       0;     432;     127;     432;     342;     343;     433
VALUE LINE STOCK INDEX - KCBT STOCK INDEX VLA ;1995.04.04;     804;       0;     210;       0;     494;     125;     494;     335;     310;     469
VALUE LINE STOCK INDEX - KCBT STOCK INDEX VLA ;1995.03.28;     748;       0;     203;       0;     392;     114;     392;     317;     356;     431
VALUE LINE STOCK INDEX - KCBT STOCK INDEX VLA ;1995.03.21;     647;       0;     153;       0;     301;      95;     301;     248;     346;     399
VALUE LINE STOCK INDEX - KCBT STOCK INDEX VLA ;1995.04.11;     775;       0;     215;       0;     432;     127;     432;     342;     343;     433
VALUE LINE STOCK INDEX - KCBT STOCK INDEX VLA ;1995.04.04;     804;       0;     210;       0;     494;     125;     494;     335;     310;     469
VALUE LINE STOCK INDEX - KCBT STOCK INDEX VLA ;1995.03.28;     748;       0;     203;       0;     392;     114;     392;     317;     356;     431
VALUE LINE STOCK INDEX - KCBT STOCK INDEX VLA ;1995.03.21;     647;       0;     153;       0;     301;      95;     301;     248;     346;     399
VALUE LINE STOCK INDEX - KCBT STOCK INDEX VLA ;1995.04.11;     775;       0;     215;       0;     432;     127;     432;     342;     343;     433
VALUE LINE STOCK INDEX - KCBT STOCK INDEX VLA ;1995.04.04;     804;       0;     210;       0;     494;     125;     494;     335;     310;     469
VALUE LINE STOCK INDEX - KCBT STOCK INDEX VLA ;1995.03.28;     748;       0;     203;       0;     392;     114;     392;     317;     356;     431
VALUE LINE STOCK INDEX - KCBT STOCK INDEX VLA ;1995.03.21;     647;       0;     153;       0;     301;      95;     301;     248;     346;     399
