WHEAT - MGE WHEAT ;1995.04.11;   63590;     600;    4815;    1200;   26259;   20524;   28059;   26539;   35531;   37051
WHEAT - MGE WHEAT ;1995.04.04;   65231;    1145;    9345;    1200;   31745;   22704;   34090;   33249;   31141;   31982
WHEAT - MGE WHEAT ;1995.03.28;   64018;    1145;    8160;    1700;   29426;   23769;   32271;   33629;   31747;   30389
WHEAT - MGE WHEAT ;1995.03.21;   61451;     570;    8140;    1200;   27415;   19798;   29185;   29138;   32266;   32314
WHEAT - MGE WHEAT ;1995.04.11;   63590;     600;    4815;    1200;   26259;   20524;   28059;   26539;   35531;   37051
WHEAT - MGE WHEAT ;1995.04.04;   65231;    1145;    9345;    1200;   31745;   22704;   34090;   33249;   31141;   31982
WHEAT - MGE WHEAT ;1995.03.28;   64018;    1145;    8160;    1700;   29426;   23769;   32271;   33629;   31747;   30389
WHEAT - MGE WHEAT ;1995.03.21;   61451;     570;    8140;    1200;   27415;   19798;   29185;   29138;   32266;   32314
WHEAT - MGE WHEAT ;1995.04.11;   63590;     600;    4815;    1200;   26259;   20524;   28059;   26539;   35531;   37051
WHEAT - MGE WHEAT ;1995.04.04;   65231;    1145;    9345;    1200;   31745;   22704;   34090;   33249;   31141;   31982
WHEAT - MGE WHEAT ;1995.03.28;   64018;    1145;    8160;    1700;   29426;   23769;   32271;   33629;   31747;   30389
WHEAT - MGE WHEAT ;1995.03.21;   61451;     570;    8140;    1200;   27415;   19798;   29185;   29138;   32266;   32314
