HSC FIN BASIS - ICE OTC ;2011.07.12;  313248;    5022;   36789;   18017;  281653;  251945;  304692;  306751;    8556;    6497
HSC FIN BASIS - ICE OTC ;2011.07.12;  313248;    5022;   36789;   18017;  281653;  251945;  304692;  306751;    8556;    6497
HSC FIN BASIS - ICE OTC ;2010.12.28;  351586;   16807;   51914;   17902;  310087;  276570;  344796;  346386;    6790;    5200
HSC FIN BASIS - ICE OTC ;2010.12.21;  345896;   18119;   48512;   17725;  303324;  275163;  339168;  341400;    6728;    4496
HSC FIN BASIS - ICE OTC ;2010.12.14;  346806;   19334;   43855;   22495;  296958;  274941;  338787;  341291;    8019;    5515
HSC FIN BASIS - ICE OTC ;2010.12.07;  341401;   20971;   27563;   29270;  283776;  280816;  334017;  337649;    7384;    3752
HSC FIN BASIS - ICE OTC ;2010.11.30;  369742;   24850;   24044;   27846;  307386;  312101;  360082;  363991;    9660;    5751
HSC FIN BASIS - ICE OTC ;2010.11.23;  356536;   25485;   33300;   21804;  299064;  295946;  346353;  351050;   10183;    5486
HSC FIN BASIS - ICE OTC ;2010.11.16;  344554;   23531;   35001;   21225;  287894;  284039;  332650;  340265;   11904;    4289
HSC FIN BASIS - ICE OTC ;2010.11.09;  342580;   23556;   41489;   19315;  288351;  275803;  331222;  336607;   11358;    5973
HSC FIN BASIS - ICE OTC ;2010.11.02;  360692;   26594;   45928;   17516;  306834;  293476;  350944;  356920;    9748;    3772
HSC FIN BASIS - ICE OTC ;2010.10.26;  362120;   27275;   46746;   19456;  305589;  289894;  352320;  356096;    9800;    6024
HSC FIN BASIS - ICE OTC ;2010.10.19;  377906;   28151;   81997;   21863;  317519;  268578;  367533;  372438;   10373;    5468
HSC FIN BASIS - ICE OTC ;2010.10.12;  368144;   27264;   73508;   19839;  310036;  268041;  357139;  361388;   11005;    6756
HSC FIN BASIS - ICE OTC ;2010.10.05;  358330;   24638;   80128;   11373;  314217;  259690;  350228;  351191;    8102;    7139
HSC FIN BASIS - ICE OTC ;2010.09.28;  397153;   20848;   89507;   18064;  352085;  283772;  390997;  391343;    6156;    5810
HSC FIN BASIS - ICE OTC ;2010.09.21;  390745;   19946;   83087;   18730;  344989;  281968;  383665;  383785;    7080;    6960
HSC FIN BASIS - ICE OTC ;2010.09.14;  391710;   20003;   70437;   27284;  335881;  285323;  383168;  383044;    8542;    8666
HSC FIN BASIS - ICE OTC ;2010.09.07;  372956;   16135;   54801;   31227;  319793;  279969;  367155;  365997;    5801;    6959
HSC FIN BASIS - ICE OTC ;2010.08.31;  392765;   14152;   56882;   34810;  339104;  294926;  388066;  386618;    4699;    6147
HSC FIN BASIS - ICE OTC ;2010.08.24;  385487;   15156;   57595;   30185;  334636;  290344;  379977;  378124;    5510;    7363
HSC FIN BASIS - ICE OTC ;2010.08.17;  371355;   14221;   60395;   30004;  319926;  272421;  364151;  362820;    7204;    8535
HSC FIN BASIS - ICE OTC ;2011.07.12;  313248;    5022;   36789;   18017;  281653;  251945;  304692;  306751;    8556;    6497
HSC FIN BASIS - ICE OTC ;2011.07.05;  334817;    5100;   33423;   17302;  304560;  277647;  326962;  328372;    7855;    6445
HSC FIN BASIS - ICE OTC ;2011.06.28;  322625;    5592;   33833;   14894;  294284;  266897;  314770;  315624;    7855;    7001
HSC FIN BASIS - ICE OTC ;2011.06.21;  291191;    7699;   22881;   18224;  256742;  241524;  282665;  282629;    8526;    8562
HSC FIN BASIS - ICE OTC ;2011.06.14;  291578;    7214;   32741;   14763;  259060;  235666;  281037;  283170;   10541;    8408
HSC FIN BASIS - ICE OTC ;2011.06.07;  300412;   11207;   33650;   21975;  256517;  236323;  289699;  291948;   10713;    8464
HSC FIN BASIS - ICE OTC ;2011.05.31;  320939;   10667;   36965;   20112;  282790;  255109;  313569;  312186;    7370;    8753
HSC FIN BASIS - ICE OTC ;2011.05.24;  320002;   10704;   25721;   19852;  279895;  266076;  310451;  311649;    9551;    8353
HSC FIN BASIS - ICE OTC ;2011.05.17;  338393;   11527;   21055;   22513;  293491;  286103;  327531;  329671;   10862;    8722
HSC FIN BASIS - ICE OTC ;2011.05.10;  343119;   13225;   15905;   24894;  293893;  294496;  332012;  335295;   11107;    7824
HSC FIN BASIS - ICE OTC ;2011.05.03;  316272;   13930;   43417;    6704;  289260;  259490;  309894;  309611;    6378;    6661
HSC FIN BASIS - ICE OTC ;2011.04.26;  332722;   13097;   39988;   12360;  298784;  272152;  324241;  324500;    8481;    8222
HSC FIN BASIS - ICE OTC ;2011.04.19;  344439;   14773;   67457;    5387;  316405;  263467;  336565;  336311;    7874;    8128
HSC FIN BASIS - ICE OTC ;2011.04.12;  338623;   14168;   62509;   10964;  303631;  253406;  328763;  326879;    9860;   11744
HSC FIN BASIS - ICE OTC ;2011.04.05;  318297;   13719;   49682;   18743;  276190;  238437;  308652;  306862;    9645;   11435
HSC FIN BASIS - ICE OTC ;2011.03.29;  339145;   17774;   52048;   16709;  296406;  260724;  330889;  329481;    8256;    9664
HSC FIN BASIS - ICE OTC ;2011.03.22;  327711;   16988;   56800;   12503;  286845;  247474;  316336;  316777;   11375;   10934
HSC FIN BASIS - ICE OTC ;2011.03.15;  323212;   17804;   63603;    7628;  285219;  238817;  310651;  310048;   12561;   13164
HSC FIN BASIS - ICE OTC ;2011.03.08;  321671;   18140;   59787;    6282;  285211;  243753;  309633;  309822;   12038;   11849
HSC FIN BASIS - ICE OTC ;2011.03.01;  338688;   17377;   46418;   14412;  295299;  271436;  327088;  332266;   11600;    6422
HSC FIN BASIS - ICE OTC ;2011.02.22;  329419;   14756;   41888;   18162;  285395;  263132;  318313;  323182;   11106;    6237
HSC FIN BASIS - ICE OTC ;2011.02.15;  332034;   17420;   43345;   19197;  283792;  262149;  320409;  324691;   11625;    7343
HSC FIN BASIS - ICE OTC ;2011.02.08;  329027;   15902;   27544;   29898;  274373;  263286;  320173;  320728;    8854;    8299
HSC FIN BASIS - ICE OTC ;2011.02.01;  353690;   18603;   18501;   38459;  289026;  289723;  346088;  346683;    7602;    7007
HSC FIN BASIS - ICE OTC ;2011.01.25;  344302;   13549;   19877;   39246;  284327;  278187;  337122;  337310;    7180;    6992
HSC FIN BASIS - ICE OTC ;2011.01.18;  334075;   12745;   30405;   31673;  282699;  265035;  327117;  327113;    6958;    6962
HSC FIN BASIS - ICE OTC ;2011.01.11;  330683;   16147;   41092;   23911;  282575;  258991;  322633;  323994;    8050;    6689
HSC FIN BASIS - ICE OTC ;2011.01.04;  348081;   17871;   53512;   15222;  302913;  275827;  336006;  344561;   12075;    3520
HSC FIN BASIS - ICE OTC ;2011.07.12;  313248;    5022;   36789;   18017;  281653;  251945;  304692;  306751;    8556;    6497
HSC FIN BASIS - ICE OTC ;2010.12.28;  351586;   16807;   51914;   17902;  310087;  276570;  344796;  346386;    6790;    5200
HSC FIN BASIS - ICE OTC ;2010.12.21;  345896;   18119;   48512;   17725;  303324;  275163;  339168;  341400;    6728;    4496
HSC FIN BASIS - ICE OTC ;2010.12.14;  346806;   19334;   43855;   22495;  296958;  274941;  338787;  341291;    8019;    5515
HSC FIN BASIS - ICE OTC ;2010.12.07;  341401;   20971;   27563;   29270;  283776;  280816;  334017;  337649;    7384;    3752
HSC FIN BASIS - ICE OTC ;2010.11.30;  369742;   24850;   24044;   27846;  307386;  312101;  360082;  363991;    9660;    5751
HSC FIN BASIS - ICE OTC ;2010.11.23;  356536;   25485;   33300;   21804;  299064;  295946;  346353;  351050;   10183;    5486
HSC FIN BASIS - ICE OTC ;2010.11.16;  344554;   23531;   35001;   21225;  287894;  284039;  332650;  340265;   11904;    4289
HSC FIN BASIS - ICE OTC ;2010.11.09;  342580;   23556;   41489;   19315;  288351;  275803;  331222;  336607;   11358;    5973
HSC FIN BASIS - ICE OTC ;2010.11.02;  360692;   26594;   45928;   17516;  306834;  293476;  350944;  356920;    9748;    3772
HSC FIN BASIS - ICE OTC ;2010.10.26;  362120;   27275;   46746;   19456;  305589;  289894;  352320;  356096;    9800;    6024
HSC FIN BASIS - ICE OTC ;2010.10.19;  377906;   28151;   81997;   21863;  317519;  268578;  367533;  372438;   10373;    5468
HSC FIN BASIS - ICE OTC ;2010.10.12;  368144;   27264;   73508;   19839;  310036;  268041;  357139;  361388;   11005;    6756
HSC FIN BASIS - ICE OTC ;2010.10.05;  358330;   24638;   80128;   11373;  314217;  259690;  350228;  351191;    8102;    7139
HSC FIN BASIS - ICE OTC ;2010.09.28;  397153;   20848;   89507;   18064;  352085;  283772;  390997;  391343;    6156;    5810
HSC FIN BASIS - ICE OTC ;2010.09.21;  390745;   19946;   83087;   18730;  344989;  281968;  383665;  383785;    7080;    6960
HSC FIN BASIS - ICE OTC ;2010.09.14;  391710;   20003;   70437;   27284;  335881;  285323;  383168;  383044;    8542;    8666
HSC FIN BASIS - ICE OTC ;2010.09.07;  372956;   16135;   54801;   31227;  319793;  279969;  367155;  365997;    5801;    6959
HSC FIN BASIS - ICE OTC ;2010.08.31;  392765;   14152;   56882;   34810;  339104;  294926;  388066;  386618;    4699;    6147
HSC FIN BASIS - ICE OTC ;2010.08.24;  385487;   15156;   57595;   30185;  334636;  290344;  379977;  378124;    5510;    7363
HSC FIN BASIS - ICE OTC ;2010.08.17;  371355;   14221;   60395;   30004;  319926;  272421;  364151;  362820;    7204;    8535
HSC FIN BASIS - ICE OTC ;2011.07.12;  313248;    5022;   36789;   18017;  281653;  251945;  304692;  306751;    8556;    6497
HSC FIN BASIS - ICE OTC ;2011.07.05;  334817;    5100;   33423;   17302;  304560;  277647;  326962;  328372;    7855;    6445
HSC FIN BASIS - ICE OTC ;2011.06.28;  322625;    5592;   33833;   14894;  294284;  266897;  314770;  315624;    7855;    7001
HSC FIN BASIS - ICE OTC ;2011.06.21;  291191;    7699;   22881;   18224;  256742;  241524;  282665;  282629;    8526;    8562
HSC FIN BASIS - ICE OTC ;2011.06.14;  291578;    7214;   32741;   14763;  259060;  235666;  281037;  283170;   10541;    8408
HSC FIN BASIS - ICE OTC ;2011.06.07;  300412;   11207;   33650;   21975;  256517;  236323;  289699;  291948;   10713;    8464
HSC FIN BASIS - ICE OTC ;2011.05.31;  320939;   10667;   36965;   20112;  282790;  255109;  313569;  312186;    7370;    8753
HSC FIN BASIS - ICE OTC ;2011.05.24;  320002;   10704;   25721;   19852;  279895;  266076;  310451;  311649;    9551;    8353
HSC FIN BASIS - ICE OTC ;2011.05.17;  338393;   11527;   21055;   22513;  293491;  286103;  327531;  329671;   10862;    8722
HSC FIN BASIS - ICE OTC ;2011.05.10;  343119;   13225;   15905;   24894;  293893;  294496;  332012;  335295;   11107;    7824
HSC FIN BASIS - ICE OTC ;2011.05.03;  316272;   13930;   43417;    6704;  289260;  259490;  309894;  309611;    6378;    6661
HSC FIN BASIS - ICE OTC ;2011.04.26;  332722;   13097;   39988;   12360;  298784;  272152;  324241;  324500;    8481;    8222
HSC FIN BASIS - ICE OTC ;2011.04.19;  344439;   14773;   67457;    5387;  316405;  263467;  336565;  336311;    7874;    8128
HSC FIN BASIS - ICE OTC ;2011.04.12;  338623;   14168;   62509;   10964;  303631;  253406;  328763;  326879;    9860;   11744
HSC FIN BASIS - ICE OTC ;2011.04.05;  318297;   13719;   49682;   18743;  276190;  238437;  308652;  306862;    9645;   11435
HSC FIN BASIS - ICE OTC ;2011.03.29;  339145;   17774;   52048;   16709;  296406;  260724;  330889;  329481;    8256;    9664
HSC FIN BASIS - ICE OTC ;2011.03.22;  327711;   16988;   56800;   12503;  286845;  247474;  316336;  316777;   11375;   10934
HSC FIN BASIS - ICE OTC ;2011.03.15;  323212;   17804;   63603;    7628;  285219;  238817;  310651;  310048;   12561;   13164
HSC FIN BASIS - ICE OTC ;2011.03.08;  321671;   18140;   59787;    6282;  285211;  243753;  309633;  309822;   12038;   11849
HSC FIN BASIS - ICE OTC ;2011.03.01;  338688;   17377;   46418;   14412;  295299;  271436;  327088;  332266;   11600;    6422
HSC FIN BASIS - ICE OTC ;2011.02.22;  329419;   14756;   41888;   18162;  285395;  263132;  318313;  323182;   11106;    6237
HSC FIN BASIS - ICE OTC ;2011.02.15;  332034;   17420;   43345;   19197;  283792;  262149;  320409;  324691;   11625;    7343
HSC FIN BASIS - ICE OTC ;2011.02.08;  329027;   15902;   27544;   29898;  274373;  263286;  320173;  320728;    8854;    8299
HSC FIN BASIS - ICE OTC ;2011.02.01;  353690;   18603;   18501;   38459;  289026;  289723;  346088;  346683;    7602;    7007
HSC FIN BASIS - ICE OTC ;2011.01.25;  344302;   13549;   19877;   39246;  284327;  278187;  337122;  337310;    7180;    6992
HSC FIN BASIS - ICE OTC ;2011.01.18;  334075;   12745;   30405;   31673;  282699;  265035;  327117;  327113;    6958;    6962
HSC FIN BASIS - ICE OTC ;2011.01.11;  330683;   16147;   41092;   23911;  282575;  258991;  322633;  323994;    8050;    6689
HSC FIN BASIS - ICE OTC ;2011.01.04;  348081;   17871;   53512;   15222;  302913;  275827;  336006;  344561;   12075;    3520
HSC FIN BASIS - ICE OTC ;2011.07.12;  313248;    5022;   36789;   18017;  281653;  251945;  304692;  306751;    8556;    6497
HSC FIN BASIS - ICE OTC ;2011.07.05;  334817;    5100;   33423;   17302;  304560;  277647;  326962;  328372;    7855;    6445
HSC FIN BASIS - ICE OTC ;2011.06.28;  322625;    5592;   33833;   14894;  294284;  266897;  314770;  315624;    7855;    7001
HSC FIN BASIS - ICE OTC ;2011.06.21;  291191;    7699;   22881;   18224;  256742;  241524;  282665;  282629;    8526;    8562
HSC FIN BASIS - ICE OTC ;2011.06.14;  291578;    7214;   32741;   14763;  259060;  235666;  281037;  283170;   10541;    8408
HSC FIN BASIS - ICE OTC ;2011.06.07;  300412;   11207;   33650;   21975;  256517;  236323;  289699;  291948;   10713;    8464
HSC FIN BASIS - ICE OTC ;2011.05.31;  320939;   10667;   36965;   20112;  282790;  255109;  313569;  312186;    7370;    8753
HSC FIN BASIS - ICE OTC ;2011.05.24;  320002;   10704;   25721;   19852;  279895;  266076;  310451;  311649;    9551;    8353
HSC FIN BASIS - ICE OTC ;2011.05.17;  338393;   11527;   21055;   22513;  293491;  286103;  327531;  329671;   10862;    8722
HSC FIN BASIS - ICE OTC ;2011.05.10;  343119;   13225;   15905;   24894;  293893;  294496;  332012;  335295;   11107;    7824
HSC FIN BASIS - ICE OTC ;2011.05.03;  316272;   13930;   43417;    6704;  289260;  259490;  309894;  309611;    6378;    6661
HSC FIN BASIS - ICE OTC ;2011.04.26;  332722;   13097;   39988;   12360;  298784;  272152;  324241;  324500;    8481;    8222
HSC FIN BASIS - ICE OTC ;2011.04.19;  344439;   14773;   67457;    5387;  316405;  263467;  336565;  336311;    7874;    8128
HSC FIN BASIS - ICE OTC ;2011.04.12;  338623;   14168;   62509;   10964;  303631;  253406;  328763;  326879;    9860;   11744
HSC FIN BASIS - ICE OTC ;2011.04.05;  318297;   13719;   49682;   18743;  276190;  238437;  308652;  306862;    9645;   11435
HSC FIN BASIS - ICE OTC ;2011.03.29;  339145;   17774;   52048;   16709;  296406;  260724;  330889;  329481;    8256;    9664
HSC FIN BASIS - ICE OTC ;2011.03.22;  327711;   16988;   56800;   12503;  286845;  247474;  316336;  316777;   11375;   10934
HSC FIN BASIS - ICE OTC ;2011.03.15;  323212;   17804;   63603;    7628;  285219;  238817;  310651;  310048;   12561;   13164
HSC FIN BASIS - ICE OTC ;2011.03.08;  321671;   18140;   59787;    6282;  285211;  243753;  309633;  309822;   12038;   11849
HSC FIN BASIS - ICE OTC ;2011.03.01;  338688;   17377;   46418;   14412;  295299;  271436;  327088;  332266;   11600;    6422
HSC FIN BASIS - ICE OTC ;2011.02.22;  329419;   14756;   41888;   18162;  285395;  263132;  318313;  323182;   11106;    6237
HSC FIN BASIS - ICE OTC ;2011.02.15;  332034;   17420;   43345;   19197;  283792;  262149;  320409;  324691;   11625;    7343
HSC FIN BASIS - ICE OTC ;2011.02.08;  329027;   15902;   27544;   29898;  274373;  263286;  320173;  320728;    8854;    8299
HSC FIN BASIS - ICE OTC ;2011.02.01;  353690;   18603;   18501;   38459;  289026;  289723;  346088;  346683;    7602;    7007
HSC FIN BASIS - ICE OTC ;2011.01.25;  344302;   13549;   19877;   39246;  284327;  278187;  337122;  337310;    7180;    6992
HSC FIN BASIS - ICE OTC ;2011.01.18;  334075;   12745;   30405;   31673;  282699;  265035;  327117;  327113;    6958;    6962
HSC FIN BASIS - ICE OTC ;2011.01.11;  330683;   16147;   41092;   23911;  282575;  258991;  322633;  323994;    8050;    6689
HSC FIN BASIS - ICE OTC ;2011.01.04;  348081;   17871;   53512;   15222;  302913;  275827;  336006;  344561;   12075;    3520
HSC FIN BASIS - ICE OTC ;2010.12.28;  351586;   16807;   51914;   17902;  310087;  276570;  344796;  346386;    6790;    5200
HSC FIN BASIS - ICE OTC ;2010.12.21;  345896;   18119;   48512;   17725;  303324;  275163;  339168;  341400;    6728;    4496
HSC FIN BASIS - ICE OTC ;2010.12.14;  346806;   19334;   43855;   22495;  296958;  274941;  338787;  341291;    8019;    5515
HSC FIN BASIS - ICE OTC ;2010.12.07;  341401;   20971;   27563;   29270;  283776;  280816;  334017;  337649;    7384;    3752
HSC FIN BASIS - ICE OTC ;2010.11.30;  369742;   24850;   24044;   27846;  307386;  312101;  360082;  363991;    9660;    5751
HSC FIN BASIS - ICE OTC ;2010.11.23;  356536;   25485;   33300;   21804;  299064;  295946;  346353;  351050;   10183;    5486
HSC FIN BASIS - ICE OTC ;2010.11.16;  344554;   23531;   35001;   21225;  287894;  284039;  332650;  340265;   11904;    4289
HSC FIN BASIS - ICE OTC ;2010.11.09;  342580;   23556;   41489;   19315;  288351;  275803;  331222;  336607;   11358;    5973
HSC FIN BASIS - ICE OTC ;2010.11.02;  360692;   26594;   45928;   17516;  306834;  293476;  350944;  356920;    9748;    3772
HSC FIN BASIS - ICE OTC ;2010.10.26;  362120;   27275;   46746;   19456;  305589;  289894;  352320;  356096;    9800;    6024
HSC FIN BASIS - ICE OTC ;2010.10.19;  377906;   28151;   81997;   21863;  317519;  268578;  367533;  372438;   10373;    5468
HSC FIN BASIS - ICE OTC ;2010.10.12;  368144;   27264;   73508;   19839;  310036;  268041;  357139;  361388;   11005;    6756
HSC FIN BASIS - ICE OTC ;2010.10.05;  358330;   24638;   80128;   11373;  314217;  259690;  350228;  351191;    8102;    7139
HSC FIN BASIS - ICE OTC ;2010.09.28;  397153;   20848;   89507;   18064;  352085;  283772;  390997;  391343;    6156;    5810
HSC FIN BASIS - ICE OTC ;2010.09.21;  390745;   19946;   83087;   18730;  344989;  281968;  383665;  383785;    7080;    6960
HSC FIN BASIS - ICE OTC ;2010.09.14;  391710;   20003;   70437;   27284;  335881;  285323;  383168;  383044;    8542;    8666
HSC FIN BASIS - ICE OTC ;2010.09.07;  372956;   16135;   54801;   31227;  319793;  279969;  367155;  365997;    5801;    6959
HSC FIN BASIS - ICE OTC ;2010.08.31;  392765;   14152;   56882;   34810;  339104;  294926;  388066;  386618;    4699;    6147
HSC FIN BASIS - ICE OTC ;2010.08.24;  385487;   15156;   57595;   30185;  334636;  290344;  379977;  378124;    5510;    7363
HSC FIN BASIS - ICE OTC ;2010.08.17;  371355;   14221;   60395;   30004;  319926;  272421;  364151;  362820;    7204;    8535
HSC FIN BASIS - ICE OTC ;2011.07.12;  313248;    5022;   36789;   18017;  281653;  251945;  304692;  306751;    8556;    6497
