SUGAR NO. 14 - CSCE SUGAR NO. 14 ;1995.04.04;   10957;       0;       0;       0;    8539;    9332;    8539;    9332;    2418;    1625
SUGAR NO. 14 - CSCE SUGAR NO. 14 ;1995.03.28;   11197;       0;       0;       0;    9226;    9675;    9226;    9675;    1971;    1522
SUGAR NO. 14 - CSCE SUGAR NO. 14 ;1995.03.21;   11457;       0;       0;       0;    9567;    9909;    9567;    9909;    1890;    1548
SUGAR NO. 14 - CSCE SUGAR NO. 14 ;1995.04.04;   10957;       0;       0;       0;    8539;    9332;    8539;    9332;    2418;    1625
SUGAR NO. 14 - CSCE SUGAR NO. 14 ;1995.03.28;   11197;       0;       0;       0;    9226;    9675;    9226;    9675;    1971;    1522
SUGAR NO. 14 - CSCE SUGAR NO. 14 ;1995.03.21;   11457;       0;       0;       0;    9567;    9909;    9567;    9909;    1890;    1548
SUGAR NO. 14 - CSCE SUGAR NO. 14 ;1995.04.04;   10957;       0;       0;       0;    8539;    9332;    8539;    9332;    2418;    1625
SUGAR NO. 14 - CSCE SUGAR NO. 14 ;1995.03.28;   11197;       0;       0;       0;    9226;    9675;    9226;    9675;    1971;    1522
SUGAR NO. 14 - CSCE SUGAR NO. 14 ;1995.03.21;   11457;       0;       0;       0;    9567;    9909;    9567;    9909;    1890;    1548
