FRZN CONCENTRATED ORANGE JUICE - CANY ORANGE JUICE ;1995.04.04;   31171;    4267;    1738;    5098;   16245;   18734;   25610;   25570;    5561;    5601
FRZN CONCENTRATED ORANGE JUICE - CANY ORANGE JUICE ;1995.03.28;   29862;    3726;    2018;    4596;   16171;   18133;   24493;   24747;    5369;    5116
FRZN CONCENTRATED ORANGE JUICE - CANY ORANGE JUICE ;1995.03.21;   29236;    3547;    2029;    4366;   16607;   17759;   24520;   24154;    4716;    5082
FRZN CONCENTRATED ORANGE JUICE - CANY ORANGE JUICE ;1995.04.04;   31171;    4267;    1738;    5098;   16245;   18734;   25610;   25570;    5561;    5601
FRZN CONCENTRATED ORANGE JUICE - CANY ORANGE JUICE ;1995.03.28;   29862;    3726;    2018;    4596;   16171;   18133;   24493;   24747;    5369;    5116
FRZN CONCENTRATED ORANGE JUICE - CANY ORANGE JUICE ;1995.03.21;   29236;    3547;    2029;    4366;   16607;   17759;   24520;   24154;    4716;    5082
FRZN CONCENTRATED ORANGE JUICE - CANY ORANGE JUICE ;1995.04.04;   31171;    4267;    1738;    5098;   16245;   18734;   25610;   25570;    5561;    5601
FRZN CONCENTRATED ORANGE JUICE - CANY ORANGE JUICE ;1995.03.28;   29862;    3726;    2018;    4596;   16171;   18133;   24493;   24747;    5369;    5116
FRZN CONCENTRATED ORANGE JUICE - CANY ORANGE JUICE ;1995.03.21;   29236;    3547;    2029;    4366;   16607;   17759;   24520;   24154;    4716;    5082
