NATURAL GAS CAL SPREAD OPTIONS - NEW YORK MERCANTILE EXCHANGE ;2009.02.17;   42056;   17469;   24108;    5186;   19256;   12588;   41911;   41882;     144;     174
NATURAL GAS CAL SPREAD OPTIONS - NEW YORK MERCANTILE EXCHANGE ;2009.02.10;   43959;   18603;   25268;    5435;   19716;   13008;   43754;   43711;     205;     248
NATURAL GAS CAL SPREAD OPTIONS - NEW YORK MERCANTILE EXCHANGE ;2009.02.03;   47197;   21144;   24960;    5765;   20008;   16181;   46916;   46906;     280;     291
NATURAL GAS CAL SPREAD OPTIONS - NEW YORK MERCANTILE EXCHANGE ;2009.01.27;   46664;   20646;   24977;    5728;   20042;   15719;   46416;   46425;     248;     239
NATURAL GAS CAL SPREAD OPTIONS - NEW YORK MERCANTILE EXCHANGE ;2009.01.20;   46367;   20437;   24656;    5857;   19832;   15609;   46126;   46122;     241;     245
NATURAL GAS CAL SPREAD OPTIONS - NEW YORK MERCANTILE EXCHANGE ;2009.01.13;   43912;   21760;   25213;    5500;   16595;   13038;   43856;   43751;      56;     161
NATURAL GAS CAL SPREAD OPTIONS - NEW YORK MERCANTILE EXCHANGE ;2009.01.06;   42134;   19706;   23812;    5843;   16397;   12285;   41946;   41939;     188;     195
NATURAL GAS CAL SPREAD OPTIONS - NEW YORK MERCANTILE EXCHANGE ;2008.12.30;   41436;   19603;   23476;    5710;   15981;   12064;   41295;   41250;     141;     186
NATURAL GAS CAL SPREAD OPTIONS - NEW YORK MERCANTILE EXCHANGE ;2008.12.22;   42832;   20702;   24179;    5734;   16124;   12577;   42560;   42490;     272;     343
NATURAL GAS CAL SPREAD OPTIONS - NEW YORK MERCANTILE EXCHANGE ;2008.12.16;   39487;   19382;   23196;    4873;   15001;   11117;   39256;   39186;     231;     301
NATURAL GAS CAL SPREAD OPTIONS - NEW YORK MERCANTILE EXCHANGE ;2008.12.09;   41649;   19105;   23146;    6087;   16200;   12085;   41392;   41319;     256;     330
NATURAL GAS CAL SPREAD OPTIONS - NEW YORK MERCANTILE EXCHANGE ;2008.12.02;   37969;   17024;   22033;    5424;   15337;   10218;   37785;   37676;     184;     294
NATURAL GAS CAL SPREAD OPTIONS - NEW YORK MERCANTILE EXCHANGE ;2008.11.25;   37307;   16608;   21609;    5396;   15114;   10004;   37119;   37010;     188;     298
NATURAL GAS CAL SPREAD OPTIONS - NEW YORK MERCANTILE EXCHANGE ;2008.11.18;   36406;   15596;   20491;    5736;   14876;    9920;   36208;   36146;     198;     260
NATURAL GAS CAL SPREAD OPTIONS - NEW YORK MERCANTILE EXCHANGE ;2008.11.11;   34673;   14638;   19970;    5285;   14557;    9152;   34480;   34407;     193;     266
NATURAL GAS CAL SPREAD OPTIONS - NEW YORK MERCANTILE EXCHANGE ;2008.11.04;   33488;   13394;   18823;    5460;   14448;    8924;   33302;   33208;     186;     281
NATURAL GAS CAL SPREAD OPTIONS - NEW YORK MERCANTILE EXCHANGE ;2008.10.28;   32840;   13920;   19356;    4834;   13947;    8456;   32701;   32646;     139;     194
NATURAL GAS CAL SPREAD OPTIONS - NEW YORK MERCANTILE EXCHANGE ;2008.10.21;   31287;   12337;   17907;    5032;   13799;    8103;   31168;   31042;     118;     244
NATURAL GAS CAL SPREAD OPTIONS - NEW YORK MERCANTILE EXCHANGE ;2008.10.14;   30902;     453;   18997;    3471;   13577;    7956;   17501;   30423;   13400;     478
NATURAL GAS CAL SPREAD OPTIONS - NEW YORK MERCANTILE EXCHANGE ;2008.10.07;   31541;   14320;   19305;    3428;   13594;    7854;   31342;   30587;     199;     954
NATURAL GAS CAL SPREAD OPTIONS - NEW YORK MERCANTILE EXCHANGE ;2008.09.30;   30206;   13292;   18418;    3393;   13404;    7212;   30089;   29023;     117;    1183
NATURAL GAS CAL SPREAD OPTIONS - NEW YORK MERCANTILE EXCHANGE ;2008.09.23;   29673;   12073;   17052;    3841;   13641;    7464;   29555;   28357;     118;    1316
NATURAL GAS CAL SPREAD OPTIONS - NEW YORK MERCANTILE EXCHANGE ;2008.09.16;   29755;   11644;   17902;    4344;   13639;    6761;   29627;   29007;     128;     748
NATURAL GAS CAL SPREAD OPTIONS - NEW YORK MERCANTILE EXCHANGE ;2008.09.09;   29972;    9894;   17032;    6159;   13754;    6692;   29807;   29883;     165;      89
NATURAL GAS CAL SPREAD OPTIONS - NEW YORK MERCANTILE EXCHANGE ;2008.09.02;   29751;   10846;   18024;    5150;   13595;    5804;   29592;   28978;     160;     773
NATURAL GAS CAL SPREAD OPTIONS - NEW YORK MERCANTILE EXCHANGE ;2008.08.26;   26977;    8834;   16450;    4496;   11695;    5804;   25025;   26749;    1952;     228
NATURAL GAS CAL SPREAD OPTIONS - NEW YORK MERCANTILE EXCHANGE ;2008.08.19;   26372;    9235;   16042;    4454;   12532;    5435;   26221;   25931;     151;     441
NATURAL GAS CAL SPREAD OPTIONS - NEW YORK MERCANTILE EXCHANGE ;2008.08.12;   25490;    7849;   14685;    5516;   11928;    4732;   25293;   24933;     198;     557
NATURAL GAS CAL SPREAD OPTIONS - NEW YORK MERCANTILE EXCHANGE ;2008.08.05;   24987;    7865;   13788;    5639;   11339;    5508;   24842;   24934;     145;      53
NATURAL GAS CAL SPREAD OPTIONS - NEW YORK MERCANTILE EXCHANGE ;2008.07.29;   23628;    6963;   13205;    5492;   10986;    4541;   23441;   23238;     187;     390
NATURAL GAS CAL SPREAD OPTIONS - NEW YORK MERCANTILE EXCHANGE ;2008.07.22;   21969;    5645;   10629;    5739;   10350;    5239;   21734;   21607;     235;     362
NATURAL GAS CAL SPREAD OPTIONS - NEW YORK MERCANTILE EXCHANGE ;2008.07.15;   20148;    5406;    9145;    4699;    9899;    6009;   20004;   19854;     144;     294
NATURAL GAS CAL SPREAD OPTIONS - NEW YORK MERCANTILE EXCHANGE ;2008.07.08;   19088;    6273;    8313;    3454;    9181;    6987;   18907;   18754;     181;     334
NATURAL GAS CAL SPREAD OPTIONS - NEW YORK MERCANTILE EXCHANGE ;2008.07.01;   17742;    5210;    6684;    3843;    8527;    6901;   17580;   17428;     162;     314
NATURAL GAS CAL SPREAD OPTIONS - NEW YORK MERCANTILE EXCHANGE ;2008.06.24;   14004;    4649;    5035;    2856;    6337;    5798;   13841;   13689;     163;     315
NATURAL GAS CAL SPREAD OPTIONS - NEW YORK MERCANTILE EXCHANGE ;2008.06.17;   13872;    4426;    5002;    2941;    6294;    5568;   13661;   13511;     211;     360
NATURAL GAS CAL SPREAD OPTIONS - NEW YORK MERCANTILE EXCHANGE ;2008.06.10;   12928;    4124;    4110;    3032;    5565;    5477;   12721;   12619;     207;     309
NATURAL GAS CAL SPREAD OPTIONS - NEW YORK MERCANTILE EXCHANGE ;2008.06.03;   10881;    3874;    2620;    2640;    4159;    5312;   10673;   10572;     208;     309
NATURAL GAS CAL SPREAD OPTIONS - NEW YORK MERCANTILE EXCHANGE ;2008.05.27;    9976;    4482;    3157;    1753;    3526;    4754;    9761;    9663;     215;     313
NATURAL GAS CAL SPREAD OPTIONS - NEW YORK MERCANTILE EXCHANGE ;2008.05.20;    9944;    4461;    3255;    1672;    3547;    4671;    9680;    9597;     263;     346
NATURAL GAS CAL SPREAD OPTIONS - NEW YORK MERCANTILE EXCHANGE ;2008.05.13;    9517;    4399;    3255;    1363;    3514;    4559;    9276;    9177;     241;     339
NATURAL GAS CAL SPREAD OPTIONS - NEW YORK MERCANTILE EXCHANGE ;2008.05.06;    9583;    4416;    3282;    1373;    3551;    4586;    9340;    9241;     243;     342
NATURAL GAS CAL SPREAD OPTIONS - NEW YORK MERCANTILE EXCHANGE ;2009.02.17;   42056;   17469;   24108;    5186;   19256;   12588;   41911;   41882;     144;     174
NATURAL GAS CAL SPREAD OPTIONS - NEW YORK MERCANTILE EXCHANGE ;2009.02.10;   43959;   18603;   25268;    5435;   19716;   13008;   43754;   43711;     205;     248
NATURAL GAS CAL SPREAD OPTIONS - NEW YORK MERCANTILE EXCHANGE ;2009.02.03;   47197;   21144;   24960;    5765;   20008;   16181;   46916;   46906;     280;     291
NATURAL GAS CAL SPREAD OPTIONS - NEW YORK MERCANTILE EXCHANGE ;2009.01.27;   46664;   20646;   24977;    5728;   20042;   15719;   46416;   46425;     248;     239
NATURAL GAS CAL SPREAD OPTIONS - NEW YORK MERCANTILE EXCHANGE ;2009.01.20;   46367;   20437;   24656;    5857;   19832;   15609;   46126;   46122;     241;     245
NATURAL GAS CAL SPREAD OPTIONS - NEW YORK MERCANTILE EXCHANGE ;2009.01.13;   43912;   21760;   25213;    5500;   16595;   13038;   43856;   43751;      56;     161
NATURAL GAS CAL SPREAD OPTIONS - NEW YORK MERCANTILE EXCHANGE ;2009.01.06;   42134;   19706;   23812;    5843;   16397;   12285;   41946;   41939;     188;     195
NATURAL GAS CAL SPREAD OPTIONS - NEW YORK MERCANTILE EXCHANGE ;2008.12.30;   41436;   19603;   23476;    5710;   15981;   12064;   41295;   41250;     141;     186
NATURAL GAS CAL SPREAD OPTIONS - NEW YORK MERCANTILE EXCHANGE ;2008.12.22;   42832;   20702;   24179;    5734;   16124;   12577;   42560;   42490;     272;     343
NATURAL GAS CAL SPREAD OPTIONS - NEW YORK MERCANTILE EXCHANGE ;2008.12.16;   39487;   19382;   23196;    4873;   15001;   11117;   39256;   39186;     231;     301
NATURAL GAS CAL SPREAD OPTIONS - NEW YORK MERCANTILE EXCHANGE ;2008.12.09;   41649;   19105;   23146;    6087;   16200;   12085;   41392;   41319;     256;     330
NATURAL GAS CAL SPREAD OPTIONS - NEW YORK MERCANTILE EXCHANGE ;2008.12.02;   37969;   17024;   22033;    5424;   15337;   10218;   37785;   37676;     184;     294
NATURAL GAS CAL SPREAD OPTIONS - NEW YORK MERCANTILE EXCHANGE ;2008.11.25;   37307;   16608;   21609;    5396;   15114;   10004;   37119;   37010;     188;     298
NATURAL GAS CAL SPREAD OPTIONS - NEW YORK MERCANTILE EXCHANGE ;2008.11.18;   36406;   15596;   20491;    5736;   14876;    9920;   36208;   36146;     198;     260
NATURAL GAS CAL SPREAD OPTIONS - NEW YORK MERCANTILE EXCHANGE ;2008.11.11;   34673;   14638;   19970;    5285;   14557;    9152;   34480;   34407;     193;     266
NATURAL GAS CAL SPREAD OPTIONS - NEW YORK MERCANTILE EXCHANGE ;2008.11.04;   33488;   13394;   18823;    5460;   14448;    8924;   33302;   33208;     186;     281
NATURAL GAS CAL SPREAD OPTIONS - NEW YORK MERCANTILE EXCHANGE ;2008.10.28;   32840;   13920;   19356;    4834;   13947;    8456;   32701;   32646;     139;     194
NATURAL GAS CAL SPREAD OPTIONS - NEW YORK MERCANTILE EXCHANGE ;2008.10.21;   31287;   12337;   17907;    5032;   13799;    8103;   31168;   31042;     118;     244
NATURAL GAS CAL SPREAD OPTIONS - NEW YORK MERCANTILE EXCHANGE ;2008.10.14;   30902;     453;   18997;    3471;   13577;    7956;   17501;   30423;   13400;     478
NATURAL GAS CAL SPREAD OPTIONS - NEW YORK MERCANTILE EXCHANGE ;2008.10.07;   31541;   14320;   19305;    3428;   13594;    7854;   31342;   30587;     199;     954
NATURAL GAS CAL SPREAD OPTIONS - NEW YORK MERCANTILE EXCHANGE ;2008.09.30;   30206;   13292;   18418;    3393;   13404;    7212;   30089;   29023;     117;    1183
NATURAL GAS CAL SPREAD OPTIONS - NEW YORK MERCANTILE EXCHANGE ;2008.09.23;   29673;   12073;   17052;    3841;   13641;    7464;   29555;   28357;     118;    1316
NATURAL GAS CAL SPREAD OPTIONS - NEW YORK MERCANTILE EXCHANGE ;2008.09.16;   29755;   11644;   17902;    4344;   13639;    6761;   29627;   29007;     128;     748
NATURAL GAS CAL SPREAD OPTIONS - NEW YORK MERCANTILE EXCHANGE ;2008.09.09;   29972;    9894;   17032;    6159;   13754;    6692;   29807;   29883;     165;      89
NATURAL GAS CAL SPREAD OPTIONS - NEW YORK MERCANTILE EXCHANGE ;2008.09.02;   29751;   10846;   18024;    5150;   13595;    5804;   29592;   28978;     160;     773
NATURAL GAS CAL SPREAD OPTIONS - NEW YORK MERCANTILE EXCHANGE ;2008.08.26;   26977;    8834;   16450;    4496;   11695;    5804;   25025;   26749;    1952;     228
NATURAL GAS CAL SPREAD OPTIONS - NEW YORK MERCANTILE EXCHANGE ;2008.08.19;   26372;    9235;   16042;    4454;   12532;    5435;   26221;   25931;     151;     441
NATURAL GAS CAL SPREAD OPTIONS - NEW YORK MERCANTILE EXCHANGE ;2008.08.12;   25490;    7849;   14685;    5516;   11928;    4732;   25293;   24933;     198;     557
NATURAL GAS CAL SPREAD OPTIONS - NEW YORK MERCANTILE EXCHANGE ;2008.08.05;   24987;    7865;   13788;    5639;   11339;    5508;   24842;   24934;     145;      53
NATURAL GAS CAL SPREAD OPTIONS - NEW YORK MERCANTILE EXCHANGE ;2008.07.29;   23628;    6963;   13205;    5492;   10986;    4541;   23441;   23238;     187;     390
NATURAL GAS CAL SPREAD OPTIONS - NEW YORK MERCANTILE EXCHANGE ;2008.07.22;   21969;    5645;   10629;    5739;   10350;    5239;   21734;   21607;     235;     362
NATURAL GAS CAL SPREAD OPTIONS - NEW YORK MERCANTILE EXCHANGE ;2008.07.15;   20148;    5406;    9145;    4699;    9899;    6009;   20004;   19854;     144;     294
NATURAL GAS CAL SPREAD OPTIONS - NEW YORK MERCANTILE EXCHANGE ;2008.07.08;   19088;    6273;    8313;    3454;    9181;    6987;   18907;   18754;     181;     334
NATURAL GAS CAL SPREAD OPTIONS - NEW YORK MERCANTILE EXCHANGE ;2008.07.01;   17742;    5210;    6684;    3843;    8527;    6901;   17580;   17428;     162;     314
NATURAL GAS CAL SPREAD OPTIONS - NEW YORK MERCANTILE EXCHANGE ;2008.06.24;   14004;    4649;    5035;    2856;    6337;    5798;   13841;   13689;     163;     315
NATURAL GAS CAL SPREAD OPTIONS - NEW YORK MERCANTILE EXCHANGE ;2008.06.17;   13872;    4426;    5002;    2941;    6294;    5568;   13661;   13511;     211;     360
NATURAL GAS CAL SPREAD OPTIONS - NEW YORK MERCANTILE EXCHANGE ;2008.06.10;   12928;    4124;    4110;    3032;    5565;    5477;   12721;   12619;     207;     309
NATURAL GAS CAL SPREAD OPTIONS - NEW YORK MERCANTILE EXCHANGE ;2008.06.03;   10881;    3874;    2620;    2640;    4159;    5312;   10673;   10572;     208;     309
NATURAL GAS CAL SPREAD OPTIONS - NEW YORK MERCANTILE EXCHANGE ;2008.05.27;    9976;    4482;    3157;    1753;    3526;    4754;    9761;    9663;     215;     313
NATURAL GAS CAL SPREAD OPTIONS - NEW YORK MERCANTILE EXCHANGE ;2008.05.20;    9944;    4461;    3255;    1672;    3547;    4671;    9680;    9597;     263;     346
NATURAL GAS CAL SPREAD OPTIONS - NEW YORK MERCANTILE EXCHANGE ;2008.05.13;    9517;    4399;    3255;    1363;    3514;    4559;    9276;    9177;     241;     339
NATURAL GAS CAL SPREAD OPTIONS - NEW YORK MERCANTILE EXCHANGE ;2008.05.06;    9583;    4416;    3282;    1373;    3551;    4586;    9340;    9241;     243;     342
NATURAL GAS CAL SPREAD OPTIONS - NEW YORK MERCANTILE EXCHANGE ;2009.02.17;   42056;   17469;   24108;    5186;   19256;   12588;   41911;   41882;     144;     174
NATURAL GAS CAL SPREAD OPTIONS - NEW YORK MERCANTILE EXCHANGE ;2009.02.10;   43959;   18603;   25268;    5435;   19716;   13008;   43754;   43711;     205;     248
NATURAL GAS CAL SPREAD OPTIONS - NEW YORK MERCANTILE EXCHANGE ;2009.02.03;   47197;   21144;   24960;    5765;   20008;   16181;   46916;   46906;     280;     291
NATURAL GAS CAL SPREAD OPTIONS - NEW YORK MERCANTILE EXCHANGE ;2009.01.27;   46664;   20646;   24977;    5728;   20042;   15719;   46416;   46425;     248;     239
NATURAL GAS CAL SPREAD OPTIONS - NEW YORK MERCANTILE EXCHANGE ;2009.01.20;   46367;   20437;   24656;    5857;   19832;   15609;   46126;   46122;     241;     245
NATURAL GAS CAL SPREAD OPTIONS - NEW YORK MERCANTILE EXCHANGE ;2009.01.13;   43912;   21760;   25213;    5500;   16595;   13038;   43856;   43751;      56;     161
NATURAL GAS CAL SPREAD OPTIONS - NEW YORK MERCANTILE EXCHANGE ;2009.01.06;   42134;   19706;   23812;    5843;   16397;   12285;   41946;   41939;     188;     195
NATURAL GAS CAL SPREAD OPTIONS - NEW YORK MERCANTILE EXCHANGE ;2008.12.30;   41436;   19603;   23476;    5710;   15981;   12064;   41295;   41250;     141;     186
NATURAL GAS CAL SPREAD OPTIONS - NEW YORK MERCANTILE EXCHANGE ;2008.12.22;   42832;   20702;   24179;    5734;   16124;   12577;   42560;   42490;     272;     343
NATURAL GAS CAL SPREAD OPTIONS - NEW YORK MERCANTILE EXCHANGE ;2008.12.16;   39487;   19382;   23196;    4873;   15001;   11117;   39256;   39186;     231;     301
NATURAL GAS CAL SPREAD OPTIONS - NEW YORK MERCANTILE EXCHANGE ;2008.12.09;   41649;   19105;   23146;    6087;   16200;   12085;   41392;   41319;     256;     330
NATURAL GAS CAL SPREAD OPTIONS - NEW YORK MERCANTILE EXCHANGE ;2008.12.02;   37969;   17024;   22033;    5424;   15337;   10218;   37785;   37676;     184;     294
NATURAL GAS CAL SPREAD OPTIONS - NEW YORK MERCANTILE EXCHANGE ;2008.11.25;   37307;   16608;   21609;    5396;   15114;   10004;   37119;   37010;     188;     298
NATURAL GAS CAL SPREAD OPTIONS - NEW YORK MERCANTILE EXCHANGE ;2008.11.18;   36406;   15596;   20491;    5736;   14876;    9920;   36208;   36146;     198;     260
NATURAL GAS CAL SPREAD OPTIONS - NEW YORK MERCANTILE EXCHANGE ;2008.11.11;   34673;   14638;   19970;    5285;   14557;    9152;   34480;   34407;     193;     266
NATURAL GAS CAL SPREAD OPTIONS - NEW YORK MERCANTILE EXCHANGE ;2008.11.04;   33488;   13394;   18823;    5460;   14448;    8924;   33302;   33208;     186;     281
NATURAL GAS CAL SPREAD OPTIONS - NEW YORK MERCANTILE EXCHANGE ;2008.10.28;   32840;   13920;   19356;    4834;   13947;    8456;   32701;   32646;     139;     194
NATURAL GAS CAL SPREAD OPTIONS - NEW YORK MERCANTILE EXCHANGE ;2008.10.21;   31287;   12337;   17907;    5032;   13799;    8103;   31168;   31042;     118;     244
NATURAL GAS CAL SPREAD OPTIONS - NEW YORK MERCANTILE EXCHANGE ;2008.10.14;   30902;     453;   18997;    3471;   13577;    7956;   17501;   30423;   13400;     478
NATURAL GAS CAL SPREAD OPTIONS - NEW YORK MERCANTILE EXCHANGE ;2008.10.07;   31541;   14320;   19305;    3428;   13594;    7854;   31342;   30587;     199;     954
NATURAL GAS CAL SPREAD OPTIONS - NEW YORK MERCANTILE EXCHANGE ;2008.09.30;   30206;   13292;   18418;    3393;   13404;    7212;   30089;   29023;     117;    1183
NATURAL GAS CAL SPREAD OPTIONS - NEW YORK MERCANTILE EXCHANGE ;2008.09.23;   29673;   12073;   17052;    3841;   13641;    7464;   29555;   28357;     118;    1316
NATURAL GAS CAL SPREAD OPTIONS - NEW YORK MERCANTILE EXCHANGE ;2008.09.16;   29755;   11644;   17902;    4344;   13639;    6761;   29627;   29007;     128;     748
NATURAL GAS CAL SPREAD OPTIONS - NEW YORK MERCANTILE EXCHANGE ;2008.09.09;   29972;    9894;   17032;    6159;   13754;    6692;   29807;   29883;     165;      89
NATURAL GAS CAL SPREAD OPTIONS - NEW YORK MERCANTILE EXCHANGE ;2008.09.02;   29751;   10846;   18024;    5150;   13595;    5804;   29592;   28978;     160;     773
NATURAL GAS CAL SPREAD OPTIONS - NEW YORK MERCANTILE EXCHANGE ;2008.08.26;   26977;    8834;   16450;    4496;   11695;    5804;   25025;   26749;    1952;     228
NATURAL GAS CAL SPREAD OPTIONS - NEW YORK MERCANTILE EXCHANGE ;2008.08.19;   26372;    9235;   16042;    4454;   12532;    5435;   26221;   25931;     151;     441
NATURAL GAS CAL SPREAD OPTIONS - NEW YORK MERCANTILE EXCHANGE ;2008.08.12;   25490;    7849;   14685;    5516;   11928;    4732;   25293;   24933;     198;     557
NATURAL GAS CAL SPREAD OPTIONS - NEW YORK MERCANTILE EXCHANGE ;2008.08.05;   24987;    7865;   13788;    5639;   11339;    5508;   24842;   24934;     145;      53
NATURAL GAS CAL SPREAD OPTIONS - NEW YORK MERCANTILE EXCHANGE ;2008.07.29;   23628;    6963;   13205;    5492;   10986;    4541;   23441;   23238;     187;     390
NATURAL GAS CAL SPREAD OPTIONS - NEW YORK MERCANTILE EXCHANGE ;2008.07.22;   21969;    5645;   10629;    5739;   10350;    5239;   21734;   21607;     235;     362
NATURAL GAS CAL SPREAD OPTIONS - NEW YORK MERCANTILE EXCHANGE ;2008.07.15;   20148;    5406;    9145;    4699;    9899;    6009;   20004;   19854;     144;     294
NATURAL GAS CAL SPREAD OPTIONS - NEW YORK MERCANTILE EXCHANGE ;2008.07.08;   19088;    6273;    8313;    3454;    9181;    6987;   18907;   18754;     181;     334
NATURAL GAS CAL SPREAD OPTIONS - NEW YORK MERCANTILE EXCHANGE ;2008.07.01;   17742;    5210;    6684;    3843;    8527;    6901;   17580;   17428;     162;     314
NATURAL GAS CAL SPREAD OPTIONS - NEW YORK MERCANTILE EXCHANGE ;2008.06.24;   14004;    4649;    5035;    2856;    6337;    5798;   13841;   13689;     163;     315
NATURAL GAS CAL SPREAD OPTIONS - NEW YORK MERCANTILE EXCHANGE ;2008.06.17;   13872;    4426;    5002;    2941;    6294;    5568;   13661;   13511;     211;     360
NATURAL GAS CAL SPREAD OPTIONS - NEW YORK MERCANTILE EXCHANGE ;2008.06.10;   12928;    4124;    4110;    3032;    5565;    5477;   12721;   12619;     207;     309
NATURAL GAS CAL SPREAD OPTIONS - NEW YORK MERCANTILE EXCHANGE ;2008.06.03;   10881;    3874;    2620;    2640;    4159;    5312;   10673;   10572;     208;     309
NATURAL GAS CAL SPREAD OPTIONS - NEW YORK MERCANTILE EXCHANGE ;2008.05.27;    9976;    4482;    3157;    1753;    3526;    4754;    9761;    9663;     215;     313
NATURAL GAS CAL SPREAD OPTIONS - NEW YORK MERCANTILE EXCHANGE ;2008.05.20;    9944;    4461;    3255;    1672;    3547;    4671;    9680;    9597;     263;     346
NATURAL GAS CAL SPREAD OPTIONS - NEW YORK MERCANTILE EXCHANGE ;2008.05.13;    9517;    4399;    3255;    1363;    3514;    4559;    9276;    9177;     241;     339
NATURAL GAS CAL SPREAD OPTIONS - NEW YORK MERCANTILE EXCHANGE ;2008.05.06;    9583;    4416;    3282;    1373;    3551;    4586;    9340;    9241;     243;     342
