MSCI EAFE MINI INDEX - NYSE LIFFE ;2011.07.12;   33283;    1492;    1110;       0;   28461;   31361;   29953;   32471;    3330;     812
MSCI EAFE MINI INDEX - NYSE LIFFE ;2011.07.12;   33283;       0;    5816;     493;   20330;   13342;    4818;    3893;    7998;       4
MSCI EAFE MINI INDEX - NYSE LIFFE ;2011.07.12;   33283;    1492;    1110;       0;   28461;   31361;   29953;   32471;    3330;     812
MSCI EAFE MINI INDEX - NYSE LIFFE ;2011.07.12;   33283;       0;    5816;     493;   20330;   13342;    4818;    3893;    7998;       4
MSCI EAFE MINI INDEX - NYSE LIFFE ;2011.07.12;   33283;    1492;    1110;       0;   28461;   31361;   29953;   32471;    3330;     812
MSCI EAFE MINI INDEX - NYSE LIFFE ;2011.07.05;   31268;     625;    1321;       0;   27814;   29228;   28439;   30549;    2829;     719
MSCI EAFE MINI INDEX - NYSE LIFFE ;2011.06.28;   31794;     776;     706;       0;   28210;   30138;   28986;   30844;    2808;     950
MSCI EAFE MINI INDEX - NYSE LIFFE ;2011.06.21;   31991;       0;     706;       0;   28515;   29846;   28515;   30552;    3476;    1439
MSCI EAFE MINI INDEX - NYSE LIFFE ;2011.06.14;   46300;       0;     424;     413;   42916;   42582;   43329;   43419;    2971;    2881
MSCI EAFE MINI INDEX - NYSE LIFFE ;2011.07.12;   33283;    1492;    1110;       0;   28461;   31361;   29953;   32471;    3330;     812
MSCI EAFE MINI INDEX - NYSE LIFFE ;2011.07.12;   33283;       0;    5816;     493;   20330;   13342;    4818;    3893;    7998;       4
MSCI EAFE MINI INDEX - NYSE LIFFE ;2011.07.12;   33283;    1492;    1110;       0;   28461;   31361;   29953;   32471;    3330;     812
MSCI EAFE MINI INDEX - NYSE LIFFE ;2011.07.05;   31268;     625;    1321;       0;   27814;   29228;   28439;   30549;    2829;     719
MSCI EAFE MINI INDEX - NYSE LIFFE ;2011.06.28;   31794;     776;     706;       0;   28210;   30138;   28986;   30844;    2808;     950
MSCI EAFE MINI INDEX - NYSE LIFFE ;2011.06.21;   31991;       0;     706;       0;   28515;   29846;   28515;   30552;    3476;    1439
MSCI EAFE MINI INDEX - NYSE LIFFE ;2011.06.14;   46300;       0;     424;     413;   42916;   42582;   43329;   43419;    2971;    2881
MSCI EAFE MINI INDEX - NYSE LIFFE ;2011.07.12;   33283;       0;    5816;     493;   20330;   13342;    4818;    3893;    7998;       4
MSCI EAFE MINI INDEX - NYSE LIFFE ;2011.07.05;   31268;       0;    5953;     491;   20360;   12025;    4173;    2997;    7904;       3
MSCI EAFE MINI INDEX - NYSE LIFFE ;2011.06.28;   31794;     200;    5596;     449;   21094;   13627;    4304;    2521;    6865;       3
MSCI EAFE MINI INDEX - NYSE LIFFE ;2011.06.21;   31991;     277;    5516;     429;   21536;   13669;    4093;    1762;    6842;       3
MSCI EAFE MINI INDEX - NYSE LIFFE ;2011.06.14;   46300;       0;    5461;    3071;   10183;     643;   25557;     344;    4509;    3759
MSCI EAFE MINI INDEX - NYSE LIFFE ;2011.07.12;   33283;    1492;    1110;       0;   28461;   31361;   29953;   32471;    3330;     812
MSCI EAFE MINI INDEX - NYSE LIFFE ;2011.07.05;   31268;     625;    1321;       0;   27814;   29228;   28439;   30549;    2829;     719
MSCI EAFE MINI INDEX - NYSE LIFFE ;2011.06.28;   31794;     776;     706;       0;   28210;   30138;   28986;   30844;    2808;     950
MSCI EAFE MINI INDEX - NYSE LIFFE ;2011.06.21;   31991;       0;     706;       0;   28515;   29846;   28515;   30552;    3476;    1439
MSCI EAFE MINI INDEX - NYSE LIFFE ;2011.06.14;   46300;       0;     424;     413;   42916;   42582;   43329;   43419;    2971;    2881
MSCI EAFE MINI INDEX - NYSE LIFFE ;2011.07.12;   33283;       0;    5816;     493;   20330;   13342;    4818;    3893;    7998;       4
MSCI EAFE MINI INDEX - NYSE LIFFE ;2011.07.05;   31268;       0;    5953;     491;   20360;   12025;    4173;    2997;    7904;       3
MSCI EAFE MINI INDEX - NYSE LIFFE ;2011.06.28;   31794;     200;    5596;     449;   21094;   13627;    4304;    2521;    6865;       3
MSCI EAFE MINI INDEX - NYSE LIFFE ;2011.06.21;   31991;     277;    5516;     429;   21536;   13669;    4093;    1762;    6842;       3
MSCI EAFE MINI INDEX - NYSE LIFFE ;2011.06.14;   46300;       0;    5461;    3071;   10183;     643;   25557;     344;    4509;    3759
MSCI EAFE MINI INDEX - NYSE LIFFE ;2011.07.12;   33283;    1492;    1110;       0;   28461;   31361;   29953;   32471;    3330;     812
MSCI EAFE MINI INDEX - NYSE LIFFE ;2011.07.12;   33283;       0;    5816;     493;   20330;   13342;    4818;    3893;    7998;       4
