SOUTH AFRICAN RAND - CHICAGO MERCANTILE EXCHANGE ;2010.03.09;   10039;    1001;    4988;       0;    7743;    4356;    8744;    9344;    1295;     695
SOUTH AFRICAN RAND - CHICAGO MERCANTILE EXCHANGE ;2010.03.09;   10039;    1001;    4988;       0;    7743;    4356;    8744;    9344;    1295;     695
SOUTH AFRICAN RAND - CHICAGO MERCANTILE EXCHANGE ;2010.03.09;   10039;    1001;    4988;       0;    7743;    4356;    8744;    9344;    1295;     695
