MEXICO BRADY BOND - INTERNATIONAL MONETARY MARKET ;1996.06.11;     416;       0;     231;       0;     248;      32;     248;     263;     168;     153
MEXICO BRADY BOND - INTERNATIONAL MONETARY MARKET ;1996.06.04;     436;      27;     258;       0;     248;       0;     275;     258;     161;     178
MEXICO BRADY BOND - INTERNATIONAL MONETARY MARKET ;1996.05.28;     446;      37;     268;       0;     253;       0;     290;     268;     156;     178
MEXICO BRADY BOND - INTERNATIONAL MONETARY MARKET ;1996.05.21;     452;      41;     272;       0;     255;       0;     296;     272;     156;     180
MEXICO BRADY BOND - INTERNATIONAL MONETARY MARKET ;1996.05.14;     490;      43;     274;       0;     293;       0;     336;     274;     154;     216
MEXICO BRADY BOND - INTERNATIONAL MONETARY MARKET ;1996.05.07;     423;      31;     262;       0;     251;       0;     282;     262;     141;     161
MEXICO BRADY BOND - INTERNATIONAL MONETARY MARKET ;1996.04.30;     544;      48;     359;       0;     347;      40;     395;     399;     149;     145
MEXICO BRADY BOND - INTERNATIONAL MONETARY MARKET ;1996.04.23;     511;       0;     311;       0;     387;      40;     387;     351;     124;     160
MEXICO BRADY BOND - INTERNATIONAL MONETARY MARKET ;1996.04.16;     461;       0;     351;       0;     329;       0;     329;     351;     132;     110
MEXICO BRADY BOND - INTERNATIONAL MONETARY MARKET ;1996.04.09;     252;       0;     231;       0;     245;       0;     245;     231;       7;      21
MEXICO BRADY BOND - INTERNATIONAL MONETARY MARKET ;1996.04.02;     312;       0;     219;       0;     270;       0;     270;     219;      42;      93
MEXICO BRADY BOND - INTERNATIONAL MONETARY MARKET ;1996.06.11;     416;       0;     231;       0;     248;      32;     248;     263;     168;     153
MEXICO BRADY BOND - INTERNATIONAL MONETARY MARKET ;1996.06.04;     436;      27;     258;       0;     248;       0;     275;     258;     161;     178
MEXICO BRADY BOND - INTERNATIONAL MONETARY MARKET ;1996.05.28;     446;      37;     268;       0;     253;       0;     290;     268;     156;     178
MEXICO BRADY BOND - INTERNATIONAL MONETARY MARKET ;1996.05.21;     452;      41;     272;       0;     255;       0;     296;     272;     156;     180
MEXICO BRADY BOND - INTERNATIONAL MONETARY MARKET ;1996.05.14;     490;      43;     274;       0;     293;       0;     336;     274;     154;     216
MEXICO BRADY BOND - INTERNATIONAL MONETARY MARKET ;1996.05.07;     423;      31;     262;       0;     251;       0;     282;     262;     141;     161
MEXICO BRADY BOND - INTERNATIONAL MONETARY MARKET ;1996.04.30;     544;      48;     359;       0;     347;      40;     395;     399;     149;     145
MEXICO BRADY BOND - INTERNATIONAL MONETARY MARKET ;1996.04.23;     511;       0;     311;       0;     387;      40;     387;     351;     124;     160
MEXICO BRADY BOND - INTERNATIONAL MONETARY MARKET ;1996.04.16;     461;       0;     351;       0;     329;       0;     329;     351;     132;     110
MEXICO BRADY BOND - INTERNATIONAL MONETARY MARKET ;1996.04.09;     252;       0;     231;       0;     245;       0;     245;     231;       7;      21
MEXICO BRADY BOND - INTERNATIONAL MONETARY MARKET ;1996.04.02;     312;       0;     219;       0;     270;       0;     270;     219;      42;      93
MEXICO BRADY BOND - INTERNATIONAL MONETARY MARKET ;1996.06.11;     416;       0;     231;       0;     248;      32;     248;     263;     168;     153
MEXICO BRADY BOND - INTERNATIONAL MONETARY MARKET ;1996.06.04;     436;      27;     258;       0;     248;       0;     275;     258;     161;     178
MEXICO BRADY BOND - INTERNATIONAL MONETARY MARKET ;1996.05.28;     446;      37;     268;       0;     253;       0;     290;     268;     156;     178
MEXICO BRADY BOND - INTERNATIONAL MONETARY MARKET ;1996.05.21;     452;      41;     272;       0;     255;       0;     296;     272;     156;     180
MEXICO BRADY BOND - INTERNATIONAL MONETARY MARKET ;1996.05.14;     490;      43;     274;       0;     293;       0;     336;     274;     154;     216
MEXICO BRADY BOND - INTERNATIONAL MONETARY MARKET ;1996.05.07;     423;      31;     262;       0;     251;       0;     282;     262;     141;     161
MEXICO BRADY BOND - INTERNATIONAL MONETARY MARKET ;1996.04.30;     544;      48;     359;       0;     347;      40;     395;     399;     149;     145
MEXICO BRADY BOND - INTERNATIONAL MONETARY MARKET ;1996.04.23;     511;       0;     311;       0;     387;      40;     387;     351;     124;     160
MEXICO BRADY BOND - INTERNATIONAL MONETARY MARKET ;1996.04.16;     461;       0;     351;       0;     329;       0;     329;     351;     132;     110
MEXICO BRADY BOND - INTERNATIONAL MONETARY MARKET ;1996.04.09;     252;       0;     231;       0;     245;       0;     245;     231;       7;      21
MEXICO BRADY BOND - INTERNATIONAL MONETARY MARKET ;1996.04.02;     312;       0;     219;       0;     270;       0;     270;     219;      42;      93
