NATURAL GAS - KANSAS CITY BOARD OF TRADE ;1999.07.20;    1108;       0;       0;       0;     800;     486;     800;     486;     308;     622
NATURAL GAS - KANSAS CITY BOARD OF TRADE ;1999.07.13;    1079;       0;       0;       0;     770;     487;     770;     487;     309;     592
NATURAL GAS - KANSAS CITY BOARD OF TRADE ;1999.07.06;    1058;       0;       0;       0;     770;     487;     770;     487;     288;     571
NATURAL GAS - KANSAS CITY BOARD OF TRADE ;1999.06.22;    1560;       0;       0;       0;    1301;     993;    1301;     993;     259;     567
NATURAL GAS - KANSAS CITY BOARD OF TRADE ;1999.06.15;    1454;       0;       0;       0;    1114;     936;    1114;     936;     340;     518
NATURAL GAS - KANSAS CITY BOARD OF TRADE ;1999.05.25;    2127;       0;       0;       0;    1820;    1692;    1820;    1692;     307;     435
NATURAL GAS - KANSAS CITY BOARD OF TRADE ;1999.05.18;    1929;       0;       0;       0;    1474;    1589;    1474;    1589;     455;     340
NATURAL GAS - KANSAS CITY BOARD OF TRADE ;1999.05.11;    1896;       0;       0;       0;    1294;    1248;    1294;    1248;     602;     648
NATURAL GAS - KANSAS CITY BOARD OF TRADE ;1999.05.04;    1906;       0;       0;       0;    1315;    1267;    1315;    1267;     591;     639
NATURAL GAS - KANSAS CITY BOARD OF TRADE ;1999.04.27;    2452;       0;       0;       0;    1766;    1611;    1766;    1611;     686;     841
NATURAL GAS - KANSAS CITY BOARD OF TRADE ;1999.04.20;    2122;       0;       0;       0;    1638;    1431;    1638;    1431;     484;     691
NATURAL GAS - KANSAS CITY BOARD OF TRADE ;1999.04.13;    2061;       0;       0;       0;    1592;    1542;    1592;    1542;     469;     519
NATURAL GAS - KANSAS CITY BOARD OF TRADE ;1999.04.06;    2044;       0;       0;       0;    1519;    1535;    1519;    1535;     525;     509
NATURAL GAS - KANSAS CITY BOARD OF TRADE ;1999.03.30;    2099;       0;       0;       0;    1623;    1341;    1623;    1341;     476;     758
NATURAL GAS - KANSAS CITY BOARD OF TRADE ;1999.03.23;    2553;       0;       0;       0;    1924;    1705;    1924;    1705;     629;     848
NATURAL GAS - KANSAS CITY BOARD OF TRADE ;1999.03.16;    2496;       0;       0;       0;    1972;    1695;    1972;    1695;     524;     801
NATURAL GAS - KANSAS CITY BOARD OF TRADE ;1999.03.09;    2580;       0;     165;       0;    1911;    1437;    1911;    1602;     669;     978
NATURAL GAS - KANSAS CITY BOARD OF TRADE ;1999.03.02;    2725;       0;     473;       0;    2104;    1291;    2104;    1764;     621;     961
NATURAL GAS - KANSAS CITY BOARD OF TRADE ;1999.02.23;    2884;       0;     137;       0;    2467;    1861;    2467;    1998;     417;     886
NATURAL GAS - KANSAS CITY BOARD OF TRADE ;1999.02.16;    2707;       0;       0;       0;    2330;    1949;    2330;    1949;     377;     758
NATURAL GAS - KANSAS CITY BOARD OF TRADE ;1999.02.09;    2709;       0;       0;       0;    2290;    1947;    2290;    1947;     419;     762
NATURAL GAS - KANSAS CITY BOARD OF TRADE ;1999.01.12;    3014;       0;       0;       0;    1857;    2512;    1857;    2512;    1157;     502
NATURAL GAS - KANSAS CITY BOARD OF TRADE ;1998.12.29;    2534;       0;       0;       0;    1612;    2028;    1612;    2028;     922;     506
NATURAL GAS - KANSAS CITY BOARD OF TRADE ;1998.12.15;    2838;       0;     299;       0;    1867;    1685;    1867;    1984;     971;     854
NATURAL GAS - KANSAS CITY BOARD OF TRADE ;1998.10.27;    3759;       0;       0;       0;    2763;    2919;    2763;    2919;     996;     840
NATURAL GAS - KANSAS CITY BOARD OF TRADE ;1998.09.29;    4792;       0;       0;       0;    4163;    3997;    4163;    3997;     629;     795
NATURAL GAS - KANSAS CITY BOARD OF TRADE ;1998.09.22;    4853;       0;       0;       0;    4115;    4315;    4115;    4315;     738;     538
NATURAL GAS - KANSAS CITY BOARD OF TRADE ;1998.09.15;    4824;       0;       0;       0;    4009;    4184;    4009;    4184;     815;     640
NATURAL GAS - KANSAS CITY BOARD OF TRADE ;1998.09.08;    4900;       0;       0;       0;    3937;    4025;    3937;    4025;     963;     875
NATURAL GAS - KANSAS CITY BOARD OF TRADE ;1998.09.01;    4954;       0;       0;       0;    4008;    4199;    4008;    4199;     946;     755
NATURAL GAS - KANSAS CITY BOARD OF TRADE ;1998.08.25;    6133;       0;       0;       0;    5133;    5458;    5133;    5458;    1000;     675
NATURAL GAS - KANSAS CITY BOARD OF TRADE ;1998.08.18;    6739;       0;       0;       0;    5435;    5806;    5435;    5806;    1304;     933
NATURAL GAS - KANSAS CITY BOARD OF TRADE ;1998.08.11;    6474;       0;       0;       0;    5242;    5612;    5242;    5612;    1232;     862
NATURAL GAS - KANSAS CITY BOARD OF TRADE ;1998.08.04;    6344;       0;       0;       0;    5110;    5398;    5110;    5398;    1234;     946
NATURAL GAS - KANSAS CITY BOARD OF TRADE ;1998.07.28;    6869;       0;       0;       0;    5394;    5770;    5394;    5770;    1475;    1099
NATURAL GAS - KANSAS CITY BOARD OF TRADE ;1998.07.21;    7385;       0;       0;       0;    6125;    6282;    6125;    6282;    1260;    1103
NATURAL GAS - KANSAS CITY BOARD OF TRADE ;1998.07.14;    7567;       0;       0;       0;    6401;    6315;    6401;    6315;    1166;    1252
NATURAL GAS - KANSAS CITY BOARD OF TRADE ;1998.07.07;    7781;       0;       0;       0;    6623;    6341;    6623;    6341;    1158;    1440
NATURAL GAS - KANSAS CITY BOARD OF TRADE ;1998.06.30;    7584;       0;     258;      20;    6647;    5947;    6667;    6225;     917;    1359
NATURAL GAS - KANSAS CITY BOARD OF TRADE ;1998.06.23;    8396;       0;     285;       0;    7366;    6639;    7366;    6924;    1030;    1472
NATURAL GAS - KANSAS CITY BOARD OF TRADE ;1998.06.16;    8174;       0;     204;       0;    7207;    6316;    7207;    6520;     967;    1654
NATURAL GAS - KANSAS CITY BOARD OF TRADE ;1998.06.09;    8048;       0;     204;       0;    7182;    6396;    7182;    6600;     866;    1448
NATURAL GAS - KANSAS CITY BOARD OF TRADE ;1998.06.02;    8230;       0;       0;       0;    7593;    6421;    7593;    6421;     637;    1809
NATURAL GAS - KANSAS CITY BOARD OF TRADE ;1998.05.26;    9065;       0;       0;       0;    8548;    7439;    8548;    7439;     517;    1626
NATURAL GAS - KANSAS CITY BOARD OF TRADE ;1998.05.19;    8201;       0;       0;       0;    7693;    6639;    7693;    6639;     508;    1562
NATURAL GAS - KANSAS CITY BOARD OF TRADE ;1998.05.12;    8355;       0;       0;       0;    7836;    6945;    7836;    6945;     519;    1410
NATURAL GAS - KANSAS CITY BOARD OF TRADE ;1998.05.05;    8314;       0;       0;       0;    7607;    6846;    7607;    6846;     707;    1468
NATURAL GAS - KANSAS CITY BOARD OF TRADE ;1998.04.28;    8817;       0;       0;       0;    8105;    7280;    8105;    7280;     712;    1537
NATURAL GAS - KANSAS CITY BOARD OF TRADE ;1998.04.21;    9393;       0;       0;       0;    8932;    8126;    8932;    8126;     461;    1267
NATURAL GAS - KANSAS CITY BOARD OF TRADE ;1998.04.14;    9061;       0;       0;       0;    8386;    7597;    8386;    7597;     675;    1464
NATURAL GAS - KANSAS CITY BOARD OF TRADE ;1998.04.07;    9050;       0;       0;       0;    8410;    7621;    8410;    7621;     640;    1429
NATURAL GAS - KANSAS CITY BOARD OF TRADE ;1998.03.31;    8672;       0;       0;       0;    7968;    7200;    7968;    7200;     704;    1472
NATURAL GAS - KANSAS CITY BOARD OF TRADE ;1998.03.24;    9182;       0;       0;       0;    8352;    6977;    8352;    6977;     830;    2205
NATURAL GAS - KANSAS CITY BOARD OF TRADE ;1998.03.17;    8100;       0;       0;       0;    6927;    5895;    6927;    5895;    1173;    2205
NATURAL GAS - KANSAS CITY BOARD OF TRADE ;1998.03.10;    7895;       0;       0;       0;    6829;    5429;    6829;    5429;    1066;    2466
NATURAL GAS - KANSAS CITY BOARD OF TRADE ;1998.03.03;    7776;       0;       0;       0;    6625;    5638;    6625;    5638;    1151;    2138
NATURAL GAS - KANSAS CITY BOARD OF TRADE ;1998.02.24;    8248;       0;       0;       0;    7274;    6216;    7274;    6216;     974;    2032
NATURAL GAS - KANSAS CITY BOARD OF TRADE ;1998.02.17;    7834;       0;       0;       0;    6885;    6097;    6885;    6097;     949;    1737
NATURAL GAS - KANSAS CITY BOARD OF TRADE ;1998.02.10;    6211;       0;       0;       0;    5095;    4549;    5095;    4549;    1116;    1662
NATURAL GAS - KANSAS CITY BOARD OF TRADE ;1998.02.03;    5623;       0;       0;       0;    4527;    4155;    4527;    4155;    1096;    1468
NATURAL GAS - KANSAS CITY BOARD OF TRADE ;1998.01.27;    4622;       0;       0;       0;    3844;    3203;    3844;    3203;     778;    1419
NATURAL GAS - KANSAS CITY BOARD OF TRADE ;1998.01.20;    4135;       0;       0;       0;    3432;    2742;    3432;    2742;     704;    1393
NATURAL GAS - KANSAS CITY BOARD OF TRADE ;1998.01.13;    3755;       0;       0;       0;    3092;    2431;    3092;    2431;     663;    1324
NATURAL GAS - KANSAS CITY BOARD OF TRADE ;1997.12.30;    3513;       0;       0;       0;    2571;    1850;    2571;    1850;     942;    1663
NATURAL GAS - KANSAS CITY BOARD OF TRADE ;1997.12.23;    3664;       0;       0;       0;    3166;    2156;    3166;    2156;     498;    1508
NATURAL GAS - KANSAS CITY BOARD OF TRADE ;1997.12.16;    3420;       0;       0;       0;    2078;    1831;    2078;    1831;    1342;    1589
NATURAL GAS - KANSAS CITY BOARD OF TRADE ;1997.12.09;    2960;       0;       0;       0;    1996;    1438;    1996;    1438;     964;    1522
NATURAL GAS - KANSAS CITY BOARD OF TRADE ;1997.12.02;    2486;       0;       0;       0;    1432;    1121;    1432;    1121;    1054;    1365
NATURAL GAS - KANSAS CITY BOARD OF TRADE ;1997.11.25;    1948;       0;       0;       0;    1203;    1054;    1203;    1054;     745;     894
NATURAL GAS - KANSAS CITY BOARD OF TRADE ;1997.11.18;    2023;       0;       0;       0;    1278;     903;    1278;     903;     745;    1120
NATURAL GAS - KANSAS CITY BOARD OF TRADE ;1997.11.11;    1861;       0;       0;       0;    1202;     940;    1202;     940;     659;     921
NATURAL GAS - KANSAS CITY BOARD OF TRADE ;1997.11.04;    1679;       0;       0;       0;    1137;     772;    1137;     772;     542;     907
NATURAL GAS - KANSAS CITY BOARD OF TRADE ;1997.10.21;    2066;       0;       0;       0;    1244;     989;    1244;     989;     822;    1077
NATURAL GAS - KANSAS CITY BOARD OF TRADE ;1997.09.23;    2317;       0;       0;       0;    1494;    1292;    1494;    1292;     823;    1025
NATURAL GAS - KANSAS CITY BOARD OF TRADE ;1997.09.16;    2128;       0;       0;       0;    1262;    1247;    1262;    1247;     866;     881
NATURAL GAS - KANSAS CITY BOARD OF TRADE ;1997.09.09;    2124;       0;       0;       0;    1104;    1039;    1104;    1039;    1020;    1085
NATURAL GAS - KANSAS CITY BOARD OF TRADE ;1997.09.02;    1870;       0;       0;       0;     634;     782;     634;     782;    1236;    1088
NATURAL GAS - KANSAS CITY BOARD OF TRADE ;1997.08.26;    2489;       0;       0;       0;    1362;     888;    1362;     888;    1127;    1601
NATURAL GAS - KANSAS CITY BOARD OF TRADE ;1997.08.19;    2256;       0;       0;       0;    1239;     782;    1239;     782;    1017;    1474
NATURAL GAS - KANSAS CITY BOARD OF TRADE ;1997.08.12;    1866;       0;       0;       0;     843;     447;     843;     447;    1023;    1419
NATURAL GAS - KANSAS CITY BOARD OF TRADE ;1997.07.29;    2389;       0;       0;       0;    1487;     999;    1487;     999;     902;    1390
NATURAL GAS - KANSAS CITY BOARD OF TRADE ;1997.07.22;    2773;       0;       0;       0;    1645;    1279;    1645;    1279;    1128;    1494
NATURAL GAS - KANSAS CITY BOARD OF TRADE ;1997.07.15;    2508;       0;       0;       0;    1425;    1075;    1425;    1075;    1083;    1433
NATURAL GAS - KANSAS CITY BOARD OF TRADE ;1997.07.08;    2388;       0;       0;       0;    1450;     879;    1450;     879;     938;    1509
NATURAL GAS - KANSAS CITY BOARD OF TRADE ;1997.07.01;    2356;       0;       0;       0;    1460;     930;    1460;     930;     896;    1426
NATURAL GAS - KANSAS CITY BOARD OF TRADE ;1997.06.24;    2870;       0;       0;       0;    1885;    1101;    1885;    1101;     985;    1769
NATURAL GAS - KANSAS CITY BOARD OF TRADE ;1997.06.17;    2781;       0;       0;       0;    1809;     979;    1809;     979;     972;    1802
NATURAL GAS - KANSAS CITY BOARD OF TRADE ;1997.06.10;    2643;       0;       0;       0;    1580;     825;    1580;     825;    1063;    1818
NATURAL GAS - KANSAS CITY BOARD OF TRADE ;1997.06.03;    1954;       0;       0;       0;    1089;     628;    1089;     628;     865;    1326
NATURAL GAS - KANSAS CITY BOARD OF TRADE ;1997.05.27;    2229;       0;       0;       0;    1407;     945;    1407;     945;     822;    1284
NATURAL GAS - KANSAS CITY BOARD OF TRADE ;1997.05.13;    2483;       0;       0;       0;    1443;     759;    1443;     759;    1040;    1724
NATURAL GAS - KANSAS CITY BOARD OF TRADE ;1997.05.06;    2235;       0;       0;       0;    1195;     682;    1195;     682;    1040;    1553
NATURAL GAS - KANSAS CITY BOARD OF TRADE ;1997.04.22;    2581;       0;       0;       0;    1059;    1138;    1059;    1138;    1522;    1443
NATURAL GAS - KANSAS CITY BOARD OF TRADE ;1997.03.25;    2733;       0;       0;       0;    1417;    1420;    1417;    1420;    1316;    1313
NATURAL GAS - KANSAS CITY BOARD OF TRADE ;1997.03.18;    3525;       0;       0;       0;    1836;    2248;    1836;    2248;    1689;    1277
NATURAL GAS - KANSAS CITY BOARD OF TRADE ;1997.03.11;    3460;       0;       0;       0;    1760;    2158;    1760;    2158;    1700;    1302
NATURAL GAS - KANSAS CITY BOARD OF TRADE ;1997.02.18;    2584;       0;       0;       0;    1275;    1189;    1275;    1189;    1309;    1395
NATURAL GAS - KANSAS CITY BOARD OF TRADE ;1997.02.04;    1927;       0;       0;       0;     959;     467;     959;     467;     968;    1460
NATURAL GAS - KANSAS CITY BOARD OF TRADE ;1997.01.28;    2687;       0;       0;       0;    1546;    1065;    1546;    1065;    1141;    1622
NATURAL GAS - KANSAS CITY BOARD OF TRADE ;1997.01.21;    2202;       0;       0;       0;     749;     406;     749;     406;    1453;    1796
NATURAL GAS - KANSAS CITY BOARD OF TRADE ;1996.12.17;    2935;       0;       0;       0;    1180;    1441;    1180;    1441;    1755;    1494
NATURAL GAS - KANSAS CITY BOARD OF TRADE ;1996.12.10;    2626;       0;       0;       0;    1083;     919;    1083;     919;    1543;    1707
NATURAL GAS - KANSAS CITY BOARD OF TRADE ;1996.11.19;    2718;       0;       0;       0;    1111;     724;    1111;     724;    1607;    1994
NATURAL GAS - KANSAS CITY BOARD OF TRADE ;1996.11.12;    2931;       0;       0;       0;    1317;    1300;    1317;    1300;    1614;    1631
NATURAL GAS - KANSAS CITY BOARD OF TRADE ;1996.11.05;    3103;       0;       0;       0;    1609;    1460;    1609;    1460;    1494;    1643
NATURAL GAS - KANSAS CITY BOARD OF TRADE ;1996.10.29;    2660;       0;       0;       0;    1326;    1260;    1326;    1260;    1334;    1400
NATURAL GAS - KANSAS CITY BOARD OF TRADE ;1996.10.22;    3346;       0;       0;       0;    1884;    1493;    1884;    1493;    1462;    1853
NATURAL GAS - KANSAS CITY BOARD OF TRADE ;1996.10.15;    2688;       0;       0;       0;    1225;     584;    1225;     584;    1463;    2104
NATURAL GAS - KANSAS CITY BOARD OF TRADE ;1996.09.24;    2436;       0;       0;       0;     356;     534;     356;     534;    2080;    1902
NATURAL GAS - KANSAS CITY BOARD OF TRADE ;1996.08.27;    2372;       0;       0;       0;     724;     698;     724;     698;    1648;    1674
NATURAL GAS - KANSAS CITY BOARD OF TRADE ;1996.07.23;    2806;       0;       0;       0;    1254;     838;    1254;     838;    1552;    1968
NATURAL GAS - KANSAS CITY BOARD OF TRADE ;1996.07.16;    2490;       0;       0;       0;    1006;     734;    1006;     734;    1484;    1756
NATURAL GAS - KANSAS CITY BOARD OF TRADE ;1996.06.25;    3369;       0;       0;       0;    1638;    1576;    1638;    1576;    1731;    1793
NATURAL GAS - KANSAS CITY BOARD OF TRADE ;1996.06.18;    3740;       0;       0;       0;    1679;    1731;    1679;    1731;    2061;    2009
NATURAL GAS - KANSAS CITY BOARD OF TRADE ;1996.06.11;    2906;       0;       0;       0;    1345;     974;    1345;     974;    1561;    1932
NATURAL GAS - KANSAS CITY BOARD OF TRADE ;1996.06.04;    2802;       0;       0;       0;    1363;     941;    1363;     941;    1439;    1861
NATURAL GAS - KANSAS CITY BOARD OF TRADE ;1996.05.28;    3107;       0;       0;       0;    1313;    1266;    1313;    1266;    1794;    1841
NATURAL GAS - KANSAS CITY BOARD OF TRADE ;1996.05.21;    3454;       0;       0;       0;    1534;    1155;    1534;    1155;    1920;    2299
NATURAL GAS - KANSAS CITY BOARD OF TRADE ;1996.05.14;    2789;       0;       0;       0;     860;     433;     860;     433;    1929;    2356
NATURAL GAS - KANSAS CITY BOARD OF TRADE ;1996.05.07;    2711;       0;       0;       0;     864;     551;     864;     551;    1847;    2160
NATURAL GAS - KANSAS CITY BOARD OF TRADE ;1996.04.30;    2407;       0;       0;       0;     725;     612;     725;     612;    1682;    1795
NATURAL GAS - KANSAS CITY BOARD OF TRADE ;1996.04.23;    3247;       0;       0;       0;     812;    1484;     812;    1484;    2435;    1763
NATURAL GAS - KANSAS CITY BOARD OF TRADE ;1996.04.16;    3739;       0;       9;     252;    1166;    1661;    1418;    1922;    2321;    1818
NATURAL GAS - KANSAS CITY BOARD OF TRADE ;1996.04.09;    3473;       0;      15;     252;    1492;    1349;    1744;    1616;    1729;    1856
NATURAL GAS - KANSAS CITY BOARD OF TRADE ;1996.04.02;    3451;       0;      23;     250;    1498;    1267;    1747;    1540;    1704;    1911
NATURAL GAS - KANSAS CITY BOARD OF TRADE ;1996.03.26;    3803;       0;      41;     245;    1752;    1670;    1997;    1956;    1806;    1846
NATURAL GAS - KANSAS CITY BOARD OF TRADE ;1996.03.19;    4819;       0;      91;     362;    2188;    2155;    2549;    2608;    2270;    2211
NATURAL GAS - KANSAS CITY BOARD OF TRADE ;1996.03.12;    4712;       0;     170;     350;    2444;    1811;    2794;    2332;    1918;    2380
NATURAL GAS - KANSAS CITY BOARD OF TRADE ;1996.03.05;    4379;       0;     129;     352;    1849;    2206;    2201;    2688;    2178;    1692
NATURAL GAS - KANSAS CITY BOARD OF TRADE ;1996.02.27;    4377;       0;     131;     321;    1813;    2392;    2134;    2844;    2243;    1534
NATURAL GAS - KANSAS CITY BOARD OF TRADE ;1996.02.20;    5331;       0;     249;     264;    2168;    2960;    2432;    3473;    2899;    1857
NATURAL GAS - KANSAS CITY BOARD OF TRADE ;1996.02.13;    5091;       0;     222;     296;    2011;    2743;    2308;    3261;    2783;    1829
NATURAL GAS - KANSAS CITY BOARD OF TRADE ;1996.02.06;    5120;       0;     210;     307;    1780;    2736;    2087;    3252;    3033;    1868
NATURAL GAS - KANSAS CITY BOARD OF TRADE ;1996.01.30;    5183;       0;     176;     304;    1797;    2894;    2101;    3373;    3082;    1810
NATURAL GAS - KANSAS CITY BOARD OF TRADE ;1996.01.23;    5806;       0;     141;     327;    2206;    3063;    2534;    3531;    3272;    2275
NATURAL GAS - KANSAS CITY BOARD OF TRADE ;1996.01.16;    6105;       0;      69;     474;    2333;    3034;    2807;    3576;    3299;    2529
NATURAL GAS - KANSAS CITY BOARD OF TRADE ;1996.01.09;    5663;      13;      67;     550;    2550;    3224;    3113;    3841;    2550;    1822
NATURAL GAS - KANSAS CITY BOARD OF TRADE ;1996.01.02;    5050;       6;      14;     556;    2184;    2826;    2746;    3395;    2304;    1655
NATURAL GAS - KANSAS CITY BOARD OF TRADE ;1995.12.26;    4764;       6;      18;     501;    2074;    2784;    2581;    3303;    2183;    1461
NATURAL GAS - KANSAS CITY BOARD OF TRADE ;1995.12.19;    5570;     175;       0;     363;    2301;    2701;    2839;    3064;    2731;    2506
NATURAL GAS - KANSAS CITY BOARD OF TRADE ;1995.12.12;    5849;     168;       0;     399;    2817;    3049;    3384;    3448;    2465;    2401
NATURAL GAS - KANSAS CITY BOARD OF TRADE ;1995.12.05;    5281;     185;       0;     350;    2841;    3097;    3376;    3447;    1905;    1834
NATURAL GAS - KANSAS CITY BOARD OF TRADE ;1995.11.28;    5018;      36;       0;     384;    2612;    2800;    3032;    3184;    1986;    1834
NATURAL GAS - KANSAS CITY BOARD OF TRADE ;1995.11.21;    5381;       0;      28;     211;    3002;    3364;    3213;    3603;    2168;    1778
NATURAL GAS - KANSAS CITY BOARD OF TRADE ;1995.11.14;    5563;       0;     139;     366;    2878;    2843;    3244;    3348;    2319;    2214
NATURAL GAS - KANSAS CITY BOARD OF TRADE ;1995.11.07;    5676;       0;       9;     375;    2920;    2970;    3295;    3355;    2380;    2321
NATURAL GAS - KANSAS CITY BOARD OF TRADE ;1995.10.31;    5361;      27;       0;     360;    2819;    2706;    3206;    3066;    2155;    2295
NATURAL GAS - KANSAS CITY BOARD OF TRADE ;1995.10.24;    5172;       0;       0;       0;    2207;    2334;    2207;    2334;    2966;    2838
NATURAL GAS - KANSAS CITY BOARD OF TRADE ;1995.10.17;    4982;       0;       0;       0;    2658;    2722;    2658;    2722;    2324;    2259
NATURAL GAS - KANSAS CITY BOARD OF TRADE ;1995.10.10;    4696;       0;      14;     213;    2839;    2326;    3052;    2553;    1644;    2143
NATURAL GAS - KANSAS CITY BOARD OF TRADE ;1995.10.03;    4599;       0;      24;     182;    2807;    2020;    2989;    2227;    1610;    2372
NATURAL GAS - KANSAS CITY BOARD OF TRADE ;1995.09.26;    4118;       0;      63;     180;    2732;    1652;    2912;    1896;    1205;    2222
NATURAL GAS - KANSAS CITY BOARD OF TRADE ;1995.09.19;    4199;      15;       0;     179;    2007;    1822;    2201;    2001;    1997;    2198
NATURAL GAS - KANSAS CITY BOARD OF TRADE ;1995.09.12;    3601;       0;       4;     174;    1776;    1208;    1950;    1386;    1651;    2215
NATURAL GAS - KANSAS CITY BOARD OF TRADE ;1995.09.05;    3089;       0;       0;       0;    1484;    1012;    1484;    1012;    1605;    2077
NATURAL GAS - KANSAS CITY BOARD OF TRADE ;1995.08.29;    2676;       0;       0;       0;    1257;     569;    1257;     569;    1419;    2107
NATURAL GAS - KANSAS CITY BOARD OF TRADE ;1995.08.22;    3326;       0;       0;       0;    1533;     956;    1533;     956;    1793;    2370
NATURAL GAS - KANSAS CITY BOARD OF TRADE ;1995.08.15;    2706;       0;       0;       0;    1237;     798;    1237;     798;    1469;    1908
NATURAL GAS - KANSAS CITY BOARD OF TRADE ;1995.08.01;    1250;     218;       0;     108;     460;     450;     786;     558;     464;     692
NATURAL GAS - KANSAS CITY BOARD OF TRADE ;1999.07.20;    1108;       0;       0;       0;     800;     486;     800;     486;     308;     622
NATURAL GAS - KANSAS CITY BOARD OF TRADE ;1999.07.13;    1079;       0;       0;       0;     770;     487;     770;     487;     309;     592
NATURAL GAS - KANSAS CITY BOARD OF TRADE ;1999.07.06;    1058;       0;       0;       0;     770;     487;     770;     487;     288;     571
NATURAL GAS - KANSAS CITY BOARD OF TRADE ;1999.06.22;    1560;       0;       0;       0;    1301;     993;    1301;     993;     259;     567
NATURAL GAS - KANSAS CITY BOARD OF TRADE ;1999.06.15;    1454;       0;       0;       0;    1114;     936;    1114;     936;     340;     518
NATURAL GAS - KANSAS CITY BOARD OF TRADE ;1999.05.25;    2127;       0;       0;       0;    1820;    1692;    1820;    1692;     307;     435
NATURAL GAS - KANSAS CITY BOARD OF TRADE ;1999.05.18;    1929;       0;       0;       0;    1474;    1589;    1474;    1589;     455;     340
NATURAL GAS - KANSAS CITY BOARD OF TRADE ;1999.05.11;    1896;       0;       0;       0;    1294;    1248;    1294;    1248;     602;     648
NATURAL GAS - KANSAS CITY BOARD OF TRADE ;1999.05.04;    1906;       0;       0;       0;    1315;    1267;    1315;    1267;     591;     639
NATURAL GAS - KANSAS CITY BOARD OF TRADE ;1999.04.27;    2452;       0;       0;       0;    1766;    1611;    1766;    1611;     686;     841
NATURAL GAS - KANSAS CITY BOARD OF TRADE ;1999.04.20;    2122;       0;       0;       0;    1638;    1431;    1638;    1431;     484;     691
NATURAL GAS - KANSAS CITY BOARD OF TRADE ;1999.04.13;    2061;       0;       0;       0;    1592;    1542;    1592;    1542;     469;     519
NATURAL GAS - KANSAS CITY BOARD OF TRADE ;1999.04.06;    2044;       0;       0;       0;    1519;    1535;    1519;    1535;     525;     509
NATURAL GAS - KANSAS CITY BOARD OF TRADE ;1999.03.30;    2099;       0;       0;       0;    1623;    1341;    1623;    1341;     476;     758
NATURAL GAS - KANSAS CITY BOARD OF TRADE ;1999.03.23;    2553;       0;       0;       0;    1924;    1705;    1924;    1705;     629;     848
NATURAL GAS - KANSAS CITY BOARD OF TRADE ;1999.03.16;    2496;       0;       0;       0;    1972;    1695;    1972;    1695;     524;     801
NATURAL GAS - KANSAS CITY BOARD OF TRADE ;1999.03.09;    2580;       0;     165;       0;    1911;    1437;    1911;    1602;     669;     978
NATURAL GAS - KANSAS CITY BOARD OF TRADE ;1999.03.02;    2725;       0;     473;       0;    2104;    1291;    2104;    1764;     621;     961
NATURAL GAS - KANSAS CITY BOARD OF TRADE ;1999.02.23;    2884;       0;     137;       0;    2467;    1861;    2467;    1998;     417;     886
NATURAL GAS - KANSAS CITY BOARD OF TRADE ;1999.02.16;    2707;       0;       0;       0;    2330;    1949;    2330;    1949;     377;     758
NATURAL GAS - KANSAS CITY BOARD OF TRADE ;1999.02.09;    2709;       0;       0;       0;    2290;    1947;    2290;    1947;     419;     762
NATURAL GAS - KANSAS CITY BOARD OF TRADE ;1999.01.12;    3014;       0;       0;       0;    1857;    2512;    1857;    2512;    1157;     502
NATURAL GAS - KANSAS CITY BOARD OF TRADE ;1998.12.29;    2534;       0;       0;       0;    1612;    2028;    1612;    2028;     922;     506
NATURAL GAS - KANSAS CITY BOARD OF TRADE ;1998.12.15;    2838;       0;     299;       0;    1867;    1685;    1867;    1984;     971;     854
NATURAL GAS - KANSAS CITY BOARD OF TRADE ;1998.10.27;    3759;       0;       0;       0;    2763;    2919;    2763;    2919;     996;     840
NATURAL GAS - KANSAS CITY BOARD OF TRADE ;1998.09.29;    4792;       0;       0;       0;    4163;    3997;    4163;    3997;     629;     795
NATURAL GAS - KANSAS CITY BOARD OF TRADE ;1998.09.22;    4853;       0;       0;       0;    4115;    4315;    4115;    4315;     738;     538
NATURAL GAS - KANSAS CITY BOARD OF TRADE ;1998.09.15;    4824;       0;       0;       0;    4009;    4184;    4009;    4184;     815;     640
NATURAL GAS - KANSAS CITY BOARD OF TRADE ;1998.09.08;    4900;       0;       0;       0;    3937;    4025;    3937;    4025;     963;     875
NATURAL GAS - KANSAS CITY BOARD OF TRADE ;1998.09.01;    4954;       0;       0;       0;    4008;    4199;    4008;    4199;     946;     755
NATURAL GAS - KANSAS CITY BOARD OF TRADE ;1998.08.25;    6133;       0;       0;       0;    5133;    5458;    5133;    5458;    1000;     675
NATURAL GAS - KANSAS CITY BOARD OF TRADE ;1998.08.18;    6739;       0;       0;       0;    5435;    5806;    5435;    5806;    1304;     933
NATURAL GAS - KANSAS CITY BOARD OF TRADE ;1998.08.11;    6474;       0;       0;       0;    5242;    5612;    5242;    5612;    1232;     862
NATURAL GAS - KANSAS CITY BOARD OF TRADE ;1998.08.04;    6344;       0;       0;       0;    5110;    5398;    5110;    5398;    1234;     946
NATURAL GAS - KANSAS CITY BOARD OF TRADE ;1998.07.28;    6869;       0;       0;       0;    5394;    5770;    5394;    5770;    1475;    1099
NATURAL GAS - KANSAS CITY BOARD OF TRADE ;1998.07.21;    7385;       0;       0;       0;    6125;    6282;    6125;    6282;    1260;    1103
NATURAL GAS - KANSAS CITY BOARD OF TRADE ;1998.07.14;    7567;       0;       0;       0;    6401;    6315;    6401;    6315;    1166;    1252
NATURAL GAS - KANSAS CITY BOARD OF TRADE ;1998.07.07;    7781;       0;       0;       0;    6623;    6341;    6623;    6341;    1158;    1440
NATURAL GAS - KANSAS CITY BOARD OF TRADE ;1998.06.30;    7584;       0;     258;      20;    6647;    5947;    6667;    6225;     917;    1359
NATURAL GAS - KANSAS CITY BOARD OF TRADE ;1998.06.23;    8396;       0;     285;       0;    7366;    6639;    7366;    6924;    1030;    1472
NATURAL GAS - KANSAS CITY BOARD OF TRADE ;1998.06.16;    8174;       0;     204;       0;    7207;    6316;    7207;    6520;     967;    1654
NATURAL GAS - KANSAS CITY BOARD OF TRADE ;1998.06.09;    8048;       0;     204;       0;    7182;    6396;    7182;    6600;     866;    1448
NATURAL GAS - KANSAS CITY BOARD OF TRADE ;1998.06.02;    8230;       0;       0;       0;    7593;    6421;    7593;    6421;     637;    1809
NATURAL GAS - KANSAS CITY BOARD OF TRADE ;1998.05.26;    9065;       0;       0;       0;    8548;    7439;    8548;    7439;     517;    1626
NATURAL GAS - KANSAS CITY BOARD OF TRADE ;1998.05.19;    8201;       0;       0;       0;    7693;    6639;    7693;    6639;     508;    1562
NATURAL GAS - KANSAS CITY BOARD OF TRADE ;1998.05.12;    8355;       0;       0;       0;    7836;    6945;    7836;    6945;     519;    1410
NATURAL GAS - KANSAS CITY BOARD OF TRADE ;1998.05.05;    8314;       0;       0;       0;    7607;    6846;    7607;    6846;     707;    1468
NATURAL GAS - KANSAS CITY BOARD OF TRADE ;1998.04.28;    8817;       0;       0;       0;    8105;    7280;    8105;    7280;     712;    1537
NATURAL GAS - KANSAS CITY BOARD OF TRADE ;1998.04.21;    9393;       0;       0;       0;    8932;    8126;    8932;    8126;     461;    1267
NATURAL GAS - KANSAS CITY BOARD OF TRADE ;1998.04.14;    9061;       0;       0;       0;    8386;    7597;    8386;    7597;     675;    1464
NATURAL GAS - KANSAS CITY BOARD OF TRADE ;1998.04.07;    9050;       0;       0;       0;    8410;    7621;    8410;    7621;     640;    1429
NATURAL GAS - KANSAS CITY BOARD OF TRADE ;1998.03.31;    8672;       0;       0;       0;    7968;    7200;    7968;    7200;     704;    1472
NATURAL GAS - KANSAS CITY BOARD OF TRADE ;1998.03.24;    9182;       0;       0;       0;    8352;    6977;    8352;    6977;     830;    2205
NATURAL GAS - KANSAS CITY BOARD OF TRADE ;1998.03.17;    8100;       0;       0;       0;    6927;    5895;    6927;    5895;    1173;    2205
NATURAL GAS - KANSAS CITY BOARD OF TRADE ;1998.03.10;    7895;       0;       0;       0;    6829;    5429;    6829;    5429;    1066;    2466
NATURAL GAS - KANSAS CITY BOARD OF TRADE ;1998.03.03;    7776;       0;       0;       0;    6625;    5638;    6625;    5638;    1151;    2138
NATURAL GAS - KANSAS CITY BOARD OF TRADE ;1998.02.24;    8248;       0;       0;       0;    7274;    6216;    7274;    6216;     974;    2032
NATURAL GAS - KANSAS CITY BOARD OF TRADE ;1998.02.17;    7834;       0;       0;       0;    6885;    6097;    6885;    6097;     949;    1737
NATURAL GAS - KANSAS CITY BOARD OF TRADE ;1998.02.10;    6211;       0;       0;       0;    5095;    4549;    5095;    4549;    1116;    1662
NATURAL GAS - KANSAS CITY BOARD OF TRADE ;1998.02.03;    5623;       0;       0;       0;    4527;    4155;    4527;    4155;    1096;    1468
NATURAL GAS - KANSAS CITY BOARD OF TRADE ;1998.01.27;    4622;       0;       0;       0;    3844;    3203;    3844;    3203;     778;    1419
NATURAL GAS - KANSAS CITY BOARD OF TRADE ;1998.01.20;    4135;       0;       0;       0;    3432;    2742;    3432;    2742;     704;    1393
NATURAL GAS - KANSAS CITY BOARD OF TRADE ;1998.01.13;    3755;       0;       0;       0;    3092;    2431;    3092;    2431;     663;    1324
NATURAL GAS - KANSAS CITY BOARD OF TRADE ;1997.12.30;    3513;       0;       0;       0;    2571;    1850;    2571;    1850;     942;    1663
NATURAL GAS - KANSAS CITY BOARD OF TRADE ;1997.12.23;    3664;       0;       0;       0;    3166;    2156;    3166;    2156;     498;    1508
NATURAL GAS - KANSAS CITY BOARD OF TRADE ;1997.12.16;    3420;       0;       0;       0;    2078;    1831;    2078;    1831;    1342;    1589
NATURAL GAS - KANSAS CITY BOARD OF TRADE ;1997.12.09;    2960;       0;       0;       0;    1996;    1438;    1996;    1438;     964;    1522
NATURAL GAS - KANSAS CITY BOARD OF TRADE ;1997.12.02;    2486;       0;       0;       0;    1432;    1121;    1432;    1121;    1054;    1365
NATURAL GAS - KANSAS CITY BOARD OF TRADE ;1997.11.25;    1948;       0;       0;       0;    1203;    1054;    1203;    1054;     745;     894
NATURAL GAS - KANSAS CITY BOARD OF TRADE ;1997.11.18;    2023;       0;       0;       0;    1278;     903;    1278;     903;     745;    1120
NATURAL GAS - KANSAS CITY BOARD OF TRADE ;1997.11.11;    1861;       0;       0;       0;    1202;     940;    1202;     940;     659;     921
NATURAL GAS - KANSAS CITY BOARD OF TRADE ;1997.11.04;    1679;       0;       0;       0;    1137;     772;    1137;     772;     542;     907
NATURAL GAS - KANSAS CITY BOARD OF TRADE ;1997.10.21;    2066;       0;       0;       0;    1244;     989;    1244;     989;     822;    1077
NATURAL GAS - KANSAS CITY BOARD OF TRADE ;1997.09.23;    2317;       0;       0;       0;    1494;    1292;    1494;    1292;     823;    1025
NATURAL GAS - KANSAS CITY BOARD OF TRADE ;1997.09.16;    2128;       0;       0;       0;    1262;    1247;    1262;    1247;     866;     881
NATURAL GAS - KANSAS CITY BOARD OF TRADE ;1997.09.09;    2124;       0;       0;       0;    1104;    1039;    1104;    1039;    1020;    1085
NATURAL GAS - KANSAS CITY BOARD OF TRADE ;1997.09.02;    1870;       0;       0;       0;     634;     782;     634;     782;    1236;    1088
NATURAL GAS - KANSAS CITY BOARD OF TRADE ;1997.08.26;    2489;       0;       0;       0;    1362;     888;    1362;     888;    1127;    1601
NATURAL GAS - KANSAS CITY BOARD OF TRADE ;1997.08.19;    2256;       0;       0;       0;    1239;     782;    1239;     782;    1017;    1474
NATURAL GAS - KANSAS CITY BOARD OF TRADE ;1997.08.12;    1866;       0;       0;       0;     843;     447;     843;     447;    1023;    1419
NATURAL GAS - KANSAS CITY BOARD OF TRADE ;1997.07.29;    2389;       0;       0;       0;    1487;     999;    1487;     999;     902;    1390
NATURAL GAS - KANSAS CITY BOARD OF TRADE ;1997.07.22;    2773;       0;       0;       0;    1645;    1279;    1645;    1279;    1128;    1494
NATURAL GAS - KANSAS CITY BOARD OF TRADE ;1997.07.15;    2508;       0;       0;       0;    1425;    1075;    1425;    1075;    1083;    1433
NATURAL GAS - KANSAS CITY BOARD OF TRADE ;1997.07.08;    2388;       0;       0;       0;    1450;     879;    1450;     879;     938;    1509
NATURAL GAS - KANSAS CITY BOARD OF TRADE ;1997.07.01;    2356;       0;       0;       0;    1460;     930;    1460;     930;     896;    1426
NATURAL GAS - KANSAS CITY BOARD OF TRADE ;1997.06.24;    2870;       0;       0;       0;    1885;    1101;    1885;    1101;     985;    1769
NATURAL GAS - KANSAS CITY BOARD OF TRADE ;1997.06.17;    2781;       0;       0;       0;    1809;     979;    1809;     979;     972;    1802
NATURAL GAS - KANSAS CITY BOARD OF TRADE ;1997.06.10;    2643;       0;       0;       0;    1580;     825;    1580;     825;    1063;    1818
NATURAL GAS - KANSAS CITY BOARD OF TRADE ;1997.06.03;    1954;       0;       0;       0;    1089;     628;    1089;     628;     865;    1326
NATURAL GAS - KANSAS CITY BOARD OF TRADE ;1997.05.27;    2229;       0;       0;       0;    1407;     945;    1407;     945;     822;    1284
NATURAL GAS - KANSAS CITY BOARD OF TRADE ;1997.05.13;    2483;       0;       0;       0;    1443;     759;    1443;     759;    1040;    1724
NATURAL GAS - KANSAS CITY BOARD OF TRADE ;1997.05.06;    2235;       0;       0;       0;    1195;     682;    1195;     682;    1040;    1553
NATURAL GAS - KANSAS CITY BOARD OF TRADE ;1997.04.22;    2581;       0;       0;       0;    1059;    1138;    1059;    1138;    1522;    1443
NATURAL GAS - KANSAS CITY BOARD OF TRADE ;1997.03.25;    2733;       0;       0;       0;    1417;    1420;    1417;    1420;    1316;    1313
NATURAL GAS - KANSAS CITY BOARD OF TRADE ;1997.03.18;    3525;       0;       0;       0;    1836;    2248;    1836;    2248;    1689;    1277
NATURAL GAS - KANSAS CITY BOARD OF TRADE ;1997.03.11;    3460;       0;       0;       0;    1760;    2158;    1760;    2158;    1700;    1302
NATURAL GAS - KANSAS CITY BOARD OF TRADE ;1997.02.18;    2584;       0;       0;       0;    1275;    1189;    1275;    1189;    1309;    1395
NATURAL GAS - KANSAS CITY BOARD OF TRADE ;1997.02.04;    1927;       0;       0;       0;     959;     467;     959;     467;     968;    1460
NATURAL GAS - KANSAS CITY BOARD OF TRADE ;1997.01.28;    2687;       0;       0;       0;    1546;    1065;    1546;    1065;    1141;    1622
NATURAL GAS - KANSAS CITY BOARD OF TRADE ;1997.01.21;    2202;       0;       0;       0;     749;     406;     749;     406;    1453;    1796
NATURAL GAS - KANSAS CITY BOARD OF TRADE ;1996.12.17;    2935;       0;       0;       0;    1180;    1441;    1180;    1441;    1755;    1494
NATURAL GAS - KANSAS CITY BOARD OF TRADE ;1996.12.10;    2626;       0;       0;       0;    1083;     919;    1083;     919;    1543;    1707
NATURAL GAS - KANSAS CITY BOARD OF TRADE ;1996.11.19;    2718;       0;       0;       0;    1111;     724;    1111;     724;    1607;    1994
NATURAL GAS - KANSAS CITY BOARD OF TRADE ;1996.11.12;    2931;       0;       0;       0;    1317;    1300;    1317;    1300;    1614;    1631
NATURAL GAS - KANSAS CITY BOARD OF TRADE ;1996.11.05;    3103;       0;       0;       0;    1609;    1460;    1609;    1460;    1494;    1643
NATURAL GAS - KANSAS CITY BOARD OF TRADE ;1996.10.29;    2660;       0;       0;       0;    1326;    1260;    1326;    1260;    1334;    1400
NATURAL GAS - KANSAS CITY BOARD OF TRADE ;1996.10.22;    3346;       0;       0;       0;    1884;    1493;    1884;    1493;    1462;    1853
NATURAL GAS - KANSAS CITY BOARD OF TRADE ;1996.10.15;    2688;       0;       0;       0;    1225;     584;    1225;     584;    1463;    2104
NATURAL GAS - KANSAS CITY BOARD OF TRADE ;1996.09.24;    2436;       0;       0;       0;     356;     534;     356;     534;    2080;    1902
NATURAL GAS - KANSAS CITY BOARD OF TRADE ;1996.08.27;    2372;       0;       0;       0;     724;     698;     724;     698;    1648;    1674
NATURAL GAS - KANSAS CITY BOARD OF TRADE ;1996.07.23;    2806;       0;       0;       0;    1254;     838;    1254;     838;    1552;    1968
NATURAL GAS - KANSAS CITY BOARD OF TRADE ;1996.07.16;    2490;       0;       0;       0;    1006;     734;    1006;     734;    1484;    1756
NATURAL GAS - KANSAS CITY BOARD OF TRADE ;1996.06.25;    3369;       0;       0;       0;    1638;    1576;    1638;    1576;    1731;    1793
NATURAL GAS - KANSAS CITY BOARD OF TRADE ;1996.06.18;    3740;       0;       0;       0;    1679;    1731;    1679;    1731;    2061;    2009
NATURAL GAS - KANSAS CITY BOARD OF TRADE ;1996.06.11;    2906;       0;       0;       0;    1345;     974;    1345;     974;    1561;    1932
NATURAL GAS - KANSAS CITY BOARD OF TRADE ;1996.06.04;    2802;       0;       0;       0;    1363;     941;    1363;     941;    1439;    1861
NATURAL GAS - KANSAS CITY BOARD OF TRADE ;1996.05.28;    3107;       0;       0;       0;    1313;    1266;    1313;    1266;    1794;    1841
NATURAL GAS - KANSAS CITY BOARD OF TRADE ;1996.05.21;    3454;       0;       0;       0;    1534;    1155;    1534;    1155;    1920;    2299
NATURAL GAS - KANSAS CITY BOARD OF TRADE ;1996.05.14;    2789;       0;       0;       0;     860;     433;     860;     433;    1929;    2356
NATURAL GAS - KANSAS CITY BOARD OF TRADE ;1996.05.07;    2711;       0;       0;       0;     864;     551;     864;     551;    1847;    2160
NATURAL GAS - KANSAS CITY BOARD OF TRADE ;1996.04.30;    2407;       0;       0;       0;     725;     612;     725;     612;    1682;    1795
NATURAL GAS - KANSAS CITY BOARD OF TRADE ;1996.04.23;    3247;       0;       0;       0;     812;    1484;     812;    1484;    2435;    1763
NATURAL GAS - KANSAS CITY BOARD OF TRADE ;1996.04.16;    3739;       0;       9;     252;    1166;    1661;    1418;    1922;    2321;    1818
NATURAL GAS - KANSAS CITY BOARD OF TRADE ;1996.04.09;    3473;       0;      15;     252;    1492;    1349;    1744;    1616;    1729;    1856
NATURAL GAS - KANSAS CITY BOARD OF TRADE ;1996.04.02;    3451;       0;      23;     250;    1498;    1267;    1747;    1540;    1704;    1911
NATURAL GAS - KANSAS CITY BOARD OF TRADE ;1996.03.26;    3803;       0;      41;     245;    1752;    1670;    1997;    1956;    1806;    1846
NATURAL GAS - KANSAS CITY BOARD OF TRADE ;1996.03.19;    4819;       0;      91;     362;    2188;    2155;    2549;    2608;    2270;    2211
NATURAL GAS - KANSAS CITY BOARD OF TRADE ;1996.03.12;    4712;       0;     170;     350;    2444;    1811;    2794;    2332;    1918;    2380
NATURAL GAS - KANSAS CITY BOARD OF TRADE ;1996.03.05;    4379;       0;     129;     352;    1849;    2206;    2201;    2688;    2178;    1692
NATURAL GAS - KANSAS CITY BOARD OF TRADE ;1996.02.27;    4377;       0;     131;     321;    1813;    2392;    2134;    2844;    2243;    1534
NATURAL GAS - KANSAS CITY BOARD OF TRADE ;1996.02.20;    5331;       0;     249;     264;    2168;    2960;    2432;    3473;    2899;    1857
NATURAL GAS - KANSAS CITY BOARD OF TRADE ;1996.02.13;    5091;       0;     222;     296;    2011;    2743;    2308;    3261;    2783;    1829
NATURAL GAS - KANSAS CITY BOARD OF TRADE ;1996.02.06;    5120;       0;     210;     307;    1780;    2736;    2087;    3252;    3033;    1868
NATURAL GAS - KANSAS CITY BOARD OF TRADE ;1996.01.30;    5183;       0;     176;     304;    1797;    2894;    2101;    3373;    3082;    1810
NATURAL GAS - KANSAS CITY BOARD OF TRADE ;1996.01.23;    5806;       0;     141;     327;    2206;    3063;    2534;    3531;    3272;    2275
NATURAL GAS - KANSAS CITY BOARD OF TRADE ;1996.01.16;    6105;       0;      69;     474;    2333;    3034;    2807;    3576;    3299;    2529
NATURAL GAS - KANSAS CITY BOARD OF TRADE ;1996.01.09;    5663;      13;      67;     550;    2550;    3224;    3113;    3841;    2550;    1822
NATURAL GAS - KANSAS CITY BOARD OF TRADE ;1996.01.02;    5050;       6;      14;     556;    2184;    2826;    2746;    3395;    2304;    1655
NATURAL GAS - KANSAS CITY BOARD OF TRADE ;1995.12.26;    4764;       6;      18;     501;    2074;    2784;    2581;    3303;    2183;    1461
NATURAL GAS - KANSAS CITY BOARD OF TRADE ;1995.12.19;    5570;     175;       0;     363;    2301;    2701;    2839;    3064;    2731;    2506
NATURAL GAS - KANSAS CITY BOARD OF TRADE ;1995.12.12;    5849;     168;       0;     399;    2817;    3049;    3384;    3448;    2465;    2401
NATURAL GAS - KANSAS CITY BOARD OF TRADE ;1995.12.05;    5281;     185;       0;     350;    2841;    3097;    3376;    3447;    1905;    1834
NATURAL GAS - KANSAS CITY BOARD OF TRADE ;1995.11.28;    5018;      36;       0;     384;    2612;    2800;    3032;    3184;    1986;    1834
NATURAL GAS - KANSAS CITY BOARD OF TRADE ;1995.11.21;    5381;       0;      28;     211;    3002;    3364;    3213;    3603;    2168;    1778
NATURAL GAS - KANSAS CITY BOARD OF TRADE ;1995.11.14;    5563;       0;     139;     366;    2878;    2843;    3244;    3348;    2319;    2214
NATURAL GAS - KANSAS CITY BOARD OF TRADE ;1995.11.07;    5676;       0;       9;     375;    2920;    2970;    3295;    3355;    2380;    2321
NATURAL GAS - KANSAS CITY BOARD OF TRADE ;1995.10.31;    5361;      27;       0;     360;    2819;    2706;    3206;    3066;    2155;    2295
NATURAL GAS - KANSAS CITY BOARD OF TRADE ;1995.10.24;    5172;       0;       0;       0;    2207;    2334;    2207;    2334;    2966;    2838
NATURAL GAS - KANSAS CITY BOARD OF TRADE ;1995.10.17;    4982;       0;       0;       0;    2658;    2722;    2658;    2722;    2324;    2259
NATURAL GAS - KANSAS CITY BOARD OF TRADE ;1995.10.10;    4696;       0;      14;     213;    2839;    2326;    3052;    2553;    1644;    2143
NATURAL GAS - KANSAS CITY BOARD OF TRADE ;1995.10.03;    4599;       0;      24;     182;    2807;    2020;    2989;    2227;    1610;    2372
NATURAL GAS - KANSAS CITY BOARD OF TRADE ;1995.09.26;    4118;       0;      63;     180;    2732;    1652;    2912;    1896;    1205;    2222
NATURAL GAS - KANSAS CITY BOARD OF TRADE ;1995.09.19;    4199;      15;       0;     179;    2007;    1822;    2201;    2001;    1997;    2198
NATURAL GAS - KANSAS CITY BOARD OF TRADE ;1995.09.12;    3601;       0;       4;     174;    1776;    1208;    1950;    1386;    1651;    2215
NATURAL GAS - KANSAS CITY BOARD OF TRADE ;1995.09.05;    3089;       0;       0;       0;    1484;    1012;    1484;    1012;    1605;    2077
NATURAL GAS - KANSAS CITY BOARD OF TRADE ;1995.08.29;    2676;       0;       0;       0;    1257;     569;    1257;     569;    1419;    2107
NATURAL GAS - KANSAS CITY BOARD OF TRADE ;1995.08.22;    3326;       0;       0;       0;    1533;     956;    1533;     956;    1793;    2370
NATURAL GAS - KANSAS CITY BOARD OF TRADE ;1995.08.15;    2706;       0;       0;       0;    1237;     798;    1237;     798;    1469;    1908
NATURAL GAS - KANSAS CITY BOARD OF TRADE ;1995.08.01;    1250;     218;       0;     108;     460;     450;     786;     558;     464;     692
NATURAL GAS - KANSAS CITY BOARD OF TRADE ;1999.07.20;    1108;       0;       0;       0;     800;     486;     800;     486;     308;     622
NATURAL GAS - KANSAS CITY BOARD OF TRADE ;1999.07.13;    1079;       0;       0;       0;     770;     487;     770;     487;     309;     592
NATURAL GAS - KANSAS CITY BOARD OF TRADE ;1999.07.06;    1058;       0;       0;       0;     770;     487;     770;     487;     288;     571
NATURAL GAS - KANSAS CITY BOARD OF TRADE ;1999.06.22;    1560;       0;       0;       0;    1301;     993;    1301;     993;     259;     567
NATURAL GAS - KANSAS CITY BOARD OF TRADE ;1999.06.15;    1454;       0;       0;       0;    1114;     936;    1114;     936;     340;     518
NATURAL GAS - KANSAS CITY BOARD OF TRADE ;1999.05.25;    2127;       0;       0;       0;    1820;    1692;    1820;    1692;     307;     435
NATURAL GAS - KANSAS CITY BOARD OF TRADE ;1999.05.18;    1929;       0;       0;       0;    1474;    1589;    1474;    1589;     455;     340
NATURAL GAS - KANSAS CITY BOARD OF TRADE ;1999.05.11;    1896;       0;       0;       0;    1294;    1248;    1294;    1248;     602;     648
NATURAL GAS - KANSAS CITY BOARD OF TRADE ;1999.05.04;    1906;       0;       0;       0;    1315;    1267;    1315;    1267;     591;     639
NATURAL GAS - KANSAS CITY BOARD OF TRADE ;1999.04.27;    2452;       0;       0;       0;    1766;    1611;    1766;    1611;     686;     841
NATURAL GAS - KANSAS CITY BOARD OF TRADE ;1999.04.20;    2122;       0;       0;       0;    1638;    1431;    1638;    1431;     484;     691
NATURAL GAS - KANSAS CITY BOARD OF TRADE ;1999.04.13;    2061;       0;       0;       0;    1592;    1542;    1592;    1542;     469;     519
NATURAL GAS - KANSAS CITY BOARD OF TRADE ;1999.04.06;    2044;       0;       0;       0;    1519;    1535;    1519;    1535;     525;     509
NATURAL GAS - KANSAS CITY BOARD OF TRADE ;1999.03.30;    2099;       0;       0;       0;    1623;    1341;    1623;    1341;     476;     758
NATURAL GAS - KANSAS CITY BOARD OF TRADE ;1999.03.23;    2553;       0;       0;       0;    1924;    1705;    1924;    1705;     629;     848
NATURAL GAS - KANSAS CITY BOARD OF TRADE ;1999.03.16;    2496;       0;       0;       0;    1972;    1695;    1972;    1695;     524;     801
NATURAL GAS - KANSAS CITY BOARD OF TRADE ;1999.03.09;    2580;       0;     165;       0;    1911;    1437;    1911;    1602;     669;     978
NATURAL GAS - KANSAS CITY BOARD OF TRADE ;1999.03.02;    2725;       0;     473;       0;    2104;    1291;    2104;    1764;     621;     961
NATURAL GAS - KANSAS CITY BOARD OF TRADE ;1999.02.23;    2884;       0;     137;       0;    2467;    1861;    2467;    1998;     417;     886
NATURAL GAS - KANSAS CITY BOARD OF TRADE ;1999.02.16;    2707;       0;       0;       0;    2330;    1949;    2330;    1949;     377;     758
NATURAL GAS - KANSAS CITY BOARD OF TRADE ;1999.02.09;    2709;       0;       0;       0;    2290;    1947;    2290;    1947;     419;     762
NATURAL GAS - KANSAS CITY BOARD OF TRADE ;1999.01.12;    3014;       0;       0;       0;    1857;    2512;    1857;    2512;    1157;     502
NATURAL GAS - KANSAS CITY BOARD OF TRADE ;1998.12.29;    2534;       0;       0;       0;    1612;    2028;    1612;    2028;     922;     506
NATURAL GAS - KANSAS CITY BOARD OF TRADE ;1998.12.15;    2838;       0;     299;       0;    1867;    1685;    1867;    1984;     971;     854
NATURAL GAS - KANSAS CITY BOARD OF TRADE ;1998.10.27;    3759;       0;       0;       0;    2763;    2919;    2763;    2919;     996;     840
NATURAL GAS - KANSAS CITY BOARD OF TRADE ;1998.09.29;    4792;       0;       0;       0;    4163;    3997;    4163;    3997;     629;     795
NATURAL GAS - KANSAS CITY BOARD OF TRADE ;1998.09.22;    4853;       0;       0;       0;    4115;    4315;    4115;    4315;     738;     538
NATURAL GAS - KANSAS CITY BOARD OF TRADE ;1998.09.15;    4824;       0;       0;       0;    4009;    4184;    4009;    4184;     815;     640
NATURAL GAS - KANSAS CITY BOARD OF TRADE ;1998.09.08;    4900;       0;       0;       0;    3937;    4025;    3937;    4025;     963;     875
NATURAL GAS - KANSAS CITY BOARD OF TRADE ;1998.09.01;    4954;       0;       0;       0;    4008;    4199;    4008;    4199;     946;     755
NATURAL GAS - KANSAS CITY BOARD OF TRADE ;1998.08.25;    6133;       0;       0;       0;    5133;    5458;    5133;    5458;    1000;     675
NATURAL GAS - KANSAS CITY BOARD OF TRADE ;1998.08.18;    6739;       0;       0;       0;    5435;    5806;    5435;    5806;    1304;     933
NATURAL GAS - KANSAS CITY BOARD OF TRADE ;1998.08.11;    6474;       0;       0;       0;    5242;    5612;    5242;    5612;    1232;     862
NATURAL GAS - KANSAS CITY BOARD OF TRADE ;1998.08.04;    6344;       0;       0;       0;    5110;    5398;    5110;    5398;    1234;     946
NATURAL GAS - KANSAS CITY BOARD OF TRADE ;1998.07.28;    6869;       0;       0;       0;    5394;    5770;    5394;    5770;    1475;    1099
NATURAL GAS - KANSAS CITY BOARD OF TRADE ;1998.07.21;    7385;       0;       0;       0;    6125;    6282;    6125;    6282;    1260;    1103
NATURAL GAS - KANSAS CITY BOARD OF TRADE ;1998.07.14;    7567;       0;       0;       0;    6401;    6315;    6401;    6315;    1166;    1252
NATURAL GAS - KANSAS CITY BOARD OF TRADE ;1998.07.07;    7781;       0;       0;       0;    6623;    6341;    6623;    6341;    1158;    1440
NATURAL GAS - KANSAS CITY BOARD OF TRADE ;1998.06.30;    7584;       0;     258;      20;    6647;    5947;    6667;    6225;     917;    1359
NATURAL GAS - KANSAS CITY BOARD OF TRADE ;1998.06.23;    8396;       0;     285;       0;    7366;    6639;    7366;    6924;    1030;    1472
NATURAL GAS - KANSAS CITY BOARD OF TRADE ;1998.06.16;    8174;       0;     204;       0;    7207;    6316;    7207;    6520;     967;    1654
NATURAL GAS - KANSAS CITY BOARD OF TRADE ;1998.06.09;    8048;       0;     204;       0;    7182;    6396;    7182;    6600;     866;    1448
NATURAL GAS - KANSAS CITY BOARD OF TRADE ;1998.06.02;    8230;       0;       0;       0;    7593;    6421;    7593;    6421;     637;    1809
NATURAL GAS - KANSAS CITY BOARD OF TRADE ;1998.05.26;    9065;       0;       0;       0;    8548;    7439;    8548;    7439;     517;    1626
NATURAL GAS - KANSAS CITY BOARD OF TRADE ;1998.05.19;    8201;       0;       0;       0;    7693;    6639;    7693;    6639;     508;    1562
NATURAL GAS - KANSAS CITY BOARD OF TRADE ;1998.05.12;    8355;       0;       0;       0;    7836;    6945;    7836;    6945;     519;    1410
NATURAL GAS - KANSAS CITY BOARD OF TRADE ;1998.05.05;    8314;       0;       0;       0;    7607;    6846;    7607;    6846;     707;    1468
NATURAL GAS - KANSAS CITY BOARD OF TRADE ;1998.04.28;    8817;       0;       0;       0;    8105;    7280;    8105;    7280;     712;    1537
NATURAL GAS - KANSAS CITY BOARD OF TRADE ;1998.04.21;    9393;       0;       0;       0;    8932;    8126;    8932;    8126;     461;    1267
NATURAL GAS - KANSAS CITY BOARD OF TRADE ;1998.04.14;    9061;       0;       0;       0;    8386;    7597;    8386;    7597;     675;    1464
NATURAL GAS - KANSAS CITY BOARD OF TRADE ;1998.04.07;    9050;       0;       0;       0;    8410;    7621;    8410;    7621;     640;    1429
NATURAL GAS - KANSAS CITY BOARD OF TRADE ;1998.03.31;    8672;       0;       0;       0;    7968;    7200;    7968;    7200;     704;    1472
NATURAL GAS - KANSAS CITY BOARD OF TRADE ;1998.03.24;    9182;       0;       0;       0;    8352;    6977;    8352;    6977;     830;    2205
NATURAL GAS - KANSAS CITY BOARD OF TRADE ;1998.03.17;    8100;       0;       0;       0;    6927;    5895;    6927;    5895;    1173;    2205
NATURAL GAS - KANSAS CITY BOARD OF TRADE ;1998.03.10;    7895;       0;       0;       0;    6829;    5429;    6829;    5429;    1066;    2466
NATURAL GAS - KANSAS CITY BOARD OF TRADE ;1998.03.03;    7776;       0;       0;       0;    6625;    5638;    6625;    5638;    1151;    2138
NATURAL GAS - KANSAS CITY BOARD OF TRADE ;1998.02.24;    8248;       0;       0;       0;    7274;    6216;    7274;    6216;     974;    2032
NATURAL GAS - KANSAS CITY BOARD OF TRADE ;1998.02.17;    7834;       0;       0;       0;    6885;    6097;    6885;    6097;     949;    1737
NATURAL GAS - KANSAS CITY BOARD OF TRADE ;1998.02.10;    6211;       0;       0;       0;    5095;    4549;    5095;    4549;    1116;    1662
NATURAL GAS - KANSAS CITY BOARD OF TRADE ;1998.02.03;    5623;       0;       0;       0;    4527;    4155;    4527;    4155;    1096;    1468
NATURAL GAS - KANSAS CITY BOARD OF TRADE ;1998.01.27;    4622;       0;       0;       0;    3844;    3203;    3844;    3203;     778;    1419
NATURAL GAS - KANSAS CITY BOARD OF TRADE ;1998.01.20;    4135;       0;       0;       0;    3432;    2742;    3432;    2742;     704;    1393
NATURAL GAS - KANSAS CITY BOARD OF TRADE ;1998.01.13;    3755;       0;       0;       0;    3092;    2431;    3092;    2431;     663;    1324
NATURAL GAS - KANSAS CITY BOARD OF TRADE ;1997.12.30;    3513;       0;       0;       0;    2571;    1850;    2571;    1850;     942;    1663
NATURAL GAS - KANSAS CITY BOARD OF TRADE ;1997.12.23;    3664;       0;       0;       0;    3166;    2156;    3166;    2156;     498;    1508
NATURAL GAS - KANSAS CITY BOARD OF TRADE ;1997.12.16;    3420;       0;       0;       0;    2078;    1831;    2078;    1831;    1342;    1589
NATURAL GAS - KANSAS CITY BOARD OF TRADE ;1997.12.09;    2960;       0;       0;       0;    1996;    1438;    1996;    1438;     964;    1522
NATURAL GAS - KANSAS CITY BOARD OF TRADE ;1997.12.02;    2486;       0;       0;       0;    1432;    1121;    1432;    1121;    1054;    1365
NATURAL GAS - KANSAS CITY BOARD OF TRADE ;1997.11.25;    1948;       0;       0;       0;    1203;    1054;    1203;    1054;     745;     894
NATURAL GAS - KANSAS CITY BOARD OF TRADE ;1997.11.18;    2023;       0;       0;       0;    1278;     903;    1278;     903;     745;    1120
NATURAL GAS - KANSAS CITY BOARD OF TRADE ;1997.11.11;    1861;       0;       0;       0;    1202;     940;    1202;     940;     659;     921
NATURAL GAS - KANSAS CITY BOARD OF TRADE ;1997.11.04;    1679;       0;       0;       0;    1137;     772;    1137;     772;     542;     907
NATURAL GAS - KANSAS CITY BOARD OF TRADE ;1997.10.21;    2066;       0;       0;       0;    1244;     989;    1244;     989;     822;    1077
NATURAL GAS - KANSAS CITY BOARD OF TRADE ;1997.09.23;    2317;       0;       0;       0;    1494;    1292;    1494;    1292;     823;    1025
NATURAL GAS - KANSAS CITY BOARD OF TRADE ;1997.09.16;    2128;       0;       0;       0;    1262;    1247;    1262;    1247;     866;     881
NATURAL GAS - KANSAS CITY BOARD OF TRADE ;1997.09.09;    2124;       0;       0;       0;    1104;    1039;    1104;    1039;    1020;    1085
NATURAL GAS - KANSAS CITY BOARD OF TRADE ;1997.09.02;    1870;       0;       0;       0;     634;     782;     634;     782;    1236;    1088
NATURAL GAS - KANSAS CITY BOARD OF TRADE ;1997.08.26;    2489;       0;       0;       0;    1362;     888;    1362;     888;    1127;    1601
NATURAL GAS - KANSAS CITY BOARD OF TRADE ;1997.08.19;    2256;       0;       0;       0;    1239;     782;    1239;     782;    1017;    1474
NATURAL GAS - KANSAS CITY BOARD OF TRADE ;1997.08.12;    1866;       0;       0;       0;     843;     447;     843;     447;    1023;    1419
NATURAL GAS - KANSAS CITY BOARD OF TRADE ;1997.07.29;    2389;       0;       0;       0;    1487;     999;    1487;     999;     902;    1390
NATURAL GAS - KANSAS CITY BOARD OF TRADE ;1997.07.22;    2773;       0;       0;       0;    1645;    1279;    1645;    1279;    1128;    1494
NATURAL GAS - KANSAS CITY BOARD OF TRADE ;1997.07.15;    2508;       0;       0;       0;    1425;    1075;    1425;    1075;    1083;    1433
NATURAL GAS - KANSAS CITY BOARD OF TRADE ;1997.07.08;    2388;       0;       0;       0;    1450;     879;    1450;     879;     938;    1509
NATURAL GAS - KANSAS CITY BOARD OF TRADE ;1997.07.01;    2356;       0;       0;       0;    1460;     930;    1460;     930;     896;    1426
NATURAL GAS - KANSAS CITY BOARD OF TRADE ;1997.06.24;    2870;       0;       0;       0;    1885;    1101;    1885;    1101;     985;    1769
NATURAL GAS - KANSAS CITY BOARD OF TRADE ;1997.06.17;    2781;       0;       0;       0;    1809;     979;    1809;     979;     972;    1802
NATURAL GAS - KANSAS CITY BOARD OF TRADE ;1997.06.10;    2643;       0;       0;       0;    1580;     825;    1580;     825;    1063;    1818
NATURAL GAS - KANSAS CITY BOARD OF TRADE ;1997.06.03;    1954;       0;       0;       0;    1089;     628;    1089;     628;     865;    1326
NATURAL GAS - KANSAS CITY BOARD OF TRADE ;1997.05.27;    2229;       0;       0;       0;    1407;     945;    1407;     945;     822;    1284
NATURAL GAS - KANSAS CITY BOARD OF TRADE ;1997.05.13;    2483;       0;       0;       0;    1443;     759;    1443;     759;    1040;    1724
NATURAL GAS - KANSAS CITY BOARD OF TRADE ;1997.05.06;    2235;       0;       0;       0;    1195;     682;    1195;     682;    1040;    1553
NATURAL GAS - KANSAS CITY BOARD OF TRADE ;1997.04.22;    2581;       0;       0;       0;    1059;    1138;    1059;    1138;    1522;    1443
NATURAL GAS - KANSAS CITY BOARD OF TRADE ;1997.03.25;    2733;       0;       0;       0;    1417;    1420;    1417;    1420;    1316;    1313
NATURAL GAS - KANSAS CITY BOARD OF TRADE ;1997.03.18;    3525;       0;       0;       0;    1836;    2248;    1836;    2248;    1689;    1277
NATURAL GAS - KANSAS CITY BOARD OF TRADE ;1997.03.11;    3460;       0;       0;       0;    1760;    2158;    1760;    2158;    1700;    1302
NATURAL GAS - KANSAS CITY BOARD OF TRADE ;1997.02.18;    2584;       0;       0;       0;    1275;    1189;    1275;    1189;    1309;    1395
NATURAL GAS - KANSAS CITY BOARD OF TRADE ;1997.02.04;    1927;       0;       0;       0;     959;     467;     959;     467;     968;    1460
NATURAL GAS - KANSAS CITY BOARD OF TRADE ;1997.01.28;    2687;       0;       0;       0;    1546;    1065;    1546;    1065;    1141;    1622
NATURAL GAS - KANSAS CITY BOARD OF TRADE ;1997.01.21;    2202;       0;       0;       0;     749;     406;     749;     406;    1453;    1796
NATURAL GAS - KANSAS CITY BOARD OF TRADE ;1996.12.17;    2935;       0;       0;       0;    1180;    1441;    1180;    1441;    1755;    1494
NATURAL GAS - KANSAS CITY BOARD OF TRADE ;1996.12.10;    2626;       0;       0;       0;    1083;     919;    1083;     919;    1543;    1707
NATURAL GAS - KANSAS CITY BOARD OF TRADE ;1996.11.19;    2718;       0;       0;       0;    1111;     724;    1111;     724;    1607;    1994
NATURAL GAS - KANSAS CITY BOARD OF TRADE ;1996.11.12;    2931;       0;       0;       0;    1317;    1300;    1317;    1300;    1614;    1631
NATURAL GAS - KANSAS CITY BOARD OF TRADE ;1996.11.05;    3103;       0;       0;       0;    1609;    1460;    1609;    1460;    1494;    1643
NATURAL GAS - KANSAS CITY BOARD OF TRADE ;1996.10.29;    2660;       0;       0;       0;    1326;    1260;    1326;    1260;    1334;    1400
NATURAL GAS - KANSAS CITY BOARD OF TRADE ;1996.10.22;    3346;       0;       0;       0;    1884;    1493;    1884;    1493;    1462;    1853
NATURAL GAS - KANSAS CITY BOARD OF TRADE ;1996.10.15;    2688;       0;       0;       0;    1225;     584;    1225;     584;    1463;    2104
NATURAL GAS - KANSAS CITY BOARD OF TRADE ;1996.09.24;    2436;       0;       0;       0;     356;     534;     356;     534;    2080;    1902
NATURAL GAS - KANSAS CITY BOARD OF TRADE ;1996.08.27;    2372;       0;       0;       0;     724;     698;     724;     698;    1648;    1674
NATURAL GAS - KANSAS CITY BOARD OF TRADE ;1996.07.23;    2806;       0;       0;       0;    1254;     838;    1254;     838;    1552;    1968
NATURAL GAS - KANSAS CITY BOARD OF TRADE ;1996.07.16;    2490;       0;       0;       0;    1006;     734;    1006;     734;    1484;    1756
NATURAL GAS - KANSAS CITY BOARD OF TRADE ;1996.06.25;    3369;       0;       0;       0;    1638;    1576;    1638;    1576;    1731;    1793
NATURAL GAS - KANSAS CITY BOARD OF TRADE ;1996.06.18;    3740;       0;       0;       0;    1679;    1731;    1679;    1731;    2061;    2009
NATURAL GAS - KANSAS CITY BOARD OF TRADE ;1996.06.11;    2906;       0;       0;       0;    1345;     974;    1345;     974;    1561;    1932
NATURAL GAS - KANSAS CITY BOARD OF TRADE ;1996.06.04;    2802;       0;       0;       0;    1363;     941;    1363;     941;    1439;    1861
NATURAL GAS - KANSAS CITY BOARD OF TRADE ;1996.05.28;    3107;       0;       0;       0;    1313;    1266;    1313;    1266;    1794;    1841
NATURAL GAS - KANSAS CITY BOARD OF TRADE ;1996.05.21;    3454;       0;       0;       0;    1534;    1155;    1534;    1155;    1920;    2299
NATURAL GAS - KANSAS CITY BOARD OF TRADE ;1996.05.14;    2789;       0;       0;       0;     860;     433;     860;     433;    1929;    2356
NATURAL GAS - KANSAS CITY BOARD OF TRADE ;1996.05.07;    2711;       0;       0;       0;     864;     551;     864;     551;    1847;    2160
NATURAL GAS - KANSAS CITY BOARD OF TRADE ;1996.04.30;    2407;       0;       0;       0;     725;     612;     725;     612;    1682;    1795
NATURAL GAS - KANSAS CITY BOARD OF TRADE ;1996.04.23;    3247;       0;       0;       0;     812;    1484;     812;    1484;    2435;    1763
NATURAL GAS - KANSAS CITY BOARD OF TRADE ;1996.04.16;    3739;       0;       9;     252;    1166;    1661;    1418;    1922;    2321;    1818
NATURAL GAS - KANSAS CITY BOARD OF TRADE ;1996.04.09;    3473;       0;      15;     252;    1492;    1349;    1744;    1616;    1729;    1856
NATURAL GAS - KANSAS CITY BOARD OF TRADE ;1996.04.02;    3451;       0;      23;     250;    1498;    1267;    1747;    1540;    1704;    1911
NATURAL GAS - KANSAS CITY BOARD OF TRADE ;1996.03.26;    3803;       0;      41;     245;    1752;    1670;    1997;    1956;    1806;    1846
NATURAL GAS - KANSAS CITY BOARD OF TRADE ;1996.03.19;    4819;       0;      91;     362;    2188;    2155;    2549;    2608;    2270;    2211
NATURAL GAS - KANSAS CITY BOARD OF TRADE ;1996.03.12;    4712;       0;     170;     350;    2444;    1811;    2794;    2332;    1918;    2380
NATURAL GAS - KANSAS CITY BOARD OF TRADE ;1996.03.05;    4379;       0;     129;     352;    1849;    2206;    2201;    2688;    2178;    1692
NATURAL GAS - KANSAS CITY BOARD OF TRADE ;1996.02.27;    4377;       0;     131;     321;    1813;    2392;    2134;    2844;    2243;    1534
NATURAL GAS - KANSAS CITY BOARD OF TRADE ;1996.02.20;    5331;       0;     249;     264;    2168;    2960;    2432;    3473;    2899;    1857
NATURAL GAS - KANSAS CITY BOARD OF TRADE ;1996.02.13;    5091;       0;     222;     296;    2011;    2743;    2308;    3261;    2783;    1829
NATURAL GAS - KANSAS CITY BOARD OF TRADE ;1996.02.06;    5120;       0;     210;     307;    1780;    2736;    2087;    3252;    3033;    1868
NATURAL GAS - KANSAS CITY BOARD OF TRADE ;1996.01.30;    5183;       0;     176;     304;    1797;    2894;    2101;    3373;    3082;    1810
NATURAL GAS - KANSAS CITY BOARD OF TRADE ;1996.01.23;    5806;       0;     141;     327;    2206;    3063;    2534;    3531;    3272;    2275
NATURAL GAS - KANSAS CITY BOARD OF TRADE ;1996.01.16;    6105;       0;      69;     474;    2333;    3034;    2807;    3576;    3299;    2529
NATURAL GAS - KANSAS CITY BOARD OF TRADE ;1996.01.09;    5663;      13;      67;     550;    2550;    3224;    3113;    3841;    2550;    1822
NATURAL GAS - KANSAS CITY BOARD OF TRADE ;1996.01.02;    5050;       6;      14;     556;    2184;    2826;    2746;    3395;    2304;    1655
NATURAL GAS - KANSAS CITY BOARD OF TRADE ;1995.12.26;    4764;       6;      18;     501;    2074;    2784;    2581;    3303;    2183;    1461
NATURAL GAS - KANSAS CITY BOARD OF TRADE ;1995.12.19;    5570;     175;       0;     363;    2301;    2701;    2839;    3064;    2731;    2506
NATURAL GAS - KANSAS CITY BOARD OF TRADE ;1995.12.12;    5849;     168;       0;     399;    2817;    3049;    3384;    3448;    2465;    2401
NATURAL GAS - KANSAS CITY BOARD OF TRADE ;1995.12.05;    5281;     185;       0;     350;    2841;    3097;    3376;    3447;    1905;    1834
NATURAL GAS - KANSAS CITY BOARD OF TRADE ;1995.11.28;    5018;      36;       0;     384;    2612;    2800;    3032;    3184;    1986;    1834
NATURAL GAS - KANSAS CITY BOARD OF TRADE ;1995.11.21;    5381;       0;      28;     211;    3002;    3364;    3213;    3603;    2168;    1778
NATURAL GAS - KANSAS CITY BOARD OF TRADE ;1995.11.14;    5563;       0;     139;     366;    2878;    2843;    3244;    3348;    2319;    2214
NATURAL GAS - KANSAS CITY BOARD OF TRADE ;1995.11.07;    5676;       0;       9;     375;    2920;    2970;    3295;    3355;    2380;    2321
NATURAL GAS - KANSAS CITY BOARD OF TRADE ;1995.10.31;    5361;      27;       0;     360;    2819;    2706;    3206;    3066;    2155;    2295
NATURAL GAS - KANSAS CITY BOARD OF TRADE ;1995.10.24;    5172;       0;       0;       0;    2207;    2334;    2207;    2334;    2966;    2838
NATURAL GAS - KANSAS CITY BOARD OF TRADE ;1995.10.17;    4982;       0;       0;       0;    2658;    2722;    2658;    2722;    2324;    2259
NATURAL GAS - KANSAS CITY BOARD OF TRADE ;1995.10.10;    4696;       0;      14;     213;    2839;    2326;    3052;    2553;    1644;    2143
NATURAL GAS - KANSAS CITY BOARD OF TRADE ;1995.10.03;    4599;       0;      24;     182;    2807;    2020;    2989;    2227;    1610;    2372
NATURAL GAS - KANSAS CITY BOARD OF TRADE ;1995.09.26;    4118;       0;      63;     180;    2732;    1652;    2912;    1896;    1205;    2222
NATURAL GAS - KANSAS CITY BOARD OF TRADE ;1995.09.19;    4199;      15;       0;     179;    2007;    1822;    2201;    2001;    1997;    2198
NATURAL GAS - KANSAS CITY BOARD OF TRADE ;1995.09.12;    3601;       0;       4;     174;    1776;    1208;    1950;    1386;    1651;    2215
NATURAL GAS - KANSAS CITY BOARD OF TRADE ;1995.09.05;    3089;       0;       0;       0;    1484;    1012;    1484;    1012;    1605;    2077
NATURAL GAS - KANSAS CITY BOARD OF TRADE ;1995.08.29;    2676;       0;       0;       0;    1257;     569;    1257;     569;    1419;    2107
NATURAL GAS - KANSAS CITY BOARD OF TRADE ;1995.08.22;    3326;       0;       0;       0;    1533;     956;    1533;     956;    1793;    2370
NATURAL GAS - KANSAS CITY BOARD OF TRADE ;1995.08.15;    2706;       0;       0;       0;    1237;     798;    1237;     798;    1469;    1908
NATURAL GAS - KANSAS CITY BOARD OF TRADE ;1995.08.01;    1250;     218;       0;     108;     460;     450;     786;     558;     464;     692
