UNL GAS CRACK SPRD CAL SWAP - NEW YORK MERCANTILE EXCHANGE ;2005.01.18;    8587;     450;    2106;     402;    7660;    5929;    8512;    8437;      75;     150
UNL GAS CRACK SPRD CAL SWAP - NEW YORK MERCANTILE EXCHANGE ;2005.01.11;    8752;     450;    2031;     402;    7900;    6319;    8752;    8752;       0;       0
UNL GAS CRACK SPRD CAL SWAP - NEW YORK MERCANTILE EXCHANGE ;2005.01.04;    8677;     450;    2106;     402;    7825;    6169;    8677;    8677;       0;       0
UNL GAS CRACK SPRD CAL SWAP - NEW YORK MERCANTILE EXCHANGE ;2004.12.28;    9007;     550;    2516;     447;    8010;    6044;    9007;    9007;       0;       0
UNL GAS CRACK SPRD CAL SWAP - NEW YORK MERCANTILE EXCHANGE ;2004.12.21;    8857;     550;    2366;     447;    7860;    6044;    8857;    8857;       0;       0
UNL GAS CRACK SPRD CAL SWAP - NEW YORK MERCANTILE EXCHANGE ;2004.12.14;   10062;     700;    2867;     977;    8385;    6218;   10062;   10062;       0;       0
UNL GAS CRACK SPRD CAL SWAP - NEW YORK MERCANTILE EXCHANGE ;2004.12.07;    9612;     475;    2567;     977;    8160;    5993;    9612;    9537;       0;      75
UNL GAS CRACK SPRD CAL SWAP - NEW YORK MERCANTILE EXCHANGE ;2004.11.30;    9902;     575;    3007;     952;    8375;    5943;    9902;    9902;       0;       0
UNL GAS CRACK SPRD CAL SWAP - NEW YORK MERCANTILE EXCHANGE ;2004.11.23;    9902;     575;    2857;     952;    8375;    6093;    9902;    9902;       0;       0
UNL GAS CRACK SPRD CAL SWAP - NEW YORK MERCANTILE EXCHANGE ;2004.11.16;    9852;     575;    2932;     977;    8225;    5868;    9777;    9777;      75;      75
UNL GAS CRACK SPRD CAL SWAP - NEW YORK MERCANTILE EXCHANGE ;2004.11.09;    9352;     575;    2557;    1077;    7700;    5643;    9352;    9277;       0;      75
UNL GAS CRACK SPRD CAL SWAP - NEW YORK MERCANTILE EXCHANGE ;2004.11.02;    9427;     575;    3058;    1052;    7775;    5268;    9402;    9378;      25;      49
UNL GAS CRACK SPRD CAL SWAP - NEW YORK MERCANTILE EXCHANGE ;2004.10.26;   10038;     675;    2117;    2053;    7235;    5793;    9963;    9963;      75;      75
UNL GAS CRACK SPRD CAL SWAP - NEW YORK MERCANTILE EXCHANGE ;2004.10.19;    9910;     675;    2045;    2150;    7085;    5640;    9910;    9835;       0;      75
UNL GAS CRACK SPRD CAL SWAP - NEW YORK MERCANTILE EXCHANGE ;2004.10.12;   10195;     675;    2135;    2285;    7175;    5730;   10135;   10150;      60;      45
UNL GAS CRACK SPRD CAL SWAP - NEW YORK MERCANTILE EXCHANGE ;2004.09.28;    9970;     675;    2246;    2085;    7135;    5564;    9895;    9895;      75;      75
UNL GAS CRACK SPRD CAL SWAP - NEW YORK MERCANTILE EXCHANGE ;2004.08.31;    9155;     300;    3636;     870;    7910;    4529;    9080;    9035;      75;     120
UNL GAS CRACK SPRD CAL SWAP - NEW YORK MERCANTILE EXCHANGE ;2004.08.24;    8655;     300;    3786;     795;    7485;    3954;    8580;    8535;      75;     120
UNL GAS CRACK SPRD CAL SWAP - NEW YORK MERCANTILE EXCHANGE ;2005.01.18;    8587;     450;    2106;     402;    7660;    5929;    8512;    8437;      75;     150
UNL GAS CRACK SPRD CAL SWAP - NEW YORK MERCANTILE EXCHANGE ;2005.01.11;    8752;     450;    2031;     402;    7900;    6319;    8752;    8752;       0;       0
UNL GAS CRACK SPRD CAL SWAP - NEW YORK MERCANTILE EXCHANGE ;2005.01.04;    8677;     450;    2106;     402;    7825;    6169;    8677;    8677;       0;       0
UNL GAS CRACK SPRD CAL SWAP - NEW YORK MERCANTILE EXCHANGE ;2004.12.28;    9007;     550;    2516;     447;    8010;    6044;    9007;    9007;       0;       0
UNL GAS CRACK SPRD CAL SWAP - NEW YORK MERCANTILE EXCHANGE ;2004.12.21;    8857;     550;    2366;     447;    7860;    6044;    8857;    8857;       0;       0
UNL GAS CRACK SPRD CAL SWAP - NEW YORK MERCANTILE EXCHANGE ;2004.12.14;   10062;     700;    2867;     977;    8385;    6218;   10062;   10062;       0;       0
UNL GAS CRACK SPRD CAL SWAP - NEW YORK MERCANTILE EXCHANGE ;2004.12.07;    9612;     475;    2567;     977;    8160;    5993;    9612;    9537;       0;      75
UNL GAS CRACK SPRD CAL SWAP - NEW YORK MERCANTILE EXCHANGE ;2004.11.30;    9902;     575;    3007;     952;    8375;    5943;    9902;    9902;       0;       0
UNL GAS CRACK SPRD CAL SWAP - NEW YORK MERCANTILE EXCHANGE ;2004.11.23;    9902;     575;    2857;     952;    8375;    6093;    9902;    9902;       0;       0
UNL GAS CRACK SPRD CAL SWAP - NEW YORK MERCANTILE EXCHANGE ;2004.11.16;    9852;     575;    2932;     977;    8225;    5868;    9777;    9777;      75;      75
UNL GAS CRACK SPRD CAL SWAP - NEW YORK MERCANTILE EXCHANGE ;2004.11.09;    9352;     575;    2557;    1077;    7700;    5643;    9352;    9277;       0;      75
UNL GAS CRACK SPRD CAL SWAP - NEW YORK MERCANTILE EXCHANGE ;2004.11.02;    9427;     575;    3058;    1052;    7775;    5268;    9402;    9378;      25;      49
UNL GAS CRACK SPRD CAL SWAP - NEW YORK MERCANTILE EXCHANGE ;2004.10.26;   10038;     675;    2117;    2053;    7235;    5793;    9963;    9963;      75;      75
UNL GAS CRACK SPRD CAL SWAP - NEW YORK MERCANTILE EXCHANGE ;2004.10.19;    9910;     675;    2045;    2150;    7085;    5640;    9910;    9835;       0;      75
UNL GAS CRACK SPRD CAL SWAP - NEW YORK MERCANTILE EXCHANGE ;2004.10.12;   10195;     675;    2135;    2285;    7175;    5730;   10135;   10150;      60;      45
UNL GAS CRACK SPRD CAL SWAP - NEW YORK MERCANTILE EXCHANGE ;2004.09.28;    9970;     675;    2246;    2085;    7135;    5564;    9895;    9895;      75;      75
UNL GAS CRACK SPRD CAL SWAP - NEW YORK MERCANTILE EXCHANGE ;2004.08.31;    9155;     300;    3636;     870;    7910;    4529;    9080;    9035;      75;     120
UNL GAS CRACK SPRD CAL SWAP - NEW YORK MERCANTILE EXCHANGE ;2004.08.24;    8655;     300;    3786;     795;    7485;    3954;    8580;    8535;      75;     120
UNL GAS CRACK SPRD CAL SWAP - NEW YORK MERCANTILE EXCHANGE ;2005.01.18;    8587;     450;    2106;     402;    7660;    5929;    8512;    8437;      75;     150
UNL GAS CRACK SPRD CAL SWAP - NEW YORK MERCANTILE EXCHANGE ;2005.01.11;    8752;     450;    2031;     402;    7900;    6319;    8752;    8752;       0;       0
UNL GAS CRACK SPRD CAL SWAP - NEW YORK MERCANTILE EXCHANGE ;2005.01.04;    8677;     450;    2106;     402;    7825;    6169;    8677;    8677;       0;       0
UNL GAS CRACK SPRD CAL SWAP - NEW YORK MERCANTILE EXCHANGE ;2004.12.28;    9007;     550;    2516;     447;    8010;    6044;    9007;    9007;       0;       0
UNL GAS CRACK SPRD CAL SWAP - NEW YORK MERCANTILE EXCHANGE ;2004.12.21;    8857;     550;    2366;     447;    7860;    6044;    8857;    8857;       0;       0
UNL GAS CRACK SPRD CAL SWAP - NEW YORK MERCANTILE EXCHANGE ;2004.12.14;   10062;     700;    2867;     977;    8385;    6218;   10062;   10062;       0;       0
UNL GAS CRACK SPRD CAL SWAP - NEW YORK MERCANTILE EXCHANGE ;2004.12.07;    9612;     475;    2567;     977;    8160;    5993;    9612;    9537;       0;      75
UNL GAS CRACK SPRD CAL SWAP - NEW YORK MERCANTILE EXCHANGE ;2004.11.30;    9902;     575;    3007;     952;    8375;    5943;    9902;    9902;       0;       0
UNL GAS CRACK SPRD CAL SWAP - NEW YORK MERCANTILE EXCHANGE ;2004.11.23;    9902;     575;    2857;     952;    8375;    6093;    9902;    9902;       0;       0
UNL GAS CRACK SPRD CAL SWAP - NEW YORK MERCANTILE EXCHANGE ;2004.11.16;    9852;     575;    2932;     977;    8225;    5868;    9777;    9777;      75;      75
UNL GAS CRACK SPRD CAL SWAP - NEW YORK MERCANTILE EXCHANGE ;2004.11.09;    9352;     575;    2557;    1077;    7700;    5643;    9352;    9277;       0;      75
UNL GAS CRACK SPRD CAL SWAP - NEW YORK MERCANTILE EXCHANGE ;2004.11.02;    9427;     575;    3058;    1052;    7775;    5268;    9402;    9378;      25;      49
UNL GAS CRACK SPRD CAL SWAP - NEW YORK MERCANTILE EXCHANGE ;2004.10.26;   10038;     675;    2117;    2053;    7235;    5793;    9963;    9963;      75;      75
UNL GAS CRACK SPRD CAL SWAP - NEW YORK MERCANTILE EXCHANGE ;2004.10.19;    9910;     675;    2045;    2150;    7085;    5640;    9910;    9835;       0;      75
UNL GAS CRACK SPRD CAL SWAP - NEW YORK MERCANTILE EXCHANGE ;2004.10.12;   10195;     675;    2135;    2285;    7175;    5730;   10135;   10150;      60;      45
UNL GAS CRACK SPRD CAL SWAP - NEW YORK MERCANTILE EXCHANGE ;2004.09.28;    9970;     675;    2246;    2085;    7135;    5564;    9895;    9895;      75;      75
UNL GAS CRACK SPRD CAL SWAP - NEW YORK MERCANTILE EXCHANGE ;2004.08.31;    9155;     300;    3636;     870;    7910;    4529;    9080;    9035;      75;     120
UNL GAS CRACK SPRD CAL SWAP - NEW YORK MERCANTILE EXCHANGE ;2004.08.24;    8655;     300;    3786;     795;    7485;    3954;    8580;    8535;      75;     120
