RGGI CO2 ALLOWANCE - CHICAGO CLIMATE FUTURES EXCHANGE ;2010.02.16;   12312;     737;      58;      45;   11508;   12209;   12290;   12312;      22;       0
RGGI CO2 ALLOWANCE - CHICAGO CLIMATE FUTURES EXCHANGE ;2010.02.09;   12208;     718;      58;      57;   11406;   12086;   12181;   12201;      27;       7
RGGI CO2 ALLOWANCE - CHICAGO CLIMATE FUTURES EXCHANGE ;2010.01.05;   10977;     160;      37;      94;   10670;   10837;   10924;   10968;      53;       9
RGGI CO2 ALLOWANCE - CHICAGO CLIMATE FUTURES EXCHANGE ;2009.12.29;   30757;    2641;     118;     125;   27708;   30128;   30474;   30371;     283;     386
RGGI CO2 ALLOWANCE - CHICAGO CLIMATE FUTURES EXCHANGE ;2009.12.22;   38325;    2284;     653;    1533;   34478;   36125;   38294;   38310;      31;      15
RGGI CO2 ALLOWANCE - CHICAGO CLIMATE FUTURES EXCHANGE ;2009.12.15;   40379;    2195;     721;    1789;   36292;   37823;   40276;   40334;     103;      45
RGGI CO2 ALLOWANCE - CHICAGO CLIMATE FUTURES EXCHANGE ;2009.12.08;   37790;    2218;     673;    1883;   33308;   34898;   37409;   37455;     380;     335
RGGI CO2 ALLOWANCE - CHICAGO CLIMATE FUTURES EXCHANGE ;2009.12.01;   35709;    2203;     854;    1789;   31625;   33000;   35616;   35643;      93;      66
RGGI CO2 ALLOWANCE - CHICAGO CLIMATE FUTURES EXCHANGE ;2009.11.24;   32460;    1729;     948;    1580;   29123;   29932;   32432;   32460;      28;       0
RGGI CO2 ALLOWANCE - CHICAGO CLIMATE FUTURES EXCHANGE ;2009.11.17;   30694;    1582;    1058;    1095;   27965;   28498;   30642;   30651;      52;      43
RGGI CO2 ALLOWANCE - CHICAGO CLIMATE FUTURES EXCHANGE ;2009.11.09;   29040;    1462;     939;     977;   26550;   27117;   28989;   29033;      51;       7
RGGI CO2 ALLOWANCE - CHICAGO CLIMATE FUTURES EXCHANGE ;2009.11.03;   28103;    1262;    1033;     960;   25834;   26093;   28056;   28087;      47;      16
RGGI CO2 ALLOWANCE - CHICAGO CLIMATE FUTURES EXCHANGE ;2009.10.27;   28226;    1209;     974;     983;   25978;   26257;   28170;   28214;      56;      12
RGGI CO2 ALLOWANCE - CHICAGO CLIMATE FUTURES EXCHANGE ;2009.10.20;   28416;    1118;     884;    1261;   25962;   26233;   28341;   28378;      75;      38
RGGI CO2 ALLOWANCE - CHICAGO CLIMATE FUTURES EXCHANGE ;2009.10.13;   27941;    1116;    1028;    1149;   25547;   25660;   27811;   27837;     129;     103
RGGI CO2 ALLOWANCE - CHICAGO CLIMATE FUTURES EXCHANGE ;2009.10.06;   27006;    1085;     839;    1194;   24681;   24946;   26960;   26980;      46;      27
RGGI CO2 ALLOWANCE - CHICAGO CLIMATE FUTURES EXCHANGE ;2009.09.29;   27969;    1008;     782;    1176;   25632;   25853;   27816;   27811;     153;     158
RGGI CO2 ALLOWANCE - CHICAGO CLIMATE FUTURES EXCHANGE ;2009.09.22;   27220;     957;     888;     712;   25390;   25427;   27059;   27027;     161;     194
RGGI CO2 ALLOWANCE - CHICAGO CLIMATE FUTURES EXCHANGE ;2009.09.15;   26235;     953;    1075;     846;   24262;   24172;   26060;   26093;     175;     143
RGGI CO2 ALLOWANCE - CHICAGO CLIMATE FUTURES EXCHANGE ;2009.09.08;   22421;     947;     795;     710;   20736;   20810;   22393;   22314;      28;     106
RGGI CO2 ALLOWANCE - CHICAGO CLIMATE FUTURES EXCHANGE ;2009.09.01;   20281;    1054;     575;     382;   18817;   19286;   20252;   20242;      28;      38
RGGI CO2 ALLOWANCE - CHICAGO CLIMATE FUTURES EXCHANGE ;2009.08.25;   19301;     826;     551;     412;   18027;   18205;   19264;   19168;      36;     132
RGGI CO2 ALLOWANCE - CHICAGO CLIMATE FUTURES EXCHANGE ;2009.08.18;   18532;     801;     444;     355;   17308;   17548;   18464;   18346;      69;     186
RGGI CO2 ALLOWANCE - CHICAGO CLIMATE FUTURES EXCHANGE ;2009.08.11;   17613;     788;     493;     347;   16434;   16572;   17570;   17412;      43;     201
RGGI CO2 ALLOWANCE - CHICAGO CLIMATE FUTURES EXCHANGE ;2009.08.04;   16772;     730;     426;     345;   15668;   15965;   16743;   16736;      29;      36
RGGI CO2 ALLOWANCE - CHICAGO CLIMATE FUTURES EXCHANGE ;2009.07.28;   17978;     701;     416;     334;   16895;   17172;   17930;   17922;      48;      56
RGGI CO2 ALLOWANCE - CHICAGO CLIMATE FUTURES EXCHANGE ;2009.07.21;   17658;     987;     416;     465;   16167;   16731;   17619;   17612;      39;      46
RGGI CO2 ALLOWANCE - CHICAGO CLIMATE FUTURES EXCHANGE ;2009.07.14;   16818;     955;    2114;     386;   15433;   14267;   16774;   16767;      44;      51
RGGI CO2 ALLOWANCE - CHICAGO CLIMATE FUTURES EXCHANGE ;2009.07.07;   15689;     947;    2218;     286;   14435;   13153;   15667;   15657;      22;      33
RGGI CO2 ALLOWANCE - CHICAGO CLIMATE FUTURES EXCHANGE ;2009.06.30;   18445;     978;    2768;     821;   16559;   14752;   18358;   18341;      86;     103
RGGI CO2 ALLOWANCE - CHICAGO CLIMATE FUTURES EXCHANGE ;2009.06.23;   18247;    1050;    2892;     583;   16561;   14707;   18194;   18182;      53;      65
RGGI CO2 ALLOWANCE - CHICAGO CLIMATE FUTURES EXCHANGE ;2009.06.16;   16945;    1277;    2667;     517;   15127;   13726;   16921;   16910;      24;      35
RGGI CO2 ALLOWANCE - CHICAGO CLIMATE FUTURES EXCHANGE ;2009.06.09;   16323;    1249;    2788;     486;   14548;   12982;   16283;   16256;      40;      67
RGGI CO2 ALLOWANCE - CHICAGO CLIMATE FUTURES EXCHANGE ;2009.06.02;   15665;    1283;    2849;     479;   13849;   12263;   15611;   15591;      54;      73
RGGI CO2 ALLOWANCE - CHICAGO CLIMATE FUTURES EXCHANGE ;2009.05.26;   17898;    1467;    4768;     469;   15807;   12512;   17743;   17748;     155;     150
RGGI CO2 ALLOWANCE - CHICAGO CLIMATE FUTURES EXCHANGE ;2009.05.19;   17386;    1469;    4799;     498;   15399;   12082;   17366;   17379;      20;       7
RGGI CO2 ALLOWANCE - CHICAGO CLIMATE FUTURES EXCHANGE ;2009.05.12;   15475;    1315;    4460;     486;   13553;   10417;   15354;   15362;     121;     113
RGGI CO2 ALLOWANCE - CHICAGO CLIMATE FUTURES EXCHANGE ;2009.05.05;   13621;    2099;    3263;     732;   10661;    9517;   13492;   13512;     129;     109
RGGI CO2 ALLOWANCE - CHICAGO CLIMATE FUTURES EXCHANGE ;2009.04.28;   15978;     922;    4930;    1554;   13456;    9428;   15931;   15912;      47;      67
RGGI CO2 ALLOWANCE - CHICAGO CLIMATE FUTURES EXCHANGE ;2009.04.21;   15395;    1355;    4404;    1474;   12445;    9404;   15274;   15282;     121;     113
RGGI CO2 ALLOWANCE - CHICAGO CLIMATE FUTURES EXCHANGE ;2009.04.14;   14944;    1481;    4249;    1269;   11760;    8988;   14510;   14506;     434;     438
RGGI CO2 ALLOWANCE - CHICAGO CLIMATE FUTURES EXCHANGE ;2009.04.07;   13231;    1457;    4416;     774;   10109;    7143;   12339;   12333;     891;     898
RGGI CO2 ALLOWANCE - CHICAGO CLIMATE FUTURES EXCHANGE ;2009.03.31;   12769;    1062;    3564;    1513;   10132;    7646;   12707;   12723;      62;      46
RGGI CO2 ALLOWANCE - CHICAGO CLIMATE FUTURES EXCHANGE ;2009.03.24;   10837;    1056;    2551;    1297;    8365;    6873;   10717;   10721;     119;     116
RGGI CO2 ALLOWANCE - CHICAGO CLIMATE FUTURES EXCHANGE ;2009.03.17;   10773;     592;    2702;    1429;    8663;    6513;   10684;   10643;      89;     130
RGGI CO2 ALLOWANCE - CHICAGO CLIMATE FUTURES EXCHANGE ;2009.03.10;    9924;     791;    2278;    1342;    7651;    6132;    9784;    9752;     140;     172
RGGI CO2 ALLOWANCE - CHICAGO CLIMATE FUTURES EXCHANGE ;2009.03.03;    9105;     842;    2429;    1241;    6967;    5370;    9049;    9040;      55;      65
RGGI CO2 ALLOWANCE - CHICAGO CLIMATE FUTURES EXCHANGE ;2009.02.24;    9402;     785;    2802;    1044;    7509;    5520;    9337;    9366;      65;      36
RGGI CO2 ALLOWANCE - CHICAGO CLIMATE FUTURES EXCHANGE ;2009.02.17;    8408;     645;    2403;     803;    6951;    5192;    8400;    8397;       8;      10
RGGI CO2 ALLOWANCE - CHICAGO CLIMATE FUTURES EXCHANGE ;2009.02.10;    8070;     876;    2674;     734;    6396;    4623;    8007;    8031;      63;      39
RGGI CO2 ALLOWANCE - CHICAGO CLIMATE FUTURES EXCHANGE ;2009.02.03;    7564;     962;    2657;     593;    5949;    4277;    7504;    7526;      60;      38
RGGI CO2 ALLOWANCE - CHICAGO CLIMATE FUTURES EXCHANGE ;2009.01.27;    6928;     834;    2294;     198;    5801;    4395;    6834;    6888;      94;      41
RGGI CO2 ALLOWANCE - CHICAGO CLIMATE FUTURES EXCHANGE ;2009.01.20;    6559;     800;    1741;     185;    5515;    4598;    6500;    6523;      59;      36
RGGI CO2 ALLOWANCE - CHICAGO CLIMATE FUTURES EXCHANGE ;2009.01.13;    6347;     689;    1590;     192;    5428;    4527;    6309;    6309;      38;      38
RGGI CO2 ALLOWANCE - CHICAGO CLIMATE FUTURES EXCHANGE ;2009.01.06;    5518;     467;    1669;     222;    4803;    3545;    5492;    5437;      26;      82
RGGI CO2 ALLOWANCE - CHICAGO CLIMATE FUTURES EXCHANGE ;2008.12.30;    6487;     235;    1200;     986;    5192;    4172;    6413;    6357;      74;     129
RGGI CO2 ALLOWANCE - CHICAGO CLIMATE FUTURES EXCHANGE ;2008.12.22;    6563;     212;    1292;     944;    5373;    4260;    6528;    6496;      34;      67
RGGI CO2 ALLOWANCE - CHICAGO CLIMATE FUTURES EXCHANGE ;2008.12.16;    6835;     216;    1592;     416;    6171;    4752;    6802;    6760;      33;      75
RGGI CO2 ALLOWANCE - CHICAGO CLIMATE FUTURES EXCHANGE ;2008.12.09;    6063;     216;    1782;     472;    5346;    3732;    6034;    5986;      29;      77
RGGI CO2 ALLOWANCE - CHICAGO CLIMATE FUTURES EXCHANGE ;2008.12.02;    3928;     104;    1626;     240;    3454;    1911;    3798;    3777;     130;     151
RGGI CO2 ALLOWANCE - CHICAGO CLIMATE FUTURES EXCHANGE ;2008.11.25;    4006;     203;    1590;     265;    3415;    2003;    3883;    3857;     124;     150
RGGI CO2 ALLOWANCE - CHICAGO CLIMATE FUTURES EXCHANGE ;2008.11.18;    4088;     264;    1538;     276;    3394;    2135;    3933;    3948;     155;     140
RGGI CO2 ALLOWANCE - CHICAGO CLIMATE FUTURES EXCHANGE ;2008.11.11;    4110;     363;    1354;     311;    3338;    2336;    4012;    4001;      98;     109
RGGI CO2 ALLOWANCE - CHICAGO CLIMATE FUTURES EXCHANGE ;2008.11.04;    3610;     358;    1135;     241;    2948;    2087;    3547;    3463;      63;     147
RGGI CO2 ALLOWANCE - CHICAGO CLIMATE FUTURES EXCHANGE ;2008.10.28;    2921;     134;     633;     260;    2423;    1853;    2817;    2746;     105;     175
RGGI CO2 ALLOWANCE - CHICAGO CLIMATE FUTURES EXCHANGE ;2008.10.21;    3068;     211;     370;     277;    2404;    2170;    2892;    2817;     176;     251
RGGI CO2 ALLOWANCE - CHICAGO CLIMATE FUTURES EXCHANGE ;2010.02.16;   12312;     737;      58;      45;   11508;   12209;   12290;   12312;      22;       0
RGGI CO2 ALLOWANCE - CHICAGO CLIMATE FUTURES EXCHANGE ;2010.02.09;   12208;     718;      58;      57;   11406;   12086;   12181;   12201;      27;       7
RGGI CO2 ALLOWANCE - CHICAGO CLIMATE FUTURES EXCHANGE ;2010.01.05;   10977;     160;      37;      94;   10670;   10837;   10924;   10968;      53;       9
RGGI CO2 ALLOWANCE - CHICAGO CLIMATE FUTURES EXCHANGE ;2009.12.29;   30757;    2641;     118;     125;   27708;   30128;   30474;   30371;     283;     386
RGGI CO2 ALLOWANCE - CHICAGO CLIMATE FUTURES EXCHANGE ;2009.12.22;   38325;    2284;     653;    1533;   34478;   36125;   38294;   38310;      31;      15
RGGI CO2 ALLOWANCE - CHICAGO CLIMATE FUTURES EXCHANGE ;2009.12.15;   40379;    2195;     721;    1789;   36292;   37823;   40276;   40334;     103;      45
RGGI CO2 ALLOWANCE - CHICAGO CLIMATE FUTURES EXCHANGE ;2009.12.08;   37790;    2218;     673;    1883;   33308;   34898;   37409;   37455;     380;     335
RGGI CO2 ALLOWANCE - CHICAGO CLIMATE FUTURES EXCHANGE ;2009.12.01;   35709;    2203;     854;    1789;   31625;   33000;   35616;   35643;      93;      66
RGGI CO2 ALLOWANCE - CHICAGO CLIMATE FUTURES EXCHANGE ;2009.11.24;   32460;    1729;     948;    1580;   29123;   29932;   32432;   32460;      28;       0
RGGI CO2 ALLOWANCE - CHICAGO CLIMATE FUTURES EXCHANGE ;2009.11.17;   30694;    1582;    1058;    1095;   27965;   28498;   30642;   30651;      52;      43
RGGI CO2 ALLOWANCE - CHICAGO CLIMATE FUTURES EXCHANGE ;2009.11.09;   29040;    1462;     939;     977;   26550;   27117;   28989;   29033;      51;       7
RGGI CO2 ALLOWANCE - CHICAGO CLIMATE FUTURES EXCHANGE ;2009.11.03;   28103;    1262;    1033;     960;   25834;   26093;   28056;   28087;      47;      16
RGGI CO2 ALLOWANCE - CHICAGO CLIMATE FUTURES EXCHANGE ;2009.10.27;   28226;    1209;     974;     983;   25978;   26257;   28170;   28214;      56;      12
RGGI CO2 ALLOWANCE - CHICAGO CLIMATE FUTURES EXCHANGE ;2009.10.20;   28416;    1118;     884;    1261;   25962;   26233;   28341;   28378;      75;      38
RGGI CO2 ALLOWANCE - CHICAGO CLIMATE FUTURES EXCHANGE ;2009.10.13;   27941;    1116;    1028;    1149;   25547;   25660;   27811;   27837;     129;     103
RGGI CO2 ALLOWANCE - CHICAGO CLIMATE FUTURES EXCHANGE ;2009.10.06;   27006;    1085;     839;    1194;   24681;   24946;   26960;   26980;      46;      27
RGGI CO2 ALLOWANCE - CHICAGO CLIMATE FUTURES EXCHANGE ;2009.09.29;   27969;    1008;     782;    1176;   25632;   25853;   27816;   27811;     153;     158
RGGI CO2 ALLOWANCE - CHICAGO CLIMATE FUTURES EXCHANGE ;2009.09.22;   27220;     957;     888;     712;   25390;   25427;   27059;   27027;     161;     194
RGGI CO2 ALLOWANCE - CHICAGO CLIMATE FUTURES EXCHANGE ;2009.09.15;   26235;     953;    1075;     846;   24262;   24172;   26060;   26093;     175;     143
RGGI CO2 ALLOWANCE - CHICAGO CLIMATE FUTURES EXCHANGE ;2009.09.08;   22421;     947;     795;     710;   20736;   20810;   22393;   22314;      28;     106
RGGI CO2 ALLOWANCE - CHICAGO CLIMATE FUTURES EXCHANGE ;2009.09.01;   20281;    1054;     575;     382;   18817;   19286;   20252;   20242;      28;      38
RGGI CO2 ALLOWANCE - CHICAGO CLIMATE FUTURES EXCHANGE ;2009.08.25;   19301;     826;     551;     412;   18027;   18205;   19264;   19168;      36;     132
RGGI CO2 ALLOWANCE - CHICAGO CLIMATE FUTURES EXCHANGE ;2009.08.18;   18532;     801;     444;     355;   17308;   17548;   18464;   18346;      69;     186
RGGI CO2 ALLOWANCE - CHICAGO CLIMATE FUTURES EXCHANGE ;2009.08.11;   17613;     788;     493;     347;   16434;   16572;   17570;   17412;      43;     201
RGGI CO2 ALLOWANCE - CHICAGO CLIMATE FUTURES EXCHANGE ;2009.08.04;   16772;     730;     426;     345;   15668;   15965;   16743;   16736;      29;      36
RGGI CO2 ALLOWANCE - CHICAGO CLIMATE FUTURES EXCHANGE ;2009.07.28;   17978;     701;     416;     334;   16895;   17172;   17930;   17922;      48;      56
RGGI CO2 ALLOWANCE - CHICAGO CLIMATE FUTURES EXCHANGE ;2009.07.21;   17658;     987;     416;     465;   16167;   16731;   17619;   17612;      39;      46
RGGI CO2 ALLOWANCE - CHICAGO CLIMATE FUTURES EXCHANGE ;2009.07.14;   16818;     955;    2114;     386;   15433;   14267;   16774;   16767;      44;      51
RGGI CO2 ALLOWANCE - CHICAGO CLIMATE FUTURES EXCHANGE ;2009.07.07;   15689;     947;    2218;     286;   14435;   13153;   15667;   15657;      22;      33
RGGI CO2 ALLOWANCE - CHICAGO CLIMATE FUTURES EXCHANGE ;2009.06.30;   18445;     978;    2768;     821;   16559;   14752;   18358;   18341;      86;     103
RGGI CO2 ALLOWANCE - CHICAGO CLIMATE FUTURES EXCHANGE ;2009.06.23;   18247;    1050;    2892;     583;   16561;   14707;   18194;   18182;      53;      65
RGGI CO2 ALLOWANCE - CHICAGO CLIMATE FUTURES EXCHANGE ;2009.06.16;   16945;    1277;    2667;     517;   15127;   13726;   16921;   16910;      24;      35
RGGI CO2 ALLOWANCE - CHICAGO CLIMATE FUTURES EXCHANGE ;2009.06.09;   16323;    1249;    2788;     486;   14548;   12982;   16283;   16256;      40;      67
RGGI CO2 ALLOWANCE - CHICAGO CLIMATE FUTURES EXCHANGE ;2009.06.02;   15665;    1283;    2849;     479;   13849;   12263;   15611;   15591;      54;      73
RGGI CO2 ALLOWANCE - CHICAGO CLIMATE FUTURES EXCHANGE ;2009.05.26;   17898;    1467;    4768;     469;   15807;   12512;   17743;   17748;     155;     150
RGGI CO2 ALLOWANCE - CHICAGO CLIMATE FUTURES EXCHANGE ;2009.05.19;   17386;    1469;    4799;     498;   15399;   12082;   17366;   17379;      20;       7
RGGI CO2 ALLOWANCE - CHICAGO CLIMATE FUTURES EXCHANGE ;2009.05.12;   15475;    1315;    4460;     486;   13553;   10417;   15354;   15362;     121;     113
RGGI CO2 ALLOWANCE - CHICAGO CLIMATE FUTURES EXCHANGE ;2009.05.05;   13621;    2099;    3263;     732;   10661;    9517;   13492;   13512;     129;     109
RGGI CO2 ALLOWANCE - CHICAGO CLIMATE FUTURES EXCHANGE ;2009.04.28;   15978;     922;    4930;    1554;   13456;    9428;   15931;   15912;      47;      67
RGGI CO2 ALLOWANCE - CHICAGO CLIMATE FUTURES EXCHANGE ;2009.04.21;   15395;    1355;    4404;    1474;   12445;    9404;   15274;   15282;     121;     113
RGGI CO2 ALLOWANCE - CHICAGO CLIMATE FUTURES EXCHANGE ;2009.04.14;   14944;    1481;    4249;    1269;   11760;    8988;   14510;   14506;     434;     438
RGGI CO2 ALLOWANCE - CHICAGO CLIMATE FUTURES EXCHANGE ;2009.04.07;   13231;    1457;    4416;     774;   10109;    7143;   12339;   12333;     891;     898
RGGI CO2 ALLOWANCE - CHICAGO CLIMATE FUTURES EXCHANGE ;2009.03.31;   12769;    1062;    3564;    1513;   10132;    7646;   12707;   12723;      62;      46
RGGI CO2 ALLOWANCE - CHICAGO CLIMATE FUTURES EXCHANGE ;2009.03.24;   10837;    1056;    2551;    1297;    8365;    6873;   10717;   10721;     119;     116
RGGI CO2 ALLOWANCE - CHICAGO CLIMATE FUTURES EXCHANGE ;2009.03.17;   10773;     592;    2702;    1429;    8663;    6513;   10684;   10643;      89;     130
RGGI CO2 ALLOWANCE - CHICAGO CLIMATE FUTURES EXCHANGE ;2009.03.10;    9924;     791;    2278;    1342;    7651;    6132;    9784;    9752;     140;     172
RGGI CO2 ALLOWANCE - CHICAGO CLIMATE FUTURES EXCHANGE ;2009.03.03;    9105;     842;    2429;    1241;    6967;    5370;    9049;    9040;      55;      65
RGGI CO2 ALLOWANCE - CHICAGO CLIMATE FUTURES EXCHANGE ;2009.02.24;    9402;     785;    2802;    1044;    7509;    5520;    9337;    9366;      65;      36
RGGI CO2 ALLOWANCE - CHICAGO CLIMATE FUTURES EXCHANGE ;2009.02.17;    8408;     645;    2403;     803;    6951;    5192;    8400;    8397;       8;      10
RGGI CO2 ALLOWANCE - CHICAGO CLIMATE FUTURES EXCHANGE ;2009.02.10;    8070;     876;    2674;     734;    6396;    4623;    8007;    8031;      63;      39
RGGI CO2 ALLOWANCE - CHICAGO CLIMATE FUTURES EXCHANGE ;2009.02.03;    7564;     962;    2657;     593;    5949;    4277;    7504;    7526;      60;      38
RGGI CO2 ALLOWANCE - CHICAGO CLIMATE FUTURES EXCHANGE ;2009.01.27;    6928;     834;    2294;     198;    5801;    4395;    6834;    6888;      94;      41
RGGI CO2 ALLOWANCE - CHICAGO CLIMATE FUTURES EXCHANGE ;2009.01.20;    6559;     800;    1741;     185;    5515;    4598;    6500;    6523;      59;      36
RGGI CO2 ALLOWANCE - CHICAGO CLIMATE FUTURES EXCHANGE ;2009.01.13;    6347;     689;    1590;     192;    5428;    4527;    6309;    6309;      38;      38
RGGI CO2 ALLOWANCE - CHICAGO CLIMATE FUTURES EXCHANGE ;2009.01.06;    5518;     467;    1669;     222;    4803;    3545;    5492;    5437;      26;      82
RGGI CO2 ALLOWANCE - CHICAGO CLIMATE FUTURES EXCHANGE ;2008.12.30;    6487;     235;    1200;     986;    5192;    4172;    6413;    6357;      74;     129
RGGI CO2 ALLOWANCE - CHICAGO CLIMATE FUTURES EXCHANGE ;2008.12.22;    6563;     212;    1292;     944;    5373;    4260;    6528;    6496;      34;      67
RGGI CO2 ALLOWANCE - CHICAGO CLIMATE FUTURES EXCHANGE ;2008.12.16;    6835;     216;    1592;     416;    6171;    4752;    6802;    6760;      33;      75
RGGI CO2 ALLOWANCE - CHICAGO CLIMATE FUTURES EXCHANGE ;2008.12.09;    6063;     216;    1782;     472;    5346;    3732;    6034;    5986;      29;      77
RGGI CO2 ALLOWANCE - CHICAGO CLIMATE FUTURES EXCHANGE ;2008.12.02;    3928;     104;    1626;     240;    3454;    1911;    3798;    3777;     130;     151
RGGI CO2 ALLOWANCE - CHICAGO CLIMATE FUTURES EXCHANGE ;2008.11.25;    4006;     203;    1590;     265;    3415;    2003;    3883;    3857;     124;     150
RGGI CO2 ALLOWANCE - CHICAGO CLIMATE FUTURES EXCHANGE ;2008.11.18;    4088;     264;    1538;     276;    3394;    2135;    3933;    3948;     155;     140
RGGI CO2 ALLOWANCE - CHICAGO CLIMATE FUTURES EXCHANGE ;2008.11.11;    4110;     363;    1354;     311;    3338;    2336;    4012;    4001;      98;     109
RGGI CO2 ALLOWANCE - CHICAGO CLIMATE FUTURES EXCHANGE ;2008.11.04;    3610;     358;    1135;     241;    2948;    2087;    3547;    3463;      63;     147
RGGI CO2 ALLOWANCE - CHICAGO CLIMATE FUTURES EXCHANGE ;2008.10.28;    2921;     134;     633;     260;    2423;    1853;    2817;    2746;     105;     175
RGGI CO2 ALLOWANCE - CHICAGO CLIMATE FUTURES EXCHANGE ;2008.10.21;    3068;     211;     370;     277;    2404;    2170;    2892;    2817;     176;     251
RGGI CO2 ALLOWANCE - CHICAGO CLIMATE FUTURES EXCHANGE ;2010.02.16;   12312;     737;      58;      45;   11508;   12209;   12290;   12312;      22;       0
RGGI CO2 ALLOWANCE - CHICAGO CLIMATE FUTURES EXCHANGE ;2010.02.09;   12208;     718;      58;      57;   11406;   12086;   12181;   12201;      27;       7
RGGI CO2 ALLOWANCE - CHICAGO CLIMATE FUTURES EXCHANGE ;2010.01.05;   10977;     160;      37;      94;   10670;   10837;   10924;   10968;      53;       9
RGGI CO2 ALLOWANCE - CHICAGO CLIMATE FUTURES EXCHANGE ;2009.12.29;   30757;    2641;     118;     125;   27708;   30128;   30474;   30371;     283;     386
RGGI CO2 ALLOWANCE - CHICAGO CLIMATE FUTURES EXCHANGE ;2009.12.22;   38325;    2284;     653;    1533;   34478;   36125;   38294;   38310;      31;      15
RGGI CO2 ALLOWANCE - CHICAGO CLIMATE FUTURES EXCHANGE ;2009.12.15;   40379;    2195;     721;    1789;   36292;   37823;   40276;   40334;     103;      45
RGGI CO2 ALLOWANCE - CHICAGO CLIMATE FUTURES EXCHANGE ;2009.12.08;   37790;    2218;     673;    1883;   33308;   34898;   37409;   37455;     380;     335
RGGI CO2 ALLOWANCE - CHICAGO CLIMATE FUTURES EXCHANGE ;2009.12.01;   35709;    2203;     854;    1789;   31625;   33000;   35616;   35643;      93;      66
RGGI CO2 ALLOWANCE - CHICAGO CLIMATE FUTURES EXCHANGE ;2009.11.24;   32460;    1729;     948;    1580;   29123;   29932;   32432;   32460;      28;       0
RGGI CO2 ALLOWANCE - CHICAGO CLIMATE FUTURES EXCHANGE ;2009.11.17;   30694;    1582;    1058;    1095;   27965;   28498;   30642;   30651;      52;      43
RGGI CO2 ALLOWANCE - CHICAGO CLIMATE FUTURES EXCHANGE ;2009.11.09;   29040;    1462;     939;     977;   26550;   27117;   28989;   29033;      51;       7
RGGI CO2 ALLOWANCE - CHICAGO CLIMATE FUTURES EXCHANGE ;2009.11.03;   28103;    1262;    1033;     960;   25834;   26093;   28056;   28087;      47;      16
RGGI CO2 ALLOWANCE - CHICAGO CLIMATE FUTURES EXCHANGE ;2009.10.27;   28226;    1209;     974;     983;   25978;   26257;   28170;   28214;      56;      12
RGGI CO2 ALLOWANCE - CHICAGO CLIMATE FUTURES EXCHANGE ;2009.10.20;   28416;    1118;     884;    1261;   25962;   26233;   28341;   28378;      75;      38
RGGI CO2 ALLOWANCE - CHICAGO CLIMATE FUTURES EXCHANGE ;2009.10.13;   27941;    1116;    1028;    1149;   25547;   25660;   27811;   27837;     129;     103
RGGI CO2 ALLOWANCE - CHICAGO CLIMATE FUTURES EXCHANGE ;2009.10.06;   27006;    1085;     839;    1194;   24681;   24946;   26960;   26980;      46;      27
RGGI CO2 ALLOWANCE - CHICAGO CLIMATE FUTURES EXCHANGE ;2009.09.29;   27969;    1008;     782;    1176;   25632;   25853;   27816;   27811;     153;     158
RGGI CO2 ALLOWANCE - CHICAGO CLIMATE FUTURES EXCHANGE ;2009.09.22;   27220;     957;     888;     712;   25390;   25427;   27059;   27027;     161;     194
RGGI CO2 ALLOWANCE - CHICAGO CLIMATE FUTURES EXCHANGE ;2009.09.15;   26235;     953;    1075;     846;   24262;   24172;   26060;   26093;     175;     143
RGGI CO2 ALLOWANCE - CHICAGO CLIMATE FUTURES EXCHANGE ;2009.09.08;   22421;     947;     795;     710;   20736;   20810;   22393;   22314;      28;     106
RGGI CO2 ALLOWANCE - CHICAGO CLIMATE FUTURES EXCHANGE ;2009.09.01;   20281;    1054;     575;     382;   18817;   19286;   20252;   20242;      28;      38
RGGI CO2 ALLOWANCE - CHICAGO CLIMATE FUTURES EXCHANGE ;2009.08.25;   19301;     826;     551;     412;   18027;   18205;   19264;   19168;      36;     132
RGGI CO2 ALLOWANCE - CHICAGO CLIMATE FUTURES EXCHANGE ;2009.08.18;   18532;     801;     444;     355;   17308;   17548;   18464;   18346;      69;     186
RGGI CO2 ALLOWANCE - CHICAGO CLIMATE FUTURES EXCHANGE ;2009.08.11;   17613;     788;     493;     347;   16434;   16572;   17570;   17412;      43;     201
RGGI CO2 ALLOWANCE - CHICAGO CLIMATE FUTURES EXCHANGE ;2009.08.04;   16772;     730;     426;     345;   15668;   15965;   16743;   16736;      29;      36
RGGI CO2 ALLOWANCE - CHICAGO CLIMATE FUTURES EXCHANGE ;2009.07.28;   17978;     701;     416;     334;   16895;   17172;   17930;   17922;      48;      56
RGGI CO2 ALLOWANCE - CHICAGO CLIMATE FUTURES EXCHANGE ;2009.07.21;   17658;     987;     416;     465;   16167;   16731;   17619;   17612;      39;      46
RGGI CO2 ALLOWANCE - CHICAGO CLIMATE FUTURES EXCHANGE ;2009.07.14;   16818;     955;    2114;     386;   15433;   14267;   16774;   16767;      44;      51
RGGI CO2 ALLOWANCE - CHICAGO CLIMATE FUTURES EXCHANGE ;2009.07.07;   15689;     947;    2218;     286;   14435;   13153;   15667;   15657;      22;      33
RGGI CO2 ALLOWANCE - CHICAGO CLIMATE FUTURES EXCHANGE ;2009.06.30;   18445;     978;    2768;     821;   16559;   14752;   18358;   18341;      86;     103
RGGI CO2 ALLOWANCE - CHICAGO CLIMATE FUTURES EXCHANGE ;2009.06.23;   18247;    1050;    2892;     583;   16561;   14707;   18194;   18182;      53;      65
RGGI CO2 ALLOWANCE - CHICAGO CLIMATE FUTURES EXCHANGE ;2009.06.16;   16945;    1277;    2667;     517;   15127;   13726;   16921;   16910;      24;      35
RGGI CO2 ALLOWANCE - CHICAGO CLIMATE FUTURES EXCHANGE ;2009.06.09;   16323;    1249;    2788;     486;   14548;   12982;   16283;   16256;      40;      67
RGGI CO2 ALLOWANCE - CHICAGO CLIMATE FUTURES EXCHANGE ;2009.06.02;   15665;    1283;    2849;     479;   13849;   12263;   15611;   15591;      54;      73
RGGI CO2 ALLOWANCE - CHICAGO CLIMATE FUTURES EXCHANGE ;2009.05.26;   17898;    1467;    4768;     469;   15807;   12512;   17743;   17748;     155;     150
RGGI CO2 ALLOWANCE - CHICAGO CLIMATE FUTURES EXCHANGE ;2009.05.19;   17386;    1469;    4799;     498;   15399;   12082;   17366;   17379;      20;       7
RGGI CO2 ALLOWANCE - CHICAGO CLIMATE FUTURES EXCHANGE ;2009.05.12;   15475;    1315;    4460;     486;   13553;   10417;   15354;   15362;     121;     113
RGGI CO2 ALLOWANCE - CHICAGO CLIMATE FUTURES EXCHANGE ;2009.05.05;   13621;    2099;    3263;     732;   10661;    9517;   13492;   13512;     129;     109
RGGI CO2 ALLOWANCE - CHICAGO CLIMATE FUTURES EXCHANGE ;2009.04.28;   15978;     922;    4930;    1554;   13456;    9428;   15931;   15912;      47;      67
RGGI CO2 ALLOWANCE - CHICAGO CLIMATE FUTURES EXCHANGE ;2009.04.21;   15395;    1355;    4404;    1474;   12445;    9404;   15274;   15282;     121;     113
RGGI CO2 ALLOWANCE - CHICAGO CLIMATE FUTURES EXCHANGE ;2009.04.14;   14944;    1481;    4249;    1269;   11760;    8988;   14510;   14506;     434;     438
RGGI CO2 ALLOWANCE - CHICAGO CLIMATE FUTURES EXCHANGE ;2009.04.07;   13231;    1457;    4416;     774;   10109;    7143;   12339;   12333;     891;     898
RGGI CO2 ALLOWANCE - CHICAGO CLIMATE FUTURES EXCHANGE ;2009.03.31;   12769;    1062;    3564;    1513;   10132;    7646;   12707;   12723;      62;      46
RGGI CO2 ALLOWANCE - CHICAGO CLIMATE FUTURES EXCHANGE ;2009.03.24;   10837;    1056;    2551;    1297;    8365;    6873;   10717;   10721;     119;     116
RGGI CO2 ALLOWANCE - CHICAGO CLIMATE FUTURES EXCHANGE ;2009.03.17;   10773;     592;    2702;    1429;    8663;    6513;   10684;   10643;      89;     130
RGGI CO2 ALLOWANCE - CHICAGO CLIMATE FUTURES EXCHANGE ;2009.03.10;    9924;     791;    2278;    1342;    7651;    6132;    9784;    9752;     140;     172
RGGI CO2 ALLOWANCE - CHICAGO CLIMATE FUTURES EXCHANGE ;2009.03.03;    9105;     842;    2429;    1241;    6967;    5370;    9049;    9040;      55;      65
RGGI CO2 ALLOWANCE - CHICAGO CLIMATE FUTURES EXCHANGE ;2009.02.24;    9402;     785;    2802;    1044;    7509;    5520;    9337;    9366;      65;      36
RGGI CO2 ALLOWANCE - CHICAGO CLIMATE FUTURES EXCHANGE ;2009.02.17;    8408;     645;    2403;     803;    6951;    5192;    8400;    8397;       8;      10
RGGI CO2 ALLOWANCE - CHICAGO CLIMATE FUTURES EXCHANGE ;2009.02.10;    8070;     876;    2674;     734;    6396;    4623;    8007;    8031;      63;      39
RGGI CO2 ALLOWANCE - CHICAGO CLIMATE FUTURES EXCHANGE ;2009.02.03;    7564;     962;    2657;     593;    5949;    4277;    7504;    7526;      60;      38
RGGI CO2 ALLOWANCE - CHICAGO CLIMATE FUTURES EXCHANGE ;2009.01.27;    6928;     834;    2294;     198;    5801;    4395;    6834;    6888;      94;      41
RGGI CO2 ALLOWANCE - CHICAGO CLIMATE FUTURES EXCHANGE ;2009.01.20;    6559;     800;    1741;     185;    5515;    4598;    6500;    6523;      59;      36
RGGI CO2 ALLOWANCE - CHICAGO CLIMATE FUTURES EXCHANGE ;2009.01.13;    6347;     689;    1590;     192;    5428;    4527;    6309;    6309;      38;      38
RGGI CO2 ALLOWANCE - CHICAGO CLIMATE FUTURES EXCHANGE ;2009.01.06;    5518;     467;    1669;     222;    4803;    3545;    5492;    5437;      26;      82
RGGI CO2 ALLOWANCE - CHICAGO CLIMATE FUTURES EXCHANGE ;2008.12.30;    6487;     235;    1200;     986;    5192;    4172;    6413;    6357;      74;     129
RGGI CO2 ALLOWANCE - CHICAGO CLIMATE FUTURES EXCHANGE ;2008.12.22;    6563;     212;    1292;     944;    5373;    4260;    6528;    6496;      34;      67
RGGI CO2 ALLOWANCE - CHICAGO CLIMATE FUTURES EXCHANGE ;2008.12.16;    6835;     216;    1592;     416;    6171;    4752;    6802;    6760;      33;      75
RGGI CO2 ALLOWANCE - CHICAGO CLIMATE FUTURES EXCHANGE ;2008.12.09;    6063;     216;    1782;     472;    5346;    3732;    6034;    5986;      29;      77
RGGI CO2 ALLOWANCE - CHICAGO CLIMATE FUTURES EXCHANGE ;2008.12.02;    3928;     104;    1626;     240;    3454;    1911;    3798;    3777;     130;     151
RGGI CO2 ALLOWANCE - CHICAGO CLIMATE FUTURES EXCHANGE ;2008.11.25;    4006;     203;    1590;     265;    3415;    2003;    3883;    3857;     124;     150
RGGI CO2 ALLOWANCE - CHICAGO CLIMATE FUTURES EXCHANGE ;2008.11.18;    4088;     264;    1538;     276;    3394;    2135;    3933;    3948;     155;     140
RGGI CO2 ALLOWANCE - CHICAGO CLIMATE FUTURES EXCHANGE ;2008.11.11;    4110;     363;    1354;     311;    3338;    2336;    4012;    4001;      98;     109
RGGI CO2 ALLOWANCE - CHICAGO CLIMATE FUTURES EXCHANGE ;2008.11.04;    3610;     358;    1135;     241;    2948;    2087;    3547;    3463;      63;     147
RGGI CO2 ALLOWANCE - CHICAGO CLIMATE FUTURES EXCHANGE ;2008.10.28;    2921;     134;     633;     260;    2423;    1853;    2817;    2746;     105;     175
RGGI CO2 ALLOWANCE - CHICAGO CLIMATE FUTURES EXCHANGE ;2008.10.21;    3068;     211;     370;     277;    2404;    2170;    2892;    2817;     176;     251
