PJM N ILL HUB 5 OFF PEAK SWAP - NEW YORK MERCANTILE EXCHANGE ;2011.07.12;  668186;   91225;       0;   10775;  566186;  657411;  668186;  668186;       0;       0
PJM N ILL HUB 5 OFF PEAK SWAP - NEW YORK MERCANTILE EXCHANGE ;2011.07.12;  668186;   91225;       0;   10775;  566186;  657411;  668186;  668186;       0;       0
PJM N ILL HUB 5 OFF PEAK SWAP - NEW YORK MERCANTILE EXCHANGE ;2010.12.28;  412232;       0;   11605;    3760;  408472;  396867;  412232;  412232;       0;       0
PJM N ILL HUB 5 OFF PEAK SWAP - NEW YORK MERCANTILE EXCHANGE ;2010.12.21;  412232;       0;   11605;    3760;  408472;  396867;  412232;  412232;       0;       0
PJM N ILL HUB 5 OFF PEAK SWAP - NEW YORK MERCANTILE EXCHANGE ;2010.12.14;  412232;       0;   11605;    3760;  408472;  396867;  412232;  412232;       0;       0
PJM N ILL HUB 5 OFF PEAK SWAP - NEW YORK MERCANTILE EXCHANGE ;2010.12.07;  412232;       0;   11605;    3760;  408472;  396867;  412232;  412232;       0;       0
PJM N ILL HUB 5 OFF PEAK SWAP - NEW YORK MERCANTILE EXCHANGE ;2010.11.30;  431482;       0;    7755;    7610;  423872;  416117;  431482;  431482;       0;       0
PJM N ILL HUB 5 OFF PEAK SWAP - NEW YORK MERCANTILE EXCHANGE ;2010.11.23;  428474;       0;    7755;    7610;  420864;  413109;  428474;  428474;       0;       0
PJM N ILL HUB 5 OFF PEAK SWAP - NEW YORK MERCANTILE EXCHANGE ;2010.11.16;  426956;    6005;    7755;    7610;  413341;  388191;  426956;  403556;       0;   23400
PJM N ILL HUB 5 OFF PEAK SWAP - NEW YORK MERCANTILE EXCHANGE ;2010.11.09;  426956;    6005;   31155;    7610;  413341;  388191;  426956;  426956;       0;       0
PJM N ILL HUB 5 OFF PEAK SWAP - NEW YORK MERCANTILE EXCHANGE ;2011.07.12;  668186;   91225;       0;   10775;  566186;  657411;  668186;  668186;       0;       0
PJM N ILL HUB 5 OFF PEAK SWAP - NEW YORK MERCANTILE EXCHANGE ;2011.07.05;  668186;   91225;       0;   10775;  566186;  657411;  668186;  668186;       0;       0
PJM N ILL HUB 5 OFF PEAK SWAP - NEW YORK MERCANTILE EXCHANGE ;2011.06.28;  702042;   77609;       0;   24391;  600042;  677651;  702042;  702042;       0;       0
PJM N ILL HUB 5 OFF PEAK SWAP - NEW YORK MERCANTILE EXCHANGE ;2011.06.21;  678594;   77609;       0;   24391;  576594;  654203;  678594;  678594;       0;       0
PJM N ILL HUB 5 OFF PEAK SWAP - NEW YORK MERCANTILE EXCHANGE ;2011.06.14;  678594;   77609;       0;   24391;  576594;  654203;  678594;  678594;       0;       0
PJM N ILL HUB 5 OFF PEAK SWAP - NEW YORK MERCANTILE EXCHANGE ;2011.06.07;  678594;   77609;       0;   24391;  576594;  654203;  678594;  678594;       0;       0
PJM N ILL HUB 5 OFF PEAK SWAP - NEW YORK MERCANTILE EXCHANGE ;2011.05.31;  702666;   76793;       0;   25207;  600666;  677459;  702666;  702666;       0;       0
PJM N ILL HUB 5 OFF PEAK SWAP - NEW YORK MERCANTILE EXCHANGE ;2011.05.24;  702666;   76793;       0;   25207;  600666;  677459;  702666;  702666;       0;       0
PJM N ILL HUB 5 OFF PEAK SWAP - NEW YORK MERCANTILE EXCHANGE ;2011.05.17;  689786;   89673;       0;   12327;  587786;  677459;  689786;  689786;       0;       0
PJM N ILL HUB 5 OFF PEAK SWAP - NEW YORK MERCANTILE EXCHANGE ;2011.05.10;  689786;   89673;       0;   12327;  587786;  677459;  689786;  689786;       0;       0
PJM N ILL HUB 5 OFF PEAK SWAP - NEW YORK MERCANTILE EXCHANGE ;2011.05.03;  689786;   89673;       0;   12327;  587786;  677459;  689786;  689786;       0;       0
PJM N ILL HUB 5 OFF PEAK SWAP - NEW YORK MERCANTILE EXCHANGE ;2011.04.26;  751610;   50505;       0;   51495;  649610;  700115;  751610;  751610;       0;       0
PJM N ILL HUB 5 OFF PEAK SWAP - NEW YORK MERCANTILE EXCHANGE ;2011.04.19;  745605;   50505;       0;   51495;  643605;  694110;  745605;  745605;       0;       0
PJM N ILL HUB 5 OFF PEAK SWAP - NEW YORK MERCANTILE EXCHANGE ;2011.04.12;  745605;   50505;       0;   51495;  643605;  694110;  745605;  745605;       0;       0
PJM N ILL HUB 5 OFF PEAK SWAP - NEW YORK MERCANTILE EXCHANGE ;2011.04.05;  745605;   50505;       0;   51495;  643605;  694110;  745605;  745605;       0;       0
PJM N ILL HUB 5 OFF PEAK SWAP - NEW YORK MERCANTILE EXCHANGE ;2011.03.29;  768480;   49755;       0;   52245;  666480;  716235;  768480;  768480;       0;       0
PJM N ILL HUB 5 OFF PEAK SWAP - NEW YORK MERCANTILE EXCHANGE ;2011.03.22;  730080;   88155;       0;   13845;  628080;  716235;  730080;  730080;       0;       0
PJM N ILL HUB 5 OFF PEAK SWAP - NEW YORK MERCANTILE EXCHANGE ;2011.03.15;  730080;   88155;       0;   13845;  628080;  716235;  730080;  730080;       0;       0
PJM N ILL HUB 5 OFF PEAK SWAP - NEW YORK MERCANTILE EXCHANGE ;2011.02.22;  576368;   45691;       0;   13845;  516832;  562523;  576368;  576368;       0;       0
PJM N ILL HUB 5 OFF PEAK SWAP - NEW YORK MERCANTILE EXCHANGE ;2011.02.15;  576368;   45691;       0;   13845;  516832;  562523;  576368;  576368;       0;       0
PJM N ILL HUB 5 OFF PEAK SWAP - NEW YORK MERCANTILE EXCHANGE ;2011.02.08;  482288;   45691;       0;   13845;  422752;  468443;  482288;  482288;       0;       0
PJM N ILL HUB 5 OFF PEAK SWAP - NEW YORK MERCANTILE EXCHANGE ;2011.02.01;  388208;   45691;       0;   13845;  328672;  374363;  388208;  388208;       0;       0
PJM N ILL HUB 5 OFF PEAK SWAP - NEW YORK MERCANTILE EXCHANGE ;2011.01.25;  416360;       0;    2165;   12496;  403864;  401699;  416360;  416360;       0;       0
PJM N ILL HUB 5 OFF PEAK SWAP - NEW YORK MERCANTILE EXCHANGE ;2011.07.12;  668186;   91225;       0;   10775;  566186;  657411;  668186;  668186;       0;       0
PJM N ILL HUB 5 OFF PEAK SWAP - NEW YORK MERCANTILE EXCHANGE ;2010.12.28;  412232;       0;   11605;    3760;  408472;  396867;  412232;  412232;       0;       0
PJM N ILL HUB 5 OFF PEAK SWAP - NEW YORK MERCANTILE EXCHANGE ;2010.12.21;  412232;       0;   11605;    3760;  408472;  396867;  412232;  412232;       0;       0
PJM N ILL HUB 5 OFF PEAK SWAP - NEW YORK MERCANTILE EXCHANGE ;2010.12.14;  412232;       0;   11605;    3760;  408472;  396867;  412232;  412232;       0;       0
PJM N ILL HUB 5 OFF PEAK SWAP - NEW YORK MERCANTILE EXCHANGE ;2010.12.07;  412232;       0;   11605;    3760;  408472;  396867;  412232;  412232;       0;       0
PJM N ILL HUB 5 OFF PEAK SWAP - NEW YORK MERCANTILE EXCHANGE ;2010.11.30;  431482;       0;    7755;    7610;  423872;  416117;  431482;  431482;       0;       0
PJM N ILL HUB 5 OFF PEAK SWAP - NEW YORK MERCANTILE EXCHANGE ;2010.11.23;  428474;       0;    7755;    7610;  420864;  413109;  428474;  428474;       0;       0
PJM N ILL HUB 5 OFF PEAK SWAP - NEW YORK MERCANTILE EXCHANGE ;2010.11.16;  426956;    6005;    7755;    7610;  413341;  388191;  426956;  403556;       0;   23400
PJM N ILL HUB 5 OFF PEAK SWAP - NEW YORK MERCANTILE EXCHANGE ;2010.11.09;  426956;    6005;   31155;    7610;  413341;  388191;  426956;  426956;       0;       0
PJM N ILL HUB 5 OFF PEAK SWAP - NEW YORK MERCANTILE EXCHANGE ;2011.07.12;  668186;   91225;       0;   10775;  566186;  657411;  668186;  668186;       0;       0
PJM N ILL HUB 5 OFF PEAK SWAP - NEW YORK MERCANTILE EXCHANGE ;2011.07.05;  668186;   91225;       0;   10775;  566186;  657411;  668186;  668186;       0;       0
PJM N ILL HUB 5 OFF PEAK SWAP - NEW YORK MERCANTILE EXCHANGE ;2011.06.28;  702042;   77609;       0;   24391;  600042;  677651;  702042;  702042;       0;       0
PJM N ILL HUB 5 OFF PEAK SWAP - NEW YORK MERCANTILE EXCHANGE ;2011.06.21;  678594;   77609;       0;   24391;  576594;  654203;  678594;  678594;       0;       0
PJM N ILL HUB 5 OFF PEAK SWAP - NEW YORK MERCANTILE EXCHANGE ;2011.06.14;  678594;   77609;       0;   24391;  576594;  654203;  678594;  678594;       0;       0
PJM N ILL HUB 5 OFF PEAK SWAP - NEW YORK MERCANTILE EXCHANGE ;2011.06.07;  678594;   77609;       0;   24391;  576594;  654203;  678594;  678594;       0;       0
PJM N ILL HUB 5 OFF PEAK SWAP - NEW YORK MERCANTILE EXCHANGE ;2011.05.31;  702666;   76793;       0;   25207;  600666;  677459;  702666;  702666;       0;       0
PJM N ILL HUB 5 OFF PEAK SWAP - NEW YORK MERCANTILE EXCHANGE ;2011.05.24;  702666;   76793;       0;   25207;  600666;  677459;  702666;  702666;       0;       0
PJM N ILL HUB 5 OFF PEAK SWAP - NEW YORK MERCANTILE EXCHANGE ;2011.05.17;  689786;   89673;       0;   12327;  587786;  677459;  689786;  689786;       0;       0
PJM N ILL HUB 5 OFF PEAK SWAP - NEW YORK MERCANTILE EXCHANGE ;2011.05.10;  689786;   89673;       0;   12327;  587786;  677459;  689786;  689786;       0;       0
PJM N ILL HUB 5 OFF PEAK SWAP - NEW YORK MERCANTILE EXCHANGE ;2011.05.03;  689786;   89673;       0;   12327;  587786;  677459;  689786;  689786;       0;       0
PJM N ILL HUB 5 OFF PEAK SWAP - NEW YORK MERCANTILE EXCHANGE ;2011.04.26;  751610;   50505;       0;   51495;  649610;  700115;  751610;  751610;       0;       0
PJM N ILL HUB 5 OFF PEAK SWAP - NEW YORK MERCANTILE EXCHANGE ;2011.04.19;  745605;   50505;       0;   51495;  643605;  694110;  745605;  745605;       0;       0
PJM N ILL HUB 5 OFF PEAK SWAP - NEW YORK MERCANTILE EXCHANGE ;2011.04.12;  745605;   50505;       0;   51495;  643605;  694110;  745605;  745605;       0;       0
PJM N ILL HUB 5 OFF PEAK SWAP - NEW YORK MERCANTILE EXCHANGE ;2011.04.05;  745605;   50505;       0;   51495;  643605;  694110;  745605;  745605;       0;       0
PJM N ILL HUB 5 OFF PEAK SWAP - NEW YORK MERCANTILE EXCHANGE ;2011.03.29;  768480;   49755;       0;   52245;  666480;  716235;  768480;  768480;       0;       0
PJM N ILL HUB 5 OFF PEAK SWAP - NEW YORK MERCANTILE EXCHANGE ;2011.03.22;  730080;   88155;       0;   13845;  628080;  716235;  730080;  730080;       0;       0
PJM N ILL HUB 5 OFF PEAK SWAP - NEW YORK MERCANTILE EXCHANGE ;2011.03.15;  730080;   88155;       0;   13845;  628080;  716235;  730080;  730080;       0;       0
PJM N ILL HUB 5 OFF PEAK SWAP - NEW YORK MERCANTILE EXCHANGE ;2011.02.22;  576368;   45691;       0;   13845;  516832;  562523;  576368;  576368;       0;       0
PJM N ILL HUB 5 OFF PEAK SWAP - NEW YORK MERCANTILE EXCHANGE ;2011.02.15;  576368;   45691;       0;   13845;  516832;  562523;  576368;  576368;       0;       0
PJM N ILL HUB 5 OFF PEAK SWAP - NEW YORK MERCANTILE EXCHANGE ;2011.02.08;  482288;   45691;       0;   13845;  422752;  468443;  482288;  482288;       0;       0
PJM N ILL HUB 5 OFF PEAK SWAP - NEW YORK MERCANTILE EXCHANGE ;2011.02.01;  388208;   45691;       0;   13845;  328672;  374363;  388208;  388208;       0;       0
PJM N ILL HUB 5 OFF PEAK SWAP - NEW YORK MERCANTILE EXCHANGE ;2011.01.25;  416360;       0;    2165;   12496;  403864;  401699;  416360;  416360;       0;       0
PJM N ILL HUB 5 OFF PEAK SWAP - NEW YORK MERCANTILE EXCHANGE ;2011.07.12;  668186;   91225;       0;   10775;  566186;  657411;  668186;  668186;       0;       0
PJM N ILL HUB 5 OFF PEAK SWAP - NEW YORK MERCANTILE EXCHANGE ;2011.07.05;  668186;   91225;       0;   10775;  566186;  657411;  668186;  668186;       0;       0
PJM N ILL HUB 5 OFF PEAK SWAP - NEW YORK MERCANTILE EXCHANGE ;2011.06.28;  702042;   77609;       0;   24391;  600042;  677651;  702042;  702042;       0;       0
PJM N ILL HUB 5 OFF PEAK SWAP - NEW YORK MERCANTILE EXCHANGE ;2011.06.21;  678594;   77609;       0;   24391;  576594;  654203;  678594;  678594;       0;       0
PJM N ILL HUB 5 OFF PEAK SWAP - NEW YORK MERCANTILE EXCHANGE ;2011.06.14;  678594;   77609;       0;   24391;  576594;  654203;  678594;  678594;       0;       0
PJM N ILL HUB 5 OFF PEAK SWAP - NEW YORK MERCANTILE EXCHANGE ;2011.06.07;  678594;   77609;       0;   24391;  576594;  654203;  678594;  678594;       0;       0
PJM N ILL HUB 5 OFF PEAK SWAP - NEW YORK MERCANTILE EXCHANGE ;2011.05.31;  702666;   76793;       0;   25207;  600666;  677459;  702666;  702666;       0;       0
PJM N ILL HUB 5 OFF PEAK SWAP - NEW YORK MERCANTILE EXCHANGE ;2011.05.24;  702666;   76793;       0;   25207;  600666;  677459;  702666;  702666;       0;       0
PJM N ILL HUB 5 OFF PEAK SWAP - NEW YORK MERCANTILE EXCHANGE ;2011.05.17;  689786;   89673;       0;   12327;  587786;  677459;  689786;  689786;       0;       0
PJM N ILL HUB 5 OFF PEAK SWAP - NEW YORK MERCANTILE EXCHANGE ;2011.05.10;  689786;   89673;       0;   12327;  587786;  677459;  689786;  689786;       0;       0
PJM N ILL HUB 5 OFF PEAK SWAP - NEW YORK MERCANTILE EXCHANGE ;2011.05.03;  689786;   89673;       0;   12327;  587786;  677459;  689786;  689786;       0;       0
PJM N ILL HUB 5 OFF PEAK SWAP - NEW YORK MERCANTILE EXCHANGE ;2011.04.26;  751610;   50505;       0;   51495;  649610;  700115;  751610;  751610;       0;       0
PJM N ILL HUB 5 OFF PEAK SWAP - NEW YORK MERCANTILE EXCHANGE ;2011.04.19;  745605;   50505;       0;   51495;  643605;  694110;  745605;  745605;       0;       0
PJM N ILL HUB 5 OFF PEAK SWAP - NEW YORK MERCANTILE EXCHANGE ;2011.04.12;  745605;   50505;       0;   51495;  643605;  694110;  745605;  745605;       0;       0
PJM N ILL HUB 5 OFF PEAK SWAP - NEW YORK MERCANTILE EXCHANGE ;2011.04.05;  745605;   50505;       0;   51495;  643605;  694110;  745605;  745605;       0;       0
PJM N ILL HUB 5 OFF PEAK SWAP - NEW YORK MERCANTILE EXCHANGE ;2011.03.29;  768480;   49755;       0;   52245;  666480;  716235;  768480;  768480;       0;       0
PJM N ILL HUB 5 OFF PEAK SWAP - NEW YORK MERCANTILE EXCHANGE ;2011.03.22;  730080;   88155;       0;   13845;  628080;  716235;  730080;  730080;       0;       0
PJM N ILL HUB 5 OFF PEAK SWAP - NEW YORK MERCANTILE EXCHANGE ;2011.03.15;  730080;   88155;       0;   13845;  628080;  716235;  730080;  730080;       0;       0
PJM N ILL HUB 5 OFF PEAK SWAP - NEW YORK MERCANTILE EXCHANGE ;2011.02.22;  576368;   45691;       0;   13845;  516832;  562523;  576368;  576368;       0;       0
PJM N ILL HUB 5 OFF PEAK SWAP - NEW YORK MERCANTILE EXCHANGE ;2011.02.15;  576368;   45691;       0;   13845;  516832;  562523;  576368;  576368;       0;       0
PJM N ILL HUB 5 OFF PEAK SWAP - NEW YORK MERCANTILE EXCHANGE ;2011.02.08;  482288;   45691;       0;   13845;  422752;  468443;  482288;  482288;       0;       0
PJM N ILL HUB 5 OFF PEAK SWAP - NEW YORK MERCANTILE EXCHANGE ;2011.02.01;  388208;   45691;       0;   13845;  328672;  374363;  388208;  388208;       0;       0
PJM N ILL HUB 5 OFF PEAK SWAP - NEW YORK MERCANTILE EXCHANGE ;2011.01.25;  416360;       0;    2165;   12496;  403864;  401699;  416360;  416360;       0;       0
PJM N ILL HUB 5 OFF PEAK SWAP - NEW YORK MERCANTILE EXCHANGE ;2010.12.28;  412232;       0;   11605;    3760;  408472;  396867;  412232;  412232;       0;       0
PJM N ILL HUB 5 OFF PEAK SWAP - NEW YORK MERCANTILE EXCHANGE ;2010.12.21;  412232;       0;   11605;    3760;  408472;  396867;  412232;  412232;       0;       0
PJM N ILL HUB 5 OFF PEAK SWAP - NEW YORK MERCANTILE EXCHANGE ;2010.12.14;  412232;       0;   11605;    3760;  408472;  396867;  412232;  412232;       0;       0
PJM N ILL HUB 5 OFF PEAK SWAP - NEW YORK MERCANTILE EXCHANGE ;2010.12.07;  412232;       0;   11605;    3760;  408472;  396867;  412232;  412232;       0;       0
PJM N ILL HUB 5 OFF PEAK SWAP - NEW YORK MERCANTILE EXCHANGE ;2010.11.30;  431482;       0;    7755;    7610;  423872;  416117;  431482;  431482;       0;       0
PJM N ILL HUB 5 OFF PEAK SWAP - NEW YORK MERCANTILE EXCHANGE ;2010.11.23;  428474;       0;    7755;    7610;  420864;  413109;  428474;  428474;       0;       0
PJM N ILL HUB 5 OFF PEAK SWAP - NEW YORK MERCANTILE EXCHANGE ;2010.11.16;  426956;    6005;    7755;    7610;  413341;  388191;  426956;  403556;       0;   23400
PJM N ILL HUB 5 OFF PEAK SWAP - NEW YORK MERCANTILE EXCHANGE ;2010.11.09;  426956;    6005;   31155;    7610;  413341;  388191;  426956;  426956;       0;       0
PJM N ILL HUB 5 OFF PEAK SWAP - NEW YORK MERCANTILE EXCHANGE ;2011.07.12;  668186;   91225;       0;   10775;  566186;  657411;  668186;  668186;       0;       0
