SUGAR NO. 11 - ICE FUTURES U.S. ;2011.07.12;  845922;  212816;   32854;  192965;  344358;  554778;  750139;  780596;   95783;   65326
SUGAR NO. 11 - ICE FUTURES U.S. ;2011.07.12;  845922;  212816;   32854;  192965;  344358;  554778;  750139;  780596;   95783;   65326
SUGAR NO. 11 - ICE FUTURES U.S. ;2010.12.28; 1035783;  171944;    5980;  342452;  425500;  627968;  939896;  976400;   95887;   59383
SUGAR NO. 11 - ICE FUTURES U.S. ;2010.12.21; 1015730;  168715;    6911;  327592;  427225;  627609;  923532;  962112;   92199;   53618
SUGAR NO. 11 - ICE FUTURES U.S. ;2010.12.14;  985279;  155619;   11126;  323124;  421143;  596372;  899886;  930622;   85393;   54657
SUGAR NO. 11 - ICE FUTURES U.S. ;2010.12.07;  950513;  154464;   13721;  305408;  412429;  579909;  872300;  899039;   78213;   51474
SUGAR NO. 11 - ICE FUTURES U.S. ;2010.11.30;  936194;  154649;   13790;  301153;  409491;  572263;  865294;  887207;   70900;   48988
SUGAR NO. 11 - ICE FUTURES U.S. ;2010.11.23;  942668;  153293;   15621;  302668;  409813;  572317;  865774;  890605;   76894;   52063
SUGAR NO. 11 - ICE FUTURES U.S. ;2010.11.16;  925918;  156634;   15273;  285304;  402718;  569465;  844656;  870043;   81261;   55875
SUGAR NO. 11 - ICE FUTURES U.S. ;2010.11.09;  993202;  162282;    9685;  316747;  419838;  616353;  898867;  942785;   94335;   50417
SUGAR NO. 11 - ICE FUTURES U.S. ;2010.11.02;  948145;  170975;    5664;  273772;  412755;  617198;  857503;  896634;   90642;   51510
SUGAR NO. 11 - ICE FUTURES U.S. ;2010.10.26;  901073;  165775;    5338;  251492;  395182;  591432;  812448;  848262;   88625;   52811
SUGAR NO. 11 - ICE FUTURES U.S. ;2010.10.19;  885153;  167605;    6603;  246688;  383020;  579844;  797313;  833134;   87840;   52019
SUGAR NO. 11 - ICE FUTURES U.S. ;2010.10.12;  855149;  168890;    6672;  228339;  366664;  562374;  763894;  797385;   91254;   57763
SUGAR NO. 11 - ICE FUTURES U.S. ;2010.10.05;  799974;  168018;   13865;  189095;  356562;  540905;  713675;  743865;   86299;   56109
SUGAR NO. 11 - ICE FUTURES U.S. ;2010.09.28;  842181;  176687;   12404;  191597;  383750;  576367;  752034;  780368;   90147;   61813
SUGAR NO. 11 - ICE FUTURES U.S. ;2010.09.21;  831483;  173357;   14694;  172755;  392280;  577415;  738392;  764864;   93091;   66619
SUGAR NO. 11 - ICE FUTURES U.S. ;2010.09.14;  996801;  171275;   14383;  266784;  459251;  644071;  897310;  925238;   99491;   71563
SUGAR NO. 11 - ICE FUTURES U.S. ;2010.09.07;  917924;  160238;   12737;  245764;  423762;  605990;  829765;  864491;   88159;   53432
SUGAR NO. 11 - ICE FUTURES U.S. ;2010.08.31;  877084;  149304;   16045;  227798;  409887;  576254;  786989;  820097;   90095;   56987
SUGAR NO. 11 - ICE FUTURES U.S. ;2010.08.24;  871381;  145207;   14585;  229137;  408675;  566928;  783019;  810650;   88361;   60731
SUGAR NO. 11 - ICE FUTURES U.S. ;2010.08.17;  835440;  147860;   14322;  222693;  381679;  543362;  752233;  780377;   83208;   55063
SUGAR NO. 11 - ICE FUTURES U.S. ;2010.08.10;  815988;  136376;   12929;  212361;  382950;  531900;  731687;  757190;   84301;   58798
SUGAR NO. 11 - ICE FUTURES U.S. ;2010.08.03;  813510;  139825;   15636;  204995;  386863;  533702;  731684;  754333;   81827;   59177
SUGAR NO. 11 - ICE FUTURES U.S. ;2010.07.27;  797861;  136454;   15847;  204217;  374863;  516867;  715534;  736931;   82328;   60930
SUGAR NO. 11 - ICE FUTURES U.S. ;2010.07.20;  762507;  134828;   17435;  196800;  360550;  492331;  692178;  706566;   70330;   55941
SUGAR NO. 11 - ICE FUTURES U.S. ;2010.07.13;  750225;  129717;   15620;  187993;  364133;  490031;  681843;  693644;   68382;   56581
SUGAR NO. 11 - ICE FUTURES U.S. ;2010.07.06;  722203;  132624;   16895;  176967;  354508;  478238;  664098;  672100;   58105;   50103
SUGAR NO. 11 - ICE FUTURES U.S. ;2010.06.29;  719854;  145480;   25979;  161467;  352227;  478215;  659174;  665661;   60680;   54193
SUGAR NO. 11 - ICE FUTURES U.S. ;2010.06.22;  755125;  145523;   20288;  161682;  381844;  515186;  689050;  697156;   66076;   57969
SUGAR NO. 11 - ICE FUTURES U.S. ;2010.06.15;  789449;  150408;   23687;  172295;  395427;  530300;  718129;  726282;   71319;   63167
SUGAR NO. 11 - ICE FUTURES U.S. ;2010.06.08;  918717;  146746;   34639;  251276;  445046;  570357;  843067;  856272;   75649;   62444
SUGAR NO. 11 - ICE FUTURES U.S. ;2010.06.01;  903800;  154654;   37734;  250016;  421644;  548182;  826314;  835932;   77486;   67868
SUGAR NO. 11 - ICE FUTURES U.S. ;2010.05.25;  899153;  158419;   35826;  244430;  419350;  551952;  822198;  832208;   76955;   66945
SUGAR NO. 11 - ICE FUTURES U.S. ;2010.05.18;  879102;  157101;   43190;  225816;  411284;  537728;  794200;  806734;   84901;   72368
SUGAR NO. 11 - ICE FUTURES U.S. ;2010.05.11;  859421;  156949;   41244;  217114;  400974;  534699;  775037;  793057;   84384;   66364
SUGAR NO. 11 - ICE FUTURES U.S. ;2010.05.04;  826898;  161644;   41353;  203713;  386470;  519856;  751828;  764921;   75071;   61977
SUGAR NO. 11 - ICE FUTURES U.S. ;2010.04.27;  833921;  160364;   39343;  190093;  414677;  550298;  765134;  779734;   68787;   54187
SUGAR NO. 11 - ICE FUTURES U.S. ;2010.04.20;  845478;  168325;   31911;  186165;  423461;  569868;  777952;  787945;   67526;   57533
SUGAR NO. 11 - ICE FUTURES U.S. ;2010.04.13;  985537;  168883;   23218;  284323;  466445;  626710;  919652;  934252;   65886;   51285
SUGAR NO. 11 - ICE FUTURES U.S. ;2010.04.06;  999871;  168153;   28588;  281091;  479665;  635065;  928909;  944744;   70962;   55128
SUGAR NO. 11 - ICE FUTURES U.S. ;2010.03.30; 1002594;  176732;   25960;  278184;  483798;  642542;  938715;  946687;   63879;   55907
SUGAR NO. 11 - ICE FUTURES U.S. ;2010.03.23; 1002939;  173785;   29911;  254155;  506382;  660845;  934322;  944911;   68617;   58028
SUGAR NO. 11 - ICE FUTURES U.S. ;2010.03.16; 1029086;  172919;   22005;  247695;  543375;  706815;  963990;  976515;   65096;   52571
SUGAR NO. 11 - ICE FUTURES U.S. ;2010.03.09;  994986;  162439;   22549;  230120;  534349;  690754;  926907;  943423;   68079;   51563
SUGAR NO. 11 - ICE FUTURES U.S. ;2010.03.02;  989986;  162710;    9492;  240454;  524393;  699871;  927557;  949817;   62430;   40170
SUGAR NO. 11 - ICE FUTURES U.S. ;2010.02.23; 1008982;  177397;   15353;  228018;  539111;  724714;  944526;  968085;   64456;   40897
SUGAR NO. 11 - ICE FUTURES U.S. ;2010.02.16; 1088715;  191499;   13230;  241880;  579601;  787423; 1012980; 1042533;   75735;   46182
SUGAR NO. 11 - ICE FUTURES U.S. ;2010.02.09; 1309303;  181313;   24678;  376990;  666736;  849293; 1225039; 1250961;   84264;   58342
SUGAR NO. 11 - ICE FUTURES U.S. ;2010.02.02; 1358236;  219292;   24589;  388901;  654963;  886969; 1263156; 1300459;   95080;   57777
SUGAR NO. 11 - ICE FUTURES U.S. ;2010.01.26; 1321425;  213557;   24236;  380975;  628342;  858795; 1222874; 1264006;   98551;   57419
SUGAR NO. 11 - ICE FUTURES U.S. ;2010.01.19; 1313970;  212333;   22954;  397156;  599421;  835493; 1208910; 1255604;  105060;   58366
SUGAR NO. 11 - ICE FUTURES U.S. ;2010.01.12; 1292016;  203548;   18087;  389361;  600120;  829160; 1193029; 1236607;   98987;   55409
SUGAR NO. 11 - ICE FUTURES U.S. ;2010.01.05; 1298093;  199107;   18982;  383823;  616572;  843844; 1199502; 1246649;   98591;   51444
SUGAR NO. 11 - ICE FUTURES U.S. ;2009.12.29; 1269415;  199402;   20485;  370543;  598592;  826164; 1168537; 1217193;  100878;   52222
SUGAR NO. 11 - ICE FUTURES U.S. ;2009.12.22; 1270677;  203864;   16518;  373184;  591942;  827988; 1168990; 1217690;  101687;   52987
SUGAR NO. 11 - ICE FUTURES U.S. ;2009.12.15; 1227576;  190543;   14191;  354121;  581870;  804993; 1126535; 1173306;  101041;   54270
SUGAR NO. 11 - ICE FUTURES U.S. ;2009.12.08; 1154043;  164700;   21118;  328469;  581333;  755198; 1074501; 1104784;   79541;   49259
SUGAR NO. 11 - ICE FUTURES U.S. ;2009.12.01; 1157622;  159275;   17213;  334685;  583062;  760978; 1077023; 1112876;   80599;   44746
SUGAR NO. 11 - ICE FUTURES U.S. ;2009.11.24; 1151256;  153488;   22685;  338606;  579494;  742756; 1071589; 1104047;   79667;   47209
SUGAR NO. 11 - ICE FUTURES U.S. ;2009.11.17; 1160204;  151705;   20008;  350157;  579072;  744545; 1080933; 1114710;   79271;   45494
SUGAR NO. 11 - ICE FUTURES U.S. ;2009.11.09; 1159504;  152144;   15738;  354077;  575762;  742804; 1081983; 1112619;   77520;   46885
SUGAR NO. 11 - ICE FUTURES U.S. ;2009.11.03; 1199980;  172153;   11014;  360303;  584757;  775144; 1117214; 1146461;   82766;   53518
SUGAR NO. 11 - ICE FUTURES U.S. ;2009.10.27; 1165972;  175708;   12076;  337139;  575024;  766181; 1087872; 1115396;   78100;   50575
SUGAR NO. 11 - ICE FUTURES U.S. ;2009.10.20; 1180191;  184332;   14204;  338529;  577860;  775474; 1100721; 1128207;   79471;   51984
SUGAR NO. 11 - ICE FUTURES U.S. ;2009.10.13; 1154668;  179543;   21379;  331474;  576106;  737570; 1087124; 1090423;   67544;   64244
SUGAR NO. 11 - ICE FUTURES U.S. ;2009.10.06; 1162945;  197670;   14686;  329792;  561832;  776328; 1089294; 1120806;   73652;   42140
SUGAR NO. 11 - ICE FUTURES U.S. ;2009.09.29; 1183796;  200437;   12337;  331278;  568293;  789267; 1100008; 1132881;   83788;   50915
SUGAR NO. 11 - ICE FUTURES U.S. ;2009.09.22; 1179749;  188807;   18510;  322558;  597896;  786804; 1109261; 1127872;   70487;   51876
SUGAR NO. 11 - ICE FUTURES U.S. ;2009.09.15; 1190475;  181843;   23298;  320641;  600909;  793916; 1103394; 1137855;   87081;   52620
SUGAR NO. 11 - ICE FUTURES U.S. ;2009.09.08; 1340079;  185486;   25172;  397944;  668060;  856124; 1251490; 1279241;   88589;   60838
SUGAR NO. 11 - ICE FUTURES U.S. ;2009.09.01; 1392039;  194685;   16013;  428520;  665786;  886693; 1288991; 1331227;  103048;   60812
SUGAR NO. 11 - ICE FUTURES U.S. ;2009.08.25; 1317033;  196173;   14773;  400235;  619104;  844970; 1215513; 1259978;  101520;   57055
SUGAR NO. 11 - ICE FUTURES U.S. ;2009.08.18; 1299681;  199294;   11360;  395955;  600706;  832845; 1195954; 1240160;  103726;   59521
SUGAR NO. 11 - ICE FUTURES U.S. ;2009.08.11; 1283970;  201177;   18351;  364563;  611612;  839000; 1177352; 1221914;  106618;   62056
SUGAR NO. 11 - ICE FUTURES U.S. ;2009.08.04; 1139444;  225757;   12116;  296885;  516544;  770733; 1039186; 1079734;  100259;   59710
SUGAR NO. 11 - ICE FUTURES U.S. ;2009.07.28; 1091083;  216606;   10749;  279226;  497047;  743727;  992879; 1033702;   98203;   57380
SUGAR NO. 11 - ICE FUTURES U.S. ;2009.07.21; 1032516;  200598;   11723;  264968;  471812;  694220;  937377;  970911;   95138;   61604
SUGAR NO. 11 - ICE FUTURES U.S. ;2009.07.14; 1026949;  193375;   10838;  274077;  464541;  682291;  931993;  967206;   94956;   59743
SUGAR NO. 11 - ICE FUTURES U.S. ;2009.07.07; 1001126;  199932;   11003;  249744;  459859;  683995;  909535;  944742;   91591;   56384
SUGAR NO. 11 - ICE FUTURES U.S. ;2009.06.30; 1038949;  205708;   12371;  252164;  489315;  718797;  947187;  983331;   91762;   55617
SUGAR NO. 11 - ICE FUTURES U.S. ;2009.06.23; 1018956;  190268;   17567;  226304;  512348;  719376;  928921;  963247;   90035;   55708
SUGAR NO. 11 - ICE FUTURES U.S. ;2009.06.16;  990462;  178720;   17810;  228791;  499141;  684408;  906653;  931010;   83810;   59453
SUGAR NO. 11 - ICE FUTURES U.S. ;2009.06.09; 1089185;  205734;   24103;  277544;  513775;  737048;  997053; 1038694;   92133;   50491
SUGAR NO. 11 - ICE FUTURES U.S. ;2009.06.02; 1078305;  215194;   19167;  275983;  489738;  727020;  980914; 1022170;   97390;   56135
SUGAR NO. 11 - ICE FUTURES U.S. ;2009.05.26; 1037468;  228226;   15488;  260390;  450152;  705618;  938768;  981495;   98699;   55972
SUGAR NO. 11 - ICE FUTURES U.S. ;2009.05.19;  996027;  212953;   15298;  250356;  436254;  675299;  899562;  940953;   96465;   55074
SUGAR NO. 11 - ICE FUTURES U.S. ;2009.05.12;  968675;  209990;   15571;  237880;  428047;  663197;  875916;  916648;   92759;   52028
SUGAR NO. 11 - ICE FUTURES U.S. ;2009.05.05;  929344;  196491;   15928;  214980;  425941;  646386;  837412;  877294;   91933;   52050
SUGAR NO. 11 - ICE FUTURES U.S. ;2009.04.28;  877967;  170906;   26894;  190109;  439055;  607281;  800070;  824285;   77896;   53682
SUGAR NO. 11 - ICE FUTURES U.S. ;2009.04.21;  875942;  163747;   36806;  183827;  455354;  596015;  802927;  816648;   73015;   59294
SUGAR NO. 11 - ICE FUTURES U.S. ;2009.04.14;  938749;  160583;   33920;  208162;  495495;  629955;  864241;  872037;   74508;   66712
SUGAR NO. 11 - ICE FUTURES U.S. ;2009.04.07;  937268;  148465;   39540;  204089;  510741;  619954;  863296;  863583;   73972;   73685
SUGAR NO. 11 - ICE FUTURES U.S. ;2009.03.31;  932159;  163154;   33482;  204928;  488658;  623003;  856740;  861413;   75419;   70746
SUGAR NO. 11 - ICE FUTURES U.S. ;2009.03.24;  931330;  165198;   16553;  211243;  476183;  634454;  852623;  862249;   78707;   69081
SUGAR NO. 11 - ICE FUTURES U.S. ;2009.03.17;  869500;  147111;   26695;  204051;  446251;  571688;  797413;  802435;   72087;   67066
SUGAR NO. 11 - ICE FUTURES U.S. ;2009.03.10;  846361;  135126;   28043;  205290;  433696;  546913;  774112;  780245;   72249;   66115
SUGAR NO. 11 - ICE FUTURES U.S. ;2009.03.03;  841474;  144923;   30075;  200372;  421805;  550670;  767101;  781117;   74373;   60357
SUGAR NO. 11 - ICE FUTURES U.S. ;2009.02.24;  853180;  151688;   27715;  191771;  433711;  576631;  777170;  796117;   76010;   57062
SUGAR NO. 11 - ICE FUTURES U.S. ;2009.02.17;  886498;  155400;   25400;  195215;  444411;  590515;  795026;  811129;   91472;   75369
SUGAR NO. 11 - ICE FUTURES U.S. ;2009.02.10;  965069;  151028;   27282;  259669;  459687;  608262;  870384;  895212;   94685;   69857
SUGAR NO. 11 - ICE FUTURES U.S. ;2009.02.03;  976556;  141284;   35242;  269869;  481499;  604418;  892652;  909529;   83904;   67027
SUGAR NO. 11 - ICE FUTURES U.S. ;2009.01.27;  981814;  140791;   35785;  270431;  488043;  612505;  899265;  918721;   82549;   63092
SUGAR NO. 11 - ICE FUTURES U.S. ;2009.01.20;  970670;  135841;   42975;  263330;  496049;  602269;  895220;  908573;   75450;   62097
SUGAR NO. 11 - ICE FUTURES U.S. ;2009.01.13;  965727;  124220;   47245;  261451;  508619;  591353;  894290;  900049;   71438;   65678
SUGAR NO. 11 - ICE FUTURES U.S. ;2009.01.06;  980181;  120514;   46608;  265001;  519123;  607106;  904639;  918715;   75543;   61466
SUGAR NO. 11 - ICE FUTURES U.S. ;2008.12.30;  951269;  111601;   60856;  253576;  520108;  569714;  885285;  884146;   65984;   67123
SUGAR NO. 11 - ICE FUTURES U.S. ;2008.12.22;  954964;  111539;   60579;  250791;  526737;  574822;  889068;  886192;   65896;   68772
SUGAR NO. 11 - ICE FUTURES U.S. ;2008.12.16;  938447;  112269;   51802;  244285;  516911;  582535;  873464;  878622;   64983;   59825
SUGAR NO. 11 - ICE FUTURES U.S. ;2008.12.09;  960745;  112411;   65664;  248763;  523575;  568936;  884748;  883363;   75997;   77383
SUGAR NO. 11 - ICE FUTURES U.S. ;2008.12.02;  938038;  119742;   44152;  239988;  504546;  583456;  864276;  867597;   73762;   70441
SUGAR NO. 11 - ICE FUTURES U.S. ;2008.11.25;  933085;  117332;   46212;  242619;  500835;  577485;  860786;  866316;   72299;   66769
SUGAR NO. 11 - ICE FUTURES U.S. ;2008.11.18;  935967;  116391;   52043;  242129;  508161;  571039;  866681;  865212;   69287;   70756
SUGAR NO. 11 - ICE FUTURES U.S. ;2008.11.11;  957776;  121291;   55679;  250428;  518346;  585119;  890065;  891226;   67711;   66550
SUGAR NO. 11 - ICE FUTURES U.S. ;2008.11.04;  950267;  125929;   49562;  247736;  508653;  589193;  882318;  886491;   67949;   63776
SUGAR NO. 11 - ICE FUTURES U.S. ;2008.10.28;  936270;  118404;   66254;  239749;  515748;  563582;  873900;  869585;   62370;   66685
SUGAR NO. 11 - ICE FUTURES U.S. ;2008.10.21;  947826;  119718;   67494;  239575;  524651;  573410;  883944;  880480;   63882;   67346
SUGAR NO. 11 - ICE FUTURES U.S. ;2008.10.14;  966314;  121432;   65568;  243859;  533752;  586879;  899043;  896306;   67272;   70008
SUGAR NO. 11 - ICE FUTURES U.S. ;2008.10.07;  957222;  123242;   63097;  236395;  531286;  590677;  890922;  890169;   66299;   67053
SUGAR NO. 11 - ICE FUTURES U.S. ;2008.09.30;  979169;  143818;   51469;  223391;  542784;  642877;  909992;  917737;   69177;   61432
SUGAR NO. 11 - ICE FUTURES U.S. ;2008.09.23; 1001371;  145855;   49927;  213309;  558724;  670529;  917888;  933765;   83483;   67606
SUGAR NO. 11 - ICE FUTURES U.S. ;2008.09.16; 1041011;  155304;   59444;  211810;  580047;  687262;  947161;  958517;   93850;   82494
SUGAR NO. 11 - ICE FUTURES U.S. ;2008.09.09; 1142849;  164441;   53708;  266998;  611353;  743108; 1042792; 1063814;  100057;   79035
SUGAR NO. 11 - ICE FUTURES U.S. ;2008.09.02; 1160354;  181617;   56758;  262435;  603461;  763522; 1047512; 1082715;  112841;   77639
SUGAR NO. 11 - ICE FUTURES U.S. ;2008.08.26; 1176901;  210213;   54319;  272213;  582472;  783210; 1064898; 1109742;  112003;   67160
SUGAR NO. 11 - ICE FUTURES U.S. ;2008.08.19; 1154085;  193326;   57697;  267722;  585586;  757806; 1046634; 1083225;  107452;   70860
SUGAR NO. 11 - ICE FUTURES U.S. ;2008.08.12; 1134983;  195256;   55925;  263617;  575043;  752029; 1033916; 1071571;  101066;   63412
SUGAR NO. 11 - ICE FUTURES U.S. ;2008.08.05; 1152172;  190602;   59462;  273951;  583093;  752068; 1047647; 1085481;  104526;   66691
SUGAR NO. 11 - ICE FUTURES U.S. ;2008.07.29; 1117624;  186279;   75136;  254973;  587767;  725426; 1029020; 1055536;   88605;   62089
SUGAR NO. 11 - ICE FUTURES U.S. ;2008.07.22; 1123635;  189000;   71639;  249788;  589538;  732022; 1028326; 1053449;   95310;   70186
SUGAR NO. 11 - ICE FUTURES U.S. ;2008.07.15; 1156998;  208107;   69085;  250525;  584094;  772647; 1042726; 1092256;  114272;   64741
SUGAR NO. 11 - ICE FUTURES U.S. ;2008.07.08; 1161788;  223916;   74961;  243560;  594515;  789354; 1061991; 1107874;   99797;   53914
SUGAR NO. 11 - ICE FUTURES U.S. ;2008.07.01; 1167222;  219893;   79147;  233992;  604934;  792260; 1058819; 1105399;  108404;   61823
SUGAR NO. 11 - ICE FUTURES U.S. ;2008.06.24; 1154898;  209525;   77707;  223789;  623458;  790051; 1056772; 1091547;   98126;   63351
SUGAR NO. 11 - ICE FUTURES U.S. ;2008.06.17; 1168954;  208796;   86202;  218315;  646714;  797741; 1073825; 1102259;   95129;   66695
SUGAR NO. 11 - ICE FUTURES U.S. ;2008.06.10; 1296642;  196460;   92941;  277690;  735501;  855908; 1209651; 1226539;   86991;   70103
SUGAR NO. 11 - ICE FUTURES U.S. ;2008.06.03; 1276041;  197860;   93462;  265918;  728992;  851866; 1192770; 1211246;   83271;   64795
SUGAR NO. 11 - ICE FUTURES U.S. ;2008.05.27; 1266144;  203439;   78165;  256939;  701909;  844310; 1162287; 1179413;  103858;   86731
SUGAR NO. 11 - ICE FUTURES U.S. ;2008.05.20; 1247111;  211366;   74109;  247563;  688033;  855153; 1146962; 1176825;  100149;   70285
SUGAR NO. 11 - ICE FUTURES U.S. ;2008.05.13; 1238919;  216981;   72124;  243380;  676375;  854986; 1136736; 1170490;  102183;   68429
SUGAR NO. 11 - ICE FUTURES U.S. ;2008.05.06; 1250389;  218577;   70389;  259102;  669383;  859718; 1147062; 1189209;  103327;   61180
SUGAR NO. 11 - ICE FUTURES U.S. ;2008.04.29; 1251166;  224845;   57945;  256036;  670944;  879268; 1151825; 1193249;   99341;   57917
SUGAR NO. 11 - ICE FUTURES U.S. ;2008.04.22; 1272077;  229103;   60158;  254455;  668566;  898111; 1152124; 1212724;  119953;   59353
SUGAR NO. 11 - ICE FUTURES U.S. ;2008.04.15; 1265996;  227445;   60968;  254248;  658058;  889955; 1139750; 1205171;  126246;   60825
SUGAR NO. 11 - ICE FUTURES U.S. ;2008.04.08; 1332630;  213343;   55254;  310826;  705376;  918808; 1229544; 1284887;  103086;   47743
SUGAR NO. 11 - ICE FUTURES U.S. ;2008.04.01; 1330378;  205580;   47734;  320134;  704290;  908126; 1230005; 1275994;  100373;   54384
SUGAR NO. 11 - ICE FUTURES U.S. ;2008.03.25; 1332433;  217157;   45919;  333666;  679636;  903739; 1230459; 1283325;  101974;   49109
SUGAR NO. 11 - ICE FUTURES U.S. ;2008.03.18; 1373609;  221077;   52115;  339983;  688390;  923861; 1249450; 1315959;  124159;   57650
SUGAR NO. 11 - ICE FUTURES U.S. ;2008.03.11; 1404018;  245132;   50516;  340565;  681022;  954167; 1266719; 1345248;  137299;   58770
SUGAR NO. 11 - ICE FUTURES U.S. ;2008.03.04; 1429622;  270547;   54050;  343202;  669646;  970750; 1283395; 1368002;  146227;   61620
SUGAR NO. 11 - ICE FUTURES U.S. ;2008.02.26; 1442222;  271272;   56653;  322908;  691811;  995021; 1285991; 1374581;  156232;   67641
SUGAR NO. 11 - ICE FUTURES U.S. ;2008.02.19; 1364541;  270793;   64134;  290628;  652271;  949041; 1213692; 1303804;  150849;   60737
SUGAR NO. 11 - ICE FUTURES U.S. ;2008.02.12; 1291206;  270262;   74356;  244609;  644081;  919594; 1158952; 1238559;  132254;   52647
SUGAR NO. 11 - ICE FUTURES U.S. ;2008.02.05; 1492736;  251269;   82675;  349091;  722343;  969279; 1322703; 1401045;  170033;   91691
SUGAR NO. 11 - ICE FUTURES U.S. ;2008.01.29; 1481883;  243732;   85625;  347407;  733092;  966807; 1324231; 1399839;  157652;   82044
SUGAR NO. 11 - ICE FUTURES U.S. ;2008.01.22; 1535068;  250036;   91014;  347355;  768760;  993962; 1366152; 1432331;  168916;  102737
SUGAR NO. 11 - ICE FUTURES U.S. ;2008.01.15; 1533305;  280480;  104343;  312777;  774204; 1034436; 1367461; 1451556;  165844;   81749
SUGAR NO. 11 - ICE FUTURES U.S. ;2008.01.08; 1409581;  263447;   96713;  300517;  694631;  944281; 1258595; 1341511;  150986;   68071
SUGAR NO. 11 - ICE FUTURES U.S. ;2007.12.31; 1253424;  249200;  100822;  240782;  634258;  848189; 1124239; 1189793;  129184;   63631
SUGAR NO. 11 - ICE FUTURES U.S. ;2007.12.24; 1185335;  232457;  102258;  228728;  601144;  792549; 1062329; 1123536;  123006;   61799
SUGAR NO. 11 - ICE FUTURES U.S. ;2007.12.18; 1126297;  225102;  113632;  198192;  581533;  743077; 1004826; 1054901;  121471;   71396
SUGAR NO. 11 - ICE FUTURES U.S. ;2007.12.11; 1083984;  194131;  117385;  197347;  578471;  694492;  969949; 1009224;  114035;   74760
SUGAR NO. 11 - ICE FUTURES U.S. ;2007.12.04; 1054511;  169524;  134816;  186230;  601726;  655702;  957480;  976748;   97031;   77762
SUGAR NO. 11 - ICE FUTURES U.S. ;2007.11.27; 1034854;  167315;  150329;  184540;  587562;  626205;  939418;  961075;   95436;   73779
SUGAR NO. 11 - ICE FUTURES U.S. ;2007.11.20; 1030895;  169533;  132461;  184464;  576293;  637821;  930290;  954745;  100605;   76149
SUGAR NO. 11 - ICE FUTURES U.S. ;2007.11.13; 1024234;  167921;  114346;  174978;  581604;  670140;  924503;  959464;   99731;   64770
SUGAR NO. 11 - ICE FUTURES U.S. ;2007.11.06; 1026771;  166825;   97220;  176737;  580441;  686381;  924003;  960338;  102768;   66433
SUGAR NO. 11 - ICE FUTURES U.S. ;2007.10.30;  988992;  168385;   96423;  169118;  537880;  634345;  875383;  899887;  113608;   89105
SUGAR NO. 11 - ICE FUTURES U.S. ;2007.10.23;  950044;  164076;  102969;  171847;  514998;  612109;  850920;  886925;   99124;   63119
SUGAR NO. 11 - ICE FUTURES U.S. ;2007.10.16;  882113;  155504;  102579;  150790;  481813;  566550;  788107;  819919;   94007;   62194
SUGAR NO. 11 - ICE FUTURES U.S. ;2007.10.09;  807356;  147952;  100594;  117659;  459698;  524561;  725309;  742814;   82047;   64542
SUGAR NO. 11 - ICE FUTURES U.S. ;2007.10.02;  807474;  151351;  104018;  117224;  452265;  525651;  720839;  746893;   86634;   60581
SUGAR NO. 11 - ICE FUTURES U.S. ;2007.09.25;  824027;  147469;  107346;  120501;  461958;  528410;  729928;  756258;   94099;   67769
SUGAR NO. 11 - ICE FUTURES U.S. ;2007.09.18;  789201;  128874;  138754;  110307;  465969;  463159;  705150;  712220;   84051;   76981
SUGAR NO. 11 - ICE FUTURES U.S. ;2007.09.11;  872886;  131574;  142717;  154979;  502360;  503333;  788913;  801029;   83973;   71856
SUGAR NO. 11 - ICE FUTURES U.S. ;2007.09.04;  877867;  134541;  130706;  164723;  499968;  517551;  799232;  812980;   78635;   64886
SUGAR NO. 11 - ICE FUTURES U.S. ;2011.07.12;  845922;  212816;   32854;  192965;  344358;  554778;  750139;  780596;   95783;   65326
SUGAR NO. 11 - ICE FUTURES U.S. ;2011.07.05;  797192;  212114;   40690;  162865;  333378;  533302;  708356;  736857;   88836;   60335
SUGAR NO. 11 - ICE FUTURES U.S. ;2011.06.28;  785543;  202531;   38633;  148922;  348329;  535136;  699783;  722692;   85760;   62851
SUGAR NO. 11 - ICE FUTURES U.S. ;2011.06.21;  781878;  201941;   40348;  133110;  364575;  540332;  699626;  713790;   82252;   68088
SUGAR NO. 11 - ICE FUTURES U.S. ;2011.06.14;  838076;  182036;   39140;  168101;  410498;  565482;  760635;  772723;   77441;   65353
SUGAR NO. 11 - ICE FUTURES U.S. ;2011.06.07;  822537;  167376;   42503;  164223;  407669;  543795;  739268;  750521;   83269;   72016
SUGAR NO. 11 - ICE FUTURES U.S. ;2011.05.31;  789907;  164302;   46313;  166228;  387081;  507143;  717612;  719684;   72295;   70223
SUGAR NO. 11 - ICE FUTURES U.S. ;2011.05.24;  759727;  159940;   44031;  155933;  376781;  484460;  692654;  684424;   67073;   75304
SUGAR NO. 11 - ICE FUTURES U.S. ;2011.05.17;  756592;  168467;   52901;  154814;  370323;  476374;  693605;  684089;   62988;   72503
SUGAR NO. 11 - ICE FUTURES U.S. ;2011.05.10;  759049;  173066;   46245;  149991;  369806;  492546;  692862;  688782;   66187;   70267
SUGAR NO. 11 - ICE FUTURES U.S. ;2011.05.03;  733492;  171099;   47970;  142068;  356734;  475095;  669901;  665133;   63591;   68359
SUGAR NO. 11 - ICE FUTURES U.S. ;2011.04.26;  753555;  159549;   40687;  135264;  391399;  511722;  686212;  687672;   67343;   65883
SUGAR NO. 11 - ICE FUTURES U.S. ;2011.04.19;  769869;  160093;   39704;  139331;  400644;  522802;  700068;  701838;   69800;   68031
SUGAR NO. 11 - ICE FUTURES U.S. ;2011.04.12;  854752;  169437;   27481;  208679;  400801;  547196;  778917;  783357;   75834;   71395
SUGAR NO. 11 - ICE FUTURES U.S. ;2011.04.05;  852919;  172445;   14541;  217877;  381050;  555343;  771372;  787762;   81547;   65158
SUGAR NO. 11 - ICE FUTURES U.S. ;2011.03.29;  813737;  167510;   15594;  196719;  375050;  543725;  739280;  756037;   74458;   57700
SUGAR NO. 11 - ICE FUTURES U.S. ;2011.03.22;  810211;  161726;   15869;  199819;  376475;  541225;  738020;  756914;   72191;   53297
SUGAR NO. 11 - ICE FUTURES U.S. ;2011.03.15;  822825;  175850;   16186;  202329;  369947;  545529;  748127;  764044;   74698;   58781
SUGAR NO. 11 - ICE FUTURES U.S. ;2011.03.08;  856178;  199371;   11488;  211890;  362799;  579508;  774060;  802886;   82119;   53292
SUGAR NO. 11 - ICE FUTURES U.S. ;2011.03.01;  834192;  174809;   10860;  212820;  373700;  561199;  761328;  784879;   72863;   49313
SUGAR NO. 11 - ICE FUTURES U.S. ;2011.02.22;  870241;  171045;   11294;  212264;  405527;  590826;  788835;  814384;   81406;   55857
SUGAR NO. 11 - ICE FUTURES U.S. ;2011.02.15;  893334;  170610;   12560;  212803;  425086;  613921;  808498;  839284;   84836;   54050
SUGAR NO. 11 - ICE FUTURES U.S. ;2011.02.08; 1056996;  168274;    5103;  328463;  474847;  668148;  971585; 1001714;   85411;   55282
SUGAR NO. 11 - ICE FUTURES U.S. ;2011.02.01; 1069152;  177989;    5508;  341510;  456184;  667162;  975684; 1014181;   93469;   54972
SUGAR NO. 11 - ICE FUTURES U.S. ;2011.01.25; 1017632;  161864;    5032;  326652;  445202;  631833;  933719;  963517;   83914;   54115
SUGAR NO. 11 - ICE FUTURES U.S. ;2011.01.18; 1022317;  160330;    5772;  329784;  446800;  632072;  936914;  967628;   85403;   54689
SUGAR NO. 11 - ICE FUTURES U.S. ;2011.01.11; 1041236;  165528;    4029;  341347;  444902;  636926;  951777;  982301;   89459;   58935
SUGAR NO. 11 - ICE FUTURES U.S. ;2011.01.04; 1015284;  166516;    4990;  334356;  428128;  619190;  929000;  958536;   86283;   56748
SUGAR NO. 11 - ICE FUTURES U.S. ;2011.07.12;  845922;  212816;   32854;  192965;  344358;  554778;  750139;  780596;   95783;   65326
SUGAR NO. 11 - ICE FUTURES U.S. ;2010.12.28; 1035783;  171944;    5980;  342452;  425500;  627968;  939896;  976400;   95887;   59383
SUGAR NO. 11 - ICE FUTURES U.S. ;2010.12.21; 1015730;  168715;    6911;  327592;  427225;  627609;  923532;  962112;   92199;   53618
SUGAR NO. 11 - ICE FUTURES U.S. ;2010.12.14;  985279;  155619;   11126;  323124;  421143;  596372;  899886;  930622;   85393;   54657
SUGAR NO. 11 - ICE FUTURES U.S. ;2010.12.07;  950513;  154464;   13721;  305408;  412429;  579909;  872300;  899039;   78213;   51474
SUGAR NO. 11 - ICE FUTURES U.S. ;2010.11.30;  936194;  154649;   13790;  301153;  409491;  572263;  865294;  887207;   70900;   48988
SUGAR NO. 11 - ICE FUTURES U.S. ;2010.11.23;  942668;  153293;   15621;  302668;  409813;  572317;  865774;  890605;   76894;   52063
SUGAR NO. 11 - ICE FUTURES U.S. ;2010.11.16;  925918;  156634;   15273;  285304;  402718;  569465;  844656;  870043;   81261;   55875
SUGAR NO. 11 - ICE FUTURES U.S. ;2010.11.09;  993202;  162282;    9685;  316747;  419838;  616353;  898867;  942785;   94335;   50417
SUGAR NO. 11 - ICE FUTURES U.S. ;2010.11.02;  948145;  170975;    5664;  273772;  412755;  617198;  857503;  896634;   90642;   51510
SUGAR NO. 11 - ICE FUTURES U.S. ;2010.10.26;  901073;  165775;    5338;  251492;  395182;  591432;  812448;  848262;   88625;   52811
SUGAR NO. 11 - ICE FUTURES U.S. ;2010.10.19;  885153;  167605;    6603;  246688;  383020;  579844;  797313;  833134;   87840;   52019
SUGAR NO. 11 - ICE FUTURES U.S. ;2010.10.12;  855149;  168890;    6672;  228339;  366664;  562374;  763894;  797385;   91254;   57763
SUGAR NO. 11 - ICE FUTURES U.S. ;2010.10.05;  799974;  168018;   13865;  189095;  356562;  540905;  713675;  743865;   86299;   56109
SUGAR NO. 11 - ICE FUTURES U.S. ;2010.09.28;  842181;  176687;   12404;  191597;  383750;  576367;  752034;  780368;   90147;   61813
SUGAR NO. 11 - ICE FUTURES U.S. ;2010.09.21;  831483;  173357;   14694;  172755;  392280;  577415;  738392;  764864;   93091;   66619
SUGAR NO. 11 - ICE FUTURES U.S. ;2010.09.14;  996801;  171275;   14383;  266784;  459251;  644071;  897310;  925238;   99491;   71563
SUGAR NO. 11 - ICE FUTURES U.S. ;2010.09.07;  917924;  160238;   12737;  245764;  423762;  605990;  829765;  864491;   88159;   53432
SUGAR NO. 11 - ICE FUTURES U.S. ;2010.08.31;  877084;  149304;   16045;  227798;  409887;  576254;  786989;  820097;   90095;   56987
SUGAR NO. 11 - ICE FUTURES U.S. ;2010.08.24;  871381;  145207;   14585;  229137;  408675;  566928;  783019;  810650;   88361;   60731
SUGAR NO. 11 - ICE FUTURES U.S. ;2010.08.17;  835440;  147860;   14322;  222693;  381679;  543362;  752233;  780377;   83208;   55063
SUGAR NO. 11 - ICE FUTURES U.S. ;2010.08.10;  815988;  136376;   12929;  212361;  382950;  531900;  731687;  757190;   84301;   58798
SUGAR NO. 11 - ICE FUTURES U.S. ;2010.08.03;  813510;  139825;   15636;  204995;  386863;  533702;  731684;  754333;   81827;   59177
SUGAR NO. 11 - ICE FUTURES U.S. ;2010.07.27;  797861;  136454;   15847;  204217;  374863;  516867;  715534;  736931;   82328;   60930
SUGAR NO. 11 - ICE FUTURES U.S. ;2010.07.20;  762507;  134828;   17435;  196800;  360550;  492331;  692178;  706566;   70330;   55941
SUGAR NO. 11 - ICE FUTURES U.S. ;2010.07.13;  750225;  129717;   15620;  187993;  364133;  490031;  681843;  693644;   68382;   56581
SUGAR NO. 11 - ICE FUTURES U.S. ;2010.07.06;  722203;  132624;   16895;  176967;  354508;  478238;  664098;  672100;   58105;   50103
SUGAR NO. 11 - ICE FUTURES U.S. ;2010.06.29;  719854;  145480;   25979;  161467;  352227;  478215;  659174;  665661;   60680;   54193
SUGAR NO. 11 - ICE FUTURES U.S. ;2010.06.22;  755125;  145523;   20288;  161682;  381844;  515186;  689050;  697156;   66076;   57969
SUGAR NO. 11 - ICE FUTURES U.S. ;2010.06.15;  789449;  150408;   23687;  172295;  395427;  530300;  718129;  726282;   71319;   63167
SUGAR NO. 11 - ICE FUTURES U.S. ;2010.06.08;  918717;  146746;   34639;  251276;  445046;  570357;  843067;  856272;   75649;   62444
SUGAR NO. 11 - ICE FUTURES U.S. ;2010.06.01;  903800;  154654;   37734;  250016;  421644;  548182;  826314;  835932;   77486;   67868
SUGAR NO. 11 - ICE FUTURES U.S. ;2010.05.25;  899153;  158419;   35826;  244430;  419350;  551952;  822198;  832208;   76955;   66945
SUGAR NO. 11 - ICE FUTURES U.S. ;2010.05.18;  879102;  157101;   43190;  225816;  411284;  537728;  794200;  806734;   84901;   72368
SUGAR NO. 11 - ICE FUTURES U.S. ;2010.05.11;  859421;  156949;   41244;  217114;  400974;  534699;  775037;  793057;   84384;   66364
SUGAR NO. 11 - ICE FUTURES U.S. ;2010.05.04;  826898;  161644;   41353;  203713;  386470;  519856;  751828;  764921;   75071;   61977
SUGAR NO. 11 - ICE FUTURES U.S. ;2010.04.27;  833921;  160364;   39343;  190093;  414677;  550298;  765134;  779734;   68787;   54187
SUGAR NO. 11 - ICE FUTURES U.S. ;2010.04.20;  845478;  168325;   31911;  186165;  423461;  569868;  777952;  787945;   67526;   57533
SUGAR NO. 11 - ICE FUTURES U.S. ;2010.04.13;  985537;  168883;   23218;  284323;  466445;  626710;  919652;  934252;   65886;   51285
SUGAR NO. 11 - ICE FUTURES U.S. ;2010.04.06;  999871;  168153;   28588;  281091;  479665;  635065;  928909;  944744;   70962;   55128
SUGAR NO. 11 - ICE FUTURES U.S. ;2010.03.30; 1002594;  176732;   25960;  278184;  483798;  642542;  938715;  946687;   63879;   55907
SUGAR NO. 11 - ICE FUTURES U.S. ;2010.03.23; 1002939;  173785;   29911;  254155;  506382;  660845;  934322;  944911;   68617;   58028
SUGAR NO. 11 - ICE FUTURES U.S. ;2010.03.16; 1029086;  172919;   22005;  247695;  543375;  706815;  963990;  976515;   65096;   52571
SUGAR NO. 11 - ICE FUTURES U.S. ;2010.03.09;  994986;  162439;   22549;  230120;  534349;  690754;  926907;  943423;   68079;   51563
SUGAR NO. 11 - ICE FUTURES U.S. ;2010.03.02;  989986;  162710;    9492;  240454;  524393;  699871;  927557;  949817;   62430;   40170
SUGAR NO. 11 - ICE FUTURES U.S. ;2010.02.23; 1008982;  177397;   15353;  228018;  539111;  724714;  944526;  968085;   64456;   40897
SUGAR NO. 11 - ICE FUTURES U.S. ;2010.02.16; 1088715;  191499;   13230;  241880;  579601;  787423; 1012980; 1042533;   75735;   46182
SUGAR NO. 11 - ICE FUTURES U.S. ;2010.02.09; 1309303;  181313;   24678;  376990;  666736;  849293; 1225039; 1250961;   84264;   58342
SUGAR NO. 11 - ICE FUTURES U.S. ;2010.02.02; 1358236;  219292;   24589;  388901;  654963;  886969; 1263156; 1300459;   95080;   57777
SUGAR NO. 11 - ICE FUTURES U.S. ;2010.01.26; 1321425;  213557;   24236;  380975;  628342;  858795; 1222874; 1264006;   98551;   57419
SUGAR NO. 11 - ICE FUTURES U.S. ;2010.01.19; 1313970;  212333;   22954;  397156;  599421;  835493; 1208910; 1255604;  105060;   58366
SUGAR NO. 11 - ICE FUTURES U.S. ;2010.01.12; 1292016;  203548;   18087;  389361;  600120;  829160; 1193029; 1236607;   98987;   55409
SUGAR NO. 11 - ICE FUTURES U.S. ;2010.01.05; 1298093;  199107;   18982;  383823;  616572;  843844; 1199502; 1246649;   98591;   51444
SUGAR NO. 11 - ICE FUTURES U.S. ;2009.12.29; 1269415;  199402;   20485;  370543;  598592;  826164; 1168537; 1217193;  100878;   52222
SUGAR NO. 11 - ICE FUTURES U.S. ;2009.12.22; 1270677;  203864;   16518;  373184;  591942;  827988; 1168990; 1217690;  101687;   52987
SUGAR NO. 11 - ICE FUTURES U.S. ;2009.12.15; 1227576;  190543;   14191;  354121;  581870;  804993; 1126535; 1173306;  101041;   54270
SUGAR NO. 11 - ICE FUTURES U.S. ;2009.12.08; 1154043;  164700;   21118;  328469;  581333;  755198; 1074501; 1104784;   79541;   49259
SUGAR NO. 11 - ICE FUTURES U.S. ;2009.12.01; 1157622;  159275;   17213;  334685;  583062;  760978; 1077023; 1112876;   80599;   44746
SUGAR NO. 11 - ICE FUTURES U.S. ;2009.11.24; 1151256;  153488;   22685;  338606;  579494;  742756; 1071589; 1104047;   79667;   47209
SUGAR NO. 11 - ICE FUTURES U.S. ;2009.11.17; 1160204;  151705;   20008;  350157;  579072;  744545; 1080933; 1114710;   79271;   45494
SUGAR NO. 11 - ICE FUTURES U.S. ;2009.11.09; 1159504;  152144;   15738;  354077;  575762;  742804; 1081983; 1112619;   77520;   46885
SUGAR NO. 11 - ICE FUTURES U.S. ;2009.11.03; 1199980;  172153;   11014;  360303;  584757;  775144; 1117214; 1146461;   82766;   53518
SUGAR NO. 11 - ICE FUTURES U.S. ;2009.10.27; 1165972;  175708;   12076;  337139;  575024;  766181; 1087872; 1115396;   78100;   50575
SUGAR NO. 11 - ICE FUTURES U.S. ;2009.10.20; 1180191;  184332;   14204;  338529;  577860;  775474; 1100721; 1128207;   79471;   51984
SUGAR NO. 11 - ICE FUTURES U.S. ;2009.10.13; 1154668;  179543;   21379;  331474;  576106;  737570; 1087124; 1090423;   67544;   64244
SUGAR NO. 11 - ICE FUTURES U.S. ;2009.10.06; 1162945;  197670;   14686;  329792;  561832;  776328; 1089294; 1120806;   73652;   42140
SUGAR NO. 11 - ICE FUTURES U.S. ;2009.09.29; 1183796;  200437;   12337;  331278;  568293;  789267; 1100008; 1132881;   83788;   50915
SUGAR NO. 11 - ICE FUTURES U.S. ;2009.09.22; 1179749;  188807;   18510;  322558;  597896;  786804; 1109261; 1127872;   70487;   51876
SUGAR NO. 11 - ICE FUTURES U.S. ;2009.09.15; 1190475;  181843;   23298;  320641;  600909;  793916; 1103394; 1137855;   87081;   52620
SUGAR NO. 11 - ICE FUTURES U.S. ;2009.09.08; 1340079;  185486;   25172;  397944;  668060;  856124; 1251490; 1279241;   88589;   60838
SUGAR NO. 11 - ICE FUTURES U.S. ;2009.09.01; 1392039;  194685;   16013;  428520;  665786;  886693; 1288991; 1331227;  103048;   60812
SUGAR NO. 11 - ICE FUTURES U.S. ;2009.08.25; 1317033;  196173;   14773;  400235;  619104;  844970; 1215513; 1259978;  101520;   57055
SUGAR NO. 11 - ICE FUTURES U.S. ;2009.08.18; 1299681;  199294;   11360;  395955;  600706;  832845; 1195954; 1240160;  103726;   59521
SUGAR NO. 11 - ICE FUTURES U.S. ;2009.08.11; 1283970;  201177;   18351;  364563;  611612;  839000; 1177352; 1221914;  106618;   62056
SUGAR NO. 11 - ICE FUTURES U.S. ;2009.08.04; 1139444;  225757;   12116;  296885;  516544;  770733; 1039186; 1079734;  100259;   59710
SUGAR NO. 11 - ICE FUTURES U.S. ;2009.07.28; 1091083;  216606;   10749;  279226;  497047;  743727;  992879; 1033702;   98203;   57380
SUGAR NO. 11 - ICE FUTURES U.S. ;2009.07.21; 1032516;  200598;   11723;  264968;  471812;  694220;  937377;  970911;   95138;   61604
SUGAR NO. 11 - ICE FUTURES U.S. ;2009.07.14; 1026949;  193375;   10838;  274077;  464541;  682291;  931993;  967206;   94956;   59743
SUGAR NO. 11 - ICE FUTURES U.S. ;2009.07.07; 1001126;  199932;   11003;  249744;  459859;  683995;  909535;  944742;   91591;   56384
SUGAR NO. 11 - ICE FUTURES U.S. ;2009.06.30; 1038949;  205708;   12371;  252164;  489315;  718797;  947187;  983331;   91762;   55617
SUGAR NO. 11 - ICE FUTURES U.S. ;2009.06.23; 1018956;  190268;   17567;  226304;  512348;  719376;  928921;  963247;   90035;   55708
SUGAR NO. 11 - ICE FUTURES U.S. ;2009.06.16;  990462;  178720;   17810;  228791;  499141;  684408;  906653;  931010;   83810;   59453
SUGAR NO. 11 - ICE FUTURES U.S. ;2009.06.09; 1089185;  205734;   24103;  277544;  513775;  737048;  997053; 1038694;   92133;   50491
SUGAR NO. 11 - ICE FUTURES U.S. ;2009.06.02; 1078305;  215194;   19167;  275983;  489738;  727020;  980914; 1022170;   97390;   56135
SUGAR NO. 11 - ICE FUTURES U.S. ;2009.05.26; 1037468;  228226;   15488;  260390;  450152;  705618;  938768;  981495;   98699;   55972
SUGAR NO. 11 - ICE FUTURES U.S. ;2009.05.19;  996027;  212953;   15298;  250356;  436254;  675299;  899562;  940953;   96465;   55074
SUGAR NO. 11 - ICE FUTURES U.S. ;2009.05.12;  968675;  209990;   15571;  237880;  428047;  663197;  875916;  916648;   92759;   52028
SUGAR NO. 11 - ICE FUTURES U.S. ;2009.05.05;  929344;  196491;   15928;  214980;  425941;  646386;  837412;  877294;   91933;   52050
SUGAR NO. 11 - ICE FUTURES U.S. ;2009.04.28;  877967;  170906;   26894;  190109;  439055;  607281;  800070;  824285;   77896;   53682
SUGAR NO. 11 - ICE FUTURES U.S. ;2009.04.21;  875942;  163747;   36806;  183827;  455354;  596015;  802927;  816648;   73015;   59294
SUGAR NO. 11 - ICE FUTURES U.S. ;2009.04.14;  938749;  160583;   33920;  208162;  495495;  629955;  864241;  872037;   74508;   66712
SUGAR NO. 11 - ICE FUTURES U.S. ;2009.04.07;  937268;  148465;   39540;  204089;  510741;  619954;  863296;  863583;   73972;   73685
SUGAR NO. 11 - ICE FUTURES U.S. ;2009.03.31;  932159;  163154;   33482;  204928;  488658;  623003;  856740;  861413;   75419;   70746
SUGAR NO. 11 - ICE FUTURES U.S. ;2009.03.24;  931330;  165198;   16553;  211243;  476183;  634454;  852623;  862249;   78707;   69081
SUGAR NO. 11 - ICE FUTURES U.S. ;2009.03.17;  869500;  147111;   26695;  204051;  446251;  571688;  797413;  802435;   72087;   67066
SUGAR NO. 11 - ICE FUTURES U.S. ;2009.03.10;  846361;  135126;   28043;  205290;  433696;  546913;  774112;  780245;   72249;   66115
SUGAR NO. 11 - ICE FUTURES U.S. ;2009.03.03;  841474;  144923;   30075;  200372;  421805;  550670;  767101;  781117;   74373;   60357
SUGAR NO. 11 - ICE FUTURES U.S. ;2009.02.24;  853180;  151688;   27715;  191771;  433711;  576631;  777170;  796117;   76010;   57062
SUGAR NO. 11 - ICE FUTURES U.S. ;2009.02.17;  886498;  155400;   25400;  195215;  444411;  590515;  795026;  811129;   91472;   75369
SUGAR NO. 11 - ICE FUTURES U.S. ;2009.02.10;  965069;  151028;   27282;  259669;  459687;  608262;  870384;  895212;   94685;   69857
SUGAR NO. 11 - ICE FUTURES U.S. ;2009.02.03;  976556;  141284;   35242;  269869;  481499;  604418;  892652;  909529;   83904;   67027
SUGAR NO. 11 - ICE FUTURES U.S. ;2009.01.27;  981814;  140791;   35785;  270431;  488043;  612505;  899265;  918721;   82549;   63092
SUGAR NO. 11 - ICE FUTURES U.S. ;2009.01.20;  970670;  135841;   42975;  263330;  496049;  602269;  895220;  908573;   75450;   62097
SUGAR NO. 11 - ICE FUTURES U.S. ;2009.01.13;  965727;  124220;   47245;  261451;  508619;  591353;  894290;  900049;   71438;   65678
SUGAR NO. 11 - ICE FUTURES U.S. ;2009.01.06;  980181;  120514;   46608;  265001;  519123;  607106;  904639;  918715;   75543;   61466
SUGAR NO. 11 - ICE FUTURES U.S. ;2008.12.30;  951269;  111601;   60856;  253576;  520108;  569714;  885285;  884146;   65984;   67123
SUGAR NO. 11 - ICE FUTURES U.S. ;2008.12.22;  954964;  111539;   60579;  250791;  526737;  574822;  889068;  886192;   65896;   68772
SUGAR NO. 11 - ICE FUTURES U.S. ;2008.12.16;  938447;  112269;   51802;  244285;  516911;  582535;  873464;  878622;   64983;   59825
SUGAR NO. 11 - ICE FUTURES U.S. ;2008.12.09;  960745;  112411;   65664;  248763;  523575;  568936;  884748;  883363;   75997;   77383
SUGAR NO. 11 - ICE FUTURES U.S. ;2008.12.02;  938038;  119742;   44152;  239988;  504546;  583456;  864276;  867597;   73762;   70441
SUGAR NO. 11 - ICE FUTURES U.S. ;2008.11.25;  933085;  117332;   46212;  242619;  500835;  577485;  860786;  866316;   72299;   66769
SUGAR NO. 11 - ICE FUTURES U.S. ;2008.11.18;  935967;  116391;   52043;  242129;  508161;  571039;  866681;  865212;   69287;   70756
SUGAR NO. 11 - ICE FUTURES U.S. ;2008.11.11;  957776;  121291;   55679;  250428;  518346;  585119;  890065;  891226;   67711;   66550
SUGAR NO. 11 - ICE FUTURES U.S. ;2008.11.04;  950267;  125929;   49562;  247736;  508653;  589193;  882318;  886491;   67949;   63776
SUGAR NO. 11 - ICE FUTURES U.S. ;2008.10.28;  936270;  118404;   66254;  239749;  515748;  563582;  873900;  869585;   62370;   66685
SUGAR NO. 11 - ICE FUTURES U.S. ;2008.10.21;  947826;  119718;   67494;  239575;  524651;  573410;  883944;  880480;   63882;   67346
SUGAR NO. 11 - ICE FUTURES U.S. ;2008.10.14;  966314;  121432;   65568;  243859;  533752;  586879;  899043;  896306;   67272;   70008
SUGAR NO. 11 - ICE FUTURES U.S. ;2008.10.07;  957222;  123242;   63097;  236395;  531286;  590677;  890922;  890169;   66299;   67053
SUGAR NO. 11 - ICE FUTURES U.S. ;2008.09.30;  979169;  143818;   51469;  223391;  542784;  642877;  909992;  917737;   69177;   61432
SUGAR NO. 11 - ICE FUTURES U.S. ;2008.09.23; 1001371;  145855;   49927;  213309;  558724;  670529;  917888;  933765;   83483;   67606
SUGAR NO. 11 - ICE FUTURES U.S. ;2008.09.16; 1041011;  155304;   59444;  211810;  580047;  687262;  947161;  958517;   93850;   82494
SUGAR NO. 11 - ICE FUTURES U.S. ;2008.09.09; 1142849;  164441;   53708;  266998;  611353;  743108; 1042792; 1063814;  100057;   79035
SUGAR NO. 11 - ICE FUTURES U.S. ;2008.09.02; 1160354;  181617;   56758;  262435;  603461;  763522; 1047512; 1082715;  112841;   77639
SUGAR NO. 11 - ICE FUTURES U.S. ;2008.08.26; 1176901;  210213;   54319;  272213;  582472;  783210; 1064898; 1109742;  112003;   67160
SUGAR NO. 11 - ICE FUTURES U.S. ;2008.08.19; 1154085;  193326;   57697;  267722;  585586;  757806; 1046634; 1083225;  107452;   70860
SUGAR NO. 11 - ICE FUTURES U.S. ;2008.08.12; 1134983;  195256;   55925;  263617;  575043;  752029; 1033916; 1071571;  101066;   63412
SUGAR NO. 11 - ICE FUTURES U.S. ;2008.08.05; 1152172;  190602;   59462;  273951;  583093;  752068; 1047647; 1085481;  104526;   66691
SUGAR NO. 11 - ICE FUTURES U.S. ;2008.07.29; 1117624;  186279;   75136;  254973;  587767;  725426; 1029020; 1055536;   88605;   62089
SUGAR NO. 11 - ICE FUTURES U.S. ;2008.07.22; 1123635;  189000;   71639;  249788;  589538;  732022; 1028326; 1053449;   95310;   70186
SUGAR NO. 11 - ICE FUTURES U.S. ;2008.07.15; 1156998;  208107;   69085;  250525;  584094;  772647; 1042726; 1092256;  114272;   64741
SUGAR NO. 11 - ICE FUTURES U.S. ;2008.07.08; 1161788;  223916;   74961;  243560;  594515;  789354; 1061991; 1107874;   99797;   53914
SUGAR NO. 11 - ICE FUTURES U.S. ;2008.07.01; 1167222;  219893;   79147;  233992;  604934;  792260; 1058819; 1105399;  108404;   61823
SUGAR NO. 11 - ICE FUTURES U.S. ;2008.06.24; 1154898;  209525;   77707;  223789;  623458;  790051; 1056772; 1091547;   98126;   63351
SUGAR NO. 11 - ICE FUTURES U.S. ;2008.06.17; 1168954;  208796;   86202;  218315;  646714;  797741; 1073825; 1102259;   95129;   66695
SUGAR NO. 11 - ICE FUTURES U.S. ;2008.06.10; 1296642;  196460;   92941;  277690;  735501;  855908; 1209651; 1226539;   86991;   70103
SUGAR NO. 11 - ICE FUTURES U.S. ;2008.06.03; 1276041;  197860;   93462;  265918;  728992;  851866; 1192770; 1211246;   83271;   64795
SUGAR NO. 11 - ICE FUTURES U.S. ;2008.05.27; 1266144;  203439;   78165;  256939;  701909;  844310; 1162287; 1179413;  103858;   86731
SUGAR NO. 11 - ICE FUTURES U.S. ;2008.05.20; 1247111;  211366;   74109;  247563;  688033;  855153; 1146962; 1176825;  100149;   70285
SUGAR NO. 11 - ICE FUTURES U.S. ;2008.05.13; 1238919;  216981;   72124;  243380;  676375;  854986; 1136736; 1170490;  102183;   68429
SUGAR NO. 11 - ICE FUTURES U.S. ;2008.05.06; 1250389;  218577;   70389;  259102;  669383;  859718; 1147062; 1189209;  103327;   61180
SUGAR NO. 11 - ICE FUTURES U.S. ;2008.04.29; 1251166;  224845;   57945;  256036;  670944;  879268; 1151825; 1193249;   99341;   57917
SUGAR NO. 11 - ICE FUTURES U.S. ;2008.04.22; 1272077;  229103;   60158;  254455;  668566;  898111; 1152124; 1212724;  119953;   59353
SUGAR NO. 11 - ICE FUTURES U.S. ;2008.04.15; 1265996;  227445;   60968;  254248;  658058;  889955; 1139750; 1205171;  126246;   60825
SUGAR NO. 11 - ICE FUTURES U.S. ;2008.04.08; 1332630;  213343;   55254;  310826;  705376;  918808; 1229544; 1284887;  103086;   47743
SUGAR NO. 11 - ICE FUTURES U.S. ;2008.04.01; 1330378;  205580;   47734;  320134;  704290;  908126; 1230005; 1275994;  100373;   54384
SUGAR NO. 11 - ICE FUTURES U.S. ;2008.03.25; 1332433;  217157;   45919;  333666;  679636;  903739; 1230459; 1283325;  101974;   49109
SUGAR NO. 11 - ICE FUTURES U.S. ;2008.03.18; 1373609;  221077;   52115;  339983;  688390;  923861; 1249450; 1315959;  124159;   57650
SUGAR NO. 11 - ICE FUTURES U.S. ;2008.03.11; 1404018;  245132;   50516;  340565;  681022;  954167; 1266719; 1345248;  137299;   58770
SUGAR NO. 11 - ICE FUTURES U.S. ;2008.03.04; 1429622;  270547;   54050;  343202;  669646;  970750; 1283395; 1368002;  146227;   61620
SUGAR NO. 11 - ICE FUTURES U.S. ;2008.02.26; 1442222;  271272;   56653;  322908;  691811;  995021; 1285991; 1374581;  156232;   67641
SUGAR NO. 11 - ICE FUTURES U.S. ;2008.02.19; 1364541;  270793;   64134;  290628;  652271;  949041; 1213692; 1303804;  150849;   60737
SUGAR NO. 11 - ICE FUTURES U.S. ;2008.02.12; 1291206;  270262;   74356;  244609;  644081;  919594; 1158952; 1238559;  132254;   52647
SUGAR NO. 11 - ICE FUTURES U.S. ;2008.02.05; 1492736;  251269;   82675;  349091;  722343;  969279; 1322703; 1401045;  170033;   91691
SUGAR NO. 11 - ICE FUTURES U.S. ;2008.01.29; 1481883;  243732;   85625;  347407;  733092;  966807; 1324231; 1399839;  157652;   82044
SUGAR NO. 11 - ICE FUTURES U.S. ;2008.01.22; 1535068;  250036;   91014;  347355;  768760;  993962; 1366152; 1432331;  168916;  102737
SUGAR NO. 11 - ICE FUTURES U.S. ;2008.01.15; 1533305;  280480;  104343;  312777;  774204; 1034436; 1367461; 1451556;  165844;   81749
SUGAR NO. 11 - ICE FUTURES U.S. ;2008.01.08; 1409581;  263447;   96713;  300517;  694631;  944281; 1258595; 1341511;  150986;   68071
SUGAR NO. 11 - ICE FUTURES U.S. ;2007.12.31; 1253424;  249200;  100822;  240782;  634258;  848189; 1124239; 1189793;  129184;   63631
SUGAR NO. 11 - ICE FUTURES U.S. ;2007.12.24; 1185335;  232457;  102258;  228728;  601144;  792549; 1062329; 1123536;  123006;   61799
SUGAR NO. 11 - ICE FUTURES U.S. ;2007.12.18; 1126297;  225102;  113632;  198192;  581533;  743077; 1004826; 1054901;  121471;   71396
SUGAR NO. 11 - ICE FUTURES U.S. ;2007.12.11; 1083984;  194131;  117385;  197347;  578471;  694492;  969949; 1009224;  114035;   74760
SUGAR NO. 11 - ICE FUTURES U.S. ;2007.12.04; 1054511;  169524;  134816;  186230;  601726;  655702;  957480;  976748;   97031;   77762
SUGAR NO. 11 - ICE FUTURES U.S. ;2007.11.27; 1034854;  167315;  150329;  184540;  587562;  626205;  939418;  961075;   95436;   73779
SUGAR NO. 11 - ICE FUTURES U.S. ;2007.11.20; 1030895;  169533;  132461;  184464;  576293;  637821;  930290;  954745;  100605;   76149
SUGAR NO. 11 - ICE FUTURES U.S. ;2007.11.13; 1024234;  167921;  114346;  174978;  581604;  670140;  924503;  959464;   99731;   64770
SUGAR NO. 11 - ICE FUTURES U.S. ;2007.11.06; 1026771;  166825;   97220;  176737;  580441;  686381;  924003;  960338;  102768;   66433
SUGAR NO. 11 - ICE FUTURES U.S. ;2007.10.30;  988992;  168385;   96423;  169118;  537880;  634345;  875383;  899887;  113608;   89105
SUGAR NO. 11 - ICE FUTURES U.S. ;2007.10.23;  950044;  164076;  102969;  171847;  514998;  612109;  850920;  886925;   99124;   63119
SUGAR NO. 11 - ICE FUTURES U.S. ;2007.10.16;  882113;  155504;  102579;  150790;  481813;  566550;  788107;  819919;   94007;   62194
SUGAR NO. 11 - ICE FUTURES U.S. ;2007.10.09;  807356;  147952;  100594;  117659;  459698;  524561;  725309;  742814;   82047;   64542
SUGAR NO. 11 - ICE FUTURES U.S. ;2007.10.02;  807474;  151351;  104018;  117224;  452265;  525651;  720839;  746893;   86634;   60581
SUGAR NO. 11 - ICE FUTURES U.S. ;2007.09.25;  824027;  147469;  107346;  120501;  461958;  528410;  729928;  756258;   94099;   67769
SUGAR NO. 11 - ICE FUTURES U.S. ;2007.09.18;  789201;  128874;  138754;  110307;  465969;  463159;  705150;  712220;   84051;   76981
SUGAR NO. 11 - ICE FUTURES U.S. ;2007.09.11;  872886;  131574;  142717;  154979;  502360;  503333;  788913;  801029;   83973;   71856
SUGAR NO. 11 - ICE FUTURES U.S. ;2007.09.04;  877867;  134541;  130706;  164723;  499968;  517551;  799232;  812980;   78635;   64886
SUGAR NO. 11 - ICE FUTURES U.S. ;2011.07.12;  845922;  212816;   32854;  192965;  344358;  554778;  750139;  780596;   95783;   65326
SUGAR NO. 11 - ICE FUTURES U.S. ;2011.07.05;  797192;  212114;   40690;  162865;  333378;  533302;  708356;  736857;   88836;   60335
SUGAR NO. 11 - ICE FUTURES U.S. ;2011.06.28;  785543;  202531;   38633;  148922;  348329;  535136;  699783;  722692;   85760;   62851
SUGAR NO. 11 - ICE FUTURES U.S. ;2011.06.21;  781878;  201941;   40348;  133110;  364575;  540332;  699626;  713790;   82252;   68088
SUGAR NO. 11 - ICE FUTURES U.S. ;2011.06.14;  838076;  182036;   39140;  168101;  410498;  565482;  760635;  772723;   77441;   65353
SUGAR NO. 11 - ICE FUTURES U.S. ;2011.06.07;  822537;  167376;   42503;  164223;  407669;  543795;  739268;  750521;   83269;   72016
SUGAR NO. 11 - ICE FUTURES U.S. ;2011.05.31;  789907;  164302;   46313;  166228;  387081;  507143;  717612;  719684;   72295;   70223
SUGAR NO. 11 - ICE FUTURES U.S. ;2011.05.24;  759727;  159940;   44031;  155933;  376781;  484460;  692654;  684424;   67073;   75304
SUGAR NO. 11 - ICE FUTURES U.S. ;2011.05.17;  756592;  168467;   52901;  154814;  370323;  476374;  693605;  684089;   62988;   72503
SUGAR NO. 11 - ICE FUTURES U.S. ;2011.05.10;  759049;  173066;   46245;  149991;  369806;  492546;  692862;  688782;   66187;   70267
SUGAR NO. 11 - ICE FUTURES U.S. ;2011.05.03;  733492;  171099;   47970;  142068;  356734;  475095;  669901;  665133;   63591;   68359
SUGAR NO. 11 - ICE FUTURES U.S. ;2011.04.26;  753555;  159549;   40687;  135264;  391399;  511722;  686212;  687672;   67343;   65883
SUGAR NO. 11 - ICE FUTURES U.S. ;2011.04.19;  769869;  160093;   39704;  139331;  400644;  522802;  700068;  701838;   69800;   68031
SUGAR NO. 11 - ICE FUTURES U.S. ;2011.04.12;  854752;  169437;   27481;  208679;  400801;  547196;  778917;  783357;   75834;   71395
SUGAR NO. 11 - ICE FUTURES U.S. ;2011.04.05;  852919;  172445;   14541;  217877;  381050;  555343;  771372;  787762;   81547;   65158
SUGAR NO. 11 - ICE FUTURES U.S. ;2011.03.29;  813737;  167510;   15594;  196719;  375050;  543725;  739280;  756037;   74458;   57700
SUGAR NO. 11 - ICE FUTURES U.S. ;2011.03.22;  810211;  161726;   15869;  199819;  376475;  541225;  738020;  756914;   72191;   53297
SUGAR NO. 11 - ICE FUTURES U.S. ;2011.03.15;  822825;  175850;   16186;  202329;  369947;  545529;  748127;  764044;   74698;   58781
SUGAR NO. 11 - ICE FUTURES U.S. ;2011.03.08;  856178;  199371;   11488;  211890;  362799;  579508;  774060;  802886;   82119;   53292
SUGAR NO. 11 - ICE FUTURES U.S. ;2011.03.01;  834192;  174809;   10860;  212820;  373700;  561199;  761328;  784879;   72863;   49313
SUGAR NO. 11 - ICE FUTURES U.S. ;2011.02.22;  870241;  171045;   11294;  212264;  405527;  590826;  788835;  814384;   81406;   55857
SUGAR NO. 11 - ICE FUTURES U.S. ;2011.02.15;  893334;  170610;   12560;  212803;  425086;  613921;  808498;  839284;   84836;   54050
SUGAR NO. 11 - ICE FUTURES U.S. ;2011.02.08; 1056996;  168274;    5103;  328463;  474847;  668148;  971585; 1001714;   85411;   55282
SUGAR NO. 11 - ICE FUTURES U.S. ;2011.02.01; 1069152;  177989;    5508;  341510;  456184;  667162;  975684; 1014181;   93469;   54972
SUGAR NO. 11 - ICE FUTURES U.S. ;2011.01.25; 1017632;  161864;    5032;  326652;  445202;  631833;  933719;  963517;   83914;   54115
SUGAR NO. 11 - ICE FUTURES U.S. ;2011.01.18; 1022317;  160330;    5772;  329784;  446800;  632072;  936914;  967628;   85403;   54689
SUGAR NO. 11 - ICE FUTURES U.S. ;2011.01.11; 1041236;  165528;    4029;  341347;  444902;  636926;  951777;  982301;   89459;   58935
SUGAR NO. 11 - ICE FUTURES U.S. ;2011.01.04; 1015284;  166516;    4990;  334356;  428128;  619190;  929000;  958536;   86283;   56748
SUGAR NO. 11 - ICE FUTURES U.S. ;2011.07.12;  845922;  212816;   32854;  192965;  344358;  554778;  750139;  780596;   95783;   65326
SUGAR NO. 11 - ICE FUTURES U.S. ;2011.07.05;  797192;  212114;   40690;  162865;  333378;  533302;  708356;  736857;   88836;   60335
SUGAR NO. 11 - ICE FUTURES U.S. ;2011.06.28;  785543;  202531;   38633;  148922;  348329;  535136;  699783;  722692;   85760;   62851
SUGAR NO. 11 - ICE FUTURES U.S. ;2011.06.21;  781878;  201941;   40348;  133110;  364575;  540332;  699626;  713790;   82252;   68088
SUGAR NO. 11 - ICE FUTURES U.S. ;2011.06.14;  838076;  182036;   39140;  168101;  410498;  565482;  760635;  772723;   77441;   65353
SUGAR NO. 11 - ICE FUTURES U.S. ;2011.06.07;  822537;  167376;   42503;  164223;  407669;  543795;  739268;  750521;   83269;   72016
SUGAR NO. 11 - ICE FUTURES U.S. ;2011.05.31;  789907;  164302;   46313;  166228;  387081;  507143;  717612;  719684;   72295;   70223
SUGAR NO. 11 - ICE FUTURES U.S. ;2011.05.24;  759727;  159940;   44031;  155933;  376781;  484460;  692654;  684424;   67073;   75304
SUGAR NO. 11 - ICE FUTURES U.S. ;2011.05.17;  756592;  168467;   52901;  154814;  370323;  476374;  693605;  684089;   62988;   72503
SUGAR NO. 11 - ICE FUTURES U.S. ;2011.05.10;  759049;  173066;   46245;  149991;  369806;  492546;  692862;  688782;   66187;   70267
SUGAR NO. 11 - ICE FUTURES U.S. ;2011.05.03;  733492;  171099;   47970;  142068;  356734;  475095;  669901;  665133;   63591;   68359
SUGAR NO. 11 - ICE FUTURES U.S. ;2011.04.26;  753555;  159549;   40687;  135264;  391399;  511722;  686212;  687672;   67343;   65883
SUGAR NO. 11 - ICE FUTURES U.S. ;2011.04.19;  769869;  160093;   39704;  139331;  400644;  522802;  700068;  701838;   69800;   68031
SUGAR NO. 11 - ICE FUTURES U.S. ;2011.04.12;  854752;  169437;   27481;  208679;  400801;  547196;  778917;  783357;   75834;   71395
SUGAR NO. 11 - ICE FUTURES U.S. ;2011.04.05;  852919;  172445;   14541;  217877;  381050;  555343;  771372;  787762;   81547;   65158
SUGAR NO. 11 - ICE FUTURES U.S. ;2011.03.29;  813737;  167510;   15594;  196719;  375050;  543725;  739280;  756037;   74458;   57700
SUGAR NO. 11 - ICE FUTURES U.S. ;2011.03.22;  810211;  161726;   15869;  199819;  376475;  541225;  738020;  756914;   72191;   53297
SUGAR NO. 11 - ICE FUTURES U.S. ;2011.03.15;  822825;  175850;   16186;  202329;  369947;  545529;  748127;  764044;   74698;   58781
SUGAR NO. 11 - ICE FUTURES U.S. ;2011.03.08;  856178;  199371;   11488;  211890;  362799;  579508;  774060;  802886;   82119;   53292
SUGAR NO. 11 - ICE FUTURES U.S. ;2011.03.01;  834192;  174809;   10860;  212820;  373700;  561199;  761328;  784879;   72863;   49313
SUGAR NO. 11 - ICE FUTURES U.S. ;2011.02.22;  870241;  171045;   11294;  212264;  405527;  590826;  788835;  814384;   81406;   55857
SUGAR NO. 11 - ICE FUTURES U.S. ;2011.02.15;  893334;  170610;   12560;  212803;  425086;  613921;  808498;  839284;   84836;   54050
SUGAR NO. 11 - ICE FUTURES U.S. ;2011.02.08; 1056996;  168274;    5103;  328463;  474847;  668148;  971585; 1001714;   85411;   55282
SUGAR NO. 11 - ICE FUTURES U.S. ;2011.02.01; 1069152;  177989;    5508;  341510;  456184;  667162;  975684; 1014181;   93469;   54972
SUGAR NO. 11 - ICE FUTURES U.S. ;2011.01.25; 1017632;  161864;    5032;  326652;  445202;  631833;  933719;  963517;   83914;   54115
SUGAR NO. 11 - ICE FUTURES U.S. ;2011.01.18; 1022317;  160330;    5772;  329784;  446800;  632072;  936914;  967628;   85403;   54689
SUGAR NO. 11 - ICE FUTURES U.S. ;2011.01.11; 1041236;  165528;    4029;  341347;  444902;  636926;  951777;  982301;   89459;   58935
SUGAR NO. 11 - ICE FUTURES U.S. ;2011.01.04; 1015284;  166516;    4990;  334356;  428128;  619190;  929000;  958536;   86283;   56748
SUGAR NO. 11 - ICE FUTURES U.S. ;2010.12.28; 1035783;  171944;    5980;  342452;  425500;  627968;  939896;  976400;   95887;   59383
SUGAR NO. 11 - ICE FUTURES U.S. ;2010.12.21; 1015730;  168715;    6911;  327592;  427225;  627609;  923532;  962112;   92199;   53618
SUGAR NO. 11 - ICE FUTURES U.S. ;2010.12.14;  985279;  155619;   11126;  323124;  421143;  596372;  899886;  930622;   85393;   54657
SUGAR NO. 11 - ICE FUTURES U.S. ;2010.12.07;  950513;  154464;   13721;  305408;  412429;  579909;  872300;  899039;   78213;   51474
SUGAR NO. 11 - ICE FUTURES U.S. ;2010.11.30;  936194;  154649;   13790;  301153;  409491;  572263;  865294;  887207;   70900;   48988
SUGAR NO. 11 - ICE FUTURES U.S. ;2010.11.23;  942668;  153293;   15621;  302668;  409813;  572317;  865774;  890605;   76894;   52063
SUGAR NO. 11 - ICE FUTURES U.S. ;2010.11.16;  925918;  156634;   15273;  285304;  402718;  569465;  844656;  870043;   81261;   55875
SUGAR NO. 11 - ICE FUTURES U.S. ;2010.11.09;  993202;  162282;    9685;  316747;  419838;  616353;  898867;  942785;   94335;   50417
SUGAR NO. 11 - ICE FUTURES U.S. ;2010.11.02;  948145;  170975;    5664;  273772;  412755;  617198;  857503;  896634;   90642;   51510
SUGAR NO. 11 - ICE FUTURES U.S. ;2010.10.26;  901073;  165775;    5338;  251492;  395182;  591432;  812448;  848262;   88625;   52811
SUGAR NO. 11 - ICE FUTURES U.S. ;2010.10.19;  885153;  167605;    6603;  246688;  383020;  579844;  797313;  833134;   87840;   52019
SUGAR NO. 11 - ICE FUTURES U.S. ;2010.10.12;  855149;  168890;    6672;  228339;  366664;  562374;  763894;  797385;   91254;   57763
SUGAR NO. 11 - ICE FUTURES U.S. ;2010.10.05;  799974;  168018;   13865;  189095;  356562;  540905;  713675;  743865;   86299;   56109
SUGAR NO. 11 - ICE FUTURES U.S. ;2010.09.28;  842181;  176687;   12404;  191597;  383750;  576367;  752034;  780368;   90147;   61813
SUGAR NO. 11 - ICE FUTURES U.S. ;2010.09.21;  831483;  173357;   14694;  172755;  392280;  577415;  738392;  764864;   93091;   66619
SUGAR NO. 11 - ICE FUTURES U.S. ;2010.09.14;  996801;  171275;   14383;  266784;  459251;  644071;  897310;  925238;   99491;   71563
SUGAR NO. 11 - ICE FUTURES U.S. ;2010.09.07;  917924;  160238;   12737;  245764;  423762;  605990;  829765;  864491;   88159;   53432
SUGAR NO. 11 - ICE FUTURES U.S. ;2010.08.31;  877084;  149304;   16045;  227798;  409887;  576254;  786989;  820097;   90095;   56987
SUGAR NO. 11 - ICE FUTURES U.S. ;2010.08.24;  871381;  145207;   14585;  229137;  408675;  566928;  783019;  810650;   88361;   60731
SUGAR NO. 11 - ICE FUTURES U.S. ;2010.08.17;  835440;  147860;   14322;  222693;  381679;  543362;  752233;  780377;   83208;   55063
SUGAR NO. 11 - ICE FUTURES U.S. ;2010.08.10;  815988;  136376;   12929;  212361;  382950;  531900;  731687;  757190;   84301;   58798
SUGAR NO. 11 - ICE FUTURES U.S. ;2010.08.03;  813510;  139825;   15636;  204995;  386863;  533702;  731684;  754333;   81827;   59177
SUGAR NO. 11 - ICE FUTURES U.S. ;2010.07.27;  797861;  136454;   15847;  204217;  374863;  516867;  715534;  736931;   82328;   60930
SUGAR NO. 11 - ICE FUTURES U.S. ;2010.07.20;  762507;  134828;   17435;  196800;  360550;  492331;  692178;  706566;   70330;   55941
SUGAR NO. 11 - ICE FUTURES U.S. ;2010.07.13;  750225;  129717;   15620;  187993;  364133;  490031;  681843;  693644;   68382;   56581
SUGAR NO. 11 - ICE FUTURES U.S. ;2010.07.06;  722203;  132624;   16895;  176967;  354508;  478238;  664098;  672100;   58105;   50103
SUGAR NO. 11 - ICE FUTURES U.S. ;2010.06.29;  719854;  145480;   25979;  161467;  352227;  478215;  659174;  665661;   60680;   54193
SUGAR NO. 11 - ICE FUTURES U.S. ;2010.06.22;  755125;  145523;   20288;  161682;  381844;  515186;  689050;  697156;   66076;   57969
SUGAR NO. 11 - ICE FUTURES U.S. ;2010.06.15;  789449;  150408;   23687;  172295;  395427;  530300;  718129;  726282;   71319;   63167
SUGAR NO. 11 - ICE FUTURES U.S. ;2010.06.08;  918717;  146746;   34639;  251276;  445046;  570357;  843067;  856272;   75649;   62444
SUGAR NO. 11 - ICE FUTURES U.S. ;2010.06.01;  903800;  154654;   37734;  250016;  421644;  548182;  826314;  835932;   77486;   67868
SUGAR NO. 11 - ICE FUTURES U.S. ;2010.05.25;  899153;  158419;   35826;  244430;  419350;  551952;  822198;  832208;   76955;   66945
SUGAR NO. 11 - ICE FUTURES U.S. ;2010.05.18;  879102;  157101;   43190;  225816;  411284;  537728;  794200;  806734;   84901;   72368
SUGAR NO. 11 - ICE FUTURES U.S. ;2010.05.11;  859421;  156949;   41244;  217114;  400974;  534699;  775037;  793057;   84384;   66364
SUGAR NO. 11 - ICE FUTURES U.S. ;2010.05.04;  826898;  161644;   41353;  203713;  386470;  519856;  751828;  764921;   75071;   61977
SUGAR NO. 11 - ICE FUTURES U.S. ;2010.04.27;  833921;  160364;   39343;  190093;  414677;  550298;  765134;  779734;   68787;   54187
SUGAR NO. 11 - ICE FUTURES U.S. ;2010.04.20;  845478;  168325;   31911;  186165;  423461;  569868;  777952;  787945;   67526;   57533
SUGAR NO. 11 - ICE FUTURES U.S. ;2010.04.13;  985537;  168883;   23218;  284323;  466445;  626710;  919652;  934252;   65886;   51285
SUGAR NO. 11 - ICE FUTURES U.S. ;2010.04.06;  999871;  168153;   28588;  281091;  479665;  635065;  928909;  944744;   70962;   55128
SUGAR NO. 11 - ICE FUTURES U.S. ;2010.03.30; 1002594;  176732;   25960;  278184;  483798;  642542;  938715;  946687;   63879;   55907
SUGAR NO. 11 - ICE FUTURES U.S. ;2010.03.23; 1002939;  173785;   29911;  254155;  506382;  660845;  934322;  944911;   68617;   58028
SUGAR NO. 11 - ICE FUTURES U.S. ;2010.03.16; 1029086;  172919;   22005;  247695;  543375;  706815;  963990;  976515;   65096;   52571
SUGAR NO. 11 - ICE FUTURES U.S. ;2010.03.09;  994986;  162439;   22549;  230120;  534349;  690754;  926907;  943423;   68079;   51563
SUGAR NO. 11 - ICE FUTURES U.S. ;2010.03.02;  989986;  162710;    9492;  240454;  524393;  699871;  927557;  949817;   62430;   40170
SUGAR NO. 11 - ICE FUTURES U.S. ;2010.02.23; 1008982;  177397;   15353;  228018;  539111;  724714;  944526;  968085;   64456;   40897
SUGAR NO. 11 - ICE FUTURES U.S. ;2010.02.16; 1088715;  191499;   13230;  241880;  579601;  787423; 1012980; 1042533;   75735;   46182
SUGAR NO. 11 - ICE FUTURES U.S. ;2010.02.09; 1309303;  181313;   24678;  376990;  666736;  849293; 1225039; 1250961;   84264;   58342
SUGAR NO. 11 - ICE FUTURES U.S. ;2010.02.02; 1358236;  219292;   24589;  388901;  654963;  886969; 1263156; 1300459;   95080;   57777
SUGAR NO. 11 - ICE FUTURES U.S. ;2010.01.26; 1321425;  213557;   24236;  380975;  628342;  858795; 1222874; 1264006;   98551;   57419
SUGAR NO. 11 - ICE FUTURES U.S. ;2010.01.19; 1313970;  212333;   22954;  397156;  599421;  835493; 1208910; 1255604;  105060;   58366
SUGAR NO. 11 - ICE FUTURES U.S. ;2010.01.12; 1292016;  203548;   18087;  389361;  600120;  829160; 1193029; 1236607;   98987;   55409
SUGAR NO. 11 - ICE FUTURES U.S. ;2010.01.05; 1298093;  199107;   18982;  383823;  616572;  843844; 1199502; 1246649;   98591;   51444
SUGAR NO. 11 - ICE FUTURES U.S. ;2009.12.29; 1269415;  199402;   20485;  370543;  598592;  826164; 1168537; 1217193;  100878;   52222
SUGAR NO. 11 - ICE FUTURES U.S. ;2009.12.22; 1270677;  203864;   16518;  373184;  591942;  827988; 1168990; 1217690;  101687;   52987
SUGAR NO. 11 - ICE FUTURES U.S. ;2009.12.15; 1227576;  190543;   14191;  354121;  581870;  804993; 1126535; 1173306;  101041;   54270
SUGAR NO. 11 - ICE FUTURES U.S. ;2009.12.08; 1154043;  164700;   21118;  328469;  581333;  755198; 1074501; 1104784;   79541;   49259
SUGAR NO. 11 - ICE FUTURES U.S. ;2009.12.01; 1157622;  159275;   17213;  334685;  583062;  760978; 1077023; 1112876;   80599;   44746
SUGAR NO. 11 - ICE FUTURES U.S. ;2009.11.24; 1151256;  153488;   22685;  338606;  579494;  742756; 1071589; 1104047;   79667;   47209
SUGAR NO. 11 - ICE FUTURES U.S. ;2009.11.17; 1160204;  151705;   20008;  350157;  579072;  744545; 1080933; 1114710;   79271;   45494
SUGAR NO. 11 - ICE FUTURES U.S. ;2009.11.09; 1159504;  152144;   15738;  354077;  575762;  742804; 1081983; 1112619;   77520;   46885
SUGAR NO. 11 - ICE FUTURES U.S. ;2009.11.03; 1199980;  172153;   11014;  360303;  584757;  775144; 1117214; 1146461;   82766;   53518
SUGAR NO. 11 - ICE FUTURES U.S. ;2009.10.27; 1165972;  175708;   12076;  337139;  575024;  766181; 1087872; 1115396;   78100;   50575
SUGAR NO. 11 - ICE FUTURES U.S. ;2009.10.20; 1180191;  184332;   14204;  338529;  577860;  775474; 1100721; 1128207;   79471;   51984
SUGAR NO. 11 - ICE FUTURES U.S. ;2009.10.13; 1154668;  179543;   21379;  331474;  576106;  737570; 1087124; 1090423;   67544;   64244
SUGAR NO. 11 - ICE FUTURES U.S. ;2009.10.06; 1162945;  197670;   14686;  329792;  561832;  776328; 1089294; 1120806;   73652;   42140
SUGAR NO. 11 - ICE FUTURES U.S. ;2009.09.29; 1183796;  200437;   12337;  331278;  568293;  789267; 1100008; 1132881;   83788;   50915
SUGAR NO. 11 - ICE FUTURES U.S. ;2009.09.22; 1179749;  188807;   18510;  322558;  597896;  786804; 1109261; 1127872;   70487;   51876
SUGAR NO. 11 - ICE FUTURES U.S. ;2009.09.15; 1190475;  181843;   23298;  320641;  600909;  793916; 1103394; 1137855;   87081;   52620
SUGAR NO. 11 - ICE FUTURES U.S. ;2009.09.08; 1340079;  185486;   25172;  397944;  668060;  856124; 1251490; 1279241;   88589;   60838
SUGAR NO. 11 - ICE FUTURES U.S. ;2009.09.01; 1392039;  194685;   16013;  428520;  665786;  886693; 1288991; 1331227;  103048;   60812
SUGAR NO. 11 - ICE FUTURES U.S. ;2009.08.25; 1317033;  196173;   14773;  400235;  619104;  844970; 1215513; 1259978;  101520;   57055
SUGAR NO. 11 - ICE FUTURES U.S. ;2009.08.18; 1299681;  199294;   11360;  395955;  600706;  832845; 1195954; 1240160;  103726;   59521
SUGAR NO. 11 - ICE FUTURES U.S. ;2009.08.11; 1283970;  201177;   18351;  364563;  611612;  839000; 1177352; 1221914;  106618;   62056
SUGAR NO. 11 - ICE FUTURES U.S. ;2009.08.04; 1139444;  225757;   12116;  296885;  516544;  770733; 1039186; 1079734;  100259;   59710
SUGAR NO. 11 - ICE FUTURES U.S. ;2009.07.28; 1091083;  216606;   10749;  279226;  497047;  743727;  992879; 1033702;   98203;   57380
SUGAR NO. 11 - ICE FUTURES U.S. ;2009.07.21; 1032516;  200598;   11723;  264968;  471812;  694220;  937377;  970911;   95138;   61604
SUGAR NO. 11 - ICE FUTURES U.S. ;2009.07.14; 1026949;  193375;   10838;  274077;  464541;  682291;  931993;  967206;   94956;   59743
SUGAR NO. 11 - ICE FUTURES U.S. ;2009.07.07; 1001126;  199932;   11003;  249744;  459859;  683995;  909535;  944742;   91591;   56384
SUGAR NO. 11 - ICE FUTURES U.S. ;2009.06.30; 1038949;  205708;   12371;  252164;  489315;  718797;  947187;  983331;   91762;   55617
SUGAR NO. 11 - ICE FUTURES U.S. ;2009.06.23; 1018956;  190268;   17567;  226304;  512348;  719376;  928921;  963247;   90035;   55708
SUGAR NO. 11 - ICE FUTURES U.S. ;2009.06.16;  990462;  178720;   17810;  228791;  499141;  684408;  906653;  931010;   83810;   59453
SUGAR NO. 11 - ICE FUTURES U.S. ;2009.06.09; 1089185;  205734;   24103;  277544;  513775;  737048;  997053; 1038694;   92133;   50491
SUGAR NO. 11 - ICE FUTURES U.S. ;2009.06.02; 1078305;  215194;   19167;  275983;  489738;  727020;  980914; 1022170;   97390;   56135
SUGAR NO. 11 - ICE FUTURES U.S. ;2009.05.26; 1037468;  228226;   15488;  260390;  450152;  705618;  938768;  981495;   98699;   55972
SUGAR NO. 11 - ICE FUTURES U.S. ;2009.05.19;  996027;  212953;   15298;  250356;  436254;  675299;  899562;  940953;   96465;   55074
SUGAR NO. 11 - ICE FUTURES U.S. ;2009.05.12;  968675;  209990;   15571;  237880;  428047;  663197;  875916;  916648;   92759;   52028
SUGAR NO. 11 - ICE FUTURES U.S. ;2009.05.05;  929344;  196491;   15928;  214980;  425941;  646386;  837412;  877294;   91933;   52050
SUGAR NO. 11 - ICE FUTURES U.S. ;2009.04.28;  877967;  170906;   26894;  190109;  439055;  607281;  800070;  824285;   77896;   53682
SUGAR NO. 11 - ICE FUTURES U.S. ;2009.04.21;  875942;  163747;   36806;  183827;  455354;  596015;  802927;  816648;   73015;   59294
SUGAR NO. 11 - ICE FUTURES U.S. ;2009.04.14;  938749;  160583;   33920;  208162;  495495;  629955;  864241;  872037;   74508;   66712
SUGAR NO. 11 - ICE FUTURES U.S. ;2009.04.07;  937268;  148465;   39540;  204089;  510741;  619954;  863296;  863583;   73972;   73685
SUGAR NO. 11 - ICE FUTURES U.S. ;2009.03.31;  932159;  163154;   33482;  204928;  488658;  623003;  856740;  861413;   75419;   70746
SUGAR NO. 11 - ICE FUTURES U.S. ;2009.03.24;  931330;  165198;   16553;  211243;  476183;  634454;  852623;  862249;   78707;   69081
SUGAR NO. 11 - ICE FUTURES U.S. ;2009.03.17;  869500;  147111;   26695;  204051;  446251;  571688;  797413;  802435;   72087;   67066
SUGAR NO. 11 - ICE FUTURES U.S. ;2009.03.10;  846361;  135126;   28043;  205290;  433696;  546913;  774112;  780245;   72249;   66115
SUGAR NO. 11 - ICE FUTURES U.S. ;2009.03.03;  841474;  144923;   30075;  200372;  421805;  550670;  767101;  781117;   74373;   60357
SUGAR NO. 11 - ICE FUTURES U.S. ;2009.02.24;  853180;  151688;   27715;  191771;  433711;  576631;  777170;  796117;   76010;   57062
SUGAR NO. 11 - ICE FUTURES U.S. ;2009.02.17;  886498;  155400;   25400;  195215;  444411;  590515;  795026;  811129;   91472;   75369
SUGAR NO. 11 - ICE FUTURES U.S. ;2009.02.10;  965069;  151028;   27282;  259669;  459687;  608262;  870384;  895212;   94685;   69857
SUGAR NO. 11 - ICE FUTURES U.S. ;2009.02.03;  976556;  141284;   35242;  269869;  481499;  604418;  892652;  909529;   83904;   67027
SUGAR NO. 11 - ICE FUTURES U.S. ;2009.01.27;  981814;  140791;   35785;  270431;  488043;  612505;  899265;  918721;   82549;   63092
SUGAR NO. 11 - ICE FUTURES U.S. ;2009.01.20;  970670;  135841;   42975;  263330;  496049;  602269;  895220;  908573;   75450;   62097
SUGAR NO. 11 - ICE FUTURES U.S. ;2009.01.13;  965727;  124220;   47245;  261451;  508619;  591353;  894290;  900049;   71438;   65678
SUGAR NO. 11 - ICE FUTURES U.S. ;2009.01.06;  980181;  120514;   46608;  265001;  519123;  607106;  904639;  918715;   75543;   61466
SUGAR NO. 11 - ICE FUTURES U.S. ;2008.12.30;  951269;  111601;   60856;  253576;  520108;  569714;  885285;  884146;   65984;   67123
SUGAR NO. 11 - ICE FUTURES U.S. ;2008.12.22;  954964;  111539;   60579;  250791;  526737;  574822;  889068;  886192;   65896;   68772
SUGAR NO. 11 - ICE FUTURES U.S. ;2008.12.16;  938447;  112269;   51802;  244285;  516911;  582535;  873464;  878622;   64983;   59825
SUGAR NO. 11 - ICE FUTURES U.S. ;2008.12.09;  960745;  112411;   65664;  248763;  523575;  568936;  884748;  883363;   75997;   77383
SUGAR NO. 11 - ICE FUTURES U.S. ;2008.12.02;  938038;  119742;   44152;  239988;  504546;  583456;  864276;  867597;   73762;   70441
SUGAR NO. 11 - ICE FUTURES U.S. ;2008.11.25;  933085;  117332;   46212;  242619;  500835;  577485;  860786;  866316;   72299;   66769
SUGAR NO. 11 - ICE FUTURES U.S. ;2008.11.18;  935967;  116391;   52043;  242129;  508161;  571039;  866681;  865212;   69287;   70756
SUGAR NO. 11 - ICE FUTURES U.S. ;2008.11.11;  957776;  121291;   55679;  250428;  518346;  585119;  890065;  891226;   67711;   66550
SUGAR NO. 11 - ICE FUTURES U.S. ;2008.11.04;  950267;  125929;   49562;  247736;  508653;  589193;  882318;  886491;   67949;   63776
SUGAR NO. 11 - ICE FUTURES U.S. ;2008.10.28;  936270;  118404;   66254;  239749;  515748;  563582;  873900;  869585;   62370;   66685
SUGAR NO. 11 - ICE FUTURES U.S. ;2008.10.21;  947826;  119718;   67494;  239575;  524651;  573410;  883944;  880480;   63882;   67346
SUGAR NO. 11 - ICE FUTURES U.S. ;2008.10.14;  966314;  121432;   65568;  243859;  533752;  586879;  899043;  896306;   67272;   70008
SUGAR NO. 11 - ICE FUTURES U.S. ;2008.10.07;  957222;  123242;   63097;  236395;  531286;  590677;  890922;  890169;   66299;   67053
SUGAR NO. 11 - ICE FUTURES U.S. ;2008.09.30;  979169;  143818;   51469;  223391;  542784;  642877;  909992;  917737;   69177;   61432
SUGAR NO. 11 - ICE FUTURES U.S. ;2008.09.23; 1001371;  145855;   49927;  213309;  558724;  670529;  917888;  933765;   83483;   67606
SUGAR NO. 11 - ICE FUTURES U.S. ;2008.09.16; 1041011;  155304;   59444;  211810;  580047;  687262;  947161;  958517;   93850;   82494
SUGAR NO. 11 - ICE FUTURES U.S. ;2008.09.09; 1142849;  164441;   53708;  266998;  611353;  743108; 1042792; 1063814;  100057;   79035
SUGAR NO. 11 - ICE FUTURES U.S. ;2008.09.02; 1160354;  181617;   56758;  262435;  603461;  763522; 1047512; 1082715;  112841;   77639
SUGAR NO. 11 - ICE FUTURES U.S. ;2008.08.26; 1176901;  210213;   54319;  272213;  582472;  783210; 1064898; 1109742;  112003;   67160
SUGAR NO. 11 - ICE FUTURES U.S. ;2008.08.19; 1154085;  193326;   57697;  267722;  585586;  757806; 1046634; 1083225;  107452;   70860
SUGAR NO. 11 - ICE FUTURES U.S. ;2008.08.12; 1134983;  195256;   55925;  263617;  575043;  752029; 1033916; 1071571;  101066;   63412
SUGAR NO. 11 - ICE FUTURES U.S. ;2008.08.05; 1152172;  190602;   59462;  273951;  583093;  752068; 1047647; 1085481;  104526;   66691
SUGAR NO. 11 - ICE FUTURES U.S. ;2008.07.29; 1117624;  186279;   75136;  254973;  587767;  725426; 1029020; 1055536;   88605;   62089
SUGAR NO. 11 - ICE FUTURES U.S. ;2008.07.22; 1123635;  189000;   71639;  249788;  589538;  732022; 1028326; 1053449;   95310;   70186
SUGAR NO. 11 - ICE FUTURES U.S. ;2008.07.15; 1156998;  208107;   69085;  250525;  584094;  772647; 1042726; 1092256;  114272;   64741
SUGAR NO. 11 - ICE FUTURES U.S. ;2008.07.08; 1161788;  223916;   74961;  243560;  594515;  789354; 1061991; 1107874;   99797;   53914
SUGAR NO. 11 - ICE FUTURES U.S. ;2008.07.01; 1167222;  219893;   79147;  233992;  604934;  792260; 1058819; 1105399;  108404;   61823
SUGAR NO. 11 - ICE FUTURES U.S. ;2008.06.24; 1154898;  209525;   77707;  223789;  623458;  790051; 1056772; 1091547;   98126;   63351
SUGAR NO. 11 - ICE FUTURES U.S. ;2008.06.17; 1168954;  208796;   86202;  218315;  646714;  797741; 1073825; 1102259;   95129;   66695
SUGAR NO. 11 - ICE FUTURES U.S. ;2008.06.10; 1296642;  196460;   92941;  277690;  735501;  855908; 1209651; 1226539;   86991;   70103
SUGAR NO. 11 - ICE FUTURES U.S. ;2008.06.03; 1276041;  197860;   93462;  265918;  728992;  851866; 1192770; 1211246;   83271;   64795
SUGAR NO. 11 - ICE FUTURES U.S. ;2008.05.27; 1266144;  203439;   78165;  256939;  701909;  844310; 1162287; 1179413;  103858;   86731
SUGAR NO. 11 - ICE FUTURES U.S. ;2008.05.20; 1247111;  211366;   74109;  247563;  688033;  855153; 1146962; 1176825;  100149;   70285
SUGAR NO. 11 - ICE FUTURES U.S. ;2008.05.13; 1238919;  216981;   72124;  243380;  676375;  854986; 1136736; 1170490;  102183;   68429
SUGAR NO. 11 - ICE FUTURES U.S. ;2008.05.06; 1250389;  218577;   70389;  259102;  669383;  859718; 1147062; 1189209;  103327;   61180
SUGAR NO. 11 - ICE FUTURES U.S. ;2008.04.29; 1251166;  224845;   57945;  256036;  670944;  879268; 1151825; 1193249;   99341;   57917
SUGAR NO. 11 - ICE FUTURES U.S. ;2008.04.22; 1272077;  229103;   60158;  254455;  668566;  898111; 1152124; 1212724;  119953;   59353
SUGAR NO. 11 - ICE FUTURES U.S. ;2008.04.15; 1265996;  227445;   60968;  254248;  658058;  889955; 1139750; 1205171;  126246;   60825
SUGAR NO. 11 - ICE FUTURES U.S. ;2008.04.08; 1332630;  213343;   55254;  310826;  705376;  918808; 1229544; 1284887;  103086;   47743
SUGAR NO. 11 - ICE FUTURES U.S. ;2008.04.01; 1330378;  205580;   47734;  320134;  704290;  908126; 1230005; 1275994;  100373;   54384
SUGAR NO. 11 - ICE FUTURES U.S. ;2008.03.25; 1332433;  217157;   45919;  333666;  679636;  903739; 1230459; 1283325;  101974;   49109
SUGAR NO. 11 - ICE FUTURES U.S. ;2008.03.18; 1373609;  221077;   52115;  339983;  688390;  923861; 1249450; 1315959;  124159;   57650
SUGAR NO. 11 - ICE FUTURES U.S. ;2008.03.11; 1404018;  245132;   50516;  340565;  681022;  954167; 1266719; 1345248;  137299;   58770
SUGAR NO. 11 - ICE FUTURES U.S. ;2008.03.04; 1429622;  270547;   54050;  343202;  669646;  970750; 1283395; 1368002;  146227;   61620
SUGAR NO. 11 - ICE FUTURES U.S. ;2008.02.26; 1442222;  271272;   56653;  322908;  691811;  995021; 1285991; 1374581;  156232;   67641
SUGAR NO. 11 - ICE FUTURES U.S. ;2008.02.19; 1364541;  270793;   64134;  290628;  652271;  949041; 1213692; 1303804;  150849;   60737
SUGAR NO. 11 - ICE FUTURES U.S. ;2008.02.12; 1291206;  270262;   74356;  244609;  644081;  919594; 1158952; 1238559;  132254;   52647
SUGAR NO. 11 - ICE FUTURES U.S. ;2008.02.05; 1492736;  251269;   82675;  349091;  722343;  969279; 1322703; 1401045;  170033;   91691
SUGAR NO. 11 - ICE FUTURES U.S. ;2008.01.29; 1481883;  243732;   85625;  347407;  733092;  966807; 1324231; 1399839;  157652;   82044
SUGAR NO. 11 - ICE FUTURES U.S. ;2008.01.22; 1535068;  250036;   91014;  347355;  768760;  993962; 1366152; 1432331;  168916;  102737
SUGAR NO. 11 - ICE FUTURES U.S. ;2008.01.15; 1533305;  280480;  104343;  312777;  774204; 1034436; 1367461; 1451556;  165844;   81749
SUGAR NO. 11 - ICE FUTURES U.S. ;2008.01.08; 1409581;  263447;   96713;  300517;  694631;  944281; 1258595; 1341511;  150986;   68071
SUGAR NO. 11 - ICE FUTURES U.S. ;2007.12.31; 1253424;  249200;  100822;  240782;  634258;  848189; 1124239; 1189793;  129184;   63631
SUGAR NO. 11 - ICE FUTURES U.S. ;2007.12.24; 1185335;  232457;  102258;  228728;  601144;  792549; 1062329; 1123536;  123006;   61799
SUGAR NO. 11 - ICE FUTURES U.S. ;2007.12.18; 1126297;  225102;  113632;  198192;  581533;  743077; 1004826; 1054901;  121471;   71396
SUGAR NO. 11 - ICE FUTURES U.S. ;2007.12.11; 1083984;  194131;  117385;  197347;  578471;  694492;  969949; 1009224;  114035;   74760
SUGAR NO. 11 - ICE FUTURES U.S. ;2007.12.04; 1054511;  169524;  134816;  186230;  601726;  655702;  957480;  976748;   97031;   77762
SUGAR NO. 11 - ICE FUTURES U.S. ;2007.11.27; 1034854;  167315;  150329;  184540;  587562;  626205;  939418;  961075;   95436;   73779
SUGAR NO. 11 - ICE FUTURES U.S. ;2007.11.20; 1030895;  169533;  132461;  184464;  576293;  637821;  930290;  954745;  100605;   76149
SUGAR NO. 11 - ICE FUTURES U.S. ;2007.11.13; 1024234;  167921;  114346;  174978;  581604;  670140;  924503;  959464;   99731;   64770
SUGAR NO. 11 - ICE FUTURES U.S. ;2007.11.06; 1026771;  166825;   97220;  176737;  580441;  686381;  924003;  960338;  102768;   66433
SUGAR NO. 11 - ICE FUTURES U.S. ;2007.10.30;  988992;  168385;   96423;  169118;  537880;  634345;  875383;  899887;  113608;   89105
SUGAR NO. 11 - ICE FUTURES U.S. ;2007.10.23;  950044;  164076;  102969;  171847;  514998;  612109;  850920;  886925;   99124;   63119
SUGAR NO. 11 - ICE FUTURES U.S. ;2007.10.16;  882113;  155504;  102579;  150790;  481813;  566550;  788107;  819919;   94007;   62194
SUGAR NO. 11 - ICE FUTURES U.S. ;2007.10.09;  807356;  147952;  100594;  117659;  459698;  524561;  725309;  742814;   82047;   64542
SUGAR NO. 11 - ICE FUTURES U.S. ;2007.10.02;  807474;  151351;  104018;  117224;  452265;  525651;  720839;  746893;   86634;   60581
SUGAR NO. 11 - ICE FUTURES U.S. ;2007.09.25;  824027;  147469;  107346;  120501;  461958;  528410;  729928;  756258;   94099;   67769
SUGAR NO. 11 - ICE FUTURES U.S. ;2007.09.18;  789201;  128874;  138754;  110307;  465969;  463159;  705150;  712220;   84051;   76981
SUGAR NO. 11 - ICE FUTURES U.S. ;2007.09.11;  872886;  131574;  142717;  154979;  502360;  503333;  788913;  801029;   83973;   71856
SUGAR NO. 11 - ICE FUTURES U.S. ;2007.09.04;  877867;  134541;  130706;  164723;  499968;  517551;  799232;  812980;   78635;   64886
SUGAR NO. 11 - ICE FUTURES U.S. ;2011.07.12;  845922;  212816;   32854;  192965;  344358;  554778;  750139;  780596;   95783;   65326
