MT BELVIEU ETHANE 5 DEC SWAP - NEW YORK MERCANTILE EXCHANGE ;2010.04.20;   18389;       0;     280;      25;   17401;   17884;   17426;   18189;     963;     200
MT BELVIEU ETHANE 5 DEC SWAP - NEW YORK MERCANTILE EXCHANGE ;2010.04.13;   17999;       0;     150;      25;   17101;   17624;   17126;   17799;     873;     200
MT BELVIEU ETHANE 5 DEC SWAP - NEW YORK MERCANTILE EXCHANGE ;2010.04.06;   17833;       0;     270;      25;   16960;   17338;   16985;   17633;     848;     200
MT BELVIEU ETHANE 5 DEC SWAP - NEW YORK MERCANTILE EXCHANGE ;2010.03.30;   18752;       0;     295;      25;   17724;   18232;   17749;   18552;    1003;     200
MT BELVIEU ETHANE 5 DEC SWAP - NEW YORK MERCANTILE EXCHANGE ;2010.03.23;   17856;       0;     280;      40;   16813;   17336;   16853;   17656;    1003;     200
MT BELVIEU ETHANE 5 DEC SWAP - NEW YORK MERCANTILE EXCHANGE ;2010.03.16;   18033;       0;     280;      40;   17020;   17518;   17060;   17838;     973;     195
MT BELVIEU ETHANE 5 DEC SWAP - NEW YORK MERCANTILE EXCHANGE ;2010.03.09;   17219;     110;     270;      35;   16181;   16764;   16326;   17069;     893;     150
MT BELVIEU ETHANE 5 DEC SWAP - NEW YORK MERCANTILE EXCHANGE ;2010.03.02;   16528;     140;     270;      25;   15500;   16083;   15665;   16378;     863;     150
MT BELVIEU ETHANE 5 DEC SWAP - NEW YORK MERCANTILE EXCHANGE ;2010.02.23;   17851;     135;     270;      25;   16538;   17556;   16698;   17851;    1153;       0
MT BELVIEU ETHANE 5 DEC SWAP - NEW YORK MERCANTILE EXCHANGE ;2010.02.16;   16684;     135;     270;      25;   15556;   16389;   15716;   16684;     968;       0
MT BELVIEU ETHANE 5 DEC SWAP - NEW YORK MERCANTILE EXCHANGE ;2010.02.09;   15900;      45;       0;      25;   15205;   15860;   15275;   15885;     625;      15
MT BELVIEU ETHANE 5 DEC SWAP - NEW YORK MERCANTILE EXCHANGE ;2010.02.02;   15975;      45;       0;      25;   15330;   15950;   15400;   15975;     575;       0
MT BELVIEU ETHANE 5 DEC SWAP - NEW YORK MERCANTILE EXCHANGE ;2010.01.26;   16765;      25;       0;       0;   15880;   16765;   15905;   16765;     860;       0
MT BELVIEU ETHANE 5 DEC SWAP - NEW YORK MERCANTILE EXCHANGE ;2010.01.19;   16506;       0;       0;       0;   15766;   16506;   15766;   16506;     740;       0
MT BELVIEU ETHANE 5 DEC SWAP - NEW YORK MERCANTILE EXCHANGE ;2010.01.12;   15328;       0;       0;       0;   14838;   15328;   14838;   15328;     490;       0
MT BELVIEU ETHANE 5 DEC SWAP - NEW YORK MERCANTILE EXCHANGE ;2009.12.01;   20754;       0;     310;       0;   14320;   13132;   14320;   13442;    6434;    7312
MT BELVIEU ETHANE 5 DEC SWAP - NEW YORK MERCANTILE EXCHANGE ;2009.11.24;   10249;       0;     285;      25;    9985;    9879;   10010;   10189;     239;      60
MT BELVIEU ETHANE 5 DEC SWAP - NEW YORK MERCANTILE EXCHANGE ;2009.11.17;    8705;       0;     285;      25;    8391;    8335;    8416;    8645;     289;      60
MT BELVIEU ETHANE 5 DEC SWAP - NEW YORK MERCANTILE EXCHANGE ;2009.11.09;    7079;       0;     285;      25;    6620;    6739;    6645;    7049;     434;      30
MT BELVIEU ETHANE 5 DEC SWAP - NEW YORK MERCANTILE EXCHANGE ;2010.04.20;   18389;       0;     280;      25;   17401;   17884;   17426;   18189;     963;     200
MT BELVIEU ETHANE 5 DEC SWAP - NEW YORK MERCANTILE EXCHANGE ;2010.04.13;   17999;       0;     150;      25;   17101;   17624;   17126;   17799;     873;     200
MT BELVIEU ETHANE 5 DEC SWAP - NEW YORK MERCANTILE EXCHANGE ;2010.04.06;   17833;       0;     270;      25;   16960;   17338;   16985;   17633;     848;     200
MT BELVIEU ETHANE 5 DEC SWAP - NEW YORK MERCANTILE EXCHANGE ;2010.03.30;   18752;       0;     295;      25;   17724;   18232;   17749;   18552;    1003;     200
MT BELVIEU ETHANE 5 DEC SWAP - NEW YORK MERCANTILE EXCHANGE ;2010.03.23;   17856;       0;     280;      40;   16813;   17336;   16853;   17656;    1003;     200
MT BELVIEU ETHANE 5 DEC SWAP - NEW YORK MERCANTILE EXCHANGE ;2010.03.16;   18033;       0;     280;      40;   17020;   17518;   17060;   17838;     973;     195
MT BELVIEU ETHANE 5 DEC SWAP - NEW YORK MERCANTILE EXCHANGE ;2010.03.09;   17219;     110;     270;      35;   16181;   16764;   16326;   17069;     893;     150
MT BELVIEU ETHANE 5 DEC SWAP - NEW YORK MERCANTILE EXCHANGE ;2010.03.02;   16528;     140;     270;      25;   15500;   16083;   15665;   16378;     863;     150
MT BELVIEU ETHANE 5 DEC SWAP - NEW YORK MERCANTILE EXCHANGE ;2010.02.23;   17851;     135;     270;      25;   16538;   17556;   16698;   17851;    1153;       0
MT BELVIEU ETHANE 5 DEC SWAP - NEW YORK MERCANTILE EXCHANGE ;2010.02.16;   16684;     135;     270;      25;   15556;   16389;   15716;   16684;     968;       0
MT BELVIEU ETHANE 5 DEC SWAP - NEW YORK MERCANTILE EXCHANGE ;2010.02.09;   15900;      45;       0;      25;   15205;   15860;   15275;   15885;     625;      15
MT BELVIEU ETHANE 5 DEC SWAP - NEW YORK MERCANTILE EXCHANGE ;2010.02.02;   15975;      45;       0;      25;   15330;   15950;   15400;   15975;     575;       0
MT BELVIEU ETHANE 5 DEC SWAP - NEW YORK MERCANTILE EXCHANGE ;2010.01.26;   16765;      25;       0;       0;   15880;   16765;   15905;   16765;     860;       0
MT BELVIEU ETHANE 5 DEC SWAP - NEW YORK MERCANTILE EXCHANGE ;2010.01.19;   16506;       0;       0;       0;   15766;   16506;   15766;   16506;     740;       0
MT BELVIEU ETHANE 5 DEC SWAP - NEW YORK MERCANTILE EXCHANGE ;2010.01.12;   15328;       0;       0;       0;   14838;   15328;   14838;   15328;     490;       0
MT BELVIEU ETHANE 5 DEC SWAP - NEW YORK MERCANTILE EXCHANGE ;2009.12.01;   20754;       0;     310;       0;   14320;   13132;   14320;   13442;    6434;    7312
MT BELVIEU ETHANE 5 DEC SWAP - NEW YORK MERCANTILE EXCHANGE ;2009.11.24;   10249;       0;     285;      25;    9985;    9879;   10010;   10189;     239;      60
MT BELVIEU ETHANE 5 DEC SWAP - NEW YORK MERCANTILE EXCHANGE ;2009.11.17;    8705;       0;     285;      25;    8391;    8335;    8416;    8645;     289;      60
MT BELVIEU ETHANE 5 DEC SWAP - NEW YORK MERCANTILE EXCHANGE ;2009.11.09;    7079;       0;     285;      25;    6620;    6739;    6645;    7049;     434;      30
MT BELVIEU ETHANE 5 DEC SWAP - NEW YORK MERCANTILE EXCHANGE ;2010.04.20;   18389;       0;     280;      25;   17401;   17884;   17426;   18189;     963;     200
MT BELVIEU ETHANE 5 DEC SWAP - NEW YORK MERCANTILE EXCHANGE ;2010.04.13;   17999;       0;     150;      25;   17101;   17624;   17126;   17799;     873;     200
MT BELVIEU ETHANE 5 DEC SWAP - NEW YORK MERCANTILE EXCHANGE ;2010.04.06;   17833;       0;     270;      25;   16960;   17338;   16985;   17633;     848;     200
MT BELVIEU ETHANE 5 DEC SWAP - NEW YORK MERCANTILE EXCHANGE ;2010.03.30;   18752;       0;     295;      25;   17724;   18232;   17749;   18552;    1003;     200
MT BELVIEU ETHANE 5 DEC SWAP - NEW YORK MERCANTILE EXCHANGE ;2010.03.23;   17856;       0;     280;      40;   16813;   17336;   16853;   17656;    1003;     200
MT BELVIEU ETHANE 5 DEC SWAP - NEW YORK MERCANTILE EXCHANGE ;2010.03.16;   18033;       0;     280;      40;   17020;   17518;   17060;   17838;     973;     195
MT BELVIEU ETHANE 5 DEC SWAP - NEW YORK MERCANTILE EXCHANGE ;2010.03.09;   17219;     110;     270;      35;   16181;   16764;   16326;   17069;     893;     150
MT BELVIEU ETHANE 5 DEC SWAP - NEW YORK MERCANTILE EXCHANGE ;2010.03.02;   16528;     140;     270;      25;   15500;   16083;   15665;   16378;     863;     150
MT BELVIEU ETHANE 5 DEC SWAP - NEW YORK MERCANTILE EXCHANGE ;2010.02.23;   17851;     135;     270;      25;   16538;   17556;   16698;   17851;    1153;       0
MT BELVIEU ETHANE 5 DEC SWAP - NEW YORK MERCANTILE EXCHANGE ;2010.02.16;   16684;     135;     270;      25;   15556;   16389;   15716;   16684;     968;       0
MT BELVIEU ETHANE 5 DEC SWAP - NEW YORK MERCANTILE EXCHANGE ;2010.02.09;   15900;      45;       0;      25;   15205;   15860;   15275;   15885;     625;      15
MT BELVIEU ETHANE 5 DEC SWAP - NEW YORK MERCANTILE EXCHANGE ;2010.02.02;   15975;      45;       0;      25;   15330;   15950;   15400;   15975;     575;       0
MT BELVIEU ETHANE 5 DEC SWAP - NEW YORK MERCANTILE EXCHANGE ;2010.01.26;   16765;      25;       0;       0;   15880;   16765;   15905;   16765;     860;       0
MT BELVIEU ETHANE 5 DEC SWAP - NEW YORK MERCANTILE EXCHANGE ;2010.01.19;   16506;       0;       0;       0;   15766;   16506;   15766;   16506;     740;       0
MT BELVIEU ETHANE 5 DEC SWAP - NEW YORK MERCANTILE EXCHANGE ;2010.01.12;   15328;       0;       0;       0;   14838;   15328;   14838;   15328;     490;       0
MT BELVIEU ETHANE 5 DEC SWAP - NEW YORK MERCANTILE EXCHANGE ;2009.12.01;   20754;       0;     310;       0;   14320;   13132;   14320;   13442;    6434;    7312
MT BELVIEU ETHANE 5 DEC SWAP - NEW YORK MERCANTILE EXCHANGE ;2009.11.24;   10249;       0;     285;      25;    9985;    9879;   10010;   10189;     239;      60
MT BELVIEU ETHANE 5 DEC SWAP - NEW YORK MERCANTILE EXCHANGE ;2009.11.17;    8705;       0;     285;      25;    8391;    8335;    8416;    8645;     289;      60
MT BELVIEU ETHANE 5 DEC SWAP - NEW YORK MERCANTILE EXCHANGE ;2009.11.09;    7079;       0;     285;      25;    6620;    6739;    6645;    7049;     434;      30
