COCOA - COFFEESUGAR AND COCOA EXCHANGE ;2003.02.14;  107397;   14401;   26008;   13290;   69264;   60409;   96956;   99707;   10441;    7690
COCOA - COFFEESUGAR AND COCOA EXCHANGE ;2003.02.11;  107761;   14611;   26315;   13117;   70709;   60999;   98437;  100431;    9324;    7331
COCOA - COFFEESUGAR AND COCOA EXCHANGE ;2003.02.04;  136133;   16143;   30534;   26977;   80381;   69139;  123501;  126650;   12632;    9483
COCOA - COFFEESUGAR AND COCOA EXCHANGE ;2003.01.28;  128353;   11247;   19914;   30301;   76216;   70241;  117764;  120456;   10589;    7897
COCOA - COFFEESUGAR AND COCOA EXCHANGE ;2003.01.21;  124760;    9485;   18162;   30132;   75318;   69220;  114935;  117514;    9825;    7246
COCOA - COFFEESUGAR AND COCOA EXCHANGE ;2003.01.14;  123971;    9394;   18423;   29505;   75451;   68390;  114350;  116318;    9622;    7654
COCOA - COFFEESUGAR AND COCOA EXCHANGE ;2003.01.07;  121887;    8353;   19306;   28957;   74293;   67183;  111602;  115446;   10284;    6441
COCOA - COFFEESUGAR AND COCOA EXCHANGE ;2002.12.31;  114605;    5109;   17944;   28296;   73539;   62539;  106944;  108779;    7660;    5825
COCOA - COFFEESUGAR AND COCOA EXCHANGE ;2002.12.23;  113171;    5477;   18795;   27327;   72362;   61697;  105166;  107820;    8006;    5352
COCOA - COFFEESUGAR AND COCOA EXCHANGE ;2002.12.17;  113815;    5726;   19431;   26700;   73026;   61024;  105453;  107156;    8362;    6659
COCOA - COFFEESUGAR AND COCOA EXCHANGE ;2002.12.10;  109637;    4747;   20972;   24344;   73169;   59270;  102259;  104586;    7378;    5051
COCOA - COFFEESUGAR AND COCOA EXCHANGE ;2002.12.03;  108358;    4496;   20534;   23941;   72773;   57565;  101210;  102041;    7148;    6317
COCOA - COFFEESUGAR AND COCOA EXCHANGE ;2002.11.26;  106186;    3211;   20176;   24062;   72326;   55623;   99599;   99861;    6587;    6324
COCOA - COFFEESUGAR AND COCOA EXCHANGE ;2002.11.19;  106312;    4657;   24904;   20210;   75470;   54845;  100336;   99958;    5976;    6354
COCOA - COFFEESUGAR AND COCOA EXCHANGE ;2002.11.12;  107719;    4460;   25111;   19828;   77635;   56182;  101924;  101122;    5795;    6597
COCOA - COFFEESUGAR AND COCOA EXCHANGE ;2002.11.05;  111724;    5192;   24106;   19834;   81054;   61705;  106081;  105645;    5644;    6079
COCOA - COFFEESUGAR AND COCOA EXCHANGE ;2002.10.29;  126852;    7145;   23878;   22616;   90505;   74022;  120266;  120517;    6586;    6335
COCOA - COFFEESUGAR AND COCOA EXCHANGE ;2002.10.22;  131487;    8506;   25030;   22379;   93311;   78041;  124196;  125449;    7291;    6038
COCOA - COFFEESUGAR AND COCOA EXCHANGE ;2002.10.15;  144260;   15817;   29075;   21798;   95507;   86451;  133122;  137325;   11139;    6936
COCOA - COFFEESUGAR AND COCOA EXCHANGE ;2002.10.08;  143799;   17667;   36131;   20647;   94928;   80031;  133242;  136809;   10557;    6990
COCOA - COFFEESUGAR AND COCOA EXCHANGE ;2002.10.01;  149373;   18044;   37204;   21826;  100191;   84054;  140060;  143084;    9313;    6289
COCOA - COFFEESUGAR AND COCOA EXCHANGE ;2002.09.24;  141199;   18018;   32034;   19718;   93926;   82447;  131662;  134199;    9538;    7000
COCOA - COFFEESUGAR AND COCOA EXCHANGE ;2002.09.17;  135663;   17899;   29277;   19549;   89194;   79846;  126643;  128672;    9020;    6991
COCOA - COFFEESUGAR AND COCOA EXCHANGE ;2002.09.10;  133425;   16695;   28971;   18155;   89713;   78776;  124563;  125902;    8862;    7523
COCOA - COFFEESUGAR AND COCOA EXCHANGE ;2002.09.03;  135011;   16885;   30075;   13612;   86893;   74938;  117390;  118626;   17621;   16385
COCOA - COFFEESUGAR AND COCOA EXCHANGE ;2002.08.27;  132125;   18435;   27138;   18029;   86868;   79735;  123331;  124902;    8794;    7222
COCOA - COFFEESUGAR AND COCOA EXCHANGE ;2002.08.20;  126789;   18297;   25234;   15895;   83872;   78225;  118064;  119353;    8725;    7435
COCOA - COFFEESUGAR AND COCOA EXCHANGE ;2002.08.13;  123382;   15453;   24221;   16126;   83091;   75583;  114670;  115930;    8712;    7452
COCOA - COFFEESUGAR AND COCOA EXCHANGE ;2002.08.06;  125613;   15531;   24264;   15717;   85220;   77717;  116468;  117698;    9146;    7915
COCOA - COFFEESUGAR AND COCOA EXCHANGE ;2002.07.30;  139660;   19073;   25282;   22558;   89634;   84629;  131266;  132469;    8394;    7191
COCOA - COFFEESUGAR AND COCOA EXCHANGE ;2002.07.23;  138810;   21556;   25449;   20432;   87531;   84939;  129519;  130820;    9292;    7990
COCOA - COFFEESUGAR AND COCOA EXCHANGE ;2002.07.16;  138587;   22573;   25279;   19473;   87319;   86305;  129365;  131057;    9222;    7530
COCOA - COFFEESUGAR AND COCOA EXCHANGE ;2002.07.09;  129305;   20781;   23853;   16362;   83626;   81990;  120769;  122205;    8537;    7100
COCOA - COFFEESUGAR AND COCOA EXCHANGE ;2002.07.02;  125082;   18411;   23159;   15411;   82963;   79835;  116785;  118404;    8297;    6677
COCOA - COFFEESUGAR AND COCOA EXCHANGE ;2002.06.25;  119119;   15551;   20862;   14872;   81522;   77467;  111945;  113201;    7175;    5919
COCOA - COFFEESUGAR AND COCOA EXCHANGE ;2002.06.18;  112152;    8246;   18991;   13815;   83163;   73508;  105223;  106314;    6929;    5838
COCOA - COFFEESUGAR AND COCOA EXCHANGE ;2002.06.11;  117545;   11346;   19594;   13828;   83443;   77004;  108617;  110427;    8928;    7118
COCOA - COFFEESUGAR AND COCOA EXCHANGE ;2002.06.04;  137744;   21717;   18684;   22852;   82927;   87802;  127495;  129338;   10249;    8405
COCOA - COFFEESUGAR AND COCOA EXCHANGE ;2002.05.28;  137391;   21890;   18516;   22258;   83917;   88811;  128065;  129586;    9325;    7804
COCOA - COFFEESUGAR AND COCOA EXCHANGE ;2002.05.21;  134911;   20890;   17892;   21991;   82623;   87558;  125504;  127442;    9407;    7470
COCOA - COFFEESUGAR AND COCOA EXCHANGE ;2002.05.14;  128177;   16397;   18647;   20984;   82467;   82289;  119848;  121920;    8329;    6257
COCOA - COFFEESUGAR AND COCOA EXCHANGE ;2002.05.07;  125023;   13561;   19662;   21189;   81500;   78016;  116250;  118867;    8772;    6156
COCOA - COFFEESUGAR AND COCOA EXCHANGE ;2002.04.30;  123178;   16598;   18483;   19317;   78458;   78668;  114373;  116468;    8805;    6710
COCOA - COFFEESUGAR AND COCOA EXCHANGE ;2003.02.14;  107397;   14401;   26008;   13290;   69264;   60409;   96956;   99707;   10441;    7690
COCOA - COFFEESUGAR AND COCOA EXCHANGE ;2003.02.11;  107761;   14611;   26315;   13117;   70709;   60999;   98437;  100431;    9324;    7331
COCOA - COFFEESUGAR AND COCOA EXCHANGE ;2003.02.04;  136133;   16143;   30534;   26977;   80381;   69139;  123501;  126650;   12632;    9483
COCOA - COFFEESUGAR AND COCOA EXCHANGE ;2003.01.28;  128353;   11247;   19914;   30301;   76216;   70241;  117764;  120456;   10589;    7897
COCOA - COFFEESUGAR AND COCOA EXCHANGE ;2003.01.21;  124760;    9485;   18162;   30132;   75318;   69220;  114935;  117514;    9825;    7246
COCOA - COFFEESUGAR AND COCOA EXCHANGE ;2003.01.14;  123971;    9394;   18423;   29505;   75451;   68390;  114350;  116318;    9622;    7654
COCOA - COFFEESUGAR AND COCOA EXCHANGE ;2003.01.07;  121887;    8353;   19306;   28957;   74293;   67183;  111602;  115446;   10284;    6441
COCOA - COFFEESUGAR AND COCOA EXCHANGE ;2002.12.31;  114605;    5109;   17944;   28296;   73539;   62539;  106944;  108779;    7660;    5825
COCOA - COFFEESUGAR AND COCOA EXCHANGE ;2002.12.23;  113171;    5477;   18795;   27327;   72362;   61697;  105166;  107820;    8006;    5352
COCOA - COFFEESUGAR AND COCOA EXCHANGE ;2002.12.17;  113815;    5726;   19431;   26700;   73026;   61024;  105453;  107156;    8362;    6659
COCOA - COFFEESUGAR AND COCOA EXCHANGE ;2002.12.10;  109637;    4747;   20972;   24344;   73169;   59270;  102259;  104586;    7378;    5051
COCOA - COFFEESUGAR AND COCOA EXCHANGE ;2002.12.03;  108358;    4496;   20534;   23941;   72773;   57565;  101210;  102041;    7148;    6317
COCOA - COFFEESUGAR AND COCOA EXCHANGE ;2002.11.26;  106186;    3211;   20176;   24062;   72326;   55623;   99599;   99861;    6587;    6324
COCOA - COFFEESUGAR AND COCOA EXCHANGE ;2002.11.19;  106312;    4657;   24904;   20210;   75470;   54845;  100336;   99958;    5976;    6354
COCOA - COFFEESUGAR AND COCOA EXCHANGE ;2002.11.12;  107719;    4460;   25111;   19828;   77635;   56182;  101924;  101122;    5795;    6597
COCOA - COFFEESUGAR AND COCOA EXCHANGE ;2002.11.05;  111724;    5192;   24106;   19834;   81054;   61705;  106081;  105645;    5644;    6079
COCOA - COFFEESUGAR AND COCOA EXCHANGE ;2002.10.29;  126852;    7145;   23878;   22616;   90505;   74022;  120266;  120517;    6586;    6335
COCOA - COFFEESUGAR AND COCOA EXCHANGE ;2002.10.22;  131487;    8506;   25030;   22379;   93311;   78041;  124196;  125449;    7291;    6038
COCOA - COFFEESUGAR AND COCOA EXCHANGE ;2002.10.15;  144260;   15817;   29075;   21798;   95507;   86451;  133122;  137325;   11139;    6936
COCOA - COFFEESUGAR AND COCOA EXCHANGE ;2002.10.08;  143799;   17667;   36131;   20647;   94928;   80031;  133242;  136809;   10557;    6990
COCOA - COFFEESUGAR AND COCOA EXCHANGE ;2002.10.01;  149373;   18044;   37204;   21826;  100191;   84054;  140060;  143084;    9313;    6289
COCOA - COFFEESUGAR AND COCOA EXCHANGE ;2002.09.24;  141199;   18018;   32034;   19718;   93926;   82447;  131662;  134199;    9538;    7000
COCOA - COFFEESUGAR AND COCOA EXCHANGE ;2002.09.17;  135663;   17899;   29277;   19549;   89194;   79846;  126643;  128672;    9020;    6991
COCOA - COFFEESUGAR AND COCOA EXCHANGE ;2002.09.10;  133425;   16695;   28971;   18155;   89713;   78776;  124563;  125902;    8862;    7523
COCOA - COFFEESUGAR AND COCOA EXCHANGE ;2002.09.03;  135011;   16885;   30075;   13612;   86893;   74938;  117390;  118626;   17621;   16385
COCOA - COFFEESUGAR AND COCOA EXCHANGE ;2002.08.27;  132125;   18435;   27138;   18029;   86868;   79735;  123331;  124902;    8794;    7222
COCOA - COFFEESUGAR AND COCOA EXCHANGE ;2002.08.20;  126789;   18297;   25234;   15895;   83872;   78225;  118064;  119353;    8725;    7435
COCOA - COFFEESUGAR AND COCOA EXCHANGE ;2002.08.13;  123382;   15453;   24221;   16126;   83091;   75583;  114670;  115930;    8712;    7452
COCOA - COFFEESUGAR AND COCOA EXCHANGE ;2002.08.06;  125613;   15531;   24264;   15717;   85220;   77717;  116468;  117698;    9146;    7915
COCOA - COFFEESUGAR AND COCOA EXCHANGE ;2002.07.30;  139660;   19073;   25282;   22558;   89634;   84629;  131266;  132469;    8394;    7191
COCOA - COFFEESUGAR AND COCOA EXCHANGE ;2002.07.23;  138810;   21556;   25449;   20432;   87531;   84939;  129519;  130820;    9292;    7990
COCOA - COFFEESUGAR AND COCOA EXCHANGE ;2002.07.16;  138587;   22573;   25279;   19473;   87319;   86305;  129365;  131057;    9222;    7530
COCOA - COFFEESUGAR AND COCOA EXCHANGE ;2002.07.09;  129305;   20781;   23853;   16362;   83626;   81990;  120769;  122205;    8537;    7100
COCOA - COFFEESUGAR AND COCOA EXCHANGE ;2002.07.02;  125082;   18411;   23159;   15411;   82963;   79835;  116785;  118404;    8297;    6677
COCOA - COFFEESUGAR AND COCOA EXCHANGE ;2002.06.25;  119119;   15551;   20862;   14872;   81522;   77467;  111945;  113201;    7175;    5919
COCOA - COFFEESUGAR AND COCOA EXCHANGE ;2002.06.18;  112152;    8246;   18991;   13815;   83163;   73508;  105223;  106314;    6929;    5838
COCOA - COFFEESUGAR AND COCOA EXCHANGE ;2002.06.11;  117545;   11346;   19594;   13828;   83443;   77004;  108617;  110427;    8928;    7118
COCOA - COFFEESUGAR AND COCOA EXCHANGE ;2002.06.04;  137744;   21717;   18684;   22852;   82927;   87802;  127495;  129338;   10249;    8405
COCOA - COFFEESUGAR AND COCOA EXCHANGE ;2002.05.28;  137391;   21890;   18516;   22258;   83917;   88811;  128065;  129586;    9325;    7804
COCOA - COFFEESUGAR AND COCOA EXCHANGE ;2002.05.21;  134911;   20890;   17892;   21991;   82623;   87558;  125504;  127442;    9407;    7470
COCOA - COFFEESUGAR AND COCOA EXCHANGE ;2002.05.14;  128177;   16397;   18647;   20984;   82467;   82289;  119848;  121920;    8329;    6257
COCOA - COFFEESUGAR AND COCOA EXCHANGE ;2002.05.07;  125023;   13561;   19662;   21189;   81500;   78016;  116250;  118867;    8772;    6156
COCOA - COFFEESUGAR AND COCOA EXCHANGE ;2002.04.30;  123178;   16598;   18483;   19317;   78458;   78668;  114373;  116468;    8805;    6710
COCOA - COFFEESUGAR AND COCOA EXCHANGE ;2003.02.14;  107397;   14401;   26008;   13290;   69264;   60409;   96956;   99707;   10441;    7690
COCOA - COFFEESUGAR AND COCOA EXCHANGE ;2003.02.11;  107761;   14611;   26315;   13117;   70709;   60999;   98437;  100431;    9324;    7331
COCOA - COFFEESUGAR AND COCOA EXCHANGE ;2003.02.04;  136133;   16143;   30534;   26977;   80381;   69139;  123501;  126650;   12632;    9483
COCOA - COFFEESUGAR AND COCOA EXCHANGE ;2003.01.28;  128353;   11247;   19914;   30301;   76216;   70241;  117764;  120456;   10589;    7897
COCOA - COFFEESUGAR AND COCOA EXCHANGE ;2003.01.21;  124760;    9485;   18162;   30132;   75318;   69220;  114935;  117514;    9825;    7246
COCOA - COFFEESUGAR AND COCOA EXCHANGE ;2003.01.14;  123971;    9394;   18423;   29505;   75451;   68390;  114350;  116318;    9622;    7654
COCOA - COFFEESUGAR AND COCOA EXCHANGE ;2003.01.07;  121887;    8353;   19306;   28957;   74293;   67183;  111602;  115446;   10284;    6441
COCOA - COFFEESUGAR AND COCOA EXCHANGE ;2002.12.31;  114605;    5109;   17944;   28296;   73539;   62539;  106944;  108779;    7660;    5825
COCOA - COFFEESUGAR AND COCOA EXCHANGE ;2002.12.23;  113171;    5477;   18795;   27327;   72362;   61697;  105166;  107820;    8006;    5352
COCOA - COFFEESUGAR AND COCOA EXCHANGE ;2002.12.17;  113815;    5726;   19431;   26700;   73026;   61024;  105453;  107156;    8362;    6659
COCOA - COFFEESUGAR AND COCOA EXCHANGE ;2002.12.10;  109637;    4747;   20972;   24344;   73169;   59270;  102259;  104586;    7378;    5051
COCOA - COFFEESUGAR AND COCOA EXCHANGE ;2002.12.03;  108358;    4496;   20534;   23941;   72773;   57565;  101210;  102041;    7148;    6317
COCOA - COFFEESUGAR AND COCOA EXCHANGE ;2002.11.26;  106186;    3211;   20176;   24062;   72326;   55623;   99599;   99861;    6587;    6324
COCOA - COFFEESUGAR AND COCOA EXCHANGE ;2002.11.19;  106312;    4657;   24904;   20210;   75470;   54845;  100336;   99958;    5976;    6354
COCOA - COFFEESUGAR AND COCOA EXCHANGE ;2002.11.12;  107719;    4460;   25111;   19828;   77635;   56182;  101924;  101122;    5795;    6597
COCOA - COFFEESUGAR AND COCOA EXCHANGE ;2002.11.05;  111724;    5192;   24106;   19834;   81054;   61705;  106081;  105645;    5644;    6079
COCOA - COFFEESUGAR AND COCOA EXCHANGE ;2002.10.29;  126852;    7145;   23878;   22616;   90505;   74022;  120266;  120517;    6586;    6335
COCOA - COFFEESUGAR AND COCOA EXCHANGE ;2002.10.22;  131487;    8506;   25030;   22379;   93311;   78041;  124196;  125449;    7291;    6038
COCOA - COFFEESUGAR AND COCOA EXCHANGE ;2002.10.15;  144260;   15817;   29075;   21798;   95507;   86451;  133122;  137325;   11139;    6936
COCOA - COFFEESUGAR AND COCOA EXCHANGE ;2002.10.08;  143799;   17667;   36131;   20647;   94928;   80031;  133242;  136809;   10557;    6990
COCOA - COFFEESUGAR AND COCOA EXCHANGE ;2002.10.01;  149373;   18044;   37204;   21826;  100191;   84054;  140060;  143084;    9313;    6289
COCOA - COFFEESUGAR AND COCOA EXCHANGE ;2002.09.24;  141199;   18018;   32034;   19718;   93926;   82447;  131662;  134199;    9538;    7000
COCOA - COFFEESUGAR AND COCOA EXCHANGE ;2002.09.17;  135663;   17899;   29277;   19549;   89194;   79846;  126643;  128672;    9020;    6991
COCOA - COFFEESUGAR AND COCOA EXCHANGE ;2002.09.10;  133425;   16695;   28971;   18155;   89713;   78776;  124563;  125902;    8862;    7523
COCOA - COFFEESUGAR AND COCOA EXCHANGE ;2002.09.03;  135011;   16885;   30075;   13612;   86893;   74938;  117390;  118626;   17621;   16385
COCOA - COFFEESUGAR AND COCOA EXCHANGE ;2002.08.27;  132125;   18435;   27138;   18029;   86868;   79735;  123331;  124902;    8794;    7222
COCOA - COFFEESUGAR AND COCOA EXCHANGE ;2002.08.20;  126789;   18297;   25234;   15895;   83872;   78225;  118064;  119353;    8725;    7435
COCOA - COFFEESUGAR AND COCOA EXCHANGE ;2002.08.13;  123382;   15453;   24221;   16126;   83091;   75583;  114670;  115930;    8712;    7452
COCOA - COFFEESUGAR AND COCOA EXCHANGE ;2002.08.06;  125613;   15531;   24264;   15717;   85220;   77717;  116468;  117698;    9146;    7915
COCOA - COFFEESUGAR AND COCOA EXCHANGE ;2002.07.30;  139660;   19073;   25282;   22558;   89634;   84629;  131266;  132469;    8394;    7191
COCOA - COFFEESUGAR AND COCOA EXCHANGE ;2002.07.23;  138810;   21556;   25449;   20432;   87531;   84939;  129519;  130820;    9292;    7990
COCOA - COFFEESUGAR AND COCOA EXCHANGE ;2002.07.16;  138587;   22573;   25279;   19473;   87319;   86305;  129365;  131057;    9222;    7530
COCOA - COFFEESUGAR AND COCOA EXCHANGE ;2002.07.09;  129305;   20781;   23853;   16362;   83626;   81990;  120769;  122205;    8537;    7100
COCOA - COFFEESUGAR AND COCOA EXCHANGE ;2002.07.02;  125082;   18411;   23159;   15411;   82963;   79835;  116785;  118404;    8297;    6677
COCOA - COFFEESUGAR AND COCOA EXCHANGE ;2002.06.25;  119119;   15551;   20862;   14872;   81522;   77467;  111945;  113201;    7175;    5919
COCOA - COFFEESUGAR AND COCOA EXCHANGE ;2002.06.18;  112152;    8246;   18991;   13815;   83163;   73508;  105223;  106314;    6929;    5838
COCOA - COFFEESUGAR AND COCOA EXCHANGE ;2002.06.11;  117545;   11346;   19594;   13828;   83443;   77004;  108617;  110427;    8928;    7118
COCOA - COFFEESUGAR AND COCOA EXCHANGE ;2002.06.04;  137744;   21717;   18684;   22852;   82927;   87802;  127495;  129338;   10249;    8405
COCOA - COFFEESUGAR AND COCOA EXCHANGE ;2002.05.28;  137391;   21890;   18516;   22258;   83917;   88811;  128065;  129586;    9325;    7804
COCOA - COFFEESUGAR AND COCOA EXCHANGE ;2002.05.21;  134911;   20890;   17892;   21991;   82623;   87558;  125504;  127442;    9407;    7470
COCOA - COFFEESUGAR AND COCOA EXCHANGE ;2002.05.14;  128177;   16397;   18647;   20984;   82467;   82289;  119848;  121920;    8329;    6257
COCOA - COFFEESUGAR AND COCOA EXCHANGE ;2002.05.07;  125023;   13561;   19662;   21189;   81500;   78016;  116250;  118867;    8772;    6156
COCOA - COFFEESUGAR AND COCOA EXCHANGE ;2002.04.30;  123178;   16598;   18483;   19317;   78458;   78668;  114373;  116468;    8805;    6710
