NYISO ZONE G 5 MW PEAK SWAP - NEW YORK MERCANTILE EXCHANGE ;2011.07.12;   28115;     510;      86;       0;   27203;   27965;   27713;   28051;     402;      64
NYISO ZONE G 5 MW PEAK SWAP - NEW YORK MERCANTILE EXCHANGE ;2011.07.12;   28115;     510;      86;       0;   27203;   27965;   27713;   28051;     402;      64
NYISO ZONE G 5 MW PEAK SWAP - NEW YORK MERCANTILE EXCHANGE ;2010.12.28;   35461;     510;       0;       0;   34441;   34632;   34951;   34632;     510;     829
NYISO ZONE G 5 MW PEAK SWAP - NEW YORK MERCANTILE EXCHANGE ;2010.12.21;   35385;     510;       0;       0;   34365;   34556;   34875;   34556;     510;     829
NYISO ZONE G 5 MW PEAK SWAP - NEW YORK MERCANTILE EXCHANGE ;2010.12.14;   35817;     510;       0;       0;   34797;   34988;   35307;   34988;     510;     829
NYISO ZONE G 5 MW PEAK SWAP - NEW YORK MERCANTILE EXCHANGE ;2010.12.07;   36239;     510;       0;       0;   35219;   35410;   35729;   35410;     510;     829
NYISO ZONE G 5 MW PEAK SWAP - NEW YORK MERCANTILE EXCHANGE ;2010.11.30;   37144;     510;       0;       0;   36124;   36315;   36634;   36315;     510;     829
NYISO ZONE G 5 MW PEAK SWAP - NEW YORK MERCANTILE EXCHANGE ;2010.11.23;   36691;     510;       0;       0;   35671;   35862;   36181;   35862;     510;     829
NYISO ZONE G 5 MW PEAK SWAP - NEW YORK MERCANTILE EXCHANGE ;2010.11.16;   37240;     510;       0;       0;   36220;   36411;   36730;   36411;     510;     829
NYISO ZONE G 5 MW PEAK SWAP - NEW YORK MERCANTILE EXCHANGE ;2010.11.09;   36322;     510;       0;       0;   35238;   35493;   35748;   35493;     574;     829
NYISO ZONE G 5 MW PEAK SWAP - NEW YORK MERCANTILE EXCHANGE ;2010.11.02;   36923;     510;       0;       0;   35839;   36094;   36349;   36094;     574;     829
NYISO ZONE G 5 MW PEAK SWAP - NEW YORK MERCANTILE EXCHANGE ;2010.10.26;   36643;     510;       0;       0;   35814;   35814;   36324;   35814;     319;     829
NYISO ZONE G 5 MW PEAK SWAP - NEW YORK MERCANTILE EXCHANGE ;2010.10.19;   36501;     510;       0;       0;   35672;   35672;   36182;   35672;     319;     829
NYISO ZONE G 5 MW PEAK SWAP - NEW YORK MERCANTILE EXCHANGE ;2010.10.12;   35836;     510;       0;       0;   35007;   35007;   35517;   35007;     319;     829
NYISO ZONE G 5 MW PEAK SWAP - NEW YORK MERCANTILE EXCHANGE ;2010.10.05;   35210;     510;       0;       0;   34381;   34381;   34891;   34381;     319;     829
NYISO ZONE G 5 MW PEAK SWAP - NEW YORK MERCANTILE EXCHANGE ;2010.09.28;   35661;     510;       0;       0;   34832;   34832;   35342;   34832;     319;     829
NYISO ZONE G 5 MW PEAK SWAP - NEW YORK MERCANTILE EXCHANGE ;2010.08.31;   33102;       0;     220;       0;   33038;   32541;   33038;   32761;      64;     341
NYISO ZONE G 5 MW PEAK SWAP - NEW YORK MERCANTILE EXCHANGE ;2010.08.24;   32583;       0;     220;       0;   32411;   32022;   32411;   32242;     172;     341
NYISO ZONE G 5 MW PEAK SWAP - NEW YORK MERCANTILE EXCHANGE ;2010.08.17;   31764;       0;     220;       0;   31592;   31203;   31592;   31423;     172;     341
NYISO ZONE G 5 MW PEAK SWAP - NEW YORK MERCANTILE EXCHANGE ;2010.08.10;   31745;       0;     220;       0;   31573;   31184;   31573;   31404;     172;     341
NYISO ZONE G 5 MW PEAK SWAP - NEW YORK MERCANTILE EXCHANGE ;2010.08.03;   31003;       0;     220;       0;   30831;   30442;   30831;   30662;     172;     341
NYISO ZONE G 5 MW PEAK SWAP - NEW YORK MERCANTILE EXCHANGE ;2010.07.27;   32265;       0;     220;       0;   32072;   31683;   32072;   31903;     193;     362
NYISO ZONE G 5 MW PEAK SWAP - NEW YORK MERCANTILE EXCHANGE ;2010.07.20;   31483;       0;     220;       0;   31290;   30901;   31290;   31121;     193;     362
NYISO ZONE G 5 MW PEAK SWAP - NEW YORK MERCANTILE EXCHANGE ;2011.07.12;   28115;     510;      86;       0;   27203;   27965;   27713;   28051;     402;      64
NYISO ZONE G 5 MW PEAK SWAP - NEW YORK MERCANTILE EXCHANGE ;2011.07.05;   28051;     510;      86;       0;   27139;   27646;   27649;   27732;     402;     319
NYISO ZONE G 5 MW PEAK SWAP - NEW YORK MERCANTILE EXCHANGE ;2011.06.28;   32357;     510;     526;       0;   31423;   31512;   31933;   32038;     424;     319
NYISO ZONE G 5 MW PEAK SWAP - NEW YORK MERCANTILE EXCHANGE ;2011.06.21;   31701;     510;     526;       0;   30787;   30856;   31297;   31382;     404;     319
NYISO ZONE G 5 MW PEAK SWAP - NEW YORK MERCANTILE EXCHANGE ;2011.06.14;   31470;     510;     526;       0;   30556;   30625;   31066;   31151;     404;     319
NYISO ZONE G 5 MW PEAK SWAP - NEW YORK MERCANTILE EXCHANGE ;2011.06.07;   31391;     510;     526;       0;   30477;   30546;   30987;   31072;     404;     319
NYISO ZONE G 5 MW PEAK SWAP - NEW YORK MERCANTILE EXCHANGE ;2011.05.31;   34044;     510;     526;       0;   33109;   33199;   33619;   33725;     425;     319
NYISO ZONE G 5 MW PEAK SWAP - NEW YORK MERCANTILE EXCHANGE ;2011.05.24;   34331;     510;     526;       0;   33396;   33486;   33906;   34012;     425;     319
NYISO ZONE G 5 MW PEAK SWAP - NEW YORK MERCANTILE EXCHANGE ;2011.05.17;   33959;     510;     526;       0;   33024;   33114;   33534;   33640;     425;     319
NYISO ZONE G 5 MW PEAK SWAP - NEW YORK MERCANTILE EXCHANGE ;2011.05.10;   34150;     510;     526;       0;   32790;   33305;   33300;   33831;     850;     319
NYISO ZONE G 5 MW PEAK SWAP - NEW YORK MERCANTILE EXCHANGE ;2011.05.03;   33430;     510;     526;       0;   32070;   32585;   32580;   33111;     850;     319
NYISO ZONE G 5 MW PEAK SWAP - NEW YORK MERCANTILE EXCHANGE ;2011.04.26;   35185;     510;     841;       0;   33783;   34025;   34293;   34866;     892;     319
NYISO ZONE G 5 MW PEAK SWAP - NEW YORK MERCANTILE EXCHANGE ;2011.04.19;   34865;     510;     401;       0;   33463;   34145;   33973;   34546;     892;     319
NYISO ZONE G 5 MW PEAK SWAP - NEW YORK MERCANTILE EXCHANGE ;2011.04.12;   34236;     510;     401;       0;   32834;   33516;   33344;   33917;     892;     319
NYISO ZONE G 5 MW PEAK SWAP - NEW YORK MERCANTILE EXCHANGE ;2011.04.05;   33791;     510;     401;       0;   32644;   32816;   33154;   33217;     637;     574
NYISO ZONE G 5 MW PEAK SWAP - NEW YORK MERCANTILE EXCHANGE ;2011.03.29;   36099;     510;     401;       0;   34906;   35124;   35416;   35525;     683;     574
NYISO ZONE G 5 MW PEAK SWAP - NEW YORK MERCANTILE EXCHANGE ;2011.03.22;   34952;     510;     212;       0;   33759;   34166;   34269;   34378;     683;     574
NYISO ZONE G 5 MW PEAK SWAP - NEW YORK MERCANTILE EXCHANGE ;2011.03.15;   34352;     510;      86;       0;   32945;   33692;   33455;   33778;     897;     574
NYISO ZONE G 5 MW PEAK SWAP - NEW YORK MERCANTILE EXCHANGE ;2011.03.08;   34413;     510;      86;       0;   33006;   33753;   33516;   33839;     897;     574
NYISO ZONE G 5 MW PEAK SWAP - NEW YORK MERCANTILE EXCHANGE ;2011.03.01;   34255;     510;      86;       0;   32618;   33595;   33128;   33681;    1127;     574
NYISO ZONE G 5 MW PEAK SWAP - NEW YORK MERCANTILE EXCHANGE ;2011.02.22;   35327;     510;      86;       0;   34114;   34922;   34624;   35008;     703;     319
NYISO ZONE G 5 MW PEAK SWAP - NEW YORK MERCANTILE EXCHANGE ;2011.02.15;   35193;     510;      86;       0;   33980;   34788;   34490;   34874;     703;     319
NYISO ZONE G 5 MW PEAK SWAP - NEW YORK MERCANTILE EXCHANGE ;2011.02.08;   34278;     510;      86;       0;   33279;   33873;   33789;   33959;     489;     319
NYISO ZONE G 5 MW PEAK SWAP - NEW YORK MERCANTILE EXCHANGE ;2011.02.01;   34054;     510;      86;       0;   33055;   33649;   33565;   33735;     489;     319
NYISO ZONE G 5 MW PEAK SWAP - NEW YORK MERCANTILE EXCHANGE ;2011.01.25;   34892;     510;       0;       0;   33872;   34573;   34382;   34573;     510;     319
NYISO ZONE G 5 MW PEAK SWAP - NEW YORK MERCANTILE EXCHANGE ;2011.01.18;   35180;     510;       0;       0;   34160;   34861;   34670;   34861;     510;     319
NYISO ZONE G 5 MW PEAK SWAP - NEW YORK MERCANTILE EXCHANGE ;2011.01.11;   34554;     510;       0;       0;   33534;   34235;   34044;   34235;     510;     319
NYISO ZONE G 5 MW PEAK SWAP - NEW YORK MERCANTILE EXCHANGE ;2011.07.12;   28115;     510;      86;       0;   27203;   27965;   27713;   28051;     402;      64
NYISO ZONE G 5 MW PEAK SWAP - NEW YORK MERCANTILE EXCHANGE ;2010.12.28;   35461;     510;       0;       0;   34441;   34632;   34951;   34632;     510;     829
NYISO ZONE G 5 MW PEAK SWAP - NEW YORK MERCANTILE EXCHANGE ;2010.12.21;   35385;     510;       0;       0;   34365;   34556;   34875;   34556;     510;     829
NYISO ZONE G 5 MW PEAK SWAP - NEW YORK MERCANTILE EXCHANGE ;2010.12.14;   35817;     510;       0;       0;   34797;   34988;   35307;   34988;     510;     829
NYISO ZONE G 5 MW PEAK SWAP - NEW YORK MERCANTILE EXCHANGE ;2010.12.07;   36239;     510;       0;       0;   35219;   35410;   35729;   35410;     510;     829
NYISO ZONE G 5 MW PEAK SWAP - NEW YORK MERCANTILE EXCHANGE ;2010.11.30;   37144;     510;       0;       0;   36124;   36315;   36634;   36315;     510;     829
NYISO ZONE G 5 MW PEAK SWAP - NEW YORK MERCANTILE EXCHANGE ;2010.11.23;   36691;     510;       0;       0;   35671;   35862;   36181;   35862;     510;     829
NYISO ZONE G 5 MW PEAK SWAP - NEW YORK MERCANTILE EXCHANGE ;2010.11.16;   37240;     510;       0;       0;   36220;   36411;   36730;   36411;     510;     829
NYISO ZONE G 5 MW PEAK SWAP - NEW YORK MERCANTILE EXCHANGE ;2010.11.09;   36322;     510;       0;       0;   35238;   35493;   35748;   35493;     574;     829
NYISO ZONE G 5 MW PEAK SWAP - NEW YORK MERCANTILE EXCHANGE ;2010.11.02;   36923;     510;       0;       0;   35839;   36094;   36349;   36094;     574;     829
NYISO ZONE G 5 MW PEAK SWAP - NEW YORK MERCANTILE EXCHANGE ;2010.10.26;   36643;     510;       0;       0;   35814;   35814;   36324;   35814;     319;     829
NYISO ZONE G 5 MW PEAK SWAP - NEW YORK MERCANTILE EXCHANGE ;2010.10.19;   36501;     510;       0;       0;   35672;   35672;   36182;   35672;     319;     829
NYISO ZONE G 5 MW PEAK SWAP - NEW YORK MERCANTILE EXCHANGE ;2010.10.12;   35836;     510;       0;       0;   35007;   35007;   35517;   35007;     319;     829
NYISO ZONE G 5 MW PEAK SWAP - NEW YORK MERCANTILE EXCHANGE ;2010.10.05;   35210;     510;       0;       0;   34381;   34381;   34891;   34381;     319;     829
NYISO ZONE G 5 MW PEAK SWAP - NEW YORK MERCANTILE EXCHANGE ;2010.09.28;   35661;     510;       0;       0;   34832;   34832;   35342;   34832;     319;     829
NYISO ZONE G 5 MW PEAK SWAP - NEW YORK MERCANTILE EXCHANGE ;2010.08.31;   33102;       0;     220;       0;   33038;   32541;   33038;   32761;      64;     341
NYISO ZONE G 5 MW PEAK SWAP - NEW YORK MERCANTILE EXCHANGE ;2010.08.24;   32583;       0;     220;       0;   32411;   32022;   32411;   32242;     172;     341
NYISO ZONE G 5 MW PEAK SWAP - NEW YORK MERCANTILE EXCHANGE ;2010.08.17;   31764;       0;     220;       0;   31592;   31203;   31592;   31423;     172;     341
NYISO ZONE G 5 MW PEAK SWAP - NEW YORK MERCANTILE EXCHANGE ;2010.08.10;   31745;       0;     220;       0;   31573;   31184;   31573;   31404;     172;     341
NYISO ZONE G 5 MW PEAK SWAP - NEW YORK MERCANTILE EXCHANGE ;2010.08.03;   31003;       0;     220;       0;   30831;   30442;   30831;   30662;     172;     341
NYISO ZONE G 5 MW PEAK SWAP - NEW YORK MERCANTILE EXCHANGE ;2010.07.27;   32265;       0;     220;       0;   32072;   31683;   32072;   31903;     193;     362
NYISO ZONE G 5 MW PEAK SWAP - NEW YORK MERCANTILE EXCHANGE ;2010.07.20;   31483;       0;     220;       0;   31290;   30901;   31290;   31121;     193;     362
NYISO ZONE G 5 MW PEAK SWAP - NEW YORK MERCANTILE EXCHANGE ;2011.07.12;   28115;     510;      86;       0;   27203;   27965;   27713;   28051;     402;      64
NYISO ZONE G 5 MW PEAK SWAP - NEW YORK MERCANTILE EXCHANGE ;2011.07.05;   28051;     510;      86;       0;   27139;   27646;   27649;   27732;     402;     319
NYISO ZONE G 5 MW PEAK SWAP - NEW YORK MERCANTILE EXCHANGE ;2011.06.28;   32357;     510;     526;       0;   31423;   31512;   31933;   32038;     424;     319
NYISO ZONE G 5 MW PEAK SWAP - NEW YORK MERCANTILE EXCHANGE ;2011.06.21;   31701;     510;     526;       0;   30787;   30856;   31297;   31382;     404;     319
NYISO ZONE G 5 MW PEAK SWAP - NEW YORK MERCANTILE EXCHANGE ;2011.06.14;   31470;     510;     526;       0;   30556;   30625;   31066;   31151;     404;     319
NYISO ZONE G 5 MW PEAK SWAP - NEW YORK MERCANTILE EXCHANGE ;2011.06.07;   31391;     510;     526;       0;   30477;   30546;   30987;   31072;     404;     319
NYISO ZONE G 5 MW PEAK SWAP - NEW YORK MERCANTILE EXCHANGE ;2011.05.31;   34044;     510;     526;       0;   33109;   33199;   33619;   33725;     425;     319
NYISO ZONE G 5 MW PEAK SWAP - NEW YORK MERCANTILE EXCHANGE ;2011.05.24;   34331;     510;     526;       0;   33396;   33486;   33906;   34012;     425;     319
NYISO ZONE G 5 MW PEAK SWAP - NEW YORK MERCANTILE EXCHANGE ;2011.05.17;   33959;     510;     526;       0;   33024;   33114;   33534;   33640;     425;     319
NYISO ZONE G 5 MW PEAK SWAP - NEW YORK MERCANTILE EXCHANGE ;2011.05.10;   34150;     510;     526;       0;   32790;   33305;   33300;   33831;     850;     319
NYISO ZONE G 5 MW PEAK SWAP - NEW YORK MERCANTILE EXCHANGE ;2011.05.03;   33430;     510;     526;       0;   32070;   32585;   32580;   33111;     850;     319
NYISO ZONE G 5 MW PEAK SWAP - NEW YORK MERCANTILE EXCHANGE ;2011.04.26;   35185;     510;     841;       0;   33783;   34025;   34293;   34866;     892;     319
NYISO ZONE G 5 MW PEAK SWAP - NEW YORK MERCANTILE EXCHANGE ;2011.04.19;   34865;     510;     401;       0;   33463;   34145;   33973;   34546;     892;     319
NYISO ZONE G 5 MW PEAK SWAP - NEW YORK MERCANTILE EXCHANGE ;2011.04.12;   34236;     510;     401;       0;   32834;   33516;   33344;   33917;     892;     319
NYISO ZONE G 5 MW PEAK SWAP - NEW YORK MERCANTILE EXCHANGE ;2011.04.05;   33791;     510;     401;       0;   32644;   32816;   33154;   33217;     637;     574
NYISO ZONE G 5 MW PEAK SWAP - NEW YORK MERCANTILE EXCHANGE ;2011.03.29;   36099;     510;     401;       0;   34906;   35124;   35416;   35525;     683;     574
NYISO ZONE G 5 MW PEAK SWAP - NEW YORK MERCANTILE EXCHANGE ;2011.03.22;   34952;     510;     212;       0;   33759;   34166;   34269;   34378;     683;     574
NYISO ZONE G 5 MW PEAK SWAP - NEW YORK MERCANTILE EXCHANGE ;2011.03.15;   34352;     510;      86;       0;   32945;   33692;   33455;   33778;     897;     574
NYISO ZONE G 5 MW PEAK SWAP - NEW YORK MERCANTILE EXCHANGE ;2011.03.08;   34413;     510;      86;       0;   33006;   33753;   33516;   33839;     897;     574
NYISO ZONE G 5 MW PEAK SWAP - NEW YORK MERCANTILE EXCHANGE ;2011.03.01;   34255;     510;      86;       0;   32618;   33595;   33128;   33681;    1127;     574
NYISO ZONE G 5 MW PEAK SWAP - NEW YORK MERCANTILE EXCHANGE ;2011.02.22;   35327;     510;      86;       0;   34114;   34922;   34624;   35008;     703;     319
NYISO ZONE G 5 MW PEAK SWAP - NEW YORK MERCANTILE EXCHANGE ;2011.02.15;   35193;     510;      86;       0;   33980;   34788;   34490;   34874;     703;     319
NYISO ZONE G 5 MW PEAK SWAP - NEW YORK MERCANTILE EXCHANGE ;2011.02.08;   34278;     510;      86;       0;   33279;   33873;   33789;   33959;     489;     319
NYISO ZONE G 5 MW PEAK SWAP - NEW YORK MERCANTILE EXCHANGE ;2011.02.01;   34054;     510;      86;       0;   33055;   33649;   33565;   33735;     489;     319
NYISO ZONE G 5 MW PEAK SWAP - NEW YORK MERCANTILE EXCHANGE ;2011.01.25;   34892;     510;       0;       0;   33872;   34573;   34382;   34573;     510;     319
NYISO ZONE G 5 MW PEAK SWAP - NEW YORK MERCANTILE EXCHANGE ;2011.01.18;   35180;     510;       0;       0;   34160;   34861;   34670;   34861;     510;     319
NYISO ZONE G 5 MW PEAK SWAP - NEW YORK MERCANTILE EXCHANGE ;2011.01.11;   34554;     510;       0;       0;   33534;   34235;   34044;   34235;     510;     319
NYISO ZONE G 5 MW PEAK SWAP - NEW YORK MERCANTILE EXCHANGE ;2011.07.12;   28115;     510;      86;       0;   27203;   27965;   27713;   28051;     402;      64
NYISO ZONE G 5 MW PEAK SWAP - NEW YORK MERCANTILE EXCHANGE ;2011.07.05;   28051;     510;      86;       0;   27139;   27646;   27649;   27732;     402;     319
NYISO ZONE G 5 MW PEAK SWAP - NEW YORK MERCANTILE EXCHANGE ;2011.06.28;   32357;     510;     526;       0;   31423;   31512;   31933;   32038;     424;     319
NYISO ZONE G 5 MW PEAK SWAP - NEW YORK MERCANTILE EXCHANGE ;2011.06.21;   31701;     510;     526;       0;   30787;   30856;   31297;   31382;     404;     319
NYISO ZONE G 5 MW PEAK SWAP - NEW YORK MERCANTILE EXCHANGE ;2011.06.14;   31470;     510;     526;       0;   30556;   30625;   31066;   31151;     404;     319
NYISO ZONE G 5 MW PEAK SWAP - NEW YORK MERCANTILE EXCHANGE ;2011.06.07;   31391;     510;     526;       0;   30477;   30546;   30987;   31072;     404;     319
NYISO ZONE G 5 MW PEAK SWAP - NEW YORK MERCANTILE EXCHANGE ;2011.05.31;   34044;     510;     526;       0;   33109;   33199;   33619;   33725;     425;     319
NYISO ZONE G 5 MW PEAK SWAP - NEW YORK MERCANTILE EXCHANGE ;2011.05.24;   34331;     510;     526;       0;   33396;   33486;   33906;   34012;     425;     319
NYISO ZONE G 5 MW PEAK SWAP - NEW YORK MERCANTILE EXCHANGE ;2011.05.17;   33959;     510;     526;       0;   33024;   33114;   33534;   33640;     425;     319
NYISO ZONE G 5 MW PEAK SWAP - NEW YORK MERCANTILE EXCHANGE ;2011.05.10;   34150;     510;     526;       0;   32790;   33305;   33300;   33831;     850;     319
NYISO ZONE G 5 MW PEAK SWAP - NEW YORK MERCANTILE EXCHANGE ;2011.05.03;   33430;     510;     526;       0;   32070;   32585;   32580;   33111;     850;     319
NYISO ZONE G 5 MW PEAK SWAP - NEW YORK MERCANTILE EXCHANGE ;2011.04.26;   35185;     510;     841;       0;   33783;   34025;   34293;   34866;     892;     319
NYISO ZONE G 5 MW PEAK SWAP - NEW YORK MERCANTILE EXCHANGE ;2011.04.19;   34865;     510;     401;       0;   33463;   34145;   33973;   34546;     892;     319
NYISO ZONE G 5 MW PEAK SWAP - NEW YORK MERCANTILE EXCHANGE ;2011.04.12;   34236;     510;     401;       0;   32834;   33516;   33344;   33917;     892;     319
NYISO ZONE G 5 MW PEAK SWAP - NEW YORK MERCANTILE EXCHANGE ;2011.04.05;   33791;     510;     401;       0;   32644;   32816;   33154;   33217;     637;     574
NYISO ZONE G 5 MW PEAK SWAP - NEW YORK MERCANTILE EXCHANGE ;2011.03.29;   36099;     510;     401;       0;   34906;   35124;   35416;   35525;     683;     574
NYISO ZONE G 5 MW PEAK SWAP - NEW YORK MERCANTILE EXCHANGE ;2011.03.22;   34952;     510;     212;       0;   33759;   34166;   34269;   34378;     683;     574
NYISO ZONE G 5 MW PEAK SWAP - NEW YORK MERCANTILE EXCHANGE ;2011.03.15;   34352;     510;      86;       0;   32945;   33692;   33455;   33778;     897;     574
NYISO ZONE G 5 MW PEAK SWAP - NEW YORK MERCANTILE EXCHANGE ;2011.03.08;   34413;     510;      86;       0;   33006;   33753;   33516;   33839;     897;     574
NYISO ZONE G 5 MW PEAK SWAP - NEW YORK MERCANTILE EXCHANGE ;2011.03.01;   34255;     510;      86;       0;   32618;   33595;   33128;   33681;    1127;     574
NYISO ZONE G 5 MW PEAK SWAP - NEW YORK MERCANTILE EXCHANGE ;2011.02.22;   35327;     510;      86;       0;   34114;   34922;   34624;   35008;     703;     319
NYISO ZONE G 5 MW PEAK SWAP - NEW YORK MERCANTILE EXCHANGE ;2011.02.15;   35193;     510;      86;       0;   33980;   34788;   34490;   34874;     703;     319
NYISO ZONE G 5 MW PEAK SWAP - NEW YORK MERCANTILE EXCHANGE ;2011.02.08;   34278;     510;      86;       0;   33279;   33873;   33789;   33959;     489;     319
NYISO ZONE G 5 MW PEAK SWAP - NEW YORK MERCANTILE EXCHANGE ;2011.02.01;   34054;     510;      86;       0;   33055;   33649;   33565;   33735;     489;     319
NYISO ZONE G 5 MW PEAK SWAP - NEW YORK MERCANTILE EXCHANGE ;2011.01.25;   34892;     510;       0;       0;   33872;   34573;   34382;   34573;     510;     319
NYISO ZONE G 5 MW PEAK SWAP - NEW YORK MERCANTILE EXCHANGE ;2011.01.18;   35180;     510;       0;       0;   34160;   34861;   34670;   34861;     510;     319
NYISO ZONE G 5 MW PEAK SWAP - NEW YORK MERCANTILE EXCHANGE ;2011.01.11;   34554;     510;       0;       0;   33534;   34235;   34044;   34235;     510;     319
NYISO ZONE G 5 MW PEAK SWAP - NEW YORK MERCANTILE EXCHANGE ;2010.12.28;   35461;     510;       0;       0;   34441;   34632;   34951;   34632;     510;     829
NYISO ZONE G 5 MW PEAK SWAP - NEW YORK MERCANTILE EXCHANGE ;2010.12.21;   35385;     510;       0;       0;   34365;   34556;   34875;   34556;     510;     829
NYISO ZONE G 5 MW PEAK SWAP - NEW YORK MERCANTILE EXCHANGE ;2010.12.14;   35817;     510;       0;       0;   34797;   34988;   35307;   34988;     510;     829
NYISO ZONE G 5 MW PEAK SWAP - NEW YORK MERCANTILE EXCHANGE ;2010.12.07;   36239;     510;       0;       0;   35219;   35410;   35729;   35410;     510;     829
NYISO ZONE G 5 MW PEAK SWAP - NEW YORK MERCANTILE EXCHANGE ;2010.11.30;   37144;     510;       0;       0;   36124;   36315;   36634;   36315;     510;     829
NYISO ZONE G 5 MW PEAK SWAP - NEW YORK MERCANTILE EXCHANGE ;2010.11.23;   36691;     510;       0;       0;   35671;   35862;   36181;   35862;     510;     829
NYISO ZONE G 5 MW PEAK SWAP - NEW YORK MERCANTILE EXCHANGE ;2010.11.16;   37240;     510;       0;       0;   36220;   36411;   36730;   36411;     510;     829
NYISO ZONE G 5 MW PEAK SWAP - NEW YORK MERCANTILE EXCHANGE ;2010.11.09;   36322;     510;       0;       0;   35238;   35493;   35748;   35493;     574;     829
NYISO ZONE G 5 MW PEAK SWAP - NEW YORK MERCANTILE EXCHANGE ;2010.11.02;   36923;     510;       0;       0;   35839;   36094;   36349;   36094;     574;     829
NYISO ZONE G 5 MW PEAK SWAP - NEW YORK MERCANTILE EXCHANGE ;2010.10.26;   36643;     510;       0;       0;   35814;   35814;   36324;   35814;     319;     829
NYISO ZONE G 5 MW PEAK SWAP - NEW YORK MERCANTILE EXCHANGE ;2010.10.19;   36501;     510;       0;       0;   35672;   35672;   36182;   35672;     319;     829
NYISO ZONE G 5 MW PEAK SWAP - NEW YORK MERCANTILE EXCHANGE ;2010.10.12;   35836;     510;       0;       0;   35007;   35007;   35517;   35007;     319;     829
NYISO ZONE G 5 MW PEAK SWAP - NEW YORK MERCANTILE EXCHANGE ;2010.10.05;   35210;     510;       0;       0;   34381;   34381;   34891;   34381;     319;     829
NYISO ZONE G 5 MW PEAK SWAP - NEW YORK MERCANTILE EXCHANGE ;2010.09.28;   35661;     510;       0;       0;   34832;   34832;   35342;   34832;     319;     829
NYISO ZONE G 5 MW PEAK SWAP - NEW YORK MERCANTILE EXCHANGE ;2010.08.31;   33102;       0;     220;       0;   33038;   32541;   33038;   32761;      64;     341
NYISO ZONE G 5 MW PEAK SWAP - NEW YORK MERCANTILE EXCHANGE ;2010.08.24;   32583;       0;     220;       0;   32411;   32022;   32411;   32242;     172;     341
NYISO ZONE G 5 MW PEAK SWAP - NEW YORK MERCANTILE EXCHANGE ;2010.08.17;   31764;       0;     220;       0;   31592;   31203;   31592;   31423;     172;     341
NYISO ZONE G 5 MW PEAK SWAP - NEW YORK MERCANTILE EXCHANGE ;2010.08.10;   31745;       0;     220;       0;   31573;   31184;   31573;   31404;     172;     341
NYISO ZONE G 5 MW PEAK SWAP - NEW YORK MERCANTILE EXCHANGE ;2010.08.03;   31003;       0;     220;       0;   30831;   30442;   30831;   30662;     172;     341
NYISO ZONE G 5 MW PEAK SWAP - NEW YORK MERCANTILE EXCHANGE ;2010.07.27;   32265;       0;     220;       0;   32072;   31683;   32072;   31903;     193;     362
NYISO ZONE G 5 MW PEAK SWAP - NEW YORK MERCANTILE EXCHANGE ;2010.07.20;   31483;       0;     220;       0;   31290;   30901;   31290;   31121;     193;     362
NYISO ZONE G 5 MW PEAK SWAP - NEW YORK MERCANTILE EXCHANGE ;2011.07.12;   28115;     510;      86;       0;   27203;   27965;   27713;   28051;     402;      64
