PROPANE GAS - NYME PROPANE GAS ;1995.04.04;    2084;      53;       0;      25;    1579;    1670;    1657;    1695;     427;     389
PROPANE GAS - NYME PROPANE GAS ;1995.03.28;    2530;      38;       0;      25;    1828;    2050;    1891;    2075;     639;     455
PROPANE GAS - NYME PROPANE GAS ;1995.03.21;    2596;       5;      51;      92;    1793;    2058;    1890;    2201;     706;     395
PROPANE GAS - NYME PROPANE GAS ;1995.04.04;    2084;      53;       0;      25;    1579;    1670;    1657;    1695;     427;     389
PROPANE GAS - NYME PROPANE GAS ;1995.03.28;    2530;      38;       0;      25;    1828;    2050;    1891;    2075;     639;     455
PROPANE GAS - NYME PROPANE GAS ;1995.03.21;    2596;       5;      51;      92;    1793;    2058;    1890;    2201;     706;     395
PROPANE GAS - NYME PROPANE GAS ;1995.04.04;    2084;      53;       0;      25;    1579;    1670;    1657;    1695;     427;     389
PROPANE GAS - NYME PROPANE GAS ;1995.03.28;    2530;      38;       0;      25;    1828;    2050;    1891;    2075;     639;     455
PROPANE GAS - NYME PROPANE GAS ;1995.03.21;    2596;       5;      51;      92;    1793;    2058;    1890;    2201;     706;     395
