SOYBEAN CAL SPR OPT OLD NEW CY - CHICAGO BOARD OF TRADE ;2010.06.08;    7196;    3698;    3430;    2019;    1100;    1491;    6816;    6940;     380;     256
SOYBEAN CAL SPR OPT OLD NEW CY - CHICAGO BOARD OF TRADE ;2010.06.01;    6476;    3029;    3413;    1619;    1589;    1044;    6237;    6076;     240;     400
SOYBEAN CAL SPR OPT OLD NEW CY - CHICAGO BOARD OF TRADE ;2010.05.25;    6426;    2814;    2807;    1761;    1540;    1445;    6115;    6013;     311;     413
SOYBEAN CAL SPR OPT OLD NEW CY - CHICAGO BOARD OF TRADE ;2010.05.18;    6494;    2947;    2578;    1959;    1505;    1839;    6411;    6376;      82;     117
SOYBEAN CAL SPR OPT OLD NEW CY - CHICAGO BOARD OF TRADE ;2010.05.11;    6648;    3088;    2683;    1756;    1459;    1787;    6303;    6226;     346;     423
SOYBEAN CAL SPR OPT OLD NEW CY - CHICAGO BOARD OF TRADE ;2010.05.04;    6344;    2510;    2387;    2079;    1526;    1583;    6114;    6050;     229;     294
SOYBEAN CAL SPR OPT OLD NEW CY - CHICAGO BOARD OF TRADE ;2010.04.27;    6810;    3277;    2334;    2062;    1205;    2041;    6544;    6437;     266;     373
SOYBEAN CAL SPR OPT OLD NEW CY - CHICAGO BOARD OF TRADE ;2010.04.13;    6504;    2864;    2153;    2107;    1257;    1850;    6227;    6110;     277;     394
SOYBEAN CAL SPR OPT OLD NEW CY - CHICAGO BOARD OF TRADE ;2010.06.08;    7196;    3698;    3430;    2019;    1100;    1491;    6816;    6940;     380;     256
SOYBEAN CAL SPR OPT OLD NEW CY - CHICAGO BOARD OF TRADE ;2010.06.01;    6476;    3029;    3413;    1619;    1589;    1044;    6237;    6076;     240;     400
SOYBEAN CAL SPR OPT OLD NEW CY - CHICAGO BOARD OF TRADE ;2010.05.25;    6426;    2814;    2807;    1761;    1540;    1445;    6115;    6013;     311;     413
SOYBEAN CAL SPR OPT OLD NEW CY - CHICAGO BOARD OF TRADE ;2010.05.18;    6494;    2947;    2578;    1959;    1505;    1839;    6411;    6376;      82;     117
SOYBEAN CAL SPR OPT OLD NEW CY - CHICAGO BOARD OF TRADE ;2010.05.11;    6648;    3088;    2683;    1756;    1459;    1787;    6303;    6226;     346;     423
SOYBEAN CAL SPR OPT OLD NEW CY - CHICAGO BOARD OF TRADE ;2010.05.04;    6344;    2510;    2387;    2079;    1526;    1583;    6114;    6050;     229;     294
SOYBEAN CAL SPR OPT OLD NEW CY - CHICAGO BOARD OF TRADE ;2010.04.27;    6810;    3277;    2334;    2062;    1205;    2041;    6544;    6437;     266;     373
SOYBEAN CAL SPR OPT OLD NEW CY - CHICAGO BOARD OF TRADE ;2010.04.13;    6504;    2864;    2153;    2107;    1257;    1850;    6227;    6110;     277;     394
SOYBEAN CAL SPR OPT OLD NEW CY - CHICAGO BOARD OF TRADE ;2010.06.08;    7196;    3698;    3430;    2019;    1100;    1491;    6816;    6940;     380;     256
SOYBEAN CAL SPR OPT OLD NEW CY - CHICAGO BOARD OF TRADE ;2010.06.01;    6476;    3029;    3413;    1619;    1589;    1044;    6237;    6076;     240;     400
SOYBEAN CAL SPR OPT OLD NEW CY - CHICAGO BOARD OF TRADE ;2010.05.25;    6426;    2814;    2807;    1761;    1540;    1445;    6115;    6013;     311;     413
SOYBEAN CAL SPR OPT OLD NEW CY - CHICAGO BOARD OF TRADE ;2010.05.18;    6494;    2947;    2578;    1959;    1505;    1839;    6411;    6376;      82;     117
SOYBEAN CAL SPR OPT OLD NEW CY - CHICAGO BOARD OF TRADE ;2010.05.11;    6648;    3088;    2683;    1756;    1459;    1787;    6303;    6226;     346;     423
SOYBEAN CAL SPR OPT OLD NEW CY - CHICAGO BOARD OF TRADE ;2010.05.04;    6344;    2510;    2387;    2079;    1526;    1583;    6114;    6050;     229;     294
SOYBEAN CAL SPR OPT OLD NEW CY - CHICAGO BOARD OF TRADE ;2010.04.27;    6810;    3277;    2334;    2062;    1205;    2041;    6544;    6437;     266;     373
SOYBEAN CAL SPR OPT OLD NEW CY - CHICAGO BOARD OF TRADE ;2010.04.13;    6504;    2864;    2153;    2107;    1257;    1850;    6227;    6110;     277;     394
