PJM PSEG PEAK DAY AHEAD - NEW YORK MERCANTILE EXCHANGE ;2011.07.12;   50189;       0;       0;       0;   50189;   50189;   50189;   50189;       0;       0
PJM PSEG PEAK DAY AHEAD - NEW YORK MERCANTILE EXCHANGE ;2011.07.12;   50189;       0;       0;       0;   50189;   50189;   50189;   50189;       0;       0
PJM PSEG PEAK DAY AHEAD - NEW YORK MERCANTILE EXCHANGE ;2010.12.28;   63111;       0;       0;       0;   63088;   63111;   63088;   63111;      23;       0
PJM PSEG PEAK DAY AHEAD - NEW YORK MERCANTILE EXCHANGE ;2010.12.21;   63111;       0;       0;       0;   63088;   63111;   63088;   63111;      23;       0
PJM PSEG PEAK DAY AHEAD - NEW YORK MERCANTILE EXCHANGE ;2010.12.14;   63101;       0;       0;       0;   63078;   63101;   63078;   63101;      23;       0
PJM PSEG PEAK DAY AHEAD - NEW YORK MERCANTILE EXCHANGE ;2010.12.07;   63101;       0;       0;       0;   63078;   63101;   63078;   63101;      23;       0
PJM PSEG PEAK DAY AHEAD - NEW YORK MERCANTILE EXCHANGE ;2010.11.30;   67301;       0;       0;       0;   67257;   67301;   67257;   67301;      44;       0
PJM PSEG PEAK DAY AHEAD - NEW YORK MERCANTILE EXCHANGE ;2010.11.23;   67301;       0;       0;       0;   67257;   67301;   67257;   67301;      44;       0
PJM PSEG PEAK DAY AHEAD - NEW YORK MERCANTILE EXCHANGE ;2010.11.16;   67301;       0;       0;       0;   67257;   67301;   67257;   67301;      44;       0
PJM PSEG PEAK DAY AHEAD - NEW YORK MERCANTILE EXCHANGE ;2010.11.09;   67301;       0;       0;       0;   67257;   67301;   67257;   67301;      44;       0
PJM PSEG PEAK DAY AHEAD - NEW YORK MERCANTILE EXCHANGE ;2010.11.02;   67301;       0;       0;       0;   67257;   67301;   67257;   67301;      44;       0
PJM PSEG PEAK DAY AHEAD - NEW YORK MERCANTILE EXCHANGE ;2010.10.26;   71396;       0;       0;       0;   71331;   71396;   71331;   71396;      65;       0
PJM PSEG PEAK DAY AHEAD - NEW YORK MERCANTILE EXCHANGE ;2010.10.19;   71396;       0;       0;       0;   71331;   71396;   71331;   71396;      65;       0
PJM PSEG PEAK DAY AHEAD - NEW YORK MERCANTILE EXCHANGE ;2010.10.12;   71061;       0;       0;       0;   70996;   71061;   70996;   71061;      65;       0
PJM PSEG PEAK DAY AHEAD - NEW YORK MERCANTILE EXCHANGE ;2010.10.05;   71061;       0;       0;       0;   70996;   71061;   70996;   71061;      65;       0
PJM PSEG PEAK DAY AHEAD - NEW YORK MERCANTILE EXCHANGE ;2010.09.28;   77465;       0;       0;       0;   77379;   77465;   77379;   77465;      86;       0
PJM PSEG PEAK DAY AHEAD - NEW YORK MERCANTILE EXCHANGE ;2010.09.21;   77465;       0;       0;       0;   77379;   77465;   77379;   77465;      86;       0
PJM PSEG PEAK DAY AHEAD - NEW YORK MERCANTILE EXCHANGE ;2010.09.14;   77465;       0;       0;       0;   77379;   77465;   77379;   77465;      86;       0
PJM PSEG PEAK DAY AHEAD - NEW YORK MERCANTILE EXCHANGE ;2010.09.07;   77465;       0;       0;       0;   77379;   77465;   77379;   77465;      86;       0
PJM PSEG PEAK DAY AHEAD - NEW YORK MERCANTILE EXCHANGE ;2010.08.31;   82349;       0;       0;       0;   82241;   82349;   82241;   82349;     108;       0
PJM PSEG PEAK DAY AHEAD - NEW YORK MERCANTILE EXCHANGE ;2010.08.24;   77774;       0;       0;       0;   77666;   77774;   77666;   77774;     108;       0
PJM PSEG PEAK DAY AHEAD - NEW YORK MERCANTILE EXCHANGE ;2010.08.17;   77753;       0;       0;       0;   77645;   77753;   77645;   77753;     108;       0
PJM PSEG PEAK DAY AHEAD - NEW YORK MERCANTILE EXCHANGE ;2010.08.10;   77076;       0;       0;       0;   70683;   77076;   70683;   77076;    6393;       0
PJM PSEG PEAK DAY AHEAD - NEW YORK MERCANTILE EXCHANGE ;2010.08.03;   72601;       0;       0;       0;   72493;   72601;   72493;   72601;     108;       0
PJM PSEG PEAK DAY AHEAD - NEW YORK MERCANTILE EXCHANGE ;2010.07.27;   77053;       0;       0;       0;   76924;   77053;   76924;   77053;     129;       0
PJM PSEG PEAK DAY AHEAD - NEW YORK MERCANTILE EXCHANGE ;2010.07.20;   77053;       0;       0;       0;   76924;   77053;   76924;   77053;     129;       0
PJM PSEG PEAK DAY AHEAD - NEW YORK MERCANTILE EXCHANGE ;2010.07.13;   76833;       0;       0;       0;   76704;   76833;   76704;   76833;     129;       0
PJM PSEG PEAK DAY AHEAD - NEW YORK MERCANTILE EXCHANGE ;2010.07.06;   76833;       0;       0;       0;   76704;   76833;   76704;   76833;     129;       0
PJM PSEG PEAK DAY AHEAD - NEW YORK MERCANTILE EXCHANGE ;2010.06.29;   81494;       0;       0;       0;   81343;   81494;   81343;   81494;     151;       0
PJM PSEG PEAK DAY AHEAD - NEW YORK MERCANTILE EXCHANGE ;2010.06.22;   81494;       0;       0;       0;   81343;   81494;   81343;   81494;     151;       0
PJM PSEG PEAK DAY AHEAD - NEW YORK MERCANTILE EXCHANGE ;2010.06.15;   82260;       0;       0;       0;   82109;   82260;   82109;   82260;     151;       0
PJM PSEG PEAK DAY AHEAD - NEW YORK MERCANTILE EXCHANGE ;2010.06.08;   82260;       0;       0;       0;   82109;   82260;   82109;   82260;     151;       0
PJM PSEG PEAK DAY AHEAD - NEW YORK MERCANTILE EXCHANGE ;2010.06.01;   81830;       0;       0;       0;   81679;   81830;   81679;   81830;     151;       0
PJM PSEG PEAK DAY AHEAD - NEW YORK MERCANTILE EXCHANGE ;2010.05.25;   86070;       0;     300;       0;   85919;   85770;   85919;   86070;     151;       0
PJM PSEG PEAK DAY AHEAD - NEW YORK MERCANTILE EXCHANGE ;2010.05.18;   84795;       0;     300;       0;   84644;   84495;   84644;   84795;     151;       0
PJM PSEG PEAK DAY AHEAD - NEW YORK MERCANTILE EXCHANGE ;2010.05.11;   84795;       0;     300;       0;   84644;   84495;   84644;   84795;     151;       0
PJM PSEG PEAK DAY AHEAD - NEW YORK MERCANTILE EXCHANGE ;2010.05.04;   85309;       0;     300;       0;   85158;   85009;   85158;   85309;     151;       0
PJM PSEG PEAK DAY AHEAD - NEW YORK MERCANTILE EXCHANGE ;2010.04.27;   87982;     770;     630;       0;   87061;   87352;   87831;   87982;     151;       0
PJM PSEG PEAK DAY AHEAD - NEW YORK MERCANTILE EXCHANGE ;2010.04.20;   87725;     770;     630;       0;   86804;   87095;   87574;   87725;     151;       0
PJM PSEG PEAK DAY AHEAD - NEW YORK MERCANTILE EXCHANGE ;2010.04.13;   87725;     770;     630;       0;   86804;   87095;   87574;   87725;     151;       0
PJM PSEG PEAK DAY AHEAD - NEW YORK MERCANTILE EXCHANGE ;2010.04.06;   87725;     770;     630;       0;   86804;   87095;   87574;   87725;     151;       0
PJM PSEG PEAK DAY AHEAD - NEW YORK MERCANTILE EXCHANGE ;2010.03.30;   90645;       0;     975;       0;   89724;   89670;   89724;   90645;     921;       0
PJM PSEG PEAK DAY AHEAD - NEW YORK MERCANTILE EXCHANGE ;2010.03.23;   91991;       0;    3545;       0;   91840;   88446;   91840;   91991;     151;       0
PJM PSEG PEAK DAY AHEAD - NEW YORK MERCANTILE EXCHANGE ;2010.03.16;   90711;       0;    3545;       0;   90560;   87166;   90560;   90711;     151;       0
PJM PSEG PEAK DAY AHEAD - NEW YORK MERCANTILE EXCHANGE ;2010.03.09;   90711;       0;    3545;       0;   90560;   87166;   90560;   90711;     151;       0
PJM PSEG PEAK DAY AHEAD - NEW YORK MERCANTILE EXCHANGE ;2010.03.02;   90667;       0;    3545;       0;   90516;   87122;   90516;   90667;     151;       0
PJM PSEG PEAK DAY AHEAD - NEW YORK MERCANTILE EXCHANGE ;2010.02.23;   96523;       0;    3945;       0;   96372;   92578;   96372;   96523;     151;       0
PJM PSEG PEAK DAY AHEAD - NEW YORK MERCANTILE EXCHANGE ;2010.02.16;   96392;       0;    3945;       0;   96241;   92447;   96241;   96392;     151;       0
PJM PSEG PEAK DAY AHEAD - NEW YORK MERCANTILE EXCHANGE ;2010.02.09;   93588;       0;    3945;       0;   93437;   89643;   93437;   93588;     151;       0
PJM PSEG PEAK DAY AHEAD - NEW YORK MERCANTILE EXCHANGE ;2010.02.02;   90693;       0;    3945;       0;   90542;   86748;   90542;   90693;     151;       0
PJM PSEG PEAK DAY AHEAD - NEW YORK MERCANTILE EXCHANGE ;2010.01.26;   95883;       0;    4345;       0;   95883;   91538;   95883;   95883;       0;       0
PJM PSEG PEAK DAY AHEAD - NEW YORK MERCANTILE EXCHANGE ;2010.01.19;   91553;       0;    4345;       0;   90753;   86408;   90753;   90753;     800;     800
PJM PSEG PEAK DAY AHEAD - NEW YORK MERCANTILE EXCHANGE ;2010.01.12;   91298;       0;    4345;       0;   90498;   86153;   90498;   90498;     800;     800
PJM PSEG PEAK DAY AHEAD - NEW YORK MERCANTILE EXCHANGE ;2010.01.05;   91298;       0;    4345;       0;   90498;   86153;   90498;   90498;     800;     800
PJM PSEG PEAK DAY AHEAD - NEW YORK MERCANTILE EXCHANGE ;2009.12.29;   97812;       0;    5275;       0;   97012;   91697;   97012;   96972;     800;     840
PJM PSEG PEAK DAY AHEAD - NEW YORK MERCANTILE EXCHANGE ;2009.12.22;   97812;       0;    5275;       0;   97012;   91697;   97012;   96972;     800;     840
PJM PSEG PEAK DAY AHEAD - NEW YORK MERCANTILE EXCHANGE ;2009.12.15;   97661;       0;    5275;       0;   96861;   91546;   96861;   96821;     800;     840
PJM PSEG PEAK DAY AHEAD - NEW YORK MERCANTILE EXCHANGE ;2009.12.08;   96861;       0;    5275;       0;   96861;   91546;   96861;   96821;       0;      40
PJM PSEG PEAK DAY AHEAD - NEW YORK MERCANTILE EXCHANGE ;2009.12.01;   96501;       0;    5275;       0;   96501;   91186;   96501;   96461;       0;      40
PJM PSEG PEAK DAY AHEAD - NEW YORK MERCANTILE EXCHANGE ;2009.11.24;  101801;       0;    5575;       0;  101801;   96186;  101801;  101761;       0;      40
PJM PSEG PEAK DAY AHEAD - NEW YORK MERCANTILE EXCHANGE ;2009.11.17;  100476;       0;    5575;       0;  100178;   94861;  100178;  100436;     298;      40
PJM PSEG PEAK DAY AHEAD - NEW YORK MERCANTILE EXCHANGE ;2009.11.09;   98101;       0;    5575;       0;   98101;   92526;   98101;   98101;       0;       0
PJM PSEG PEAK DAY AHEAD - NEW YORK MERCANTILE EXCHANGE ;2009.11.03;   90909;       0;    5575;       0;   90909;   85334;   90909;   90909;       0;       0
PJM PSEG PEAK DAY AHEAD - NEW YORK MERCANTILE EXCHANGE ;2009.10.27;   94349;       0;    5905;       0;   94349;   88444;   94349;   94349;       0;       0
PJM PSEG PEAK DAY AHEAD - NEW YORK MERCANTILE EXCHANGE ;2009.10.20;   90795;       0;    5905;       0;   90795;   84890;   90795;   90795;       0;       0
PJM PSEG PEAK DAY AHEAD - NEW YORK MERCANTILE EXCHANGE ;2009.10.13;   90795;       0;    5905;       0;   90795;   84890;   90795;   90795;       0;       0
PJM PSEG PEAK DAY AHEAD - NEW YORK MERCANTILE EXCHANGE ;2009.10.06;   90695;       0;    5905;       0;   90695;   84790;   90695;   90695;       0;       0
PJM PSEG PEAK DAY AHEAD - NEW YORK MERCANTILE EXCHANGE ;2009.09.29;   95756;       0;    6325;       0;   95756;   89431;   95756;   95756;       0;       0
PJM PSEG PEAK DAY AHEAD - NEW YORK MERCANTILE EXCHANGE ;2009.09.22;   94956;       0;    6325;       0;   94956;   88631;   94956;   94956;       0;       0
PJM PSEG PEAK DAY AHEAD - NEW YORK MERCANTILE EXCHANGE ;2009.09.15;   94956;       0;    6325;       0;   94956;   88631;   94956;   94956;       0;       0
PJM PSEG PEAK DAY AHEAD - NEW YORK MERCANTILE EXCHANGE ;2009.09.08;   94344;       0;    6325;       0;   94344;   88019;   94344;   94344;       0;       0
PJM PSEG PEAK DAY AHEAD - NEW YORK MERCANTILE EXCHANGE ;2009.09.01;   94304;       0;    6325;       0;   94304;   87979;   94304;   94304;       0;       0
PJM PSEG PEAK DAY AHEAD - NEW YORK MERCANTILE EXCHANGE ;2009.08.25;   98694;       0;    6745;       0;   98694;   91949;   98694;   98694;       0;       0
PJM PSEG PEAK DAY AHEAD - NEW YORK MERCANTILE EXCHANGE ;2009.08.18;   99164;       0;    6888;    4997;   94167;   87279;   99164;   99164;       0;       0
PJM PSEG PEAK DAY AHEAD - NEW YORK MERCANTILE EXCHANGE ;2009.08.11;   98474;       0;    6888;    4997;   93477;   86589;   98474;   98474;       0;       0
PJM PSEG PEAK DAY AHEAD - NEW YORK MERCANTILE EXCHANGE ;2009.08.04;   97787;       0;    7208;    4677;   93110;   85902;   97787;   97787;       0;       0
PJM PSEG PEAK DAY AHEAD - NEW YORK MERCANTILE EXCHANGE ;2009.07.28;  102494;     683;    7205;    5140;   96671;   90149;  102494;  102494;       0;       0
PJM PSEG PEAK DAY AHEAD - NEW YORK MERCANTILE EXCHANGE ;2009.07.21;  102894;     683;    7605;    5140;   97071;   90149;  102894;  102894;       0;       0
PJM PSEG PEAK DAY AHEAD - NEW YORK MERCANTILE EXCHANGE ;2009.07.14;  100303;     683;    7605;    5140;   94480;   87558;  100303;  100303;       0;       0
PJM PSEG PEAK DAY AHEAD - NEW YORK MERCANTILE EXCHANGE ;2009.07.07;  102763;     683;    7605;    5140;   96940;   90018;  102763;  102763;       0;       0
PJM PSEG PEAK DAY AHEAD - NEW YORK MERCANTILE EXCHANGE ;2009.06.30;  104803;    1057;    8265;    5140;   98606;   91398;  104803;  104803;       0;       0
PJM PSEG PEAK DAY AHEAD - NEW YORK MERCANTILE EXCHANGE ;2009.06.23;  106173;    1057;    8265;    5140;   99976;   92768;  106173;  106173;       0;       0
PJM PSEG PEAK DAY AHEAD - NEW YORK MERCANTILE EXCHANGE ;2009.06.16;  102318;    6197;    8265;       0;   96121;   94053;  102318;  102318;       0;       0
PJM PSEG PEAK DAY AHEAD - NEW YORK MERCANTILE EXCHANGE ;2009.06.09;  102318;    6197;    8045;       0;   96121;   94273;  102318;  102318;       0;       0
PJM PSEG PEAK DAY AHEAD - NEW YORK MERCANTILE EXCHANGE ;2009.06.02;   99408;    6197;    8045;       0;   93211;   91363;   99408;   99408;       0;       0
PJM PSEG PEAK DAY AHEAD - NEW YORK MERCANTILE EXCHANGE ;2009.05.26;  101128;    6697;    8645;       0;   94431;   92483;  101128;  101128;       0;       0
PJM PSEG PEAK DAY AHEAD - NEW YORK MERCANTILE EXCHANGE ;2009.05.19;   99684;    6277;    8645;       0;   93407;   91039;   99684;   99684;       0;       0
PJM PSEG PEAK DAY AHEAD - NEW YORK MERCANTILE EXCHANGE ;2009.05.12;   99414;    6167;    8645;       0;   93247;   90769;   99414;   99414;       0;       0
PJM PSEG PEAK DAY AHEAD - NEW YORK MERCANTILE EXCHANGE ;2009.05.05;   97745;    6167;    8645;       0;   91578;   89100;   97745;   97745;       0;       0
PJM PSEG PEAK DAY AHEAD - NEW YORK MERCANTILE EXCHANGE ;2011.07.12;   50189;       0;       0;       0;   50189;   50189;   50189;   50189;       0;       0
PJM PSEG PEAK DAY AHEAD - NEW YORK MERCANTILE EXCHANGE ;2011.07.05;   49934;       0;       0;       0;   49934;   49934;   49934;   49934;       0;       0
PJM PSEG PEAK DAY AHEAD - NEW YORK MERCANTILE EXCHANGE ;2011.06.28;   53498;       0;       0;       0;   53498;   53498;   53498;   53498;       0;       0
PJM PSEG PEAK DAY AHEAD - NEW YORK MERCANTILE EXCHANGE ;2011.06.21;   53498;       0;       0;       0;   53498;   53498;   53498;   53498;       0;       0
PJM PSEG PEAK DAY AHEAD - NEW YORK MERCANTILE EXCHANGE ;2011.06.14;   53498;       0;       0;       0;   53498;   53498;   53498;   53498;       0;       0
PJM PSEG PEAK DAY AHEAD - NEW YORK MERCANTILE EXCHANGE ;2011.06.07;   53498;       0;       0;       0;   53498;   53498;   53498;   53498;       0;       0
PJM PSEG PEAK DAY AHEAD - NEW YORK MERCANTILE EXCHANGE ;2011.05.31;   57593;       0;       0;       0;   57593;   57593;   57593;   57593;       0;       0
PJM PSEG PEAK DAY AHEAD - NEW YORK MERCANTILE EXCHANGE ;2011.05.24;   57593;       0;       0;       0;   57593;   57593;   57593;   57593;       0;       0
PJM PSEG PEAK DAY AHEAD - NEW YORK MERCANTILE EXCHANGE ;2011.05.17;   55778;       0;       0;       0;   55778;   55778;   55778;   55778;       0;       0
PJM PSEG PEAK DAY AHEAD - NEW YORK MERCANTILE EXCHANGE ;2011.05.10;   52808;       0;       0;       0;   52808;   52808;   52808;   52808;       0;       0
PJM PSEG PEAK DAY AHEAD - NEW YORK MERCANTILE EXCHANGE ;2011.05.03;   52493;       0;       0;       0;   52493;   52493;   52493;   52493;       0;       0
PJM PSEG PEAK DAY AHEAD - NEW YORK MERCANTILE EXCHANGE ;2011.04.26;   56651;       0;     210;       0;   56651;   56441;   56651;   56651;       0;       0
PJM PSEG PEAK DAY AHEAD - NEW YORK MERCANTILE EXCHANGE ;2011.04.19;   55371;       0;     210;       0;   55371;   55161;   55371;   55371;       0;       0
PJM PSEG PEAK DAY AHEAD - NEW YORK MERCANTILE EXCHANGE ;2011.04.12;   54931;       0;     210;       0;   54931;   54721;   54931;   54931;       0;       0
PJM PSEG PEAK DAY AHEAD - NEW YORK MERCANTILE EXCHANGE ;2011.04.05;   57061;       0;     210;       0;   57061;   56851;   57061;   57061;       0;       0
PJM PSEG PEAK DAY AHEAD - NEW YORK MERCANTILE EXCHANGE ;2011.03.29;   62052;       0;     210;       0;   62052;   61842;   62052;   62052;       0;       0
PJM PSEG PEAK DAY AHEAD - NEW YORK MERCANTILE EXCHANGE ;2011.03.22;   62052;       0;     210;       0;   62052;   61842;   62052;   62052;       0;       0
PJM PSEG PEAK DAY AHEAD - NEW YORK MERCANTILE EXCHANGE ;2011.03.15;   62052;       0;     210;       0;   62052;   61842;   62052;   62052;       0;       0
PJM PSEG PEAK DAY AHEAD - NEW YORK MERCANTILE EXCHANGE ;2011.03.08;   62010;       0;     210;       0;   62010;   61800;   62010;   62010;       0;       0
PJM PSEG PEAK DAY AHEAD - NEW YORK MERCANTILE EXCHANGE ;2011.03.01;   61800;       0;       0;       0;   61800;   61800;   61800;   61800;       0;       0
PJM PSEG PEAK DAY AHEAD - NEW YORK MERCANTILE EXCHANGE ;2011.02.22;   62760;       0;       0;       0;   62760;   62760;   62760;   62760;       0;       0
PJM PSEG PEAK DAY AHEAD - NEW YORK MERCANTILE EXCHANGE ;2011.02.15;   62545;       0;       0;       0;   62545;   62545;   62545;   62545;       0;       0
PJM PSEG PEAK DAY AHEAD - NEW YORK MERCANTILE EXCHANGE ;2011.02.08;   61299;       0;       0;       0;   61299;   61299;   61299;   61299;       0;       0
PJM PSEG PEAK DAY AHEAD - NEW YORK MERCANTILE EXCHANGE ;2011.02.01;   53964;       0;       0;       0;   53964;   53964;   53964;   53964;       0;       0
PJM PSEG PEAK DAY AHEAD - NEW YORK MERCANTILE EXCHANGE ;2011.01.25;   58626;       0;       0;       0;   58626;   58626;   58626;   58626;       0;       0
PJM PSEG PEAK DAY AHEAD - NEW YORK MERCANTILE EXCHANGE ;2011.01.18;   58396;       0;       0;       0;   58396;   58396;   58396;   58396;       0;       0
PJM PSEG PEAK DAY AHEAD - NEW YORK MERCANTILE EXCHANGE ;2011.01.11;   58396;       0;       0;       0;   58396;   58396;   58396;   58396;       0;       0
PJM PSEG PEAK DAY AHEAD - NEW YORK MERCANTILE EXCHANGE ;2011.01.04;   58396;       0;       0;       0;   58396;   58396;   58396;   58396;       0;       0
PJM PSEG PEAK DAY AHEAD - NEW YORK MERCANTILE EXCHANGE ;2011.07.12;   50189;       0;       0;       0;   50189;   50189;   50189;   50189;       0;       0
PJM PSEG PEAK DAY AHEAD - NEW YORK MERCANTILE EXCHANGE ;2010.12.28;   63111;       0;       0;       0;   63088;   63111;   63088;   63111;      23;       0
PJM PSEG PEAK DAY AHEAD - NEW YORK MERCANTILE EXCHANGE ;2010.12.21;   63111;       0;       0;       0;   63088;   63111;   63088;   63111;      23;       0
PJM PSEG PEAK DAY AHEAD - NEW YORK MERCANTILE EXCHANGE ;2010.12.14;   63101;       0;       0;       0;   63078;   63101;   63078;   63101;      23;       0
PJM PSEG PEAK DAY AHEAD - NEW YORK MERCANTILE EXCHANGE ;2010.12.07;   63101;       0;       0;       0;   63078;   63101;   63078;   63101;      23;       0
PJM PSEG PEAK DAY AHEAD - NEW YORK MERCANTILE EXCHANGE ;2010.11.30;   67301;       0;       0;       0;   67257;   67301;   67257;   67301;      44;       0
PJM PSEG PEAK DAY AHEAD - NEW YORK MERCANTILE EXCHANGE ;2010.11.23;   67301;       0;       0;       0;   67257;   67301;   67257;   67301;      44;       0
PJM PSEG PEAK DAY AHEAD - NEW YORK MERCANTILE EXCHANGE ;2010.11.16;   67301;       0;       0;       0;   67257;   67301;   67257;   67301;      44;       0
PJM PSEG PEAK DAY AHEAD - NEW YORK MERCANTILE EXCHANGE ;2010.11.09;   67301;       0;       0;       0;   67257;   67301;   67257;   67301;      44;       0
PJM PSEG PEAK DAY AHEAD - NEW YORK MERCANTILE EXCHANGE ;2010.11.02;   67301;       0;       0;       0;   67257;   67301;   67257;   67301;      44;       0
PJM PSEG PEAK DAY AHEAD - NEW YORK MERCANTILE EXCHANGE ;2010.10.26;   71396;       0;       0;       0;   71331;   71396;   71331;   71396;      65;       0
PJM PSEG PEAK DAY AHEAD - NEW YORK MERCANTILE EXCHANGE ;2010.10.19;   71396;       0;       0;       0;   71331;   71396;   71331;   71396;      65;       0
PJM PSEG PEAK DAY AHEAD - NEW YORK MERCANTILE EXCHANGE ;2010.10.12;   71061;       0;       0;       0;   70996;   71061;   70996;   71061;      65;       0
PJM PSEG PEAK DAY AHEAD - NEW YORK MERCANTILE EXCHANGE ;2010.10.05;   71061;       0;       0;       0;   70996;   71061;   70996;   71061;      65;       0
PJM PSEG PEAK DAY AHEAD - NEW YORK MERCANTILE EXCHANGE ;2010.09.28;   77465;       0;       0;       0;   77379;   77465;   77379;   77465;      86;       0
PJM PSEG PEAK DAY AHEAD - NEW YORK MERCANTILE EXCHANGE ;2010.09.21;   77465;       0;       0;       0;   77379;   77465;   77379;   77465;      86;       0
PJM PSEG PEAK DAY AHEAD - NEW YORK MERCANTILE EXCHANGE ;2010.09.14;   77465;       0;       0;       0;   77379;   77465;   77379;   77465;      86;       0
PJM PSEG PEAK DAY AHEAD - NEW YORK MERCANTILE EXCHANGE ;2010.09.07;   77465;       0;       0;       0;   77379;   77465;   77379;   77465;      86;       0
PJM PSEG PEAK DAY AHEAD - NEW YORK MERCANTILE EXCHANGE ;2010.08.31;   82349;       0;       0;       0;   82241;   82349;   82241;   82349;     108;       0
PJM PSEG PEAK DAY AHEAD - NEW YORK MERCANTILE EXCHANGE ;2010.08.24;   77774;       0;       0;       0;   77666;   77774;   77666;   77774;     108;       0
PJM PSEG PEAK DAY AHEAD - NEW YORK MERCANTILE EXCHANGE ;2010.08.17;   77753;       0;       0;       0;   77645;   77753;   77645;   77753;     108;       0
PJM PSEG PEAK DAY AHEAD - NEW YORK MERCANTILE EXCHANGE ;2010.08.10;   77076;       0;       0;       0;   70683;   77076;   70683;   77076;    6393;       0
PJM PSEG PEAK DAY AHEAD - NEW YORK MERCANTILE EXCHANGE ;2010.08.03;   72601;       0;       0;       0;   72493;   72601;   72493;   72601;     108;       0
PJM PSEG PEAK DAY AHEAD - NEW YORK MERCANTILE EXCHANGE ;2010.07.27;   77053;       0;       0;       0;   76924;   77053;   76924;   77053;     129;       0
PJM PSEG PEAK DAY AHEAD - NEW YORK MERCANTILE EXCHANGE ;2010.07.20;   77053;       0;       0;       0;   76924;   77053;   76924;   77053;     129;       0
PJM PSEG PEAK DAY AHEAD - NEW YORK MERCANTILE EXCHANGE ;2010.07.13;   76833;       0;       0;       0;   76704;   76833;   76704;   76833;     129;       0
PJM PSEG PEAK DAY AHEAD - NEW YORK MERCANTILE EXCHANGE ;2010.07.06;   76833;       0;       0;       0;   76704;   76833;   76704;   76833;     129;       0
PJM PSEG PEAK DAY AHEAD - NEW YORK MERCANTILE EXCHANGE ;2010.06.29;   81494;       0;       0;       0;   81343;   81494;   81343;   81494;     151;       0
PJM PSEG PEAK DAY AHEAD - NEW YORK MERCANTILE EXCHANGE ;2010.06.22;   81494;       0;       0;       0;   81343;   81494;   81343;   81494;     151;       0
PJM PSEG PEAK DAY AHEAD - NEW YORK MERCANTILE EXCHANGE ;2010.06.15;   82260;       0;       0;       0;   82109;   82260;   82109;   82260;     151;       0
PJM PSEG PEAK DAY AHEAD - NEW YORK MERCANTILE EXCHANGE ;2010.06.08;   82260;       0;       0;       0;   82109;   82260;   82109;   82260;     151;       0
PJM PSEG PEAK DAY AHEAD - NEW YORK MERCANTILE EXCHANGE ;2010.06.01;   81830;       0;       0;       0;   81679;   81830;   81679;   81830;     151;       0
PJM PSEG PEAK DAY AHEAD - NEW YORK MERCANTILE EXCHANGE ;2010.05.25;   86070;       0;     300;       0;   85919;   85770;   85919;   86070;     151;       0
PJM PSEG PEAK DAY AHEAD - NEW YORK MERCANTILE EXCHANGE ;2010.05.18;   84795;       0;     300;       0;   84644;   84495;   84644;   84795;     151;       0
PJM PSEG PEAK DAY AHEAD - NEW YORK MERCANTILE EXCHANGE ;2010.05.11;   84795;       0;     300;       0;   84644;   84495;   84644;   84795;     151;       0
PJM PSEG PEAK DAY AHEAD - NEW YORK MERCANTILE EXCHANGE ;2010.05.04;   85309;       0;     300;       0;   85158;   85009;   85158;   85309;     151;       0
PJM PSEG PEAK DAY AHEAD - NEW YORK MERCANTILE EXCHANGE ;2010.04.27;   87982;     770;     630;       0;   87061;   87352;   87831;   87982;     151;       0
PJM PSEG PEAK DAY AHEAD - NEW YORK MERCANTILE EXCHANGE ;2010.04.20;   87725;     770;     630;       0;   86804;   87095;   87574;   87725;     151;       0
PJM PSEG PEAK DAY AHEAD - NEW YORK MERCANTILE EXCHANGE ;2010.04.13;   87725;     770;     630;       0;   86804;   87095;   87574;   87725;     151;       0
PJM PSEG PEAK DAY AHEAD - NEW YORK MERCANTILE EXCHANGE ;2010.04.06;   87725;     770;     630;       0;   86804;   87095;   87574;   87725;     151;       0
PJM PSEG PEAK DAY AHEAD - NEW YORK MERCANTILE EXCHANGE ;2010.03.30;   90645;       0;     975;       0;   89724;   89670;   89724;   90645;     921;       0
PJM PSEG PEAK DAY AHEAD - NEW YORK MERCANTILE EXCHANGE ;2010.03.23;   91991;       0;    3545;       0;   91840;   88446;   91840;   91991;     151;       0
PJM PSEG PEAK DAY AHEAD - NEW YORK MERCANTILE EXCHANGE ;2010.03.16;   90711;       0;    3545;       0;   90560;   87166;   90560;   90711;     151;       0
PJM PSEG PEAK DAY AHEAD - NEW YORK MERCANTILE EXCHANGE ;2010.03.09;   90711;       0;    3545;       0;   90560;   87166;   90560;   90711;     151;       0
PJM PSEG PEAK DAY AHEAD - NEW YORK MERCANTILE EXCHANGE ;2010.03.02;   90667;       0;    3545;       0;   90516;   87122;   90516;   90667;     151;       0
PJM PSEG PEAK DAY AHEAD - NEW YORK MERCANTILE EXCHANGE ;2010.02.23;   96523;       0;    3945;       0;   96372;   92578;   96372;   96523;     151;       0
PJM PSEG PEAK DAY AHEAD - NEW YORK MERCANTILE EXCHANGE ;2010.02.16;   96392;       0;    3945;       0;   96241;   92447;   96241;   96392;     151;       0
PJM PSEG PEAK DAY AHEAD - NEW YORK MERCANTILE EXCHANGE ;2010.02.09;   93588;       0;    3945;       0;   93437;   89643;   93437;   93588;     151;       0
PJM PSEG PEAK DAY AHEAD - NEW YORK MERCANTILE EXCHANGE ;2010.02.02;   90693;       0;    3945;       0;   90542;   86748;   90542;   90693;     151;       0
PJM PSEG PEAK DAY AHEAD - NEW YORK MERCANTILE EXCHANGE ;2010.01.26;   95883;       0;    4345;       0;   95883;   91538;   95883;   95883;       0;       0
PJM PSEG PEAK DAY AHEAD - NEW YORK MERCANTILE EXCHANGE ;2010.01.19;   91553;       0;    4345;       0;   90753;   86408;   90753;   90753;     800;     800
PJM PSEG PEAK DAY AHEAD - NEW YORK MERCANTILE EXCHANGE ;2010.01.12;   91298;       0;    4345;       0;   90498;   86153;   90498;   90498;     800;     800
PJM PSEG PEAK DAY AHEAD - NEW YORK MERCANTILE EXCHANGE ;2010.01.05;   91298;       0;    4345;       0;   90498;   86153;   90498;   90498;     800;     800
PJM PSEG PEAK DAY AHEAD - NEW YORK MERCANTILE EXCHANGE ;2009.12.29;   97812;       0;    5275;       0;   97012;   91697;   97012;   96972;     800;     840
PJM PSEG PEAK DAY AHEAD - NEW YORK MERCANTILE EXCHANGE ;2009.12.22;   97812;       0;    5275;       0;   97012;   91697;   97012;   96972;     800;     840
PJM PSEG PEAK DAY AHEAD - NEW YORK MERCANTILE EXCHANGE ;2009.12.15;   97661;       0;    5275;       0;   96861;   91546;   96861;   96821;     800;     840
PJM PSEG PEAK DAY AHEAD - NEW YORK MERCANTILE EXCHANGE ;2009.12.08;   96861;       0;    5275;       0;   96861;   91546;   96861;   96821;       0;      40
PJM PSEG PEAK DAY AHEAD - NEW YORK MERCANTILE EXCHANGE ;2009.12.01;   96501;       0;    5275;       0;   96501;   91186;   96501;   96461;       0;      40
PJM PSEG PEAK DAY AHEAD - NEW YORK MERCANTILE EXCHANGE ;2009.11.24;  101801;       0;    5575;       0;  101801;   96186;  101801;  101761;       0;      40
PJM PSEG PEAK DAY AHEAD - NEW YORK MERCANTILE EXCHANGE ;2009.11.17;  100476;       0;    5575;       0;  100178;   94861;  100178;  100436;     298;      40
PJM PSEG PEAK DAY AHEAD - NEW YORK MERCANTILE EXCHANGE ;2009.11.09;   98101;       0;    5575;       0;   98101;   92526;   98101;   98101;       0;       0
PJM PSEG PEAK DAY AHEAD - NEW YORK MERCANTILE EXCHANGE ;2009.11.03;   90909;       0;    5575;       0;   90909;   85334;   90909;   90909;       0;       0
PJM PSEG PEAK DAY AHEAD - NEW YORK MERCANTILE EXCHANGE ;2009.10.27;   94349;       0;    5905;       0;   94349;   88444;   94349;   94349;       0;       0
PJM PSEG PEAK DAY AHEAD - NEW YORK MERCANTILE EXCHANGE ;2009.10.20;   90795;       0;    5905;       0;   90795;   84890;   90795;   90795;       0;       0
PJM PSEG PEAK DAY AHEAD - NEW YORK MERCANTILE EXCHANGE ;2009.10.13;   90795;       0;    5905;       0;   90795;   84890;   90795;   90795;       0;       0
PJM PSEG PEAK DAY AHEAD - NEW YORK MERCANTILE EXCHANGE ;2009.10.06;   90695;       0;    5905;       0;   90695;   84790;   90695;   90695;       0;       0
PJM PSEG PEAK DAY AHEAD - NEW YORK MERCANTILE EXCHANGE ;2009.09.29;   95756;       0;    6325;       0;   95756;   89431;   95756;   95756;       0;       0
PJM PSEG PEAK DAY AHEAD - NEW YORK MERCANTILE EXCHANGE ;2009.09.22;   94956;       0;    6325;       0;   94956;   88631;   94956;   94956;       0;       0
PJM PSEG PEAK DAY AHEAD - NEW YORK MERCANTILE EXCHANGE ;2009.09.15;   94956;       0;    6325;       0;   94956;   88631;   94956;   94956;       0;       0
PJM PSEG PEAK DAY AHEAD - NEW YORK MERCANTILE EXCHANGE ;2009.09.08;   94344;       0;    6325;       0;   94344;   88019;   94344;   94344;       0;       0
PJM PSEG PEAK DAY AHEAD - NEW YORK MERCANTILE EXCHANGE ;2009.09.01;   94304;       0;    6325;       0;   94304;   87979;   94304;   94304;       0;       0
PJM PSEG PEAK DAY AHEAD - NEW YORK MERCANTILE EXCHANGE ;2009.08.25;   98694;       0;    6745;       0;   98694;   91949;   98694;   98694;       0;       0
PJM PSEG PEAK DAY AHEAD - NEW YORK MERCANTILE EXCHANGE ;2009.08.18;   99164;       0;    6888;    4997;   94167;   87279;   99164;   99164;       0;       0
PJM PSEG PEAK DAY AHEAD - NEW YORK MERCANTILE EXCHANGE ;2009.08.11;   98474;       0;    6888;    4997;   93477;   86589;   98474;   98474;       0;       0
PJM PSEG PEAK DAY AHEAD - NEW YORK MERCANTILE EXCHANGE ;2009.08.04;   97787;       0;    7208;    4677;   93110;   85902;   97787;   97787;       0;       0
PJM PSEG PEAK DAY AHEAD - NEW YORK MERCANTILE EXCHANGE ;2009.07.28;  102494;     683;    7205;    5140;   96671;   90149;  102494;  102494;       0;       0
PJM PSEG PEAK DAY AHEAD - NEW YORK MERCANTILE EXCHANGE ;2009.07.21;  102894;     683;    7605;    5140;   97071;   90149;  102894;  102894;       0;       0
PJM PSEG PEAK DAY AHEAD - NEW YORK MERCANTILE EXCHANGE ;2009.07.14;  100303;     683;    7605;    5140;   94480;   87558;  100303;  100303;       0;       0
PJM PSEG PEAK DAY AHEAD - NEW YORK MERCANTILE EXCHANGE ;2009.07.07;  102763;     683;    7605;    5140;   96940;   90018;  102763;  102763;       0;       0
PJM PSEG PEAK DAY AHEAD - NEW YORK MERCANTILE EXCHANGE ;2009.06.30;  104803;    1057;    8265;    5140;   98606;   91398;  104803;  104803;       0;       0
PJM PSEG PEAK DAY AHEAD - NEW YORK MERCANTILE EXCHANGE ;2009.06.23;  106173;    1057;    8265;    5140;   99976;   92768;  106173;  106173;       0;       0
PJM PSEG PEAK DAY AHEAD - NEW YORK MERCANTILE EXCHANGE ;2009.06.16;  102318;    6197;    8265;       0;   96121;   94053;  102318;  102318;       0;       0
PJM PSEG PEAK DAY AHEAD - NEW YORK MERCANTILE EXCHANGE ;2009.06.09;  102318;    6197;    8045;       0;   96121;   94273;  102318;  102318;       0;       0
PJM PSEG PEAK DAY AHEAD - NEW YORK MERCANTILE EXCHANGE ;2009.06.02;   99408;    6197;    8045;       0;   93211;   91363;   99408;   99408;       0;       0
PJM PSEG PEAK DAY AHEAD - NEW YORK MERCANTILE EXCHANGE ;2009.05.26;  101128;    6697;    8645;       0;   94431;   92483;  101128;  101128;       0;       0
PJM PSEG PEAK DAY AHEAD - NEW YORK MERCANTILE EXCHANGE ;2009.05.19;   99684;    6277;    8645;       0;   93407;   91039;   99684;   99684;       0;       0
PJM PSEG PEAK DAY AHEAD - NEW YORK MERCANTILE EXCHANGE ;2009.05.12;   99414;    6167;    8645;       0;   93247;   90769;   99414;   99414;       0;       0
PJM PSEG PEAK DAY AHEAD - NEW YORK MERCANTILE EXCHANGE ;2009.05.05;   97745;    6167;    8645;       0;   91578;   89100;   97745;   97745;       0;       0
PJM PSEG PEAK DAY AHEAD - NEW YORK MERCANTILE EXCHANGE ;2011.07.12;   50189;       0;       0;       0;   50189;   50189;   50189;   50189;       0;       0
PJM PSEG PEAK DAY AHEAD - NEW YORK MERCANTILE EXCHANGE ;2011.07.05;   49934;       0;       0;       0;   49934;   49934;   49934;   49934;       0;       0
PJM PSEG PEAK DAY AHEAD - NEW YORK MERCANTILE EXCHANGE ;2011.06.28;   53498;       0;       0;       0;   53498;   53498;   53498;   53498;       0;       0
PJM PSEG PEAK DAY AHEAD - NEW YORK MERCANTILE EXCHANGE ;2011.06.21;   53498;       0;       0;       0;   53498;   53498;   53498;   53498;       0;       0
PJM PSEG PEAK DAY AHEAD - NEW YORK MERCANTILE EXCHANGE ;2011.06.14;   53498;       0;       0;       0;   53498;   53498;   53498;   53498;       0;       0
PJM PSEG PEAK DAY AHEAD - NEW YORK MERCANTILE EXCHANGE ;2011.06.07;   53498;       0;       0;       0;   53498;   53498;   53498;   53498;       0;       0
PJM PSEG PEAK DAY AHEAD - NEW YORK MERCANTILE EXCHANGE ;2011.05.31;   57593;       0;       0;       0;   57593;   57593;   57593;   57593;       0;       0
PJM PSEG PEAK DAY AHEAD - NEW YORK MERCANTILE EXCHANGE ;2011.05.24;   57593;       0;       0;       0;   57593;   57593;   57593;   57593;       0;       0
PJM PSEG PEAK DAY AHEAD - NEW YORK MERCANTILE EXCHANGE ;2011.05.17;   55778;       0;       0;       0;   55778;   55778;   55778;   55778;       0;       0
PJM PSEG PEAK DAY AHEAD - NEW YORK MERCANTILE EXCHANGE ;2011.05.10;   52808;       0;       0;       0;   52808;   52808;   52808;   52808;       0;       0
PJM PSEG PEAK DAY AHEAD - NEW YORK MERCANTILE EXCHANGE ;2011.05.03;   52493;       0;       0;       0;   52493;   52493;   52493;   52493;       0;       0
PJM PSEG PEAK DAY AHEAD - NEW YORK MERCANTILE EXCHANGE ;2011.04.26;   56651;       0;     210;       0;   56651;   56441;   56651;   56651;       0;       0
PJM PSEG PEAK DAY AHEAD - NEW YORK MERCANTILE EXCHANGE ;2011.04.19;   55371;       0;     210;       0;   55371;   55161;   55371;   55371;       0;       0
PJM PSEG PEAK DAY AHEAD - NEW YORK MERCANTILE EXCHANGE ;2011.04.12;   54931;       0;     210;       0;   54931;   54721;   54931;   54931;       0;       0
PJM PSEG PEAK DAY AHEAD - NEW YORK MERCANTILE EXCHANGE ;2011.04.05;   57061;       0;     210;       0;   57061;   56851;   57061;   57061;       0;       0
PJM PSEG PEAK DAY AHEAD - NEW YORK MERCANTILE EXCHANGE ;2011.03.29;   62052;       0;     210;       0;   62052;   61842;   62052;   62052;       0;       0
PJM PSEG PEAK DAY AHEAD - NEW YORK MERCANTILE EXCHANGE ;2011.03.22;   62052;       0;     210;       0;   62052;   61842;   62052;   62052;       0;       0
PJM PSEG PEAK DAY AHEAD - NEW YORK MERCANTILE EXCHANGE ;2011.03.15;   62052;       0;     210;       0;   62052;   61842;   62052;   62052;       0;       0
PJM PSEG PEAK DAY AHEAD - NEW YORK MERCANTILE EXCHANGE ;2011.03.08;   62010;       0;     210;       0;   62010;   61800;   62010;   62010;       0;       0
PJM PSEG PEAK DAY AHEAD - NEW YORK MERCANTILE EXCHANGE ;2011.03.01;   61800;       0;       0;       0;   61800;   61800;   61800;   61800;       0;       0
PJM PSEG PEAK DAY AHEAD - NEW YORK MERCANTILE EXCHANGE ;2011.02.22;   62760;       0;       0;       0;   62760;   62760;   62760;   62760;       0;       0
PJM PSEG PEAK DAY AHEAD - NEW YORK MERCANTILE EXCHANGE ;2011.02.15;   62545;       0;       0;       0;   62545;   62545;   62545;   62545;       0;       0
PJM PSEG PEAK DAY AHEAD - NEW YORK MERCANTILE EXCHANGE ;2011.02.08;   61299;       0;       0;       0;   61299;   61299;   61299;   61299;       0;       0
PJM PSEG PEAK DAY AHEAD - NEW YORK MERCANTILE EXCHANGE ;2011.02.01;   53964;       0;       0;       0;   53964;   53964;   53964;   53964;       0;       0
PJM PSEG PEAK DAY AHEAD - NEW YORK MERCANTILE EXCHANGE ;2011.01.25;   58626;       0;       0;       0;   58626;   58626;   58626;   58626;       0;       0
PJM PSEG PEAK DAY AHEAD - NEW YORK MERCANTILE EXCHANGE ;2011.01.18;   58396;       0;       0;       0;   58396;   58396;   58396;   58396;       0;       0
PJM PSEG PEAK DAY AHEAD - NEW YORK MERCANTILE EXCHANGE ;2011.01.11;   58396;       0;       0;       0;   58396;   58396;   58396;   58396;       0;       0
PJM PSEG PEAK DAY AHEAD - NEW YORK MERCANTILE EXCHANGE ;2011.01.04;   58396;       0;       0;       0;   58396;   58396;   58396;   58396;       0;       0
PJM PSEG PEAK DAY AHEAD - NEW YORK MERCANTILE EXCHANGE ;2011.07.12;   50189;       0;       0;       0;   50189;   50189;   50189;   50189;       0;       0
PJM PSEG PEAK DAY AHEAD - NEW YORK MERCANTILE EXCHANGE ;2011.07.05;   49934;       0;       0;       0;   49934;   49934;   49934;   49934;       0;       0
PJM PSEG PEAK DAY AHEAD - NEW YORK MERCANTILE EXCHANGE ;2011.06.28;   53498;       0;       0;       0;   53498;   53498;   53498;   53498;       0;       0
PJM PSEG PEAK DAY AHEAD - NEW YORK MERCANTILE EXCHANGE ;2011.06.21;   53498;       0;       0;       0;   53498;   53498;   53498;   53498;       0;       0
PJM PSEG PEAK DAY AHEAD - NEW YORK MERCANTILE EXCHANGE ;2011.06.14;   53498;       0;       0;       0;   53498;   53498;   53498;   53498;       0;       0
PJM PSEG PEAK DAY AHEAD - NEW YORK MERCANTILE EXCHANGE ;2011.06.07;   53498;       0;       0;       0;   53498;   53498;   53498;   53498;       0;       0
PJM PSEG PEAK DAY AHEAD - NEW YORK MERCANTILE EXCHANGE ;2011.05.31;   57593;       0;       0;       0;   57593;   57593;   57593;   57593;       0;       0
PJM PSEG PEAK DAY AHEAD - NEW YORK MERCANTILE EXCHANGE ;2011.05.24;   57593;       0;       0;       0;   57593;   57593;   57593;   57593;       0;       0
PJM PSEG PEAK DAY AHEAD - NEW YORK MERCANTILE EXCHANGE ;2011.05.17;   55778;       0;       0;       0;   55778;   55778;   55778;   55778;       0;       0
PJM PSEG PEAK DAY AHEAD - NEW YORK MERCANTILE EXCHANGE ;2011.05.10;   52808;       0;       0;       0;   52808;   52808;   52808;   52808;       0;       0
PJM PSEG PEAK DAY AHEAD - NEW YORK MERCANTILE EXCHANGE ;2011.05.03;   52493;       0;       0;       0;   52493;   52493;   52493;   52493;       0;       0
PJM PSEG PEAK DAY AHEAD - NEW YORK MERCANTILE EXCHANGE ;2011.04.26;   56651;       0;     210;       0;   56651;   56441;   56651;   56651;       0;       0
PJM PSEG PEAK DAY AHEAD - NEW YORK MERCANTILE EXCHANGE ;2011.04.19;   55371;       0;     210;       0;   55371;   55161;   55371;   55371;       0;       0
PJM PSEG PEAK DAY AHEAD - NEW YORK MERCANTILE EXCHANGE ;2011.04.12;   54931;       0;     210;       0;   54931;   54721;   54931;   54931;       0;       0
PJM PSEG PEAK DAY AHEAD - NEW YORK MERCANTILE EXCHANGE ;2011.04.05;   57061;       0;     210;       0;   57061;   56851;   57061;   57061;       0;       0
PJM PSEG PEAK DAY AHEAD - NEW YORK MERCANTILE EXCHANGE ;2011.03.29;   62052;       0;     210;       0;   62052;   61842;   62052;   62052;       0;       0
PJM PSEG PEAK DAY AHEAD - NEW YORK MERCANTILE EXCHANGE ;2011.03.22;   62052;       0;     210;       0;   62052;   61842;   62052;   62052;       0;       0
PJM PSEG PEAK DAY AHEAD - NEW YORK MERCANTILE EXCHANGE ;2011.03.15;   62052;       0;     210;       0;   62052;   61842;   62052;   62052;       0;       0
PJM PSEG PEAK DAY AHEAD - NEW YORK MERCANTILE EXCHANGE ;2011.03.08;   62010;       0;     210;       0;   62010;   61800;   62010;   62010;       0;       0
PJM PSEG PEAK DAY AHEAD - NEW YORK MERCANTILE EXCHANGE ;2011.03.01;   61800;       0;       0;       0;   61800;   61800;   61800;   61800;       0;       0
PJM PSEG PEAK DAY AHEAD - NEW YORK MERCANTILE EXCHANGE ;2011.02.22;   62760;       0;       0;       0;   62760;   62760;   62760;   62760;       0;       0
PJM PSEG PEAK DAY AHEAD - NEW YORK MERCANTILE EXCHANGE ;2011.02.15;   62545;       0;       0;       0;   62545;   62545;   62545;   62545;       0;       0
PJM PSEG PEAK DAY AHEAD - NEW YORK MERCANTILE EXCHANGE ;2011.02.08;   61299;       0;       0;       0;   61299;   61299;   61299;   61299;       0;       0
PJM PSEG PEAK DAY AHEAD - NEW YORK MERCANTILE EXCHANGE ;2011.02.01;   53964;       0;       0;       0;   53964;   53964;   53964;   53964;       0;       0
PJM PSEG PEAK DAY AHEAD - NEW YORK MERCANTILE EXCHANGE ;2011.01.25;   58626;       0;       0;       0;   58626;   58626;   58626;   58626;       0;       0
PJM PSEG PEAK DAY AHEAD - NEW YORK MERCANTILE EXCHANGE ;2011.01.18;   58396;       0;       0;       0;   58396;   58396;   58396;   58396;       0;       0
PJM PSEG PEAK DAY AHEAD - NEW YORK MERCANTILE EXCHANGE ;2011.01.11;   58396;       0;       0;       0;   58396;   58396;   58396;   58396;       0;       0
PJM PSEG PEAK DAY AHEAD - NEW YORK MERCANTILE EXCHANGE ;2011.01.04;   58396;       0;       0;       0;   58396;   58396;   58396;   58396;       0;       0
PJM PSEG PEAK DAY AHEAD - NEW YORK MERCANTILE EXCHANGE ;2010.12.28;   63111;       0;       0;       0;   63088;   63111;   63088;   63111;      23;       0
PJM PSEG PEAK DAY AHEAD - NEW YORK MERCANTILE EXCHANGE ;2010.12.21;   63111;       0;       0;       0;   63088;   63111;   63088;   63111;      23;       0
PJM PSEG PEAK DAY AHEAD - NEW YORK MERCANTILE EXCHANGE ;2010.12.14;   63101;       0;       0;       0;   63078;   63101;   63078;   63101;      23;       0
PJM PSEG PEAK DAY AHEAD - NEW YORK MERCANTILE EXCHANGE ;2010.12.07;   63101;       0;       0;       0;   63078;   63101;   63078;   63101;      23;       0
PJM PSEG PEAK DAY AHEAD - NEW YORK MERCANTILE EXCHANGE ;2010.11.30;   67301;       0;       0;       0;   67257;   67301;   67257;   67301;      44;       0
PJM PSEG PEAK DAY AHEAD - NEW YORK MERCANTILE EXCHANGE ;2010.11.23;   67301;       0;       0;       0;   67257;   67301;   67257;   67301;      44;       0
PJM PSEG PEAK DAY AHEAD - NEW YORK MERCANTILE EXCHANGE ;2010.11.16;   67301;       0;       0;       0;   67257;   67301;   67257;   67301;      44;       0
PJM PSEG PEAK DAY AHEAD - NEW YORK MERCANTILE EXCHANGE ;2010.11.09;   67301;       0;       0;       0;   67257;   67301;   67257;   67301;      44;       0
PJM PSEG PEAK DAY AHEAD - NEW YORK MERCANTILE EXCHANGE ;2010.11.02;   67301;       0;       0;       0;   67257;   67301;   67257;   67301;      44;       0
PJM PSEG PEAK DAY AHEAD - NEW YORK MERCANTILE EXCHANGE ;2010.10.26;   71396;       0;       0;       0;   71331;   71396;   71331;   71396;      65;       0
PJM PSEG PEAK DAY AHEAD - NEW YORK MERCANTILE EXCHANGE ;2010.10.19;   71396;       0;       0;       0;   71331;   71396;   71331;   71396;      65;       0
PJM PSEG PEAK DAY AHEAD - NEW YORK MERCANTILE EXCHANGE ;2010.10.12;   71061;       0;       0;       0;   70996;   71061;   70996;   71061;      65;       0
PJM PSEG PEAK DAY AHEAD - NEW YORK MERCANTILE EXCHANGE ;2010.10.05;   71061;       0;       0;       0;   70996;   71061;   70996;   71061;      65;       0
PJM PSEG PEAK DAY AHEAD - NEW YORK MERCANTILE EXCHANGE ;2010.09.28;   77465;       0;       0;       0;   77379;   77465;   77379;   77465;      86;       0
PJM PSEG PEAK DAY AHEAD - NEW YORK MERCANTILE EXCHANGE ;2010.09.21;   77465;       0;       0;       0;   77379;   77465;   77379;   77465;      86;       0
PJM PSEG PEAK DAY AHEAD - NEW YORK MERCANTILE EXCHANGE ;2010.09.14;   77465;       0;       0;       0;   77379;   77465;   77379;   77465;      86;       0
PJM PSEG PEAK DAY AHEAD - NEW YORK MERCANTILE EXCHANGE ;2010.09.07;   77465;       0;       0;       0;   77379;   77465;   77379;   77465;      86;       0
PJM PSEG PEAK DAY AHEAD - NEW YORK MERCANTILE EXCHANGE ;2010.08.31;   82349;       0;       0;       0;   82241;   82349;   82241;   82349;     108;       0
PJM PSEG PEAK DAY AHEAD - NEW YORK MERCANTILE EXCHANGE ;2010.08.24;   77774;       0;       0;       0;   77666;   77774;   77666;   77774;     108;       0
PJM PSEG PEAK DAY AHEAD - NEW YORK MERCANTILE EXCHANGE ;2010.08.17;   77753;       0;       0;       0;   77645;   77753;   77645;   77753;     108;       0
PJM PSEG PEAK DAY AHEAD - NEW YORK MERCANTILE EXCHANGE ;2010.08.10;   77076;       0;       0;       0;   70683;   77076;   70683;   77076;    6393;       0
PJM PSEG PEAK DAY AHEAD - NEW YORK MERCANTILE EXCHANGE ;2010.08.03;   72601;       0;       0;       0;   72493;   72601;   72493;   72601;     108;       0
PJM PSEG PEAK DAY AHEAD - NEW YORK MERCANTILE EXCHANGE ;2010.07.27;   77053;       0;       0;       0;   76924;   77053;   76924;   77053;     129;       0
PJM PSEG PEAK DAY AHEAD - NEW YORK MERCANTILE EXCHANGE ;2010.07.20;   77053;       0;       0;       0;   76924;   77053;   76924;   77053;     129;       0
PJM PSEG PEAK DAY AHEAD - NEW YORK MERCANTILE EXCHANGE ;2010.07.13;   76833;       0;       0;       0;   76704;   76833;   76704;   76833;     129;       0
PJM PSEG PEAK DAY AHEAD - NEW YORK MERCANTILE EXCHANGE ;2010.07.06;   76833;       0;       0;       0;   76704;   76833;   76704;   76833;     129;       0
PJM PSEG PEAK DAY AHEAD - NEW YORK MERCANTILE EXCHANGE ;2010.06.29;   81494;       0;       0;       0;   81343;   81494;   81343;   81494;     151;       0
PJM PSEG PEAK DAY AHEAD - NEW YORK MERCANTILE EXCHANGE ;2010.06.22;   81494;       0;       0;       0;   81343;   81494;   81343;   81494;     151;       0
PJM PSEG PEAK DAY AHEAD - NEW YORK MERCANTILE EXCHANGE ;2010.06.15;   82260;       0;       0;       0;   82109;   82260;   82109;   82260;     151;       0
PJM PSEG PEAK DAY AHEAD - NEW YORK MERCANTILE EXCHANGE ;2010.06.08;   82260;       0;       0;       0;   82109;   82260;   82109;   82260;     151;       0
PJM PSEG PEAK DAY AHEAD - NEW YORK MERCANTILE EXCHANGE ;2010.06.01;   81830;       0;       0;       0;   81679;   81830;   81679;   81830;     151;       0
PJM PSEG PEAK DAY AHEAD - NEW YORK MERCANTILE EXCHANGE ;2010.05.25;   86070;       0;     300;       0;   85919;   85770;   85919;   86070;     151;       0
PJM PSEG PEAK DAY AHEAD - NEW YORK MERCANTILE EXCHANGE ;2010.05.18;   84795;       0;     300;       0;   84644;   84495;   84644;   84795;     151;       0
PJM PSEG PEAK DAY AHEAD - NEW YORK MERCANTILE EXCHANGE ;2010.05.11;   84795;       0;     300;       0;   84644;   84495;   84644;   84795;     151;       0
PJM PSEG PEAK DAY AHEAD - NEW YORK MERCANTILE EXCHANGE ;2010.05.04;   85309;       0;     300;       0;   85158;   85009;   85158;   85309;     151;       0
PJM PSEG PEAK DAY AHEAD - NEW YORK MERCANTILE EXCHANGE ;2010.04.27;   87982;     770;     630;       0;   87061;   87352;   87831;   87982;     151;       0
PJM PSEG PEAK DAY AHEAD - NEW YORK MERCANTILE EXCHANGE ;2010.04.20;   87725;     770;     630;       0;   86804;   87095;   87574;   87725;     151;       0
PJM PSEG PEAK DAY AHEAD - NEW YORK MERCANTILE EXCHANGE ;2010.04.13;   87725;     770;     630;       0;   86804;   87095;   87574;   87725;     151;       0
PJM PSEG PEAK DAY AHEAD - NEW YORK MERCANTILE EXCHANGE ;2010.04.06;   87725;     770;     630;       0;   86804;   87095;   87574;   87725;     151;       0
PJM PSEG PEAK DAY AHEAD - NEW YORK MERCANTILE EXCHANGE ;2010.03.30;   90645;       0;     975;       0;   89724;   89670;   89724;   90645;     921;       0
PJM PSEG PEAK DAY AHEAD - NEW YORK MERCANTILE EXCHANGE ;2010.03.23;   91991;       0;    3545;       0;   91840;   88446;   91840;   91991;     151;       0
PJM PSEG PEAK DAY AHEAD - NEW YORK MERCANTILE EXCHANGE ;2010.03.16;   90711;       0;    3545;       0;   90560;   87166;   90560;   90711;     151;       0
PJM PSEG PEAK DAY AHEAD - NEW YORK MERCANTILE EXCHANGE ;2010.03.09;   90711;       0;    3545;       0;   90560;   87166;   90560;   90711;     151;       0
PJM PSEG PEAK DAY AHEAD - NEW YORK MERCANTILE EXCHANGE ;2010.03.02;   90667;       0;    3545;       0;   90516;   87122;   90516;   90667;     151;       0
PJM PSEG PEAK DAY AHEAD - NEW YORK MERCANTILE EXCHANGE ;2010.02.23;   96523;       0;    3945;       0;   96372;   92578;   96372;   96523;     151;       0
PJM PSEG PEAK DAY AHEAD - NEW YORK MERCANTILE EXCHANGE ;2010.02.16;   96392;       0;    3945;       0;   96241;   92447;   96241;   96392;     151;       0
PJM PSEG PEAK DAY AHEAD - NEW YORK MERCANTILE EXCHANGE ;2010.02.09;   93588;       0;    3945;       0;   93437;   89643;   93437;   93588;     151;       0
PJM PSEG PEAK DAY AHEAD - NEW YORK MERCANTILE EXCHANGE ;2010.02.02;   90693;       0;    3945;       0;   90542;   86748;   90542;   90693;     151;       0
PJM PSEG PEAK DAY AHEAD - NEW YORK MERCANTILE EXCHANGE ;2010.01.26;   95883;       0;    4345;       0;   95883;   91538;   95883;   95883;       0;       0
PJM PSEG PEAK DAY AHEAD - NEW YORK MERCANTILE EXCHANGE ;2010.01.19;   91553;       0;    4345;       0;   90753;   86408;   90753;   90753;     800;     800
PJM PSEG PEAK DAY AHEAD - NEW YORK MERCANTILE EXCHANGE ;2010.01.12;   91298;       0;    4345;       0;   90498;   86153;   90498;   90498;     800;     800
PJM PSEG PEAK DAY AHEAD - NEW YORK MERCANTILE EXCHANGE ;2010.01.05;   91298;       0;    4345;       0;   90498;   86153;   90498;   90498;     800;     800
PJM PSEG PEAK DAY AHEAD - NEW YORK MERCANTILE EXCHANGE ;2009.12.29;   97812;       0;    5275;       0;   97012;   91697;   97012;   96972;     800;     840
PJM PSEG PEAK DAY AHEAD - NEW YORK MERCANTILE EXCHANGE ;2009.12.22;   97812;       0;    5275;       0;   97012;   91697;   97012;   96972;     800;     840
PJM PSEG PEAK DAY AHEAD - NEW YORK MERCANTILE EXCHANGE ;2009.12.15;   97661;       0;    5275;       0;   96861;   91546;   96861;   96821;     800;     840
PJM PSEG PEAK DAY AHEAD - NEW YORK MERCANTILE EXCHANGE ;2009.12.08;   96861;       0;    5275;       0;   96861;   91546;   96861;   96821;       0;      40
PJM PSEG PEAK DAY AHEAD - NEW YORK MERCANTILE EXCHANGE ;2009.12.01;   96501;       0;    5275;       0;   96501;   91186;   96501;   96461;       0;      40
PJM PSEG PEAK DAY AHEAD - NEW YORK MERCANTILE EXCHANGE ;2009.11.24;  101801;       0;    5575;       0;  101801;   96186;  101801;  101761;       0;      40
PJM PSEG PEAK DAY AHEAD - NEW YORK MERCANTILE EXCHANGE ;2009.11.17;  100476;       0;    5575;       0;  100178;   94861;  100178;  100436;     298;      40
PJM PSEG PEAK DAY AHEAD - NEW YORK MERCANTILE EXCHANGE ;2009.11.09;   98101;       0;    5575;       0;   98101;   92526;   98101;   98101;       0;       0
PJM PSEG PEAK DAY AHEAD - NEW YORK MERCANTILE EXCHANGE ;2009.11.03;   90909;       0;    5575;       0;   90909;   85334;   90909;   90909;       0;       0
PJM PSEG PEAK DAY AHEAD - NEW YORK MERCANTILE EXCHANGE ;2009.10.27;   94349;       0;    5905;       0;   94349;   88444;   94349;   94349;       0;       0
PJM PSEG PEAK DAY AHEAD - NEW YORK MERCANTILE EXCHANGE ;2009.10.20;   90795;       0;    5905;       0;   90795;   84890;   90795;   90795;       0;       0
PJM PSEG PEAK DAY AHEAD - NEW YORK MERCANTILE EXCHANGE ;2009.10.13;   90795;       0;    5905;       0;   90795;   84890;   90795;   90795;       0;       0
PJM PSEG PEAK DAY AHEAD - NEW YORK MERCANTILE EXCHANGE ;2009.10.06;   90695;       0;    5905;       0;   90695;   84790;   90695;   90695;       0;       0
PJM PSEG PEAK DAY AHEAD - NEW YORK MERCANTILE EXCHANGE ;2009.09.29;   95756;       0;    6325;       0;   95756;   89431;   95756;   95756;       0;       0
PJM PSEG PEAK DAY AHEAD - NEW YORK MERCANTILE EXCHANGE ;2009.09.22;   94956;       0;    6325;       0;   94956;   88631;   94956;   94956;       0;       0
PJM PSEG PEAK DAY AHEAD - NEW YORK MERCANTILE EXCHANGE ;2009.09.15;   94956;       0;    6325;       0;   94956;   88631;   94956;   94956;       0;       0
PJM PSEG PEAK DAY AHEAD - NEW YORK MERCANTILE EXCHANGE ;2009.09.08;   94344;       0;    6325;       0;   94344;   88019;   94344;   94344;       0;       0
PJM PSEG PEAK DAY AHEAD - NEW YORK MERCANTILE EXCHANGE ;2009.09.01;   94304;       0;    6325;       0;   94304;   87979;   94304;   94304;       0;       0
PJM PSEG PEAK DAY AHEAD - NEW YORK MERCANTILE EXCHANGE ;2009.08.25;   98694;       0;    6745;       0;   98694;   91949;   98694;   98694;       0;       0
PJM PSEG PEAK DAY AHEAD - NEW YORK MERCANTILE EXCHANGE ;2009.08.18;   99164;       0;    6888;    4997;   94167;   87279;   99164;   99164;       0;       0
PJM PSEG PEAK DAY AHEAD - NEW YORK MERCANTILE EXCHANGE ;2009.08.11;   98474;       0;    6888;    4997;   93477;   86589;   98474;   98474;       0;       0
PJM PSEG PEAK DAY AHEAD - NEW YORK MERCANTILE EXCHANGE ;2009.08.04;   97787;       0;    7208;    4677;   93110;   85902;   97787;   97787;       0;       0
PJM PSEG PEAK DAY AHEAD - NEW YORK MERCANTILE EXCHANGE ;2009.07.28;  102494;     683;    7205;    5140;   96671;   90149;  102494;  102494;       0;       0
PJM PSEG PEAK DAY AHEAD - NEW YORK MERCANTILE EXCHANGE ;2009.07.21;  102894;     683;    7605;    5140;   97071;   90149;  102894;  102894;       0;       0
PJM PSEG PEAK DAY AHEAD - NEW YORK MERCANTILE EXCHANGE ;2009.07.14;  100303;     683;    7605;    5140;   94480;   87558;  100303;  100303;       0;       0
PJM PSEG PEAK DAY AHEAD - NEW YORK MERCANTILE EXCHANGE ;2009.07.07;  102763;     683;    7605;    5140;   96940;   90018;  102763;  102763;       0;       0
PJM PSEG PEAK DAY AHEAD - NEW YORK MERCANTILE EXCHANGE ;2009.06.30;  104803;    1057;    8265;    5140;   98606;   91398;  104803;  104803;       0;       0
PJM PSEG PEAK DAY AHEAD - NEW YORK MERCANTILE EXCHANGE ;2009.06.23;  106173;    1057;    8265;    5140;   99976;   92768;  106173;  106173;       0;       0
PJM PSEG PEAK DAY AHEAD - NEW YORK MERCANTILE EXCHANGE ;2009.06.16;  102318;    6197;    8265;       0;   96121;   94053;  102318;  102318;       0;       0
PJM PSEG PEAK DAY AHEAD - NEW YORK MERCANTILE EXCHANGE ;2009.06.09;  102318;    6197;    8045;       0;   96121;   94273;  102318;  102318;       0;       0
PJM PSEG PEAK DAY AHEAD - NEW YORK MERCANTILE EXCHANGE ;2009.06.02;   99408;    6197;    8045;       0;   93211;   91363;   99408;   99408;       0;       0
PJM PSEG PEAK DAY AHEAD - NEW YORK MERCANTILE EXCHANGE ;2009.05.26;  101128;    6697;    8645;       0;   94431;   92483;  101128;  101128;       0;       0
PJM PSEG PEAK DAY AHEAD - NEW YORK MERCANTILE EXCHANGE ;2009.05.19;   99684;    6277;    8645;       0;   93407;   91039;   99684;   99684;       0;       0
PJM PSEG PEAK DAY AHEAD - NEW YORK MERCANTILE EXCHANGE ;2009.05.12;   99414;    6167;    8645;       0;   93247;   90769;   99414;   99414;       0;       0
PJM PSEG PEAK DAY AHEAD - NEW YORK MERCANTILE EXCHANGE ;2009.05.05;   97745;    6167;    8645;       0;   91578;   89100;   97745;   97745;       0;       0
PJM PSEG PEAK DAY AHEAD - NEW YORK MERCANTILE EXCHANGE ;2011.07.12;   50189;       0;       0;       0;   50189;   50189;   50189;   50189;       0;       0
