SING 180 380 FUEL OIL SPR SWAP - NEW YORK MERCANTILE EXCHANGE ;2010.12.28;    1657;       0;      35;       0;    1179;    1069;    1179;    1104;     478;     553
SING 180 380 FUEL OIL SPR SWAP - NEW YORK MERCANTILE EXCHANGE ;2010.12.21;    1567;       0;      35;       0;    1069;     932;    1069;     967;     498;     600
SING 180 380 FUEL OIL SPR SWAP - NEW YORK MERCANTILE EXCHANGE ;2010.11.30;    1666;       0;      55;       0;    1142;     907;    1142;     962;     524;     704
SING 180 380 FUEL OIL SPR SWAP - NEW YORK MERCANTILE EXCHANGE ;2010.11.23;    1581;       0;      55;       0;    1097;     902;    1097;     957;     484;     624
SING 180 380 FUEL OIL SPR SWAP - NEW YORK MERCANTILE EXCHANGE ;2010.11.16;    1556;       0;      55;       0;    1008;     897;    1008;     952;     548;     604
SING 180 380 FUEL OIL SPR SWAP - NEW YORK MERCANTILE EXCHANGE ;2010.11.09;    1410;       0;      55;       0;     834;     867;     834;     922;     576;     488
SING 180 380 FUEL OIL SPR SWAP - NEW YORK MERCANTILE EXCHANGE ;2010.10.26;    1824;       0;      55;       0;    1461;    1263;    1461;    1318;     363;     506
SING 180 380 FUEL OIL SPR SWAP - NEW YORK MERCANTILE EXCHANGE ;2010.10.19;    1704;       0;      50;       0;    1401;    1123;    1401;    1173;     303;     531
SING 180 380 FUEL OIL SPR SWAP - NEW YORK MERCANTILE EXCHANGE ;2010.10.12;    1634;       0;      50;       0;    1342;    1113;    1342;    1163;     292;     471
SING 180 380 FUEL OIL SPR SWAP - NEW YORK MERCANTILE EXCHANGE ;2010.10.05;    1579;       0;       0;       0;    1300;    1168;    1300;    1168;     279;     411
SING 180 380 FUEL OIL SPR SWAP - NEW YORK MERCANTILE EXCHANGE ;2010.09.28;    2135;      30;      25;       0;    1824;    1634;    1854;    1659;     281;     476
SING 180 380 FUEL OIL SPR SWAP - NEW YORK MERCANTILE EXCHANGE ;2010.09.21;    2018;      30;      25;       0;    1789;    1559;    1819;    1584;     199;     434
SING 180 380 FUEL OIL SPR SWAP - NEW YORK MERCANTILE EXCHANGE ;2010.09.14;    1952;      30;      25;       0;    1451;    1408;    1481;    1433;     471;     519
SING 180 380 FUEL OIL SPR SWAP - NEW YORK MERCANTILE EXCHANGE ;2010.09.07;    1822;      30;      25;       0;    1316;    1308;    1346;    1333;     476;     489
SING 180 380 FUEL OIL SPR SWAP - NEW YORK MERCANTILE EXCHANGE ;2010.08.31;    2272;      40;      25;       0;    1761;    1829;    1801;    1854;     471;     418
SING 180 380 FUEL OIL SPR SWAP - NEW YORK MERCANTILE EXCHANGE ;2010.08.24;    2245;      40;      25;       0;    1739;    1717;    1779;    1742;     466;     503
SING 180 380 FUEL OIL SPR SWAP - NEW YORK MERCANTILE EXCHANGE ;2010.08.17;    1820;      40;       0;       0;    1343;    1383;    1383;    1383;     437;     437
SING 180 380 FUEL OIL SPR SWAP - NEW YORK MERCANTILE EXCHANGE ;2010.08.10;    1738;       0;       0;       0;    1351;    1433;    1351;    1433;     387;     305
SING 180 380 FUEL OIL SPR SWAP - NEW YORK MERCANTILE EXCHANGE ;2010.08.03;    1559;       0;       0;       0;    1120;    1220;    1120;    1220;     439;     339
SING 180 380 FUEL OIL SPR SWAP - NEW YORK MERCANTILE EXCHANGE ;2010.07.27;    2284;       0;      76;       0;    1755;    1874;    1755;    1950;     529;     334
SING 180 380 FUEL OIL SPR SWAP - NEW YORK MERCANTILE EXCHANGE ;2010.07.20;    2144;       0;      76;       0;    1725;    1709;    1725;    1785;     419;     359
SING 180 380 FUEL OIL SPR SWAP - NEW YORK MERCANTILE EXCHANGE ;2010.07.13;    2092;       0;      76;       0;    1678;    1667;    1678;    1743;     414;     349
SING 180 380 FUEL OIL SPR SWAP - NEW YORK MERCANTILE EXCHANGE ;2010.07.06;    2019;       0;      76;       0;    1704;    1647;    1704;    1723;     315;     296
SING 180 380 FUEL OIL SPR SWAP - NEW YORK MERCANTILE EXCHANGE ;2010.06.29;    2750;       0;     111;       0;    2366;    2305;    2366;    2416;     384;     334
SING 180 380 FUEL OIL SPR SWAP - NEW YORK MERCANTILE EXCHANGE ;2010.06.22;    2662;       0;     111;       0;    2253;    2247;    2253;    2358;     409;     304
SING 180 380 FUEL OIL SPR SWAP - NEW YORK MERCANTILE EXCHANGE ;2010.06.15;    2549;       0;     111;       0;    2151;    2115;    2151;    2226;     398;     323
SING 180 380 FUEL OIL SPR SWAP - NEW YORK MERCANTILE EXCHANGE ;2010.06.08;    2311;       0;      91;       0;    1837;    1899;    1837;    1990;     474;     321
SING 180 380 FUEL OIL SPR SWAP - NEW YORK MERCANTILE EXCHANGE ;2010.06.01;    2534;       0;      70;       0;    2024;    2034;    2024;    2104;     510;     430
SING 180 380 FUEL OIL SPR SWAP - NEW YORK MERCANTILE EXCHANGE ;2010.05.25;    2351;       0;     120;       0;    1840;    1811;    1840;    1931;     511;     420
SING 180 380 FUEL OIL SPR SWAP - NEW YORK MERCANTILE EXCHANGE ;2010.05.18;    2224;       0;     130;       0;    1834;    1507;    1834;    1637;     390;     587
SING 180 380 FUEL OIL SPR SWAP - NEW YORK MERCANTILE EXCHANGE ;2010.05.11;    1604;       0;      25;       0;    1159;    1154;    1159;    1179;     445;     425
SING 180 380 FUEL OIL SPR SWAP - NEW YORK MERCANTILE EXCHANGE ;2010.03.30;    2351;       0;       0;       0;    1557;    1697;    1557;    1697;     794;     654
SING 180 380 FUEL OIL SPR SWAP - NEW YORK MERCANTILE EXCHANGE ;2009.09.01;    2425;       0;       0;       0;    1568;    1502;    1568;    1502;     857;     923
SING 180 380 FUEL OIL SPR SWAP - NEW YORK MERCANTILE EXCHANGE ;2009.08.25;    2352;       0;       0;       0;    1483;    1442;    1483;    1442;     869;     910
SING 180 380 FUEL OIL SPR SWAP - NEW YORK MERCANTILE EXCHANGE ;2009.08.18;    2347;       0;       0;       0;    1475;    1432;    1475;    1432;     872;     915
SING 180 380 FUEL OIL SPR SWAP - NEW YORK MERCANTILE EXCHANGE ;2009.08.11;    2352;       0;       0;       0;    1480;    1432;    1480;    1432;     872;     920
SING 180 380 FUEL OIL SPR SWAP - NEW YORK MERCANTILE EXCHANGE ;2009.08.04;    2297;       0;       0;       0;    1400;    1437;    1400;    1437;     897;     860
SING 180 380 FUEL OIL SPR SWAP - NEW YORK MERCANTILE EXCHANGE ;2009.07.28;    2723;       0;       0;       0;    1881;    1772;    1881;    1772;     842;     951
SING 180 380 FUEL OIL SPR SWAP - NEW YORK MERCANTILE EXCHANGE ;2009.06.30;    2615;       0;       0;       0;    1740;    1928;    1740;    1928;     875;     687
SING 180 380 FUEL OIL SPR SWAP - NEW YORK MERCANTILE EXCHANGE ;2009.06.23;    2451;       0;       0;       0;    1615;    1808;    1615;    1808;     836;     643
SING 180 380 FUEL OIL SPR SWAP - NEW YORK MERCANTILE EXCHANGE ;2009.06.16;    2400;       0;       0;       0;    1517;    1810;    1517;    1810;     883;     590
SING 180 380 FUEL OIL SPR SWAP - NEW YORK MERCANTILE EXCHANGE ;2009.06.09;    2373;       0;       0;       0;    1375;    1776;    1375;    1776;     998;     597
SING 180 380 FUEL OIL SPR SWAP - NEW YORK MERCANTILE EXCHANGE ;2009.05.26;    2813;       0;       0;       0;    1884;    2102;    1884;    2102;     929;     711
SING 180 380 FUEL OIL SPR SWAP - NEW YORK MERCANTILE EXCHANGE ;2009.05.19;    2743;       0;       0;       0;    1804;    2042;    1804;    2042;     939;     701
SING 180 380 FUEL OIL SPR SWAP - NEW YORK MERCANTILE EXCHANGE ;2009.05.12;    2687;       0;       0;       0;    1777;    2016;    1777;    2016;     910;     671
SING 180 380 FUEL OIL SPR SWAP - NEW YORK MERCANTILE EXCHANGE ;2009.05.05;    2446;       0;       0;       0;    1617;    1841;    1617;    1841;     829;     605
SING 180 380 FUEL OIL SPR SWAP - NEW YORK MERCANTILE EXCHANGE ;2009.04.28;    3028;      95;       0;       0;    2077;    2384;    2172;    2384;     856;     644
SING 180 380 FUEL OIL SPR SWAP - NEW YORK MERCANTILE EXCHANGE ;2009.04.21;    2963;      95;       0;       0;    1982;    2379;    2077;    2379;     886;     584
SING 180 380 FUEL OIL SPR SWAP - NEW YORK MERCANTILE EXCHANGE ;2009.04.14;    2816;      95;       0;       0;    1873;    2275;    1968;    2275;     848;     541
SING 180 380 FUEL OIL SPR SWAP - NEW YORK MERCANTILE EXCHANGE ;2009.04.07;    2761;      95;       0;       0;    1878;    2230;    1973;    2230;     788;     531
SING 180 380 FUEL OIL SPR SWAP - NEW YORK MERCANTILE EXCHANGE ;2009.03.31;    3224;      90;       0;       0;    2344;    2609;    2434;    2609;     790;     615
SING 180 380 FUEL OIL SPR SWAP - NEW YORK MERCANTILE EXCHANGE ;2009.03.24;    3182;      90;       0;       0;    2307;    2577;    2397;    2577;     785;     605
SING 180 380 FUEL OIL SPR SWAP - NEW YORK MERCANTILE EXCHANGE ;2009.03.17;    3046;      90;       0;       0;    2284;    2330;    2374;    2330;     672;     716
SING 180 380 FUEL OIL SPR SWAP - NEW YORK MERCANTILE EXCHANGE ;2009.03.10;    2700;      85;       0;       0;    1636;    1998;    1721;    1998;     979;     702
SING 180 380 FUEL OIL SPR SWAP - NEW YORK MERCANTILE EXCHANGE ;2009.03.03;    2664;      75;       0;       0;    1636;    1988;    1711;    1988;     953;     676
SING 180 380 FUEL OIL SPR SWAP - NEW YORK MERCANTILE EXCHANGE ;2009.02.24;    3025;     205;       0;       0;    1945;    2023;    2150;    2023;     875;    1002
SING 180 380 FUEL OIL SPR SWAP - NEW YORK MERCANTILE EXCHANGE ;2009.02.17;    2662;     175;       0;       0;    1573;    1696;    1748;    1696;     914;     966
SING 180 380 FUEL OIL SPR SWAP - NEW YORK MERCANTILE EXCHANGE ;2009.01.27;    1937;      35;       0;       0;    1089;    1391;    1124;    1391;     813;     546
SING 180 380 FUEL OIL SPR SWAP - NEW YORK MERCANTILE EXCHANGE ;2009.01.20;    1803;       0;       0;       0;    1012;    1322;    1012;    1322;     791;     481
SING 180 380 FUEL OIL SPR SWAP - NEW YORK MERCANTILE EXCHANGE ;2011.06.28;    1565;      30;       0;      10;    1163;    1123;    1203;    1133;     362;     432
SING 180 380 FUEL OIL SPR SWAP - NEW YORK MERCANTILE EXCHANGE ;2011.05.31;    1728;       0;      50;       0;    1361;    1244;    1361;    1294;     367;     434
SING 180 380 FUEL OIL SPR SWAP - NEW YORK MERCANTILE EXCHANGE ;2011.05.24;    1643;       0;      50;       0;    1336;    1149;    1336;    1199;     307;     444
SING 180 380 FUEL OIL SPR SWAP - NEW YORK MERCANTILE EXCHANGE ;2011.05.17;    1583;       0;      50;       0;    1221;    1139;    1221;    1189;     362;     394
SING 180 380 FUEL OIL SPR SWAP - NEW YORK MERCANTILE EXCHANGE ;2011.05.10;    1558;       0;      50;       0;    1301;    1143;    1301;    1193;     257;     365
SING 180 380 FUEL OIL SPR SWAP - NEW YORK MERCANTILE EXCHANGE ;2011.05.03;    1505;       0;      50;       0;    1193;    1069;    1193;    1119;     312;     386
SING 180 380 FUEL OIL SPR SWAP - NEW YORK MERCANTILE EXCHANGE ;2011.04.26;    2030;       0;      65;      15;    1671;    1461;    1686;    1541;     344;     489
SING 180 380 FUEL OIL SPR SWAP - NEW YORK MERCANTILE EXCHANGE ;2011.04.19;    1710;       0;      80;       0;    1276;    1181;    1276;    1261;     434;     449
SING 180 380 FUEL OIL SPR SWAP - NEW YORK MERCANTILE EXCHANGE ;2011.04.12;    1625;       0;      80;       0;    1155;    1107;    1155;    1187;     470;     438
SING 180 380 FUEL OIL SPR SWAP - NEW YORK MERCANTILE EXCHANGE ;2011.04.05;    1555;       0;      60;       0;    1110;    1052;    1110;    1112;     445;     443
SING 180 380 FUEL OIL SPR SWAP - NEW YORK MERCANTILE EXCHANGE ;2011.03.29;    1888;       0;      30;       0;    1488;    1339;    1488;    1369;     400;     519
SING 180 380 FUEL OIL SPR SWAP - NEW YORK MERCANTILE EXCHANGE ;2011.03.22;    1827;       0;      30;       0;    1434;    1200;    1434;    1230;     393;     597
SING 180 380 FUEL OIL SPR SWAP - NEW YORK MERCANTILE EXCHANGE ;2011.03.15;    1682;       0;      30;       0;    1128;     903;    1128;     933;     554;     749
SING 180 380 FUEL OIL SPR SWAP - NEW YORK MERCANTILE EXCHANGE ;2011.03.01;    2058;       0;       0;       0;    1468;    1376;    1468;    1376;     590;     682
SING 180 380 FUEL OIL SPR SWAP - NEW YORK MERCANTILE EXCHANGE ;2011.02.22;    2028;       0;       0;       0;    1448;    1316;    1448;    1316;     580;     712
SING 180 380 FUEL OIL SPR SWAP - NEW YORK MERCANTILE EXCHANGE ;2011.02.01;    1710;       0;       0;       0;    1321;    1299;    1321;    1299;     389;     411
SING 180 380 FUEL OIL SPR SWAP - NEW YORK MERCANTILE EXCHANGE ;2010.12.28;    1657;       0;      35;       0;    1179;    1069;    1179;    1104;     478;     553
SING 180 380 FUEL OIL SPR SWAP - NEW YORK MERCANTILE EXCHANGE ;2010.12.21;    1567;       0;      35;       0;    1069;     932;    1069;     967;     498;     600
SING 180 380 FUEL OIL SPR SWAP - NEW YORK MERCANTILE EXCHANGE ;2010.11.30;    1666;       0;      55;       0;    1142;     907;    1142;     962;     524;     704
SING 180 380 FUEL OIL SPR SWAP - NEW YORK MERCANTILE EXCHANGE ;2010.11.23;    1581;       0;      55;       0;    1097;     902;    1097;     957;     484;     624
SING 180 380 FUEL OIL SPR SWAP - NEW YORK MERCANTILE EXCHANGE ;2010.11.16;    1556;       0;      55;       0;    1008;     897;    1008;     952;     548;     604
SING 180 380 FUEL OIL SPR SWAP - NEW YORK MERCANTILE EXCHANGE ;2010.11.09;    1410;       0;      55;       0;     834;     867;     834;     922;     576;     488
SING 180 380 FUEL OIL SPR SWAP - NEW YORK MERCANTILE EXCHANGE ;2010.10.26;    1824;       0;      55;       0;    1461;    1263;    1461;    1318;     363;     506
SING 180 380 FUEL OIL SPR SWAP - NEW YORK MERCANTILE EXCHANGE ;2010.10.19;    1704;       0;      50;       0;    1401;    1123;    1401;    1173;     303;     531
SING 180 380 FUEL OIL SPR SWAP - NEW YORK MERCANTILE EXCHANGE ;2010.10.12;    1634;       0;      50;       0;    1342;    1113;    1342;    1163;     292;     471
SING 180 380 FUEL OIL SPR SWAP - NEW YORK MERCANTILE EXCHANGE ;2010.10.05;    1579;       0;       0;       0;    1300;    1168;    1300;    1168;     279;     411
SING 180 380 FUEL OIL SPR SWAP - NEW YORK MERCANTILE EXCHANGE ;2010.09.28;    2135;      30;      25;       0;    1824;    1634;    1854;    1659;     281;     476
SING 180 380 FUEL OIL SPR SWAP - NEW YORK MERCANTILE EXCHANGE ;2010.09.21;    2018;      30;      25;       0;    1789;    1559;    1819;    1584;     199;     434
SING 180 380 FUEL OIL SPR SWAP - NEW YORK MERCANTILE EXCHANGE ;2010.09.14;    1952;      30;      25;       0;    1451;    1408;    1481;    1433;     471;     519
SING 180 380 FUEL OIL SPR SWAP - NEW YORK MERCANTILE EXCHANGE ;2010.09.07;    1822;      30;      25;       0;    1316;    1308;    1346;    1333;     476;     489
SING 180 380 FUEL OIL SPR SWAP - NEW YORK MERCANTILE EXCHANGE ;2010.08.31;    2272;      40;      25;       0;    1761;    1829;    1801;    1854;     471;     418
SING 180 380 FUEL OIL SPR SWAP - NEW YORK MERCANTILE EXCHANGE ;2010.08.24;    2245;      40;      25;       0;    1739;    1717;    1779;    1742;     466;     503
SING 180 380 FUEL OIL SPR SWAP - NEW YORK MERCANTILE EXCHANGE ;2010.08.17;    1820;      40;       0;       0;    1343;    1383;    1383;    1383;     437;     437
SING 180 380 FUEL OIL SPR SWAP - NEW YORK MERCANTILE EXCHANGE ;2010.08.10;    1738;       0;       0;       0;    1351;    1433;    1351;    1433;     387;     305
SING 180 380 FUEL OIL SPR SWAP - NEW YORK MERCANTILE EXCHANGE ;2010.08.03;    1559;       0;       0;       0;    1120;    1220;    1120;    1220;     439;     339
SING 180 380 FUEL OIL SPR SWAP - NEW YORK MERCANTILE EXCHANGE ;2010.07.27;    2284;       0;      76;       0;    1755;    1874;    1755;    1950;     529;     334
SING 180 380 FUEL OIL SPR SWAP - NEW YORK MERCANTILE EXCHANGE ;2010.07.20;    2144;       0;      76;       0;    1725;    1709;    1725;    1785;     419;     359
SING 180 380 FUEL OIL SPR SWAP - NEW YORK MERCANTILE EXCHANGE ;2010.07.13;    2092;       0;      76;       0;    1678;    1667;    1678;    1743;     414;     349
SING 180 380 FUEL OIL SPR SWAP - NEW YORK MERCANTILE EXCHANGE ;2010.07.06;    2019;       0;      76;       0;    1704;    1647;    1704;    1723;     315;     296
SING 180 380 FUEL OIL SPR SWAP - NEW YORK MERCANTILE EXCHANGE ;2010.06.29;    2750;       0;     111;       0;    2366;    2305;    2366;    2416;     384;     334
SING 180 380 FUEL OIL SPR SWAP - NEW YORK MERCANTILE EXCHANGE ;2010.06.22;    2662;       0;     111;       0;    2253;    2247;    2253;    2358;     409;     304
SING 180 380 FUEL OIL SPR SWAP - NEW YORK MERCANTILE EXCHANGE ;2010.06.15;    2549;       0;     111;       0;    2151;    2115;    2151;    2226;     398;     323
SING 180 380 FUEL OIL SPR SWAP - NEW YORK MERCANTILE EXCHANGE ;2010.06.08;    2311;       0;      91;       0;    1837;    1899;    1837;    1990;     474;     321
SING 180 380 FUEL OIL SPR SWAP - NEW YORK MERCANTILE EXCHANGE ;2010.06.01;    2534;       0;      70;       0;    2024;    2034;    2024;    2104;     510;     430
SING 180 380 FUEL OIL SPR SWAP - NEW YORK MERCANTILE EXCHANGE ;2010.05.25;    2351;       0;     120;       0;    1840;    1811;    1840;    1931;     511;     420
SING 180 380 FUEL OIL SPR SWAP - NEW YORK MERCANTILE EXCHANGE ;2010.05.18;    2224;       0;     130;       0;    1834;    1507;    1834;    1637;     390;     587
SING 180 380 FUEL OIL SPR SWAP - NEW YORK MERCANTILE EXCHANGE ;2010.05.11;    1604;       0;      25;       0;    1159;    1154;    1159;    1179;     445;     425
SING 180 380 FUEL OIL SPR SWAP - NEW YORK MERCANTILE EXCHANGE ;2010.03.30;    2351;       0;       0;       0;    1557;    1697;    1557;    1697;     794;     654
SING 180 380 FUEL OIL SPR SWAP - NEW YORK MERCANTILE EXCHANGE ;2009.09.01;    2425;       0;       0;       0;    1568;    1502;    1568;    1502;     857;     923
SING 180 380 FUEL OIL SPR SWAP - NEW YORK MERCANTILE EXCHANGE ;2009.08.25;    2352;       0;       0;       0;    1483;    1442;    1483;    1442;     869;     910
SING 180 380 FUEL OIL SPR SWAP - NEW YORK MERCANTILE EXCHANGE ;2009.08.18;    2347;       0;       0;       0;    1475;    1432;    1475;    1432;     872;     915
SING 180 380 FUEL OIL SPR SWAP - NEW YORK MERCANTILE EXCHANGE ;2009.08.11;    2352;       0;       0;       0;    1480;    1432;    1480;    1432;     872;     920
SING 180 380 FUEL OIL SPR SWAP - NEW YORK MERCANTILE EXCHANGE ;2009.08.04;    2297;       0;       0;       0;    1400;    1437;    1400;    1437;     897;     860
SING 180 380 FUEL OIL SPR SWAP - NEW YORK MERCANTILE EXCHANGE ;2009.07.28;    2723;       0;       0;       0;    1881;    1772;    1881;    1772;     842;     951
SING 180 380 FUEL OIL SPR SWAP - NEW YORK MERCANTILE EXCHANGE ;2009.06.30;    2615;       0;       0;       0;    1740;    1928;    1740;    1928;     875;     687
SING 180 380 FUEL OIL SPR SWAP - NEW YORK MERCANTILE EXCHANGE ;2009.06.23;    2451;       0;       0;       0;    1615;    1808;    1615;    1808;     836;     643
SING 180 380 FUEL OIL SPR SWAP - NEW YORK MERCANTILE EXCHANGE ;2009.06.16;    2400;       0;       0;       0;    1517;    1810;    1517;    1810;     883;     590
SING 180 380 FUEL OIL SPR SWAP - NEW YORK MERCANTILE EXCHANGE ;2009.06.09;    2373;       0;       0;       0;    1375;    1776;    1375;    1776;     998;     597
SING 180 380 FUEL OIL SPR SWAP - NEW YORK MERCANTILE EXCHANGE ;2009.05.26;    2813;       0;       0;       0;    1884;    2102;    1884;    2102;     929;     711
SING 180 380 FUEL OIL SPR SWAP - NEW YORK MERCANTILE EXCHANGE ;2009.05.19;    2743;       0;       0;       0;    1804;    2042;    1804;    2042;     939;     701
SING 180 380 FUEL OIL SPR SWAP - NEW YORK MERCANTILE EXCHANGE ;2009.05.12;    2687;       0;       0;       0;    1777;    2016;    1777;    2016;     910;     671
SING 180 380 FUEL OIL SPR SWAP - NEW YORK MERCANTILE EXCHANGE ;2009.05.05;    2446;       0;       0;       0;    1617;    1841;    1617;    1841;     829;     605
SING 180 380 FUEL OIL SPR SWAP - NEW YORK MERCANTILE EXCHANGE ;2009.04.28;    3028;      95;       0;       0;    2077;    2384;    2172;    2384;     856;     644
SING 180 380 FUEL OIL SPR SWAP - NEW YORK MERCANTILE EXCHANGE ;2009.04.21;    2963;      95;       0;       0;    1982;    2379;    2077;    2379;     886;     584
SING 180 380 FUEL OIL SPR SWAP - NEW YORK MERCANTILE EXCHANGE ;2009.04.14;    2816;      95;       0;       0;    1873;    2275;    1968;    2275;     848;     541
SING 180 380 FUEL OIL SPR SWAP - NEW YORK MERCANTILE EXCHANGE ;2009.04.07;    2761;      95;       0;       0;    1878;    2230;    1973;    2230;     788;     531
SING 180 380 FUEL OIL SPR SWAP - NEW YORK MERCANTILE EXCHANGE ;2009.03.31;    3224;      90;       0;       0;    2344;    2609;    2434;    2609;     790;     615
SING 180 380 FUEL OIL SPR SWAP - NEW YORK MERCANTILE EXCHANGE ;2009.03.24;    3182;      90;       0;       0;    2307;    2577;    2397;    2577;     785;     605
SING 180 380 FUEL OIL SPR SWAP - NEW YORK MERCANTILE EXCHANGE ;2009.03.17;    3046;      90;       0;       0;    2284;    2330;    2374;    2330;     672;     716
SING 180 380 FUEL OIL SPR SWAP - NEW YORK MERCANTILE EXCHANGE ;2009.03.10;    2700;      85;       0;       0;    1636;    1998;    1721;    1998;     979;     702
SING 180 380 FUEL OIL SPR SWAP - NEW YORK MERCANTILE EXCHANGE ;2009.03.03;    2664;      75;       0;       0;    1636;    1988;    1711;    1988;     953;     676
SING 180 380 FUEL OIL SPR SWAP - NEW YORK MERCANTILE EXCHANGE ;2009.02.24;    3025;     205;       0;       0;    1945;    2023;    2150;    2023;     875;    1002
SING 180 380 FUEL OIL SPR SWAP - NEW YORK MERCANTILE EXCHANGE ;2009.02.17;    2662;     175;       0;       0;    1573;    1696;    1748;    1696;     914;     966
SING 180 380 FUEL OIL SPR SWAP - NEW YORK MERCANTILE EXCHANGE ;2009.01.27;    1937;      35;       0;       0;    1089;    1391;    1124;    1391;     813;     546
SING 180 380 FUEL OIL SPR SWAP - NEW YORK MERCANTILE EXCHANGE ;2009.01.20;    1803;       0;       0;       0;    1012;    1322;    1012;    1322;     791;     481
SING 180 380 FUEL OIL SPR SWAP - NEW YORK MERCANTILE EXCHANGE ;2011.06.28;    1565;      30;       0;      10;    1163;    1123;    1203;    1133;     362;     432
SING 180 380 FUEL OIL SPR SWAP - NEW YORK MERCANTILE EXCHANGE ;2011.05.31;    1728;       0;      50;       0;    1361;    1244;    1361;    1294;     367;     434
SING 180 380 FUEL OIL SPR SWAP - NEW YORK MERCANTILE EXCHANGE ;2011.05.24;    1643;       0;      50;       0;    1336;    1149;    1336;    1199;     307;     444
SING 180 380 FUEL OIL SPR SWAP - NEW YORK MERCANTILE EXCHANGE ;2011.05.17;    1583;       0;      50;       0;    1221;    1139;    1221;    1189;     362;     394
SING 180 380 FUEL OIL SPR SWAP - NEW YORK MERCANTILE EXCHANGE ;2011.05.10;    1558;       0;      50;       0;    1301;    1143;    1301;    1193;     257;     365
SING 180 380 FUEL OIL SPR SWAP - NEW YORK MERCANTILE EXCHANGE ;2011.05.03;    1505;       0;      50;       0;    1193;    1069;    1193;    1119;     312;     386
SING 180 380 FUEL OIL SPR SWAP - NEW YORK MERCANTILE EXCHANGE ;2011.04.26;    2030;       0;      65;      15;    1671;    1461;    1686;    1541;     344;     489
SING 180 380 FUEL OIL SPR SWAP - NEW YORK MERCANTILE EXCHANGE ;2011.04.19;    1710;       0;      80;       0;    1276;    1181;    1276;    1261;     434;     449
SING 180 380 FUEL OIL SPR SWAP - NEW YORK MERCANTILE EXCHANGE ;2011.04.12;    1625;       0;      80;       0;    1155;    1107;    1155;    1187;     470;     438
SING 180 380 FUEL OIL SPR SWAP - NEW YORK MERCANTILE EXCHANGE ;2011.04.05;    1555;       0;      60;       0;    1110;    1052;    1110;    1112;     445;     443
SING 180 380 FUEL OIL SPR SWAP - NEW YORK MERCANTILE EXCHANGE ;2011.03.29;    1888;       0;      30;       0;    1488;    1339;    1488;    1369;     400;     519
SING 180 380 FUEL OIL SPR SWAP - NEW YORK MERCANTILE EXCHANGE ;2011.03.22;    1827;       0;      30;       0;    1434;    1200;    1434;    1230;     393;     597
SING 180 380 FUEL OIL SPR SWAP - NEW YORK MERCANTILE EXCHANGE ;2011.03.15;    1682;       0;      30;       0;    1128;     903;    1128;     933;     554;     749
SING 180 380 FUEL OIL SPR SWAP - NEW YORK MERCANTILE EXCHANGE ;2011.03.01;    2058;       0;       0;       0;    1468;    1376;    1468;    1376;     590;     682
SING 180 380 FUEL OIL SPR SWAP - NEW YORK MERCANTILE EXCHANGE ;2011.02.22;    2028;       0;       0;       0;    1448;    1316;    1448;    1316;     580;     712
SING 180 380 FUEL OIL SPR SWAP - NEW YORK MERCANTILE EXCHANGE ;2011.02.01;    1710;       0;       0;       0;    1321;    1299;    1321;    1299;     389;     411
SING 180 380 FUEL OIL SPR SWAP - NEW YORK MERCANTILE EXCHANGE ;2011.06.28;    1565;      30;       0;      10;    1163;    1123;    1203;    1133;     362;     432
SING 180 380 FUEL OIL SPR SWAP - NEW YORK MERCANTILE EXCHANGE ;2011.05.31;    1728;       0;      50;       0;    1361;    1244;    1361;    1294;     367;     434
SING 180 380 FUEL OIL SPR SWAP - NEW YORK MERCANTILE EXCHANGE ;2011.05.24;    1643;       0;      50;       0;    1336;    1149;    1336;    1199;     307;     444
SING 180 380 FUEL OIL SPR SWAP - NEW YORK MERCANTILE EXCHANGE ;2011.05.17;    1583;       0;      50;       0;    1221;    1139;    1221;    1189;     362;     394
SING 180 380 FUEL OIL SPR SWAP - NEW YORK MERCANTILE EXCHANGE ;2011.05.10;    1558;       0;      50;       0;    1301;    1143;    1301;    1193;     257;     365
SING 180 380 FUEL OIL SPR SWAP - NEW YORK MERCANTILE EXCHANGE ;2011.05.03;    1505;       0;      50;       0;    1193;    1069;    1193;    1119;     312;     386
SING 180 380 FUEL OIL SPR SWAP - NEW YORK MERCANTILE EXCHANGE ;2011.04.26;    2030;       0;      65;      15;    1671;    1461;    1686;    1541;     344;     489
SING 180 380 FUEL OIL SPR SWAP - NEW YORK MERCANTILE EXCHANGE ;2011.04.19;    1710;       0;      80;       0;    1276;    1181;    1276;    1261;     434;     449
SING 180 380 FUEL OIL SPR SWAP - NEW YORK MERCANTILE EXCHANGE ;2011.04.12;    1625;       0;      80;       0;    1155;    1107;    1155;    1187;     470;     438
SING 180 380 FUEL OIL SPR SWAP - NEW YORK MERCANTILE EXCHANGE ;2011.04.05;    1555;       0;      60;       0;    1110;    1052;    1110;    1112;     445;     443
SING 180 380 FUEL OIL SPR SWAP - NEW YORK MERCANTILE EXCHANGE ;2011.03.29;    1888;       0;      30;       0;    1488;    1339;    1488;    1369;     400;     519
SING 180 380 FUEL OIL SPR SWAP - NEW YORK MERCANTILE EXCHANGE ;2011.03.22;    1827;       0;      30;       0;    1434;    1200;    1434;    1230;     393;     597
SING 180 380 FUEL OIL SPR SWAP - NEW YORK MERCANTILE EXCHANGE ;2011.03.15;    1682;       0;      30;       0;    1128;     903;    1128;     933;     554;     749
SING 180 380 FUEL OIL SPR SWAP - NEW YORK MERCANTILE EXCHANGE ;2011.03.01;    2058;       0;       0;       0;    1468;    1376;    1468;    1376;     590;     682
SING 180 380 FUEL OIL SPR SWAP - NEW YORK MERCANTILE EXCHANGE ;2011.02.22;    2028;       0;       0;       0;    1448;    1316;    1448;    1316;     580;     712
SING 180 380 FUEL OIL SPR SWAP - NEW YORK MERCANTILE EXCHANGE ;2011.02.01;    1710;       0;       0;       0;    1321;    1299;    1321;    1299;     389;     411
SING 180 380 FUEL OIL SPR SWAP - NEW YORK MERCANTILE EXCHANGE ;2010.12.28;    1657;       0;      35;       0;    1179;    1069;    1179;    1104;     478;     553
SING 180 380 FUEL OIL SPR SWAP - NEW YORK MERCANTILE EXCHANGE ;2010.12.21;    1567;       0;      35;       0;    1069;     932;    1069;     967;     498;     600
SING 180 380 FUEL OIL SPR SWAP - NEW YORK MERCANTILE EXCHANGE ;2010.11.30;    1666;       0;      55;       0;    1142;     907;    1142;     962;     524;     704
SING 180 380 FUEL OIL SPR SWAP - NEW YORK MERCANTILE EXCHANGE ;2010.11.23;    1581;       0;      55;       0;    1097;     902;    1097;     957;     484;     624
SING 180 380 FUEL OIL SPR SWAP - NEW YORK MERCANTILE EXCHANGE ;2010.11.16;    1556;       0;      55;       0;    1008;     897;    1008;     952;     548;     604
SING 180 380 FUEL OIL SPR SWAP - NEW YORK MERCANTILE EXCHANGE ;2010.11.09;    1410;       0;      55;       0;     834;     867;     834;     922;     576;     488
SING 180 380 FUEL OIL SPR SWAP - NEW YORK MERCANTILE EXCHANGE ;2010.10.26;    1824;       0;      55;       0;    1461;    1263;    1461;    1318;     363;     506
SING 180 380 FUEL OIL SPR SWAP - NEW YORK MERCANTILE EXCHANGE ;2010.10.19;    1704;       0;      50;       0;    1401;    1123;    1401;    1173;     303;     531
SING 180 380 FUEL OIL SPR SWAP - NEW YORK MERCANTILE EXCHANGE ;2010.10.12;    1634;       0;      50;       0;    1342;    1113;    1342;    1163;     292;     471
SING 180 380 FUEL OIL SPR SWAP - NEW YORK MERCANTILE EXCHANGE ;2010.10.05;    1579;       0;       0;       0;    1300;    1168;    1300;    1168;     279;     411
SING 180 380 FUEL OIL SPR SWAP - NEW YORK MERCANTILE EXCHANGE ;2010.09.28;    2135;      30;      25;       0;    1824;    1634;    1854;    1659;     281;     476
SING 180 380 FUEL OIL SPR SWAP - NEW YORK MERCANTILE EXCHANGE ;2010.09.21;    2018;      30;      25;       0;    1789;    1559;    1819;    1584;     199;     434
SING 180 380 FUEL OIL SPR SWAP - NEW YORK MERCANTILE EXCHANGE ;2010.09.14;    1952;      30;      25;       0;    1451;    1408;    1481;    1433;     471;     519
SING 180 380 FUEL OIL SPR SWAP - NEW YORK MERCANTILE EXCHANGE ;2010.09.07;    1822;      30;      25;       0;    1316;    1308;    1346;    1333;     476;     489
SING 180 380 FUEL OIL SPR SWAP - NEW YORK MERCANTILE EXCHANGE ;2010.08.31;    2272;      40;      25;       0;    1761;    1829;    1801;    1854;     471;     418
SING 180 380 FUEL OIL SPR SWAP - NEW YORK MERCANTILE EXCHANGE ;2010.08.24;    2245;      40;      25;       0;    1739;    1717;    1779;    1742;     466;     503
SING 180 380 FUEL OIL SPR SWAP - NEW YORK MERCANTILE EXCHANGE ;2010.08.17;    1820;      40;       0;       0;    1343;    1383;    1383;    1383;     437;     437
SING 180 380 FUEL OIL SPR SWAP - NEW YORK MERCANTILE EXCHANGE ;2010.08.10;    1738;       0;       0;       0;    1351;    1433;    1351;    1433;     387;     305
SING 180 380 FUEL OIL SPR SWAP - NEW YORK MERCANTILE EXCHANGE ;2010.08.03;    1559;       0;       0;       0;    1120;    1220;    1120;    1220;     439;     339
SING 180 380 FUEL OIL SPR SWAP - NEW YORK MERCANTILE EXCHANGE ;2010.07.27;    2284;       0;      76;       0;    1755;    1874;    1755;    1950;     529;     334
SING 180 380 FUEL OIL SPR SWAP - NEW YORK MERCANTILE EXCHANGE ;2010.07.20;    2144;       0;      76;       0;    1725;    1709;    1725;    1785;     419;     359
SING 180 380 FUEL OIL SPR SWAP - NEW YORK MERCANTILE EXCHANGE ;2010.07.13;    2092;       0;      76;       0;    1678;    1667;    1678;    1743;     414;     349
SING 180 380 FUEL OIL SPR SWAP - NEW YORK MERCANTILE EXCHANGE ;2010.07.06;    2019;       0;      76;       0;    1704;    1647;    1704;    1723;     315;     296
SING 180 380 FUEL OIL SPR SWAP - NEW YORK MERCANTILE EXCHANGE ;2010.06.29;    2750;       0;     111;       0;    2366;    2305;    2366;    2416;     384;     334
SING 180 380 FUEL OIL SPR SWAP - NEW YORK MERCANTILE EXCHANGE ;2010.06.22;    2662;       0;     111;       0;    2253;    2247;    2253;    2358;     409;     304
SING 180 380 FUEL OIL SPR SWAP - NEW YORK MERCANTILE EXCHANGE ;2010.06.15;    2549;       0;     111;       0;    2151;    2115;    2151;    2226;     398;     323
SING 180 380 FUEL OIL SPR SWAP - NEW YORK MERCANTILE EXCHANGE ;2010.06.08;    2311;       0;      91;       0;    1837;    1899;    1837;    1990;     474;     321
SING 180 380 FUEL OIL SPR SWAP - NEW YORK MERCANTILE EXCHANGE ;2010.06.01;    2534;       0;      70;       0;    2024;    2034;    2024;    2104;     510;     430
SING 180 380 FUEL OIL SPR SWAP - NEW YORK MERCANTILE EXCHANGE ;2010.05.25;    2351;       0;     120;       0;    1840;    1811;    1840;    1931;     511;     420
SING 180 380 FUEL OIL SPR SWAP - NEW YORK MERCANTILE EXCHANGE ;2010.05.18;    2224;       0;     130;       0;    1834;    1507;    1834;    1637;     390;     587
SING 180 380 FUEL OIL SPR SWAP - NEW YORK MERCANTILE EXCHANGE ;2010.05.11;    1604;       0;      25;       0;    1159;    1154;    1159;    1179;     445;     425
SING 180 380 FUEL OIL SPR SWAP - NEW YORK MERCANTILE EXCHANGE ;2010.03.30;    2351;       0;       0;       0;    1557;    1697;    1557;    1697;     794;     654
SING 180 380 FUEL OIL SPR SWAP - NEW YORK MERCANTILE EXCHANGE ;2009.09.01;    2425;       0;       0;       0;    1568;    1502;    1568;    1502;     857;     923
SING 180 380 FUEL OIL SPR SWAP - NEW YORK MERCANTILE EXCHANGE ;2009.08.25;    2352;       0;       0;       0;    1483;    1442;    1483;    1442;     869;     910
SING 180 380 FUEL OIL SPR SWAP - NEW YORK MERCANTILE EXCHANGE ;2009.08.18;    2347;       0;       0;       0;    1475;    1432;    1475;    1432;     872;     915
SING 180 380 FUEL OIL SPR SWAP - NEW YORK MERCANTILE EXCHANGE ;2009.08.11;    2352;       0;       0;       0;    1480;    1432;    1480;    1432;     872;     920
SING 180 380 FUEL OIL SPR SWAP - NEW YORK MERCANTILE EXCHANGE ;2009.08.04;    2297;       0;       0;       0;    1400;    1437;    1400;    1437;     897;     860
SING 180 380 FUEL OIL SPR SWAP - NEW YORK MERCANTILE EXCHANGE ;2009.07.28;    2723;       0;       0;       0;    1881;    1772;    1881;    1772;     842;     951
SING 180 380 FUEL OIL SPR SWAP - NEW YORK MERCANTILE EXCHANGE ;2009.06.30;    2615;       0;       0;       0;    1740;    1928;    1740;    1928;     875;     687
SING 180 380 FUEL OIL SPR SWAP - NEW YORK MERCANTILE EXCHANGE ;2009.06.23;    2451;       0;       0;       0;    1615;    1808;    1615;    1808;     836;     643
SING 180 380 FUEL OIL SPR SWAP - NEW YORK MERCANTILE EXCHANGE ;2009.06.16;    2400;       0;       0;       0;    1517;    1810;    1517;    1810;     883;     590
SING 180 380 FUEL OIL SPR SWAP - NEW YORK MERCANTILE EXCHANGE ;2009.06.09;    2373;       0;       0;       0;    1375;    1776;    1375;    1776;     998;     597
SING 180 380 FUEL OIL SPR SWAP - NEW YORK MERCANTILE EXCHANGE ;2009.05.26;    2813;       0;       0;       0;    1884;    2102;    1884;    2102;     929;     711
SING 180 380 FUEL OIL SPR SWAP - NEW YORK MERCANTILE EXCHANGE ;2009.05.19;    2743;       0;       0;       0;    1804;    2042;    1804;    2042;     939;     701
SING 180 380 FUEL OIL SPR SWAP - NEW YORK MERCANTILE EXCHANGE ;2009.05.12;    2687;       0;       0;       0;    1777;    2016;    1777;    2016;     910;     671
SING 180 380 FUEL OIL SPR SWAP - NEW YORK MERCANTILE EXCHANGE ;2009.05.05;    2446;       0;       0;       0;    1617;    1841;    1617;    1841;     829;     605
SING 180 380 FUEL OIL SPR SWAP - NEW YORK MERCANTILE EXCHANGE ;2009.04.28;    3028;      95;       0;       0;    2077;    2384;    2172;    2384;     856;     644
SING 180 380 FUEL OIL SPR SWAP - NEW YORK MERCANTILE EXCHANGE ;2009.04.21;    2963;      95;       0;       0;    1982;    2379;    2077;    2379;     886;     584
SING 180 380 FUEL OIL SPR SWAP - NEW YORK MERCANTILE EXCHANGE ;2009.04.14;    2816;      95;       0;       0;    1873;    2275;    1968;    2275;     848;     541
SING 180 380 FUEL OIL SPR SWAP - NEW YORK MERCANTILE EXCHANGE ;2009.04.07;    2761;      95;       0;       0;    1878;    2230;    1973;    2230;     788;     531
SING 180 380 FUEL OIL SPR SWAP - NEW YORK MERCANTILE EXCHANGE ;2009.03.31;    3224;      90;       0;       0;    2344;    2609;    2434;    2609;     790;     615
SING 180 380 FUEL OIL SPR SWAP - NEW YORK MERCANTILE EXCHANGE ;2009.03.24;    3182;      90;       0;       0;    2307;    2577;    2397;    2577;     785;     605
SING 180 380 FUEL OIL SPR SWAP - NEW YORK MERCANTILE EXCHANGE ;2009.03.17;    3046;      90;       0;       0;    2284;    2330;    2374;    2330;     672;     716
SING 180 380 FUEL OIL SPR SWAP - NEW YORK MERCANTILE EXCHANGE ;2009.03.10;    2700;      85;       0;       0;    1636;    1998;    1721;    1998;     979;     702
SING 180 380 FUEL OIL SPR SWAP - NEW YORK MERCANTILE EXCHANGE ;2009.03.03;    2664;      75;       0;       0;    1636;    1988;    1711;    1988;     953;     676
SING 180 380 FUEL OIL SPR SWAP - NEW YORK MERCANTILE EXCHANGE ;2009.02.24;    3025;     205;       0;       0;    1945;    2023;    2150;    2023;     875;    1002
SING 180 380 FUEL OIL SPR SWAP - NEW YORK MERCANTILE EXCHANGE ;2009.02.17;    2662;     175;       0;       0;    1573;    1696;    1748;    1696;     914;     966
SING 180 380 FUEL OIL SPR SWAP - NEW YORK MERCANTILE EXCHANGE ;2009.01.27;    1937;      35;       0;       0;    1089;    1391;    1124;    1391;     813;     546
SING 180 380 FUEL OIL SPR SWAP - NEW YORK MERCANTILE EXCHANGE ;2009.01.20;    1803;       0;       0;       0;    1012;    1322;    1012;    1322;     791;     481
