COLUMBIA GULF ML SWAP - NEW YORK MERCANTILE EXCHANGE ;2010.08.31;   31050;       0;       0;       0;   24847;   26763;   24847;   26763;    6203;    4287
COLUMBIA GULF ML SWAP - NEW YORK MERCANTILE EXCHANGE ;2010.07.27;   32404;       0;       0;       0;   26925;   27891;   26925;   27891;    5479;    4513
COLUMBIA GULF ML SWAP - NEW YORK MERCANTILE EXCHANGE ;2010.07.20;   32621;       0;       0;       0;   27142;   28108;   27142;   28108;    5479;    4513
COLUMBIA GULF ML SWAP - NEW YORK MERCANTILE EXCHANGE ;2010.07.13;   33477;       0;       0;       0;   27998;   28964;   27998;   28964;    5479;    4513
COLUMBIA GULF ML SWAP - NEW YORK MERCANTILE EXCHANGE ;2010.07.06;   33171;       0;       0;       0;   28181;   30794;   28181;   30794;    4990;    2377
COLUMBIA GULF ML SWAP - NEW YORK MERCANTILE EXCHANGE ;2010.06.29;   36922;       0;       0;       0;   31560;   34262;   31560;   34262;    5362;    2660
COLUMBIA GULF ML SWAP - NEW YORK MERCANTILE EXCHANGE ;2010.06.22;   37205;       0;       0;       0;   31932;   34696;   31932;   34696;    5273;    2509
COLUMBIA GULF ML SWAP - NEW YORK MERCANTILE EXCHANGE ;2010.06.15;   37205;       0;       0;       0;   31932;   34696;   31932;   34696;    5273;    2509
COLUMBIA GULF ML SWAP - NEW YORK MERCANTILE EXCHANGE ;2010.05.25;   41345;       0;     480;       0;   34481;   38674;   34481;   39154;    6864;    2191
COLUMBIA GULF ML SWAP - NEW YORK MERCANTILE EXCHANGE ;2010.08.31;   31050;       0;       0;       0;   24847;   26763;   24847;   26763;    6203;    4287
COLUMBIA GULF ML SWAP - NEW YORK MERCANTILE EXCHANGE ;2010.07.27;   32404;       0;       0;       0;   26925;   27891;   26925;   27891;    5479;    4513
COLUMBIA GULF ML SWAP - NEW YORK MERCANTILE EXCHANGE ;2010.07.20;   32621;       0;       0;       0;   27142;   28108;   27142;   28108;    5479;    4513
COLUMBIA GULF ML SWAP - NEW YORK MERCANTILE EXCHANGE ;2010.07.13;   33477;       0;       0;       0;   27998;   28964;   27998;   28964;    5479;    4513
COLUMBIA GULF ML SWAP - NEW YORK MERCANTILE EXCHANGE ;2010.07.06;   33171;       0;       0;       0;   28181;   30794;   28181;   30794;    4990;    2377
COLUMBIA GULF ML SWAP - NEW YORK MERCANTILE EXCHANGE ;2010.06.29;   36922;       0;       0;       0;   31560;   34262;   31560;   34262;    5362;    2660
COLUMBIA GULF ML SWAP - NEW YORK MERCANTILE EXCHANGE ;2010.06.22;   37205;       0;       0;       0;   31932;   34696;   31932;   34696;    5273;    2509
COLUMBIA GULF ML SWAP - NEW YORK MERCANTILE EXCHANGE ;2010.06.15;   37205;       0;       0;       0;   31932;   34696;   31932;   34696;    5273;    2509
COLUMBIA GULF ML SWAP - NEW YORK MERCANTILE EXCHANGE ;2010.05.25;   41345;       0;     480;       0;   34481;   38674;   34481;   39154;    6864;    2191
COLUMBIA GULF ML SWAP - NEW YORK MERCANTILE EXCHANGE ;2010.08.31;   31050;       0;       0;       0;   24847;   26763;   24847;   26763;    6203;    4287
COLUMBIA GULF ML SWAP - NEW YORK MERCANTILE EXCHANGE ;2010.07.27;   32404;       0;       0;       0;   26925;   27891;   26925;   27891;    5479;    4513
COLUMBIA GULF ML SWAP - NEW YORK MERCANTILE EXCHANGE ;2010.07.20;   32621;       0;       0;       0;   27142;   28108;   27142;   28108;    5479;    4513
COLUMBIA GULF ML SWAP - NEW YORK MERCANTILE EXCHANGE ;2010.07.13;   33477;       0;       0;       0;   27998;   28964;   27998;   28964;    5479;    4513
COLUMBIA GULF ML SWAP - NEW YORK MERCANTILE EXCHANGE ;2010.07.06;   33171;       0;       0;       0;   28181;   30794;   28181;   30794;    4990;    2377
COLUMBIA GULF ML SWAP - NEW YORK MERCANTILE EXCHANGE ;2010.06.29;   36922;       0;       0;       0;   31560;   34262;   31560;   34262;    5362;    2660
COLUMBIA GULF ML SWAP - NEW YORK MERCANTILE EXCHANGE ;2010.06.22;   37205;       0;       0;       0;   31932;   34696;   31932;   34696;    5273;    2509
COLUMBIA GULF ML SWAP - NEW YORK MERCANTILE EXCHANGE ;2010.06.15;   37205;       0;       0;       0;   31932;   34696;   31932;   34696;    5273;    2509
COLUMBIA GULF ML SWAP - NEW YORK MERCANTILE EXCHANGE ;2010.05.25;   41345;       0;     480;       0;   34481;   38674;   34481;   39154;    6864;    2191
