AMEX MAJOR MARKET INDEX - INTERNATIONAL MONETARY MARKET ;1995.08.08;     778;       0;      20;     228;     172;     216;     400;     464;     378;     314
AMEX MAJOR MARKET INDEX - INTERNATIONAL MONETARY MARKET ;1995.06.13;    1060;       0;       3;     247;     298;     290;     545;     540;     515;     520
AMEX MAJOR MARKET INDEX - INTERNATIONAL MONETARY MARKET ;1995.05.30;     976;      10;       2;     238;     276;     268;     524;     508;     452;     468
AMEX MAJOR MARKET INDEX - INTERNATIONAL MONETARY MARKET ;1995.05.16;    1565;       0;       5;     242;     631;     774;     873;    1021;     692;     544
AMEX MAJOR MARKET INDEX - INTERNATIONAL MONETARY MARKET ;1995.05.09;    1308;       0;       2;     251;     436;     574;     687;     827;     621;     481
AMEX MAJOR MARKET INDEX - INTERNATIONAL MONETARY MARKET ;1995.05.02;    1318;     115;       6;     237;     518;     603;     870;     846;     448;     472
AMEX MAJOR MARKET INDEX - INTERNATIONAL MONETARY MARKET ;1995.04.25;    1282;     123;       0;     242;     519;     559;     884;     801;     398;     481
AMEX MAJOR MARKET INDEX - INTERNATIONAL MONETARY MARKET ;1995.04.18;    1299;     112;       0;     248;     537;     522;     897;     770;     402;     529
AMEX MAJOR MARKET INDEX - INTERNATIONAL MONETARY MARKET ;1995.08.08;     778;       0;      20;     228;     172;     216;     400;     464;     378;     314
AMEX MAJOR MARKET INDEX - INTERNATIONAL MONETARY MARKET ;1995.06.13;    1060;       0;       3;     247;     298;     290;     545;     540;     515;     520
AMEX MAJOR MARKET INDEX - INTERNATIONAL MONETARY MARKET ;1995.05.30;     976;      10;       2;     238;     276;     268;     524;     508;     452;     468
AMEX MAJOR MARKET INDEX - INTERNATIONAL MONETARY MARKET ;1995.05.16;    1565;       0;       5;     242;     631;     774;     873;    1021;     692;     544
AMEX MAJOR MARKET INDEX - INTERNATIONAL MONETARY MARKET ;1995.05.09;    1308;       0;       2;     251;     436;     574;     687;     827;     621;     481
AMEX MAJOR MARKET INDEX - INTERNATIONAL MONETARY MARKET ;1995.05.02;    1318;     115;       6;     237;     518;     603;     870;     846;     448;     472
AMEX MAJOR MARKET INDEX - INTERNATIONAL MONETARY MARKET ;1995.04.25;    1282;     123;       0;     242;     519;     559;     884;     801;     398;     481
AMEX MAJOR MARKET INDEX - INTERNATIONAL MONETARY MARKET ;1995.04.18;    1299;     112;       0;     248;     537;     522;     897;     770;     402;     529
AMEX MAJOR MARKET INDEX - INTERNATIONAL MONETARY MARKET ;1995.08.08;     778;       0;      20;     228;     172;     216;     400;     464;     378;     314
AMEX MAJOR MARKET INDEX - INTERNATIONAL MONETARY MARKET ;1995.06.13;    1060;       0;       3;     247;     298;     290;     545;     540;     515;     520
AMEX MAJOR MARKET INDEX - INTERNATIONAL MONETARY MARKET ;1995.05.30;     976;      10;       2;     238;     276;     268;     524;     508;     452;     468
AMEX MAJOR MARKET INDEX - INTERNATIONAL MONETARY MARKET ;1995.05.16;    1565;       0;       5;     242;     631;     774;     873;    1021;     692;     544
AMEX MAJOR MARKET INDEX - INTERNATIONAL MONETARY MARKET ;1995.05.09;    1308;       0;       2;     251;     436;     574;     687;     827;     621;     481
AMEX MAJOR MARKET INDEX - INTERNATIONAL MONETARY MARKET ;1995.05.02;    1318;     115;       6;     237;     518;     603;     870;     846;     448;     472
AMEX MAJOR MARKET INDEX - INTERNATIONAL MONETARY MARKET ;1995.04.25;    1282;     123;       0;     242;     519;     559;     884;     801;     398;     481
AMEX MAJOR MARKET INDEX - INTERNATIONAL MONETARY MARKET ;1995.04.18;    1299;     112;       0;     248;     537;     522;     897;     770;     402;     529
