SUGAR NO. 11 - COFFEESUGAR AND COCOA EXCHANGE ;2003.02.14;  312961;   78748;    8486;   29639;  134649;  245344;  243036;  283468;   69926;   29493
SUGAR NO. 11 - COFFEESUGAR AND COCOA EXCHANGE ;2003.02.11;  354783;   79661;    2905;   45322;  153208;  272519;  278192;  320746;   76592;   34037
SUGAR NO. 11 - COFFEESUGAR AND COCOA EXCHANGE ;2003.02.04;  338575;   78513;    1646;   37019;  146225;  267912;  261757;  306578;   76818;   31998
SUGAR NO. 11 - COFFEESUGAR AND COCOA EXCHANGE ;2003.01.28;  325908;   72312;    1226;   34640;  140462;  257194;  247415;  293061;   78494;   32848
SUGAR NO. 11 - COFFEESUGAR AND COCOA EXCHANGE ;2003.01.21;  300595;   62484;    9861;   34835;  130026;  220668;  227346;  265364;   73249;   35231
SUGAR NO. 11 - COFFEESUGAR AND COCOA EXCHANGE ;2003.01.14;  287616;   57772;    1370;   30729;  130813;  221741;  219314;  253840;   68302;   33776
SUGAR NO. 11 - COFFEESUGAR AND COCOA EXCHANGE ;2003.01.07;  279932;   56108;    1071;   29258;  127333;  217024;  212699;  247353;   67234;   32580
SUGAR NO. 11 - COFFEESUGAR AND COCOA EXCHANGE ;2002.12.31;  274050;   51594;     493;   28008;  128627;  215166;  208229;  243667;   65822;   30384
SUGAR NO. 11 - COFFEESUGAR AND COCOA EXCHANGE ;2002.12.23;  270857;   50684;     433;   27248;  131580;  217661;  209512;  245342;   61345;   25515
SUGAR NO. 11 - COFFEESUGAR AND COCOA EXCHANGE ;2002.12.17;  270415;   52514;     167;   27098;  128371;  216899;  207983;  244164;   62432;   26251
SUGAR NO. 11 - COFFEESUGAR AND COCOA EXCHANGE ;2002.12.10;  268142;   52008;     179;   27443;  124848;  214212;  204299;  241834;   63843;   26308
SUGAR NO. 11 - COFFEESUGAR AND COCOA EXCHANGE ;2002.12.03;  272253;   57724;     714;   28889;  123164;  217753;  209778;  247356;   62475;   24897
SUGAR NO. 11 - COFFEESUGAR AND COCOA EXCHANGE ;2002.11.26;  254218;   51347;      49;   27486;  119707;  204497;  198540;  232032;   55678;   22186
SUGAR NO. 11 - COFFEESUGAR AND COCOA EXCHANGE ;2002.11.19;  251160;   51540;     575;   25070;  117195;  201545;  193805;  227191;   57355;   23970
SUGAR NO. 11 - COFFEESUGAR AND COCOA EXCHANGE ;2002.11.12;  255566;   65396;    1050;   23460;  106002;  210260;  194858;  234770;   60708;   20796
SUGAR NO. 11 - COFFEESUGAR AND COCOA EXCHANGE ;2002.11.05;  268249;   72935;    2813;   24101;  103148;  218951;  200184;  245865;   68065;   22384
SUGAR NO. 11 - COFFEESUGAR AND COCOA EXCHANGE ;2002.10.29;  261601;   72641;    5895;   22292;   99552;  211577;  194485;  239764;   67116;   21837
SUGAR NO. 11 - COFFEESUGAR AND COCOA EXCHANGE ;2002.10.22;  261905;   75419;    6187;   21810;   95099;  213136;  192328;  241133;   69577;   20772
SUGAR NO. 11 - COFFEESUGAR AND COCOA EXCHANGE ;2002.10.15;  255110;   72138;    5892;   20879;   90794;  206364;  183811;  233135;   71299;   21975
SUGAR NO. 11 - COFFEESUGAR AND COCOA EXCHANGE ;2002.10.08;  252090;   71733;    5307;   19858;   88901;  204606;  180492;  229771;   71597;   22318
SUGAR NO. 11 - COFFEESUGAR AND COCOA EXCHANGE ;2002.10.01;  238111;   64652;    8198;   10218;   77276;  176280;  152145;  194695;   85966;   43416
SUGAR NO. 11 - COFFEESUGAR AND COCOA EXCHANGE ;2002.09.24;  248886;   65959;    3027;   18052;   96903;  203810;  180914;  224888;   67972;   23997
SUGAR NO. 11 - COFFEESUGAR AND COCOA EXCHANGE ;2002.09.17;  251534;   55877;    1462;   17649;  106786;  208230;  180311;  227341;   71222;   24192
SUGAR NO. 11 - COFFEESUGAR AND COCOA EXCHANGE ;2002.09.10;  250760;   37573;    2714;   23330;  112320;  199956;  173223;  226001;   77537;   24759
SUGAR NO. 11 - COFFEESUGAR AND COCOA EXCHANGE ;2002.09.03;  238138;   29214;    4477;   25603;  118938;  187893;  173755;  217973;   64383;   20164
SUGAR NO. 11 - COFFEESUGAR AND COCOA EXCHANGE ;2002.08.27;  230499;   27614;    3877;   24473;  117427;  182504;  169514;  210855;   60985;   19644
SUGAR NO. 11 - COFFEESUGAR AND COCOA EXCHANGE ;2002.08.20;  220426;   28644;    2523;   22506;  111153;  175831;  162303;  200860;   58123;   19566
SUGAR NO. 11 - COFFEESUGAR AND COCOA EXCHANGE ;2002.08.13;  208519;   21233;    1984;   22503;  110079;  166341;  153815;  190828;   54704;   17691
SUGAR NO. 11 - COFFEESUGAR AND COCOA EXCHANGE ;2002.08.06;  204146;   21738;    2403;   22353;  106214;  160835;  150305;  185591;   53842;   18555
SUGAR NO. 11 - COFFEESUGAR AND COCOA EXCHANGE ;2002.07.30;  200321;   18017;    5821;   22256;  108766;  152771;  149039;  180847;   51282;   19474
SUGAR NO. 11 - COFFEESUGAR AND COCOA EXCHANGE ;2002.07.23;  209205;   22201;    7374;   22399;  105482;  160701;  150081;  190474;   59124;   18731
SUGAR NO. 11 - COFFEESUGAR AND COCOA EXCHANGE ;2002.07.16;  189434;   14683;    9711;   21767;  102965;  138864;  139414;  170342;   50020;   19092
SUGAR NO. 11 - COFFEESUGAR AND COCOA EXCHANGE ;2002.07.09;  183003;    7833;   15097;   20877;  106768;  125051;  135478;  161025;   47524;   21977
SUGAR NO. 11 - COFFEESUGAR AND COCOA EXCHANGE ;2002.07.02;  190880;    6944;   29086;   21508;  114198;  112593;  142651;  163187;   48230;   27693
SUGAR NO. 11 - COFFEESUGAR AND COCOA EXCHANGE ;2002.06.25;  193024;   10214;   23594;   20557;  118694;  122408;  149465;  166560;   43558;   26464
SUGAR NO. 11 - COFFEESUGAR AND COCOA EXCHANGE ;2002.06.18;  191790;   12445;   10291;   19138;  113429;  136141;  145012;  165569;   46778;   26221
SUGAR NO. 11 - COFFEESUGAR AND COCOA EXCHANGE ;2002.06.11;  210654;   20401;    2707;   24255;  110843;  160014;  155499;  186975;   55155;   23679
SUGAR NO. 11 - COFFEESUGAR AND COCOA EXCHANGE ;2002.06.04;  223135;   22482;    3100;   23936;  118903;  171804;  165321;  198840;   57814;   24295
SUGAR NO. 11 - COFFEESUGAR AND COCOA EXCHANGE ;2002.05.28;  215110;   19310;    6347;   24959;  118169;  160707;  162437;  192012;   52673;   23097
SUGAR NO. 11 - COFFEESUGAR AND COCOA EXCHANGE ;2002.05.21;  210528;   18604;    4811;   23754;  114296;  159351;  156654;  187916;   53874;   22612
SUGAR NO. 11 - COFFEESUGAR AND COCOA EXCHANGE ;2002.05.14;  209339;   15020;    9390;   24476;  119958;  153550;  159454;  187415;   49885;   21924
SUGAR NO. 11 - COFFEESUGAR AND COCOA EXCHANGE ;2002.05.07;  199989;    8953;   15703;   24295;  124785;  137643;  158033;  177641;   41957;   22349
SUGAR NO. 11 - COFFEESUGAR AND COCOA EXCHANGE ;2002.04.30;  207232;    8342;   15922;   23742;  135303;  145852;  167386;  185516;   39845;   21715
SUGAR NO. 11 - COFFEESUGAR AND COCOA EXCHANGE ;2003.02.14;  312961;   78748;    8486;   29639;  134649;  245344;  243036;  283468;   69926;   29493
SUGAR NO. 11 - COFFEESUGAR AND COCOA EXCHANGE ;2003.02.11;  354783;   79661;    2905;   45322;  153208;  272519;  278192;  320746;   76592;   34037
SUGAR NO. 11 - COFFEESUGAR AND COCOA EXCHANGE ;2003.02.04;  338575;   78513;    1646;   37019;  146225;  267912;  261757;  306578;   76818;   31998
SUGAR NO. 11 - COFFEESUGAR AND COCOA EXCHANGE ;2003.01.28;  325908;   72312;    1226;   34640;  140462;  257194;  247415;  293061;   78494;   32848
SUGAR NO. 11 - COFFEESUGAR AND COCOA EXCHANGE ;2003.01.21;  300595;   62484;    9861;   34835;  130026;  220668;  227346;  265364;   73249;   35231
SUGAR NO. 11 - COFFEESUGAR AND COCOA EXCHANGE ;2003.01.14;  287616;   57772;    1370;   30729;  130813;  221741;  219314;  253840;   68302;   33776
SUGAR NO. 11 - COFFEESUGAR AND COCOA EXCHANGE ;2003.01.07;  279932;   56108;    1071;   29258;  127333;  217024;  212699;  247353;   67234;   32580
SUGAR NO. 11 - COFFEESUGAR AND COCOA EXCHANGE ;2002.12.31;  274050;   51594;     493;   28008;  128627;  215166;  208229;  243667;   65822;   30384
SUGAR NO. 11 - COFFEESUGAR AND COCOA EXCHANGE ;2002.12.23;  270857;   50684;     433;   27248;  131580;  217661;  209512;  245342;   61345;   25515
SUGAR NO. 11 - COFFEESUGAR AND COCOA EXCHANGE ;2002.12.17;  270415;   52514;     167;   27098;  128371;  216899;  207983;  244164;   62432;   26251
SUGAR NO. 11 - COFFEESUGAR AND COCOA EXCHANGE ;2002.12.10;  268142;   52008;     179;   27443;  124848;  214212;  204299;  241834;   63843;   26308
SUGAR NO. 11 - COFFEESUGAR AND COCOA EXCHANGE ;2002.12.03;  272253;   57724;     714;   28889;  123164;  217753;  209778;  247356;   62475;   24897
SUGAR NO. 11 - COFFEESUGAR AND COCOA EXCHANGE ;2002.11.26;  254218;   51347;      49;   27486;  119707;  204497;  198540;  232032;   55678;   22186
SUGAR NO. 11 - COFFEESUGAR AND COCOA EXCHANGE ;2002.11.19;  251160;   51540;     575;   25070;  117195;  201545;  193805;  227191;   57355;   23970
SUGAR NO. 11 - COFFEESUGAR AND COCOA EXCHANGE ;2002.11.12;  255566;   65396;    1050;   23460;  106002;  210260;  194858;  234770;   60708;   20796
SUGAR NO. 11 - COFFEESUGAR AND COCOA EXCHANGE ;2002.11.05;  268249;   72935;    2813;   24101;  103148;  218951;  200184;  245865;   68065;   22384
SUGAR NO. 11 - COFFEESUGAR AND COCOA EXCHANGE ;2002.10.29;  261601;   72641;    5895;   22292;   99552;  211577;  194485;  239764;   67116;   21837
SUGAR NO. 11 - COFFEESUGAR AND COCOA EXCHANGE ;2002.10.22;  261905;   75419;    6187;   21810;   95099;  213136;  192328;  241133;   69577;   20772
SUGAR NO. 11 - COFFEESUGAR AND COCOA EXCHANGE ;2002.10.15;  255110;   72138;    5892;   20879;   90794;  206364;  183811;  233135;   71299;   21975
SUGAR NO. 11 - COFFEESUGAR AND COCOA EXCHANGE ;2002.10.08;  252090;   71733;    5307;   19858;   88901;  204606;  180492;  229771;   71597;   22318
SUGAR NO. 11 - COFFEESUGAR AND COCOA EXCHANGE ;2002.10.01;  238111;   64652;    8198;   10218;   77276;  176280;  152145;  194695;   85966;   43416
SUGAR NO. 11 - COFFEESUGAR AND COCOA EXCHANGE ;2002.09.24;  248886;   65959;    3027;   18052;   96903;  203810;  180914;  224888;   67972;   23997
SUGAR NO. 11 - COFFEESUGAR AND COCOA EXCHANGE ;2002.09.17;  251534;   55877;    1462;   17649;  106786;  208230;  180311;  227341;   71222;   24192
SUGAR NO. 11 - COFFEESUGAR AND COCOA EXCHANGE ;2002.09.10;  250760;   37573;    2714;   23330;  112320;  199956;  173223;  226001;   77537;   24759
SUGAR NO. 11 - COFFEESUGAR AND COCOA EXCHANGE ;2002.09.03;  238138;   29214;    4477;   25603;  118938;  187893;  173755;  217973;   64383;   20164
SUGAR NO. 11 - COFFEESUGAR AND COCOA EXCHANGE ;2002.08.27;  230499;   27614;    3877;   24473;  117427;  182504;  169514;  210855;   60985;   19644
SUGAR NO. 11 - COFFEESUGAR AND COCOA EXCHANGE ;2002.08.20;  220426;   28644;    2523;   22506;  111153;  175831;  162303;  200860;   58123;   19566
SUGAR NO. 11 - COFFEESUGAR AND COCOA EXCHANGE ;2002.08.13;  208519;   21233;    1984;   22503;  110079;  166341;  153815;  190828;   54704;   17691
SUGAR NO. 11 - COFFEESUGAR AND COCOA EXCHANGE ;2002.08.06;  204146;   21738;    2403;   22353;  106214;  160835;  150305;  185591;   53842;   18555
SUGAR NO. 11 - COFFEESUGAR AND COCOA EXCHANGE ;2002.07.30;  200321;   18017;    5821;   22256;  108766;  152771;  149039;  180847;   51282;   19474
SUGAR NO. 11 - COFFEESUGAR AND COCOA EXCHANGE ;2002.07.23;  209205;   22201;    7374;   22399;  105482;  160701;  150081;  190474;   59124;   18731
SUGAR NO. 11 - COFFEESUGAR AND COCOA EXCHANGE ;2002.07.16;  189434;   14683;    9711;   21767;  102965;  138864;  139414;  170342;   50020;   19092
SUGAR NO. 11 - COFFEESUGAR AND COCOA EXCHANGE ;2002.07.09;  183003;    7833;   15097;   20877;  106768;  125051;  135478;  161025;   47524;   21977
SUGAR NO. 11 - COFFEESUGAR AND COCOA EXCHANGE ;2002.07.02;  190880;    6944;   29086;   21508;  114198;  112593;  142651;  163187;   48230;   27693
SUGAR NO. 11 - COFFEESUGAR AND COCOA EXCHANGE ;2002.06.25;  193024;   10214;   23594;   20557;  118694;  122408;  149465;  166560;   43558;   26464
SUGAR NO. 11 - COFFEESUGAR AND COCOA EXCHANGE ;2002.06.18;  191790;   12445;   10291;   19138;  113429;  136141;  145012;  165569;   46778;   26221
SUGAR NO. 11 - COFFEESUGAR AND COCOA EXCHANGE ;2002.06.11;  210654;   20401;    2707;   24255;  110843;  160014;  155499;  186975;   55155;   23679
SUGAR NO. 11 - COFFEESUGAR AND COCOA EXCHANGE ;2002.06.04;  223135;   22482;    3100;   23936;  118903;  171804;  165321;  198840;   57814;   24295
SUGAR NO. 11 - COFFEESUGAR AND COCOA EXCHANGE ;2002.05.28;  215110;   19310;    6347;   24959;  118169;  160707;  162437;  192012;   52673;   23097
SUGAR NO. 11 - COFFEESUGAR AND COCOA EXCHANGE ;2002.05.21;  210528;   18604;    4811;   23754;  114296;  159351;  156654;  187916;   53874;   22612
SUGAR NO. 11 - COFFEESUGAR AND COCOA EXCHANGE ;2002.05.14;  209339;   15020;    9390;   24476;  119958;  153550;  159454;  187415;   49885;   21924
SUGAR NO. 11 - COFFEESUGAR AND COCOA EXCHANGE ;2002.05.07;  199989;    8953;   15703;   24295;  124785;  137643;  158033;  177641;   41957;   22349
SUGAR NO. 11 - COFFEESUGAR AND COCOA EXCHANGE ;2002.04.30;  207232;    8342;   15922;   23742;  135303;  145852;  167386;  185516;   39845;   21715
SUGAR NO. 11 - COFFEESUGAR AND COCOA EXCHANGE ;2003.02.14;  312961;   78748;    8486;   29639;  134649;  245344;  243036;  283468;   69926;   29493
SUGAR NO. 11 - COFFEESUGAR AND COCOA EXCHANGE ;2003.02.11;  354783;   79661;    2905;   45322;  153208;  272519;  278192;  320746;   76592;   34037
SUGAR NO. 11 - COFFEESUGAR AND COCOA EXCHANGE ;2003.02.04;  338575;   78513;    1646;   37019;  146225;  267912;  261757;  306578;   76818;   31998
SUGAR NO. 11 - COFFEESUGAR AND COCOA EXCHANGE ;2003.01.28;  325908;   72312;    1226;   34640;  140462;  257194;  247415;  293061;   78494;   32848
SUGAR NO. 11 - COFFEESUGAR AND COCOA EXCHANGE ;2003.01.21;  300595;   62484;    9861;   34835;  130026;  220668;  227346;  265364;   73249;   35231
SUGAR NO. 11 - COFFEESUGAR AND COCOA EXCHANGE ;2003.01.14;  287616;   57772;    1370;   30729;  130813;  221741;  219314;  253840;   68302;   33776
SUGAR NO. 11 - COFFEESUGAR AND COCOA EXCHANGE ;2003.01.07;  279932;   56108;    1071;   29258;  127333;  217024;  212699;  247353;   67234;   32580
SUGAR NO. 11 - COFFEESUGAR AND COCOA EXCHANGE ;2002.12.31;  274050;   51594;     493;   28008;  128627;  215166;  208229;  243667;   65822;   30384
SUGAR NO. 11 - COFFEESUGAR AND COCOA EXCHANGE ;2002.12.23;  270857;   50684;     433;   27248;  131580;  217661;  209512;  245342;   61345;   25515
SUGAR NO. 11 - COFFEESUGAR AND COCOA EXCHANGE ;2002.12.17;  270415;   52514;     167;   27098;  128371;  216899;  207983;  244164;   62432;   26251
SUGAR NO. 11 - COFFEESUGAR AND COCOA EXCHANGE ;2002.12.10;  268142;   52008;     179;   27443;  124848;  214212;  204299;  241834;   63843;   26308
SUGAR NO. 11 - COFFEESUGAR AND COCOA EXCHANGE ;2002.12.03;  272253;   57724;     714;   28889;  123164;  217753;  209778;  247356;   62475;   24897
SUGAR NO. 11 - COFFEESUGAR AND COCOA EXCHANGE ;2002.11.26;  254218;   51347;      49;   27486;  119707;  204497;  198540;  232032;   55678;   22186
SUGAR NO. 11 - COFFEESUGAR AND COCOA EXCHANGE ;2002.11.19;  251160;   51540;     575;   25070;  117195;  201545;  193805;  227191;   57355;   23970
SUGAR NO. 11 - COFFEESUGAR AND COCOA EXCHANGE ;2002.11.12;  255566;   65396;    1050;   23460;  106002;  210260;  194858;  234770;   60708;   20796
SUGAR NO. 11 - COFFEESUGAR AND COCOA EXCHANGE ;2002.11.05;  268249;   72935;    2813;   24101;  103148;  218951;  200184;  245865;   68065;   22384
SUGAR NO. 11 - COFFEESUGAR AND COCOA EXCHANGE ;2002.10.29;  261601;   72641;    5895;   22292;   99552;  211577;  194485;  239764;   67116;   21837
SUGAR NO. 11 - COFFEESUGAR AND COCOA EXCHANGE ;2002.10.22;  261905;   75419;    6187;   21810;   95099;  213136;  192328;  241133;   69577;   20772
SUGAR NO. 11 - COFFEESUGAR AND COCOA EXCHANGE ;2002.10.15;  255110;   72138;    5892;   20879;   90794;  206364;  183811;  233135;   71299;   21975
SUGAR NO. 11 - COFFEESUGAR AND COCOA EXCHANGE ;2002.10.08;  252090;   71733;    5307;   19858;   88901;  204606;  180492;  229771;   71597;   22318
SUGAR NO. 11 - COFFEESUGAR AND COCOA EXCHANGE ;2002.10.01;  238111;   64652;    8198;   10218;   77276;  176280;  152145;  194695;   85966;   43416
SUGAR NO. 11 - COFFEESUGAR AND COCOA EXCHANGE ;2002.09.24;  248886;   65959;    3027;   18052;   96903;  203810;  180914;  224888;   67972;   23997
SUGAR NO. 11 - COFFEESUGAR AND COCOA EXCHANGE ;2002.09.17;  251534;   55877;    1462;   17649;  106786;  208230;  180311;  227341;   71222;   24192
SUGAR NO. 11 - COFFEESUGAR AND COCOA EXCHANGE ;2002.09.10;  250760;   37573;    2714;   23330;  112320;  199956;  173223;  226001;   77537;   24759
SUGAR NO. 11 - COFFEESUGAR AND COCOA EXCHANGE ;2002.09.03;  238138;   29214;    4477;   25603;  118938;  187893;  173755;  217973;   64383;   20164
SUGAR NO. 11 - COFFEESUGAR AND COCOA EXCHANGE ;2002.08.27;  230499;   27614;    3877;   24473;  117427;  182504;  169514;  210855;   60985;   19644
SUGAR NO. 11 - COFFEESUGAR AND COCOA EXCHANGE ;2002.08.20;  220426;   28644;    2523;   22506;  111153;  175831;  162303;  200860;   58123;   19566
SUGAR NO. 11 - COFFEESUGAR AND COCOA EXCHANGE ;2002.08.13;  208519;   21233;    1984;   22503;  110079;  166341;  153815;  190828;   54704;   17691
SUGAR NO. 11 - COFFEESUGAR AND COCOA EXCHANGE ;2002.08.06;  204146;   21738;    2403;   22353;  106214;  160835;  150305;  185591;   53842;   18555
SUGAR NO. 11 - COFFEESUGAR AND COCOA EXCHANGE ;2002.07.30;  200321;   18017;    5821;   22256;  108766;  152771;  149039;  180847;   51282;   19474
SUGAR NO. 11 - COFFEESUGAR AND COCOA EXCHANGE ;2002.07.23;  209205;   22201;    7374;   22399;  105482;  160701;  150081;  190474;   59124;   18731
SUGAR NO. 11 - COFFEESUGAR AND COCOA EXCHANGE ;2002.07.16;  189434;   14683;    9711;   21767;  102965;  138864;  139414;  170342;   50020;   19092
SUGAR NO. 11 - COFFEESUGAR AND COCOA EXCHANGE ;2002.07.09;  183003;    7833;   15097;   20877;  106768;  125051;  135478;  161025;   47524;   21977
SUGAR NO. 11 - COFFEESUGAR AND COCOA EXCHANGE ;2002.07.02;  190880;    6944;   29086;   21508;  114198;  112593;  142651;  163187;   48230;   27693
SUGAR NO. 11 - COFFEESUGAR AND COCOA EXCHANGE ;2002.06.25;  193024;   10214;   23594;   20557;  118694;  122408;  149465;  166560;   43558;   26464
SUGAR NO. 11 - COFFEESUGAR AND COCOA EXCHANGE ;2002.06.18;  191790;   12445;   10291;   19138;  113429;  136141;  145012;  165569;   46778;   26221
SUGAR NO. 11 - COFFEESUGAR AND COCOA EXCHANGE ;2002.06.11;  210654;   20401;    2707;   24255;  110843;  160014;  155499;  186975;   55155;   23679
SUGAR NO. 11 - COFFEESUGAR AND COCOA EXCHANGE ;2002.06.04;  223135;   22482;    3100;   23936;  118903;  171804;  165321;  198840;   57814;   24295
SUGAR NO. 11 - COFFEESUGAR AND COCOA EXCHANGE ;2002.05.28;  215110;   19310;    6347;   24959;  118169;  160707;  162437;  192012;   52673;   23097
SUGAR NO. 11 - COFFEESUGAR AND COCOA EXCHANGE ;2002.05.21;  210528;   18604;    4811;   23754;  114296;  159351;  156654;  187916;   53874;   22612
SUGAR NO. 11 - COFFEESUGAR AND COCOA EXCHANGE ;2002.05.14;  209339;   15020;    9390;   24476;  119958;  153550;  159454;  187415;   49885;   21924
SUGAR NO. 11 - COFFEESUGAR AND COCOA EXCHANGE ;2002.05.07;  199989;    8953;   15703;   24295;  124785;  137643;  158033;  177641;   41957;   22349
SUGAR NO. 11 - COFFEESUGAR AND COCOA EXCHANGE ;2002.04.30;  207232;    8342;   15922;   23742;  135303;  145852;  167386;  185516;   39845;   21715
