STOCK INDEX FUT EUROTOP 100 - CMX EUROTOP 100 ;1995.04.04;    1376;     399;      16;     620;     135;     682;    1154;    1318;     222;      58
STOCK INDEX FUT EUROTOP 100 - CMX EUROTOP 100 ;1995.03.28;    1368;     375;      16;     620;     116;     659;    1111;    1295;     257;      73
STOCK INDEX FUT EUROTOP 100 - CMX EUROTOP 100 ;1995.03.21;    1351;     375;      16;     620;     141;     669;    1136;    1305;     215;      46
STOCK INDEX FUT EUROTOP 100 - CMX EUROTOP 100 ;1995.04.04;    1376;     399;      16;     620;     135;     682;    1154;    1318;     222;      58
STOCK INDEX FUT EUROTOP 100 - CMX EUROTOP 100 ;1995.03.28;    1368;     375;      16;     620;     116;     659;    1111;    1295;     257;      73
STOCK INDEX FUT EUROTOP 100 - CMX EUROTOP 100 ;1995.03.21;    1351;     375;      16;     620;     141;     669;    1136;    1305;     215;      46
STOCK INDEX FUT EUROTOP 100 - CMX EUROTOP 100 ;1995.04.04;    1376;     399;      16;     620;     135;     682;    1154;    1318;     222;      58
STOCK INDEX FUT EUROTOP 100 - CMX EUROTOP 100 ;1995.03.28;    1368;     375;      16;     620;     116;     659;    1111;    1295;     257;      73
STOCK INDEX FUT EUROTOP 100 - CMX EUROTOP 100 ;1995.03.21;    1351;     375;      16;     620;     141;     669;    1136;    1305;     215;      46
