SING JET KERO SWAP - NEW YORK MERCANTILE EXCHANGE ;2011.07.12;    5092;     414;     300;       0;    4678;    4792;    5092;    5092;       0;       0
SING JET KERO SWAP - NEW YORK MERCANTILE EXCHANGE ;2011.07.12;    5092;     414;     300;       0;    4678;    4792;    5092;    5092;       0;       0
SING JET KERO SWAP - NEW YORK MERCANTILE EXCHANGE ;2010.12.28;    6170;      86;     200;     300;    5647;    5557;    6033;    6057;     137;     113
SING JET KERO SWAP - NEW YORK MERCANTILE EXCHANGE ;2010.12.21;    5582;      86;     200;     150;    5259;    5169;    5495;    5519;      87;      63
SING JET KERO SWAP - NEW YORK MERCANTILE EXCHANGE ;2010.12.14;    5156;     186;     200;       0;    4883;    4893;    5069;    5093;      87;      63
SING JET KERO SWAP - NEW YORK MERCANTILE EXCHANGE ;2010.12.07;    4706;      86;     150;       0;    4333;    4543;    4419;    4693;     287;      13
SING JET KERO SWAP - NEW YORK MERCANTILE EXCHANGE ;2010.11.30;    5891;     222;     310;      20;    5515;    5448;    5757;    5778;     134;     113
SING JET KERO SWAP - NEW YORK MERCANTILE EXCHANGE ;2010.11.23;    5452;     222;     260;      20;    5076;    5059;    5318;    5339;     134;     113
SING JET KERO SWAP - NEW YORK MERCANTILE EXCHANGE ;2010.11.16;    5402;     222;     260;      20;    5026;    5009;    5268;    5289;     134;     113
SING JET KERO SWAP - NEW YORK MERCANTILE EXCHANGE ;2010.11.09;    4996;     222;     310;       0;    4640;    4573;    4862;    4883;     134;     113
SING JET KERO SWAP - NEW YORK MERCANTILE EXCHANGE ;2010.11.02;    4996;     222;     310;       0;    4640;    4573;    4862;    4883;     134;     113
SING JET KERO SWAP - NEW YORK MERCANTILE EXCHANGE ;2010.10.26;    6772;     250;     132;     322;    5999;    6218;    6571;    6672;     201;     100
SING JET KERO SWAP - NEW YORK MERCANTILE EXCHANGE ;2010.10.19;    6586;     250;     132;     336;    5799;    6018;    6385;    6486;     201;     100
SING JET KERO SWAP - NEW YORK MERCANTILE EXCHANGE ;2010.10.12;    6286;     250;     132;     336;    5499;    5718;    6085;    6186;     201;     100
SING JET KERO SWAP - NEW YORK MERCANTILE EXCHANGE ;2010.10.05;    6024;     200;     132;     436;    5287;    5456;    5923;    6024;     101;       0
SING JET KERO SWAP - NEW YORK MERCANTILE EXCHANGE ;2010.09.28;    8288;     250;     382;     286;    7644;    7620;    8180;    8288;     108;       0
SING JET KERO SWAP - NEW YORK MERCANTILE EXCHANGE ;2010.09.21;    7760;     250;     332;     286;    7116;    7142;    7652;    7760;     108;       0
SING JET KERO SWAP - NEW YORK MERCANTILE EXCHANGE ;2010.09.14;    7474;     250;     282;     236;    6880;    6956;    7366;    7474;     108;       0
SING JET KERO SWAP - NEW YORK MERCANTILE EXCHANGE ;2010.09.07;    7476;     250;     282;     236;    6750;    6826;    7236;    7344;     240;     132
SING JET KERO SWAP - NEW YORK MERCANTILE EXCHANGE ;2010.08.31;    9594;     250;      65;     450;    8686;    8944;    9386;    9459;     208;     135
SING JET KERO SWAP - NEW YORK MERCANTILE EXCHANGE ;2010.08.24;    8270;     250;      40;     400;    7462;    7720;    8112;    8160;     158;     110
SING JET KERO SWAP - NEW YORK MERCANTILE EXCHANGE ;2010.08.17;    7842;     250;      40;     400;    7084;    7342;    7734;    7782;     108;      60
SING JET KERO SWAP - NEW YORK MERCANTILE EXCHANGE ;2010.08.10;    7699;     250;      40;     400;    6891;    7149;    7541;    7589;     158;     110
SING JET KERO SWAP - NEW YORK MERCANTILE EXCHANGE ;2010.08.03;    7276;     200;      40;     400;    6418;    6626;    7018;    7066;     258;     210
SING JET KERO SWAP - NEW YORK MERCANTILE EXCHANGE ;2010.07.27;    7772;     200;     190;     400;    7122;    7132;    7722;    7722;      50;      50
SING JET KERO SWAP - NEW YORK MERCANTILE EXCHANGE ;2010.07.20;    6723;     250;     190;     300;    6123;    6183;    6673;    6673;      50;      50
SING JET KERO SWAP - NEW YORK MERCANTILE EXCHANGE ;2010.07.13;    6313;     200;     190;     300;    5813;    5823;    6313;    6313;       0;       0
SING JET KERO SWAP - NEW YORK MERCANTILE EXCHANGE ;2010.07.06;    6166;     200;     190;     250;    5516;    5526;    5966;    5966;     200;     200
SING JET KERO SWAP - NEW YORK MERCANTILE EXCHANGE ;2010.06.29;    8485;     500;     390;     300;    7535;    7645;    8335;    8335;     150;     150
SING JET KERO SWAP - NEW YORK MERCANTILE EXCHANGE ;2010.06.22;    8122;     500;     290;     300;    7222;    7432;    8022;    8022;     100;     100
SING JET KERO SWAP - NEW YORK MERCANTILE EXCHANGE ;2010.06.15;    8322;     500;     240;     350;    7072;    7332;    7922;    7922;     400;     400
SING JET KERO SWAP - NEW YORK MERCANTILE EXCHANGE ;2010.06.08;    7897;     600;     240;     300;    6597;    6957;    7497;    7497;     400;     400
SING JET KERO SWAP - NEW YORK MERCANTILE EXCHANGE ;2010.06.01;    9927;     650;      90;     500;    8377;    8937;    9527;    9527;     400;     400
SING JET KERO SWAP - NEW YORK MERCANTILE EXCHANGE ;2010.05.25;    9096;     600;      90;     300;    7846;    8356;    8746;    8746;     350;     350
SING JET KERO SWAP - NEW YORK MERCANTILE EXCHANGE ;2010.05.18;    8431;     500;       0;     300;    7331;    7831;    8131;    8131;     300;     300
SING JET KERO SWAP - NEW YORK MERCANTILE EXCHANGE ;2010.05.11;    8074;     475;       0;     325;    7024;    7499;    7824;    7824;     250;     250
SING JET KERO SWAP - NEW YORK MERCANTILE EXCHANGE ;2010.05.04;    8044;     450;       0;     350;    6944;    7394;    7744;    7744;     300;     300
SING JET KERO SWAP - NEW YORK MERCANTILE EXCHANGE ;2010.04.27;    9523;     550;     150;     350;    8323;    8723;    9223;    9223;     300;     300
SING JET KERO SWAP - NEW YORK MERCANTILE EXCHANGE ;2010.04.20;    8612;     550;     150;     300;    7562;    7962;    8412;    8412;     200;     200
SING JET KERO SWAP - NEW YORK MERCANTILE EXCHANGE ;2010.04.13;    7937;     658;     150;     275;    6804;    7195;    7737;    7620;     200;     317
SING JET KERO SWAP - NEW YORK MERCANTILE EXCHANGE ;2010.04.06;    7051;     658;     100;     325;    6068;    6509;    7051;    6934;       0;     117
SING JET KERO SWAP - NEW YORK MERCANTILE EXCHANGE ;2010.03.30;    9561;    1168;     100;     625;    7707;    8656;    9500;    9381;      61;     180
SING JET KERO SWAP - NEW YORK MERCANTILE EXCHANGE ;2010.03.23;    9111;    1268;     100;     525;    7307;    8356;    9100;    8981;      11;     130
SING JET KERO SWAP - NEW YORK MERCANTILE EXCHANGE ;2010.03.16;    8651;    1218;     100;     525;    6897;    7896;    8640;    8521;      11;     130
SING JET KERO SWAP - NEW YORK MERCANTILE EXCHANGE ;2010.03.09;    8226;    1218;     100;     375;    6622;    7621;    8215;    8096;      11;     130
SING JET KERO SWAP - NEW YORK MERCANTILE EXCHANGE ;2010.03.02;    7793;    1185;     175;     375;    6222;    7113;    7782;    7663;      11;     130
SING JET KERO SWAP - NEW YORK MERCANTILE EXCHANGE ;2010.02.23;    9194;    1446;     175;     225;    7492;    8642;    9163;    9042;      31;     152
SING JET KERO SWAP - NEW YORK MERCANTILE EXCHANGE ;2010.02.16;    8312;    1446;     100;     225;    6610;    7835;    8281;    8160;      31;     152
SING JET KERO SWAP - NEW YORK MERCANTILE EXCHANGE ;2010.02.09;    8087;    1346;     100;     225;    6385;    7510;    7956;    7835;     131;     252
SING JET KERO SWAP - NEW YORK MERCANTILE EXCHANGE ;2010.02.02;    8022;    1346;     100;     275;    6270;    7395;    7891;    7770;     131;     252
SING JET KERO SWAP - NEW YORK MERCANTILE EXCHANGE ;2010.01.26;    9260;    1572;      86;     450;    6946;    8415;    8968;    8951;     292;     309
SING JET KERO SWAP - NEW YORK MERCANTILE EXCHANGE ;2010.01.19;    8778;    1606;       0;     566;    6414;    8003;    8586;    8569;     192;     209
SING JET KERO SWAP - NEW YORK MERCANTILE EXCHANGE ;2010.01.12;    7809;    1606;       0;     416;    5704;    7293;    7726;    7709;      83;     100
SING JET KERO SWAP - NEW YORK MERCANTILE EXCHANGE ;2010.01.05;    7791;    1206;       0;     266;    5746;    7335;    7218;    7601;     573;     190
SING JET KERO SWAP - NEW YORK MERCANTILE EXCHANGE ;2009.12.29;    9547;    1581;       0;     316;    7002;    9116;    8899;    9432;     648;     115
SING JET KERO SWAP - NEW YORK MERCANTILE EXCHANGE ;2009.12.22;    9307;    1622;       0;     175;    6862;    9017;    8659;    9192;     648;     115
SING JET KERO SWAP - NEW YORK MERCANTILE EXCHANGE ;2009.12.15;    8837;    1672;       0;      75;    6382;    8587;    8129;    8662;     708;     175
SING JET KERO SWAP - NEW YORK MERCANTILE EXCHANGE ;2009.12.08;    8742;    1622;       0;     175;    6337;    8542;    8134;    8717;     608;      25
SING JET KERO SWAP - NEW YORK MERCANTILE EXCHANGE ;2009.12.01;   10100;    1813;       0;     175;    7504;    9344;    9492;    9519;     608;     581
SING JET KERO SWAP - NEW YORK MERCANTILE EXCHANGE ;2009.11.24;    9041;    1454;       0;     125;    6959;    8410;    8538;    8535;     503;     506
SING JET KERO SWAP - NEW YORK MERCANTILE EXCHANGE ;2009.11.17;    8474;    1454;       0;      75;    6492;    7993;    8021;    8068;     453;     406
SING JET KERO SWAP - NEW YORK MERCANTILE EXCHANGE ;2009.11.09;    8239;    1454;       0;      50;    6232;    7583;    7736;    7633;     503;     606
SING JET KERO SWAP - NEW YORK MERCANTILE EXCHANGE ;2009.11.03;    8189;    1454;       0;      50;    6182;    7633;    7686;    7683;     503;     506
SING JET KERO SWAP - NEW YORK MERCANTILE EXCHANGE ;2009.10.27;   10607;    2129;      50;     150;    7660;    9636;    9939;    9836;     668;     771
SING JET KERO SWAP - NEW YORK MERCANTILE EXCHANGE ;2009.10.20;   10267;    2054;     150;      50;    7310;    9111;    9414;    9311;     853;     956
SING JET KERO SWAP - NEW YORK MERCANTILE EXCHANGE ;2009.10.13;    9494;    2004;     150;      50;    6857;    8638;    8911;    8838;     583;     656
SING JET KERO SWAP - NEW YORK MERCANTILE EXCHANGE ;2009.10.06;    8766;    2004;     100;      50;    6217;    8048;    8271;    8198;     495;     568
SING JET KERO SWAP - NEW YORK MERCANTILE EXCHANGE ;2009.09.29;   11421;    2104;      50;     150;    8484;   10415;   10738;   10615;     683;     806
SING JET KERO SWAP - NEW YORK MERCANTILE EXCHANGE ;2009.09.22;   11474;    2104;      50;     150;    8437;   10368;   10691;   10568;     783;     906
SING JET KERO SWAP - NEW YORK MERCANTILE EXCHANGE ;2009.09.15;   11324;    2204;       0;     100;    8137;   10118;   10441;   10218;     883;    1106
SING JET KERO SWAP - NEW YORK MERCANTILE EXCHANGE ;2009.09.08;   10910;    1954;       0;     100;    8173;    9904;   10227;   10004;     683;     906
SING JET KERO SWAP - NEW YORK MERCANTILE EXCHANGE ;2009.09.01;   13074;    2304;       0;     100;    9937;   12074;   12341;   12174;     733;     900
SING JET KERO SWAP - NEW YORK MERCANTILE EXCHANGE ;2009.08.25;   12514;    2254;       0;       0;    9727;   11764;   11981;   11764;     533;     750
SING JET KERO SWAP - NEW YORK MERCANTILE EXCHANGE ;2009.08.18;   12015;    2154;       0;       0;    9378;   11415;   11532;   11415;     483;     600
SING JET KERO SWAP - NEW YORK MERCANTILE EXCHANGE ;2009.08.11;   10825;    2104;       0;     150;    8088;   10075;   10342;   10225;     483;     600
SING JET KERO SWAP - NEW YORK MERCANTILE EXCHANGE ;2009.08.04;    9138;    1954;       0;     150;    6901;    8738;    9005;    8888;     133;     250
SING JET KERO SWAP - NEW YORK MERCANTILE EXCHANGE ;2009.07.28;   10748;    1404;     100;     400;    8844;    9998;   10648;   10498;     100;     250
SING JET KERO SWAP - NEW YORK MERCANTILE EXCHANGE ;2009.07.21;   10203;    1404;     200;     250;    8449;    9503;   10103;    9953;     100;     250
SING JET KERO SWAP - NEW YORK MERCANTILE EXCHANGE ;2009.07.14;    9321;    1354;     150;     300;    7517;    8571;    9171;    9021;     150;     300
SING JET KERO SWAP - NEW YORK MERCANTILE EXCHANGE ;2009.07.07;   10246;    1354;     920;     300;    8492;    8776;   10146;    9996;     100;     250
SING JET KERO SWAP - NEW YORK MERCANTILE EXCHANGE ;2009.06.30;   12282;    1454;     820;     400;   10278;   10812;   12132;   12032;     150;     250
SING JET KERO SWAP - NEW YORK MERCANTILE EXCHANGE ;2009.06.23;   11379;    1404;     950;     100;    9725;   10079;   11229;   11129;     150;     250
SING JET KERO SWAP - NEW YORK MERCANTILE EXCHANGE ;2009.06.16;   10779;    1280;     900;     100;    9125;    9629;   10505;   10629;     274;     150
SING JET KERO SWAP - NEW YORK MERCANTILE EXCHANGE ;2009.06.09;   10223;    1250;     900;     100;    8623;    8973;    9973;    9973;     250;     250
SING JET KERO SWAP - NEW YORK MERCANTILE EXCHANGE ;2009.06.02;    9484;    1250;     900;     100;    7834;    7534;    9184;    8534;     300;     950
SING JET KERO SWAP - NEW YORK MERCANTILE EXCHANGE ;2009.05.26;   10112;    1250;     900;       0;    8562;    8312;    9812;    9212;     300;     900
SING JET KERO SWAP - NEW YORK MERCANTILE EXCHANGE ;2009.05.19;    9325;    1150;     900;       0;    8025;    7555;    9175;    8455;     150;     870
SING JET KERO SWAP - NEW YORK MERCANTILE EXCHANGE ;2009.05.12;    8725;    1050;     900;       0;    7575;    7005;    8625;    7905;     100;     820
SING JET KERO SWAP - NEW YORK MERCANTILE EXCHANGE ;2009.05.05;    8195;    1050;     600;       0;    7045;    6775;    8095;    7375;     100;     820
SING JET KERO SWAP - NEW YORK MERCANTILE EXCHANGE ;2009.04.28;    9668;    1150;     600;       0;    8244;    8098;    9394;    8698;     274;     970
SING JET KERO SWAP - NEW YORK MERCANTILE EXCHANGE ;2009.04.21;    8346;     850;       0;       0;    7222;    7376;    8072;    7376;     274;     970
SING JET KERO SWAP - NEW YORK MERCANTILE EXCHANGE ;2009.04.14;    7645;     900;       0;       0;    6521;    6725;    7421;    6725;     224;     920
SING JET KERO SWAP - NEW YORK MERCANTILE EXCHANGE ;2009.04.07;    7063;     900;       0;       0;    5939;    6043;    6839;    6043;     224;    1020
SING JET KERO SWAP - NEW YORK MERCANTILE EXCHANGE ;2009.03.31;    9058;     850;       0;      50;    7784;    8538;    8684;    8588;     374;     470
SING JET KERO SWAP - NEW YORK MERCANTILE EXCHANGE ;2009.03.24;    8008;      50;       0;      50;    7708;    7662;    7808;    7712;     200;     296
SING JET KERO SWAP - NEW YORK MERCANTILE EXCHANGE ;2009.03.17;    7683;      50;       0;      50;    7383;    7337;    7483;    7387;     200;     296
SING JET KERO SWAP - NEW YORK MERCANTILE EXCHANGE ;2009.03.10;    7191;      50;       0;      50;    6891;    6845;    6991;    6895;     200;     296
SING JET KERO SWAP - NEW YORK MERCANTILE EXCHANGE ;2009.03.03;    5673;       0;      50;       0;    5473;    5327;    5473;    5377;     200;     296
SING JET KERO SWAP - NEW YORK MERCANTILE EXCHANGE ;2009.02.24;    6418;       0;      50;       0;    6118;    5972;    6118;    6022;     300;     396
SING JET KERO SWAP - NEW YORK MERCANTILE EXCHANGE ;2009.02.17;    5860;       0;      50;       0;    5760;    5614;    5760;    5664;     100;     196
SING JET KERO SWAP - NEW YORK MERCANTILE EXCHANGE ;2009.02.10;    5253;       0;      50;       0;    5153;    5007;    5153;    5057;     100;     196
SING JET KERO SWAP - NEW YORK MERCANTILE EXCHANGE ;2009.02.03;    4143;       0;      50;       0;    4043;    3897;    4043;    3947;     100;     196
SING JET KERO SWAP - NEW YORK MERCANTILE EXCHANGE ;2009.01.27;    4822;     150;       0;       0;    4672;    4822;    4822;    4822;       0;       0
SING JET KERO SWAP - NEW YORK MERCANTILE EXCHANGE ;2009.01.20;    4522;      50;       0;       0;    4472;    4522;    4522;    4522;       0;       0
SING JET KERO SWAP - NEW YORK MERCANTILE EXCHANGE ;2009.01.13;    4334;     150;       0;       0;    4084;    4234;    4234;    4234;     100;     100
SING JET KERO SWAP - NEW YORK MERCANTILE EXCHANGE ;2009.01.06;    3809;     150;       0;       0;    3609;    3759;    3759;    3759;      50;      50
SING JET KERO SWAP - NEW YORK MERCANTILE EXCHANGE ;2008.12.30;    6877;       0;      50;     150;    6527;    6477;    6677;    6677;     200;     200
SING JET KERO SWAP - NEW YORK MERCANTILE EXCHANGE ;2008.12.22;    6727;       0;      50;     150;    6377;    6327;    6527;    6527;     200;     200
SING JET KERO SWAP - NEW YORK MERCANTILE EXCHANGE ;2008.12.16;    6852;     100;      50;     150;    6402;    6452;    6652;    6652;     200;     200
SING JET KERO SWAP - NEW YORK MERCANTILE EXCHANGE ;2008.12.09;    6702;     100;      50;     150;    6252;    6302;    6502;    6502;     200;     200
SING JET KERO SWAP - NEW YORK MERCANTILE EXCHANGE ;2008.12.02;    6327;     100;      50;     150;    5877;    5927;    6127;    6127;     200;     200
SING JET KERO SWAP - NEW YORK MERCANTILE EXCHANGE ;2008.11.25;    7432;     100;     350;      50;    7062;    6832;    7212;    7232;     220;     200
SING JET KERO SWAP - NEW YORK MERCANTILE EXCHANGE ;2008.11.18;    7507;     300;     300;       0;    7007;    7007;    7307;    7307;     200;     200
SING JET KERO SWAP - NEW YORK MERCANTILE EXCHANGE ;2008.11.11;    7407;     250;     250;       0;    6957;    6957;    7207;    7207;     200;     200
SING JET KERO SWAP - NEW YORK MERCANTILE EXCHANGE ;2008.11.04;    6572;     250;     150;       0;    6122;    6222;    6372;    6372;     200;     200
SING JET KERO SWAP - NEW YORK MERCANTILE EXCHANGE ;2008.10.28;    7886;     150;     100;     100;    7378;    7390;    7628;    7590;     258;     296
SING JET KERO SWAP - NEW YORK MERCANTILE EXCHANGE ;2008.10.21;    7364;     150;     100;     100;    7056;    7118;    7306;    7318;      58;      46
SING JET KERO SWAP - NEW YORK MERCANTILE EXCHANGE ;2008.10.14;    6536;     150;       0;     150;    6028;    6340;    6328;    6490;     208;      46
SING JET KERO SWAP - NEW YORK MERCANTILE EXCHANGE ;2008.10.07;    5139;     150;       0;     100;    4715;    4839;    4965;    4939;     174;     200
SING JET KERO SWAP - NEW YORK MERCANTILE EXCHANGE ;2008.09.30;    5956;     250;     100;     100;    5306;    5506;    5656;    5706;     300;     250
SING JET KERO SWAP - NEW YORK MERCANTILE EXCHANGE ;2008.09.23;    4925;     250;     100;     100;    4350;    4450;    4700;    4650;     225;     275
SING JET KERO SWAP - NEW YORK MERCANTILE EXCHANGE ;2008.09.16;    4700;     250;     100;     100;    4150;    4250;    4500;    4450;     200;     250
SING JET KERO SWAP - NEW YORK MERCANTILE EXCHANGE ;2008.09.09;    4600;     250;     100;       0;    4175;    4250;    4425;    4350;     175;     250
SING JET KERO SWAP - NEW YORK MERCANTILE EXCHANGE ;2008.09.02;    5575;     200;     200;      50;    5175;    5175;    5425;    5425;     150;     150
SING JET KERO SWAP - NEW YORK MERCANTILE EXCHANGE ;2008.08.26;    4975;     200;     150;      50;    4625;    4675;    4875;    4875;     100;     100
SING JET KERO SWAP - NEW YORK MERCANTILE EXCHANGE ;2008.08.19;    4725;     200;     100;      50;    4350;    4525;    4600;    4675;     125;      50
SING JET KERO SWAP - NEW YORK MERCANTILE EXCHANGE ;2008.08.12;    4550;     150;     100;      50;    3775;    3900;    3975;    4050;     575;     500
SING JET KERO SWAP - NEW YORK MERCANTILE EXCHANGE ;2008.08.05;    3450;     150;     150;       0;    3225;    3300;    3375;    3450;      75;       0
SING JET KERO SWAP - NEW YORK MERCANTILE EXCHANGE ;2008.07.29;    4377;     150;     100;      50;    4060;    4227;    4260;    4377;     117;       0
SING JET KERO SWAP - NEW YORK MERCANTILE EXCHANGE ;2008.07.22;    4052;     200;       0;       0;    3735;    4052;    3935;    4052;     117;       0
SING JET KERO SWAP - NEW YORK MERCANTILE EXCHANGE ;2008.07.15;    4352;     200;       0;       0;    4010;    4342;    4210;    4342;     142;      10
SING JET KERO SWAP - NEW YORK MERCANTILE EXCHANGE ;2008.07.08;    3752;     200;       0;       0;    3310;    3642;    3510;    3642;     242;     110
SING JET KERO SWAP - NEW YORK MERCANTILE EXCHANGE ;2008.07.01;    4602;     100;      50;     200;    4260;    4242;    4560;    4492;      42;     110
SING JET KERO SWAP - NEW YORK MERCANTILE EXCHANGE ;2008.06.24;    3760;       0;      50;     200;    3203;    3360;    3403;    3610;     357;     150
SING JET KERO SWAP - NEW YORK MERCANTILE EXCHANGE ;2008.06.17;    3510;       0;      50;     200;    2925;    3110;    3125;    3360;     385;     150
SING JET KERO SWAP - NEW YORK MERCANTILE EXCHANGE ;2008.06.10;    3110;       0;      50;     200;    2525;    2710;    2725;    2960;     385;     150
SING JET KERO SWAP - NEW YORK MERCANTILE EXCHANGE ;2008.06.03;    3110;       0;      50;     200;    2525;    2710;    2725;    2960;     385;     150
SING JET KERO SWAP - NEW YORK MERCANTILE EXCHANGE ;2008.05.27;    3235;       0;      50;     250;    2650;    2635;    2900;    2935;     335;     300
SING JET KERO SWAP - NEW YORK MERCANTILE EXCHANGE ;2008.05.20;    2775;       0;      50;     200;    2375;    2510;    2575;    2760;     200;      15
SING JET KERO SWAP - NEW YORK MERCANTILE EXCHANGE ;2008.05.13;    2725;       0;      50;     200;    2325;    2460;    2525;    2710;     200;      15
SING JET KERO SWAP - NEW YORK MERCANTILE EXCHANGE ;2008.05.06;    2660;       0;       0;     250;    2225;    2310;    2475;    2560;     185;     100
SING JET KERO SWAP - NEW YORK MERCANTILE EXCHANGE ;2008.04.01;    3220;     100;       0;     200;    2835;    2835;    3135;    3035;      85;     185
SING JET KERO SWAP - NEW YORK MERCANTILE EXCHANGE ;2008.02.26;    2550;      50;       0;     200;    2300;    2350;    2550;    2550;       0;       0
SING JET KERO SWAP - NEW YORK MERCANTILE EXCHANGE ;2008.02.19;    2450;      50;       0;     200;    2200;    2250;    2450;    2450;       0;       0
SING JET KERO SWAP - NEW YORK MERCANTILE EXCHANGE ;2008.02.12;    2450;      50;       0;     200;    2200;    2250;    2450;    2450;       0;       0
SING JET KERO SWAP - NEW YORK MERCANTILE EXCHANGE ;2008.02.05;    2450;      50;       0;     200;    2200;    2250;    2450;    2450;       0;       0
SING JET KERO SWAP - NEW YORK MERCANTILE EXCHANGE ;2008.01.29;    3375;       0;       0;     250;    3125;    3075;    3375;    3325;       0;      50
SING JET KERO SWAP - NEW YORK MERCANTILE EXCHANGE ;2008.01.22;    3275;       0;       0;     250;    3025;    2975;    3275;    3225;       0;      50
SING JET KERO SWAP - NEW YORK MERCANTILE EXCHANGE ;2008.01.15;    3275;       0;       0;     250;    3025;    2975;    3275;    3225;       0;      50
SING JET KERO SWAP - NEW YORK MERCANTILE EXCHANGE ;2008.01.08;    3275;       0;       0;     250;    3025;    2975;    3275;    3225;       0;      50
SING JET KERO SWAP - NEW YORK MERCANTILE EXCHANGE ;2007.12.31;    3825;     150;       0;     250;    3425;    3525;    3825;    3775;       0;      50
SING JET KERO SWAP - NEW YORK MERCANTILE EXCHANGE ;2007.12.24;    3825;     150;       0;     250;    3425;    3575;    3825;    3825;       0;       0
SING JET KERO SWAP - NEW YORK MERCANTILE EXCHANGE ;2007.12.18;    3825;       0;       0;     250;    3425;    3575;    3675;    3825;     150;       0
SING JET KERO SWAP - NEW YORK MERCANTILE EXCHANGE ;2007.12.11;    3625;     150;       0;     250;    3225;    3375;    3625;    3625;       0;       0
SING JET KERO SWAP - NEW YORK MERCANTILE EXCHANGE ;2007.12.04;    3650;     150;       0;     250;    3250;    3400;    3650;    3650;       0;       0
SING JET KERO SWAP - NEW YORK MERCANTILE EXCHANGE ;2007.11.27;    3900;       0;       0;     300;    3600;    3600;    3900;    3900;       0;       0
SING JET KERO SWAP - NEW YORK MERCANTILE EXCHANGE ;2007.11.20;    3650;       0;       0;     300;    3350;    3350;    3650;    3650;       0;       0
SING JET KERO SWAP - NEW YORK MERCANTILE EXCHANGE ;2007.11.13;    3600;       0;       0;     300;    3300;    3300;    3600;    3600;       0;       0
SING JET KERO SWAP - NEW YORK MERCANTILE EXCHANGE ;2007.11.06;    3450;       0;       0;     300;    3150;    3150;    3450;    3450;       0;       0
SING JET KERO SWAP - NEW YORK MERCANTILE EXCHANGE ;2007.10.30;    2800;       0;       0;     250;    2500;    2500;    2750;    2750;      50;      50
SING JET KERO SWAP - NEW YORK MERCANTILE EXCHANGE ;2007.07.31;    3290;       0;       0;       0;    3290;    3290;    3290;    3290;       0;       0
SING JET KERO SWAP - NEW YORK MERCANTILE EXCHANGE ;2007.07.24;    3040;      50;       0;      50;    2940;    2990;    3040;    3040;       0;       0
SING JET KERO SWAP - NEW YORK MERCANTILE EXCHANGE ;2007.07.17;    3040;      50;       0;      50;    2940;    2990;    3040;    3040;       0;       0
SING JET KERO SWAP - NEW YORK MERCANTILE EXCHANGE ;2007.07.10;    2940;       0;      50;       0;    2940;    2890;    2940;    2940;       0;       0
SING JET KERO SWAP - NEW YORK MERCANTILE EXCHANGE ;2007.06.26;    3560;       0;     150;       0;    3540;    3260;    3540;    3410;      20;     150
SING JET KERO SWAP - NEW YORK MERCANTILE EXCHANGE ;2007.06.19;    3560;       0;     150;       0;    3540;    3410;    3540;    3560;      20;       0
SING JET KERO SWAP - NEW YORK MERCANTILE EXCHANGE ;2007.06.12;    3510;       0;     150;       0;    3490;    3360;    3490;    3510;      20;       0
SING JET KERO SWAP - NEW YORK MERCANTILE EXCHANGE ;2007.06.05;    3010;       0;     150;       0;    2990;    2860;    2990;    3010;      20;       0
SING JET KERO SWAP - NEW YORK MERCANTILE EXCHANGE ;2011.07.12;    5092;     414;     300;       0;    4678;    4792;    5092;    5092;       0;       0
SING JET KERO SWAP - NEW YORK MERCANTILE EXCHANGE ;2011.07.05;    4892;     300;     300;       0;    4592;    4592;    4892;    4892;       0;       0
SING JET KERO SWAP - NEW YORK MERCANTILE EXCHANGE ;2011.06.28;    5869;     200;       0;     500;    5169;    5369;    5869;    5869;       0;       0
SING JET KERO SWAP - NEW YORK MERCANTILE EXCHANGE ;2011.06.21;    5219;     200;       0;     500;    4519;    4719;    5219;    5219;       0;       0
SING JET KERO SWAP - NEW YORK MERCANTILE EXCHANGE ;2011.06.14;    4926;     100;       0;     450;    4376;    4476;    4926;    4926;       0;       0
SING JET KERO SWAP - NEW YORK MERCANTILE EXCHANGE ;2011.06.07;    4576;       0;       0;     400;    4176;    4176;    4576;    4576;       0;       0
SING JET KERO SWAP - NEW YORK MERCANTILE EXCHANGE ;2011.05.31;    4933;       0;     325;     400;    4483;    4208;    4883;    4933;      50;       0
SING JET KERO SWAP - NEW YORK MERCANTILE EXCHANGE ;2011.05.24;    4134;       0;     325;     100;    4034;    3709;    4134;    4134;       0;       0
SING JET KERO SWAP - NEW YORK MERCANTILE EXCHANGE ;2011.05.17;    3448;       0;     275;     150;    3298;    2951;    3448;    3376;       0;      72
SING JET KERO SWAP - NEW YORK MERCANTILE EXCHANGE ;2011.05.10;    3236;       0;     275;     150;    3086;    2739;    3236;    3164;       0;      72
SING JET KERO SWAP - NEW YORK MERCANTILE EXCHANGE ;2011.05.03;    3086;       0;     275;     150;    2936;    2589;    3086;    3014;       0;      72
SING JET KERO SWAP - NEW YORK MERCANTILE EXCHANGE ;2011.04.26;    4041;     100;      25;     400;    3541;    3508;    4041;    3933;       0;     108
SING JET KERO SWAP - NEW YORK MERCANTILE EXCHANGE ;2011.04.19;    3941;     100;      25;     400;    3441;    3408;    3941;    3833;       0;     108
SING JET KERO SWAP - NEW YORK MERCANTILE EXCHANGE ;2011.04.12;    3728;     150;       0;     350;    3228;    3270;    3728;    3620;       0;     108
SING JET KERO SWAP - NEW YORK MERCANTILE EXCHANGE ;2011.04.05;    3578;     150;       0;     350;    3078;    3120;    3578;    3470;       0;     108
SING JET KERO SWAP - NEW YORK MERCANTILE EXCHANGE ;2011.03.29;    5347;     460;      50;     150;    4737;    5039;    5347;    5239;       0;     108
SING JET KERO SWAP - NEW YORK MERCANTILE EXCHANGE ;2011.03.22;    5147;     460;      50;     150;    4537;    4947;    5147;    5147;       0;       0
SING JET KERO SWAP - NEW YORK MERCANTILE EXCHANGE ;2011.03.15;    5018;     460;      50;     150;    4408;    4818;    5018;    5018;       0;       0
SING JET KERO SWAP - NEW YORK MERCANTILE EXCHANGE ;2011.03.08;    4868;     460;      50;     150;    4240;    4668;    4850;    4868;      18;       0
SING JET KERO SWAP - NEW YORK MERCANTILE EXCHANGE ;2011.03.01;    7228;     550;       0;     410;    6268;    6818;    7228;    7228;       0;       0
SING JET KERO SWAP - NEW YORK MERCANTILE EXCHANGE ;2011.02.22;    7078;     350;       0;     560;    6168;    6518;    7078;    7078;       0;       0
SING JET KERO SWAP - NEW YORK MERCANTILE EXCHANGE ;2011.02.15;    6453;     350;       0;     660;    5393;    5743;    6403;    6403;      50;      50
SING JET KERO SWAP - NEW YORK MERCANTILE EXCHANGE ;2011.02.08;    5970;     350;       0;     560;    5060;    5410;    5970;    5970;       0;       0
SING JET KERO SWAP - NEW YORK MERCANTILE EXCHANGE ;2011.02.01;    7543;     450;     100;     560;    6483;    6833;    7493;    7493;      50;      50
SING JET KERO SWAP - NEW YORK MERCANTILE EXCHANGE ;2011.01.25;    6239;     450;     100;     150;    5539;    5889;    6139;    6139;     100;     100
SING JET KERO SWAP - NEW YORK MERCANTILE EXCHANGE ;2011.01.18;    5944;     500;     100;     313;    5031;    5431;    5844;    5844;     100;     100
SING JET KERO SWAP - NEW YORK MERCANTILE EXCHANGE ;2011.01.11;    5061;     200;     100;     163;    4498;    4698;    4861;    4961;     200;     100
SING JET KERO SWAP - NEW YORK MERCANTILE EXCHANGE ;2011.01.04;    4511;     250;     100;     113;    4048;    4198;    4411;    4411;     100;     100
SING JET KERO SWAP - NEW YORK MERCANTILE EXCHANGE ;2011.07.12;    5092;     414;     300;       0;    4678;    4792;    5092;    5092;       0;       0
SING JET KERO SWAP - NEW YORK MERCANTILE EXCHANGE ;2010.12.28;    6170;      86;     200;     300;    5647;    5557;    6033;    6057;     137;     113
SING JET KERO SWAP - NEW YORK MERCANTILE EXCHANGE ;2010.12.21;    5582;      86;     200;     150;    5259;    5169;    5495;    5519;      87;      63
SING JET KERO SWAP - NEW YORK MERCANTILE EXCHANGE ;2010.12.14;    5156;     186;     200;       0;    4883;    4893;    5069;    5093;      87;      63
SING JET KERO SWAP - NEW YORK MERCANTILE EXCHANGE ;2010.12.07;    4706;      86;     150;       0;    4333;    4543;    4419;    4693;     287;      13
SING JET KERO SWAP - NEW YORK MERCANTILE EXCHANGE ;2010.11.30;    5891;     222;     310;      20;    5515;    5448;    5757;    5778;     134;     113
SING JET KERO SWAP - NEW YORK MERCANTILE EXCHANGE ;2010.11.23;    5452;     222;     260;      20;    5076;    5059;    5318;    5339;     134;     113
SING JET KERO SWAP - NEW YORK MERCANTILE EXCHANGE ;2010.11.16;    5402;     222;     260;      20;    5026;    5009;    5268;    5289;     134;     113
SING JET KERO SWAP - NEW YORK MERCANTILE EXCHANGE ;2010.11.09;    4996;     222;     310;       0;    4640;    4573;    4862;    4883;     134;     113
SING JET KERO SWAP - NEW YORK MERCANTILE EXCHANGE ;2010.11.02;    4996;     222;     310;       0;    4640;    4573;    4862;    4883;     134;     113
SING JET KERO SWAP - NEW YORK MERCANTILE EXCHANGE ;2010.10.26;    6772;     250;     132;     322;    5999;    6218;    6571;    6672;     201;     100
SING JET KERO SWAP - NEW YORK MERCANTILE EXCHANGE ;2010.10.19;    6586;     250;     132;     336;    5799;    6018;    6385;    6486;     201;     100
SING JET KERO SWAP - NEW YORK MERCANTILE EXCHANGE ;2010.10.12;    6286;     250;     132;     336;    5499;    5718;    6085;    6186;     201;     100
SING JET KERO SWAP - NEW YORK MERCANTILE EXCHANGE ;2010.10.05;    6024;     200;     132;     436;    5287;    5456;    5923;    6024;     101;       0
SING JET KERO SWAP - NEW YORK MERCANTILE EXCHANGE ;2010.09.28;    8288;     250;     382;     286;    7644;    7620;    8180;    8288;     108;       0
SING JET KERO SWAP - NEW YORK MERCANTILE EXCHANGE ;2010.09.21;    7760;     250;     332;     286;    7116;    7142;    7652;    7760;     108;       0
SING JET KERO SWAP - NEW YORK MERCANTILE EXCHANGE ;2010.09.14;    7474;     250;     282;     236;    6880;    6956;    7366;    7474;     108;       0
SING JET KERO SWAP - NEW YORK MERCANTILE EXCHANGE ;2010.09.07;    7476;     250;     282;     236;    6750;    6826;    7236;    7344;     240;     132
SING JET KERO SWAP - NEW YORK MERCANTILE EXCHANGE ;2010.08.31;    9594;     250;      65;     450;    8686;    8944;    9386;    9459;     208;     135
SING JET KERO SWAP - NEW YORK MERCANTILE EXCHANGE ;2010.08.24;    8270;     250;      40;     400;    7462;    7720;    8112;    8160;     158;     110
SING JET KERO SWAP - NEW YORK MERCANTILE EXCHANGE ;2010.08.17;    7842;     250;      40;     400;    7084;    7342;    7734;    7782;     108;      60
SING JET KERO SWAP - NEW YORK MERCANTILE EXCHANGE ;2010.08.10;    7699;     250;      40;     400;    6891;    7149;    7541;    7589;     158;     110
SING JET KERO SWAP - NEW YORK MERCANTILE EXCHANGE ;2010.08.03;    7276;     200;      40;     400;    6418;    6626;    7018;    7066;     258;     210
SING JET KERO SWAP - NEW YORK MERCANTILE EXCHANGE ;2010.07.27;    7772;     200;     190;     400;    7122;    7132;    7722;    7722;      50;      50
SING JET KERO SWAP - NEW YORK MERCANTILE EXCHANGE ;2010.07.20;    6723;     250;     190;     300;    6123;    6183;    6673;    6673;      50;      50
SING JET KERO SWAP - NEW YORK MERCANTILE EXCHANGE ;2010.07.13;    6313;     200;     190;     300;    5813;    5823;    6313;    6313;       0;       0
SING JET KERO SWAP - NEW YORK MERCANTILE EXCHANGE ;2010.07.06;    6166;     200;     190;     250;    5516;    5526;    5966;    5966;     200;     200
SING JET KERO SWAP - NEW YORK MERCANTILE EXCHANGE ;2010.06.29;    8485;     500;     390;     300;    7535;    7645;    8335;    8335;     150;     150
SING JET KERO SWAP - NEW YORK MERCANTILE EXCHANGE ;2010.06.22;    8122;     500;     290;     300;    7222;    7432;    8022;    8022;     100;     100
SING JET KERO SWAP - NEW YORK MERCANTILE EXCHANGE ;2010.06.15;    8322;     500;     240;     350;    7072;    7332;    7922;    7922;     400;     400
SING JET KERO SWAP - NEW YORK MERCANTILE EXCHANGE ;2010.06.08;    7897;     600;     240;     300;    6597;    6957;    7497;    7497;     400;     400
SING JET KERO SWAP - NEW YORK MERCANTILE EXCHANGE ;2010.06.01;    9927;     650;      90;     500;    8377;    8937;    9527;    9527;     400;     400
SING JET KERO SWAP - NEW YORK MERCANTILE EXCHANGE ;2010.05.25;    9096;     600;      90;     300;    7846;    8356;    8746;    8746;     350;     350
SING JET KERO SWAP - NEW YORK MERCANTILE EXCHANGE ;2010.05.18;    8431;     500;       0;     300;    7331;    7831;    8131;    8131;     300;     300
SING JET KERO SWAP - NEW YORK MERCANTILE EXCHANGE ;2010.05.11;    8074;     475;       0;     325;    7024;    7499;    7824;    7824;     250;     250
SING JET KERO SWAP - NEW YORK MERCANTILE EXCHANGE ;2010.05.04;    8044;     450;       0;     350;    6944;    7394;    7744;    7744;     300;     300
SING JET KERO SWAP - NEW YORK MERCANTILE EXCHANGE ;2010.04.27;    9523;     550;     150;     350;    8323;    8723;    9223;    9223;     300;     300
SING JET KERO SWAP - NEW YORK MERCANTILE EXCHANGE ;2010.04.20;    8612;     550;     150;     300;    7562;    7962;    8412;    8412;     200;     200
SING JET KERO SWAP - NEW YORK MERCANTILE EXCHANGE ;2010.04.13;    7937;     658;     150;     275;    6804;    7195;    7737;    7620;     200;     317
SING JET KERO SWAP - NEW YORK MERCANTILE EXCHANGE ;2010.04.06;    7051;     658;     100;     325;    6068;    6509;    7051;    6934;       0;     117
SING JET KERO SWAP - NEW YORK MERCANTILE EXCHANGE ;2010.03.30;    9561;    1168;     100;     625;    7707;    8656;    9500;    9381;      61;     180
SING JET KERO SWAP - NEW YORK MERCANTILE EXCHANGE ;2010.03.23;    9111;    1268;     100;     525;    7307;    8356;    9100;    8981;      11;     130
SING JET KERO SWAP - NEW YORK MERCANTILE EXCHANGE ;2010.03.16;    8651;    1218;     100;     525;    6897;    7896;    8640;    8521;      11;     130
SING JET KERO SWAP - NEW YORK MERCANTILE EXCHANGE ;2010.03.09;    8226;    1218;     100;     375;    6622;    7621;    8215;    8096;      11;     130
SING JET KERO SWAP - NEW YORK MERCANTILE EXCHANGE ;2010.03.02;    7793;    1185;     175;     375;    6222;    7113;    7782;    7663;      11;     130
SING JET KERO SWAP - NEW YORK MERCANTILE EXCHANGE ;2010.02.23;    9194;    1446;     175;     225;    7492;    8642;    9163;    9042;      31;     152
SING JET KERO SWAP - NEW YORK MERCANTILE EXCHANGE ;2010.02.16;    8312;    1446;     100;     225;    6610;    7835;    8281;    8160;      31;     152
SING JET KERO SWAP - NEW YORK MERCANTILE EXCHANGE ;2010.02.09;    8087;    1346;     100;     225;    6385;    7510;    7956;    7835;     131;     252
SING JET KERO SWAP - NEW YORK MERCANTILE EXCHANGE ;2010.02.02;    8022;    1346;     100;     275;    6270;    7395;    7891;    7770;     131;     252
SING JET KERO SWAP - NEW YORK MERCANTILE EXCHANGE ;2010.01.26;    9260;    1572;      86;     450;    6946;    8415;    8968;    8951;     292;     309
SING JET KERO SWAP - NEW YORK MERCANTILE EXCHANGE ;2010.01.19;    8778;    1606;       0;     566;    6414;    8003;    8586;    8569;     192;     209
SING JET KERO SWAP - NEW YORK MERCANTILE EXCHANGE ;2010.01.12;    7809;    1606;       0;     416;    5704;    7293;    7726;    7709;      83;     100
SING JET KERO SWAP - NEW YORK MERCANTILE EXCHANGE ;2010.01.05;    7791;    1206;       0;     266;    5746;    7335;    7218;    7601;     573;     190
SING JET KERO SWAP - NEW YORK MERCANTILE EXCHANGE ;2009.12.29;    9547;    1581;       0;     316;    7002;    9116;    8899;    9432;     648;     115
SING JET KERO SWAP - NEW YORK MERCANTILE EXCHANGE ;2009.12.22;    9307;    1622;       0;     175;    6862;    9017;    8659;    9192;     648;     115
SING JET KERO SWAP - NEW YORK MERCANTILE EXCHANGE ;2009.12.15;    8837;    1672;       0;      75;    6382;    8587;    8129;    8662;     708;     175
SING JET KERO SWAP - NEW YORK MERCANTILE EXCHANGE ;2009.12.08;    8742;    1622;       0;     175;    6337;    8542;    8134;    8717;     608;      25
SING JET KERO SWAP - NEW YORK MERCANTILE EXCHANGE ;2009.12.01;   10100;    1813;       0;     175;    7504;    9344;    9492;    9519;     608;     581
SING JET KERO SWAP - NEW YORK MERCANTILE EXCHANGE ;2009.11.24;    9041;    1454;       0;     125;    6959;    8410;    8538;    8535;     503;     506
SING JET KERO SWAP - NEW YORK MERCANTILE EXCHANGE ;2009.11.17;    8474;    1454;       0;      75;    6492;    7993;    8021;    8068;     453;     406
SING JET KERO SWAP - NEW YORK MERCANTILE EXCHANGE ;2009.11.09;    8239;    1454;       0;      50;    6232;    7583;    7736;    7633;     503;     606
SING JET KERO SWAP - NEW YORK MERCANTILE EXCHANGE ;2009.11.03;    8189;    1454;       0;      50;    6182;    7633;    7686;    7683;     503;     506
SING JET KERO SWAP - NEW YORK MERCANTILE EXCHANGE ;2009.10.27;   10607;    2129;      50;     150;    7660;    9636;    9939;    9836;     668;     771
SING JET KERO SWAP - NEW YORK MERCANTILE EXCHANGE ;2009.10.20;   10267;    2054;     150;      50;    7310;    9111;    9414;    9311;     853;     956
SING JET KERO SWAP - NEW YORK MERCANTILE EXCHANGE ;2009.10.13;    9494;    2004;     150;      50;    6857;    8638;    8911;    8838;     583;     656
SING JET KERO SWAP - NEW YORK MERCANTILE EXCHANGE ;2009.10.06;    8766;    2004;     100;      50;    6217;    8048;    8271;    8198;     495;     568
SING JET KERO SWAP - NEW YORK MERCANTILE EXCHANGE ;2009.09.29;   11421;    2104;      50;     150;    8484;   10415;   10738;   10615;     683;     806
SING JET KERO SWAP - NEW YORK MERCANTILE EXCHANGE ;2009.09.22;   11474;    2104;      50;     150;    8437;   10368;   10691;   10568;     783;     906
SING JET KERO SWAP - NEW YORK MERCANTILE EXCHANGE ;2009.09.15;   11324;    2204;       0;     100;    8137;   10118;   10441;   10218;     883;    1106
SING JET KERO SWAP - NEW YORK MERCANTILE EXCHANGE ;2009.09.08;   10910;    1954;       0;     100;    8173;    9904;   10227;   10004;     683;     906
SING JET KERO SWAP - NEW YORK MERCANTILE EXCHANGE ;2009.09.01;   13074;    2304;       0;     100;    9937;   12074;   12341;   12174;     733;     900
SING JET KERO SWAP - NEW YORK MERCANTILE EXCHANGE ;2009.08.25;   12514;    2254;       0;       0;    9727;   11764;   11981;   11764;     533;     750
SING JET KERO SWAP - NEW YORK MERCANTILE EXCHANGE ;2009.08.18;   12015;    2154;       0;       0;    9378;   11415;   11532;   11415;     483;     600
SING JET KERO SWAP - NEW YORK MERCANTILE EXCHANGE ;2009.08.11;   10825;    2104;       0;     150;    8088;   10075;   10342;   10225;     483;     600
SING JET KERO SWAP - NEW YORK MERCANTILE EXCHANGE ;2009.08.04;    9138;    1954;       0;     150;    6901;    8738;    9005;    8888;     133;     250
SING JET KERO SWAP - NEW YORK MERCANTILE EXCHANGE ;2009.07.28;   10748;    1404;     100;     400;    8844;    9998;   10648;   10498;     100;     250
SING JET KERO SWAP - NEW YORK MERCANTILE EXCHANGE ;2009.07.21;   10203;    1404;     200;     250;    8449;    9503;   10103;    9953;     100;     250
SING JET KERO SWAP - NEW YORK MERCANTILE EXCHANGE ;2009.07.14;    9321;    1354;     150;     300;    7517;    8571;    9171;    9021;     150;     300
SING JET KERO SWAP - NEW YORK MERCANTILE EXCHANGE ;2009.07.07;   10246;    1354;     920;     300;    8492;    8776;   10146;    9996;     100;     250
SING JET KERO SWAP - NEW YORK MERCANTILE EXCHANGE ;2009.06.30;   12282;    1454;     820;     400;   10278;   10812;   12132;   12032;     150;     250
SING JET KERO SWAP - NEW YORK MERCANTILE EXCHANGE ;2009.06.23;   11379;    1404;     950;     100;    9725;   10079;   11229;   11129;     150;     250
SING JET KERO SWAP - NEW YORK MERCANTILE EXCHANGE ;2009.06.16;   10779;    1280;     900;     100;    9125;    9629;   10505;   10629;     274;     150
SING JET KERO SWAP - NEW YORK MERCANTILE EXCHANGE ;2009.06.09;   10223;    1250;     900;     100;    8623;    8973;    9973;    9973;     250;     250
SING JET KERO SWAP - NEW YORK MERCANTILE EXCHANGE ;2009.06.02;    9484;    1250;     900;     100;    7834;    7534;    9184;    8534;     300;     950
SING JET KERO SWAP - NEW YORK MERCANTILE EXCHANGE ;2009.05.26;   10112;    1250;     900;       0;    8562;    8312;    9812;    9212;     300;     900
SING JET KERO SWAP - NEW YORK MERCANTILE EXCHANGE ;2009.05.19;    9325;    1150;     900;       0;    8025;    7555;    9175;    8455;     150;     870
SING JET KERO SWAP - NEW YORK MERCANTILE EXCHANGE ;2009.05.12;    8725;    1050;     900;       0;    7575;    7005;    8625;    7905;     100;     820
SING JET KERO SWAP - NEW YORK MERCANTILE EXCHANGE ;2009.05.05;    8195;    1050;     600;       0;    7045;    6775;    8095;    7375;     100;     820
SING JET KERO SWAP - NEW YORK MERCANTILE EXCHANGE ;2009.04.28;    9668;    1150;     600;       0;    8244;    8098;    9394;    8698;     274;     970
SING JET KERO SWAP - NEW YORK MERCANTILE EXCHANGE ;2009.04.21;    8346;     850;       0;       0;    7222;    7376;    8072;    7376;     274;     970
SING JET KERO SWAP - NEW YORK MERCANTILE EXCHANGE ;2009.04.14;    7645;     900;       0;       0;    6521;    6725;    7421;    6725;     224;     920
SING JET KERO SWAP - NEW YORK MERCANTILE EXCHANGE ;2009.04.07;    7063;     900;       0;       0;    5939;    6043;    6839;    6043;     224;    1020
SING JET KERO SWAP - NEW YORK MERCANTILE EXCHANGE ;2009.03.31;    9058;     850;       0;      50;    7784;    8538;    8684;    8588;     374;     470
SING JET KERO SWAP - NEW YORK MERCANTILE EXCHANGE ;2009.03.24;    8008;      50;       0;      50;    7708;    7662;    7808;    7712;     200;     296
SING JET KERO SWAP - NEW YORK MERCANTILE EXCHANGE ;2009.03.17;    7683;      50;       0;      50;    7383;    7337;    7483;    7387;     200;     296
SING JET KERO SWAP - NEW YORK MERCANTILE EXCHANGE ;2009.03.10;    7191;      50;       0;      50;    6891;    6845;    6991;    6895;     200;     296
SING JET KERO SWAP - NEW YORK MERCANTILE EXCHANGE ;2009.03.03;    5673;       0;      50;       0;    5473;    5327;    5473;    5377;     200;     296
SING JET KERO SWAP - NEW YORK MERCANTILE EXCHANGE ;2009.02.24;    6418;       0;      50;       0;    6118;    5972;    6118;    6022;     300;     396
SING JET KERO SWAP - NEW YORK MERCANTILE EXCHANGE ;2009.02.17;    5860;       0;      50;       0;    5760;    5614;    5760;    5664;     100;     196
SING JET KERO SWAP - NEW YORK MERCANTILE EXCHANGE ;2009.02.10;    5253;       0;      50;       0;    5153;    5007;    5153;    5057;     100;     196
SING JET KERO SWAP - NEW YORK MERCANTILE EXCHANGE ;2009.02.03;    4143;       0;      50;       0;    4043;    3897;    4043;    3947;     100;     196
SING JET KERO SWAP - NEW YORK MERCANTILE EXCHANGE ;2009.01.27;    4822;     150;       0;       0;    4672;    4822;    4822;    4822;       0;       0
SING JET KERO SWAP - NEW YORK MERCANTILE EXCHANGE ;2009.01.20;    4522;      50;       0;       0;    4472;    4522;    4522;    4522;       0;       0
SING JET KERO SWAP - NEW YORK MERCANTILE EXCHANGE ;2009.01.13;    4334;     150;       0;       0;    4084;    4234;    4234;    4234;     100;     100
SING JET KERO SWAP - NEW YORK MERCANTILE EXCHANGE ;2009.01.06;    3809;     150;       0;       0;    3609;    3759;    3759;    3759;      50;      50
SING JET KERO SWAP - NEW YORK MERCANTILE EXCHANGE ;2008.12.30;    6877;       0;      50;     150;    6527;    6477;    6677;    6677;     200;     200
SING JET KERO SWAP - NEW YORK MERCANTILE EXCHANGE ;2008.12.22;    6727;       0;      50;     150;    6377;    6327;    6527;    6527;     200;     200
SING JET KERO SWAP - NEW YORK MERCANTILE EXCHANGE ;2008.12.16;    6852;     100;      50;     150;    6402;    6452;    6652;    6652;     200;     200
SING JET KERO SWAP - NEW YORK MERCANTILE EXCHANGE ;2008.12.09;    6702;     100;      50;     150;    6252;    6302;    6502;    6502;     200;     200
SING JET KERO SWAP - NEW YORK MERCANTILE EXCHANGE ;2008.12.02;    6327;     100;      50;     150;    5877;    5927;    6127;    6127;     200;     200
SING JET KERO SWAP - NEW YORK MERCANTILE EXCHANGE ;2008.11.25;    7432;     100;     350;      50;    7062;    6832;    7212;    7232;     220;     200
SING JET KERO SWAP - NEW YORK MERCANTILE EXCHANGE ;2008.11.18;    7507;     300;     300;       0;    7007;    7007;    7307;    7307;     200;     200
SING JET KERO SWAP - NEW YORK MERCANTILE EXCHANGE ;2008.11.11;    7407;     250;     250;       0;    6957;    6957;    7207;    7207;     200;     200
SING JET KERO SWAP - NEW YORK MERCANTILE EXCHANGE ;2008.11.04;    6572;     250;     150;       0;    6122;    6222;    6372;    6372;     200;     200
SING JET KERO SWAP - NEW YORK MERCANTILE EXCHANGE ;2008.10.28;    7886;     150;     100;     100;    7378;    7390;    7628;    7590;     258;     296
SING JET KERO SWAP - NEW YORK MERCANTILE EXCHANGE ;2008.10.21;    7364;     150;     100;     100;    7056;    7118;    7306;    7318;      58;      46
SING JET KERO SWAP - NEW YORK MERCANTILE EXCHANGE ;2008.10.14;    6536;     150;       0;     150;    6028;    6340;    6328;    6490;     208;      46
SING JET KERO SWAP - NEW YORK MERCANTILE EXCHANGE ;2008.10.07;    5139;     150;       0;     100;    4715;    4839;    4965;    4939;     174;     200
SING JET KERO SWAP - NEW YORK MERCANTILE EXCHANGE ;2008.09.30;    5956;     250;     100;     100;    5306;    5506;    5656;    5706;     300;     250
SING JET KERO SWAP - NEW YORK MERCANTILE EXCHANGE ;2008.09.23;    4925;     250;     100;     100;    4350;    4450;    4700;    4650;     225;     275
SING JET KERO SWAP - NEW YORK MERCANTILE EXCHANGE ;2008.09.16;    4700;     250;     100;     100;    4150;    4250;    4500;    4450;     200;     250
SING JET KERO SWAP - NEW YORK MERCANTILE EXCHANGE ;2008.09.09;    4600;     250;     100;       0;    4175;    4250;    4425;    4350;     175;     250
SING JET KERO SWAP - NEW YORK MERCANTILE EXCHANGE ;2008.09.02;    5575;     200;     200;      50;    5175;    5175;    5425;    5425;     150;     150
SING JET KERO SWAP - NEW YORK MERCANTILE EXCHANGE ;2008.08.26;    4975;     200;     150;      50;    4625;    4675;    4875;    4875;     100;     100
SING JET KERO SWAP - NEW YORK MERCANTILE EXCHANGE ;2008.08.19;    4725;     200;     100;      50;    4350;    4525;    4600;    4675;     125;      50
SING JET KERO SWAP - NEW YORK MERCANTILE EXCHANGE ;2008.08.12;    4550;     150;     100;      50;    3775;    3900;    3975;    4050;     575;     500
SING JET KERO SWAP - NEW YORK MERCANTILE EXCHANGE ;2008.08.05;    3450;     150;     150;       0;    3225;    3300;    3375;    3450;      75;       0
SING JET KERO SWAP - NEW YORK MERCANTILE EXCHANGE ;2008.07.29;    4377;     150;     100;      50;    4060;    4227;    4260;    4377;     117;       0
SING JET KERO SWAP - NEW YORK MERCANTILE EXCHANGE ;2008.07.22;    4052;     200;       0;       0;    3735;    4052;    3935;    4052;     117;       0
SING JET KERO SWAP - NEW YORK MERCANTILE EXCHANGE ;2008.07.15;    4352;     200;       0;       0;    4010;    4342;    4210;    4342;     142;      10
SING JET KERO SWAP - NEW YORK MERCANTILE EXCHANGE ;2008.07.08;    3752;     200;       0;       0;    3310;    3642;    3510;    3642;     242;     110
SING JET KERO SWAP - NEW YORK MERCANTILE EXCHANGE ;2008.07.01;    4602;     100;      50;     200;    4260;    4242;    4560;    4492;      42;     110
SING JET KERO SWAP - NEW YORK MERCANTILE EXCHANGE ;2008.06.24;    3760;       0;      50;     200;    3203;    3360;    3403;    3610;     357;     150
SING JET KERO SWAP - NEW YORK MERCANTILE EXCHANGE ;2008.06.17;    3510;       0;      50;     200;    2925;    3110;    3125;    3360;     385;     150
SING JET KERO SWAP - NEW YORK MERCANTILE EXCHANGE ;2008.06.10;    3110;       0;      50;     200;    2525;    2710;    2725;    2960;     385;     150
SING JET KERO SWAP - NEW YORK MERCANTILE EXCHANGE ;2008.06.03;    3110;       0;      50;     200;    2525;    2710;    2725;    2960;     385;     150
SING JET KERO SWAP - NEW YORK MERCANTILE EXCHANGE ;2008.05.27;    3235;       0;      50;     250;    2650;    2635;    2900;    2935;     335;     300
SING JET KERO SWAP - NEW YORK MERCANTILE EXCHANGE ;2008.05.20;    2775;       0;      50;     200;    2375;    2510;    2575;    2760;     200;      15
SING JET KERO SWAP - NEW YORK MERCANTILE EXCHANGE ;2008.05.13;    2725;       0;      50;     200;    2325;    2460;    2525;    2710;     200;      15
SING JET KERO SWAP - NEW YORK MERCANTILE EXCHANGE ;2008.05.06;    2660;       0;       0;     250;    2225;    2310;    2475;    2560;     185;     100
SING JET KERO SWAP - NEW YORK MERCANTILE EXCHANGE ;2008.04.01;    3220;     100;       0;     200;    2835;    2835;    3135;    3035;      85;     185
SING JET KERO SWAP - NEW YORK MERCANTILE EXCHANGE ;2008.02.26;    2550;      50;       0;     200;    2300;    2350;    2550;    2550;       0;       0
SING JET KERO SWAP - NEW YORK MERCANTILE EXCHANGE ;2008.02.19;    2450;      50;       0;     200;    2200;    2250;    2450;    2450;       0;       0
SING JET KERO SWAP - NEW YORK MERCANTILE EXCHANGE ;2008.02.12;    2450;      50;       0;     200;    2200;    2250;    2450;    2450;       0;       0
SING JET KERO SWAP - NEW YORK MERCANTILE EXCHANGE ;2008.02.05;    2450;      50;       0;     200;    2200;    2250;    2450;    2450;       0;       0
SING JET KERO SWAP - NEW YORK MERCANTILE EXCHANGE ;2008.01.29;    3375;       0;       0;     250;    3125;    3075;    3375;    3325;       0;      50
SING JET KERO SWAP - NEW YORK MERCANTILE EXCHANGE ;2008.01.22;    3275;       0;       0;     250;    3025;    2975;    3275;    3225;       0;      50
SING JET KERO SWAP - NEW YORK MERCANTILE EXCHANGE ;2008.01.15;    3275;       0;       0;     250;    3025;    2975;    3275;    3225;       0;      50
SING JET KERO SWAP - NEW YORK MERCANTILE EXCHANGE ;2008.01.08;    3275;       0;       0;     250;    3025;    2975;    3275;    3225;       0;      50
SING JET KERO SWAP - NEW YORK MERCANTILE EXCHANGE ;2007.12.31;    3825;     150;       0;     250;    3425;    3525;    3825;    3775;       0;      50
SING JET KERO SWAP - NEW YORK MERCANTILE EXCHANGE ;2007.12.24;    3825;     150;       0;     250;    3425;    3575;    3825;    3825;       0;       0
SING JET KERO SWAP - NEW YORK MERCANTILE EXCHANGE ;2007.12.18;    3825;       0;       0;     250;    3425;    3575;    3675;    3825;     150;       0
SING JET KERO SWAP - NEW YORK MERCANTILE EXCHANGE ;2007.12.11;    3625;     150;       0;     250;    3225;    3375;    3625;    3625;       0;       0
SING JET KERO SWAP - NEW YORK MERCANTILE EXCHANGE ;2007.12.04;    3650;     150;       0;     250;    3250;    3400;    3650;    3650;       0;       0
SING JET KERO SWAP - NEW YORK MERCANTILE EXCHANGE ;2007.11.27;    3900;       0;       0;     300;    3600;    3600;    3900;    3900;       0;       0
SING JET KERO SWAP - NEW YORK MERCANTILE EXCHANGE ;2007.11.20;    3650;       0;       0;     300;    3350;    3350;    3650;    3650;       0;       0
SING JET KERO SWAP - NEW YORK MERCANTILE EXCHANGE ;2007.11.13;    3600;       0;       0;     300;    3300;    3300;    3600;    3600;       0;       0
SING JET KERO SWAP - NEW YORK MERCANTILE EXCHANGE ;2007.11.06;    3450;       0;       0;     300;    3150;    3150;    3450;    3450;       0;       0
SING JET KERO SWAP - NEW YORK MERCANTILE EXCHANGE ;2007.10.30;    2800;       0;       0;     250;    2500;    2500;    2750;    2750;      50;      50
SING JET KERO SWAP - NEW YORK MERCANTILE EXCHANGE ;2007.07.31;    3290;       0;       0;       0;    3290;    3290;    3290;    3290;       0;       0
SING JET KERO SWAP - NEW YORK MERCANTILE EXCHANGE ;2007.07.24;    3040;      50;       0;      50;    2940;    2990;    3040;    3040;       0;       0
SING JET KERO SWAP - NEW YORK MERCANTILE EXCHANGE ;2007.07.17;    3040;      50;       0;      50;    2940;    2990;    3040;    3040;       0;       0
SING JET KERO SWAP - NEW YORK MERCANTILE EXCHANGE ;2007.07.10;    2940;       0;      50;       0;    2940;    2890;    2940;    2940;       0;       0
SING JET KERO SWAP - NEW YORK MERCANTILE EXCHANGE ;2007.06.26;    3560;       0;     150;       0;    3540;    3260;    3540;    3410;      20;     150
SING JET KERO SWAP - NEW YORK MERCANTILE EXCHANGE ;2007.06.19;    3560;       0;     150;       0;    3540;    3410;    3540;    3560;      20;       0
SING JET KERO SWAP - NEW YORK MERCANTILE EXCHANGE ;2007.06.12;    3510;       0;     150;       0;    3490;    3360;    3490;    3510;      20;       0
SING JET KERO SWAP - NEW YORK MERCANTILE EXCHANGE ;2007.06.05;    3010;       0;     150;       0;    2990;    2860;    2990;    3010;      20;       0
SING JET KERO SWAP - NEW YORK MERCANTILE EXCHANGE ;2011.07.12;    5092;     414;     300;       0;    4678;    4792;    5092;    5092;       0;       0
SING JET KERO SWAP - NEW YORK MERCANTILE EXCHANGE ;2011.07.05;    4892;     300;     300;       0;    4592;    4592;    4892;    4892;       0;       0
SING JET KERO SWAP - NEW YORK MERCANTILE EXCHANGE ;2011.06.28;    5869;     200;       0;     500;    5169;    5369;    5869;    5869;       0;       0
SING JET KERO SWAP - NEW YORK MERCANTILE EXCHANGE ;2011.06.21;    5219;     200;       0;     500;    4519;    4719;    5219;    5219;       0;       0
SING JET KERO SWAP - NEW YORK MERCANTILE EXCHANGE ;2011.06.14;    4926;     100;       0;     450;    4376;    4476;    4926;    4926;       0;       0
SING JET KERO SWAP - NEW YORK MERCANTILE EXCHANGE ;2011.06.07;    4576;       0;       0;     400;    4176;    4176;    4576;    4576;       0;       0
SING JET KERO SWAP - NEW YORK MERCANTILE EXCHANGE ;2011.05.31;    4933;       0;     325;     400;    4483;    4208;    4883;    4933;      50;       0
SING JET KERO SWAP - NEW YORK MERCANTILE EXCHANGE ;2011.05.24;    4134;       0;     325;     100;    4034;    3709;    4134;    4134;       0;       0
SING JET KERO SWAP - NEW YORK MERCANTILE EXCHANGE ;2011.05.17;    3448;       0;     275;     150;    3298;    2951;    3448;    3376;       0;      72
SING JET KERO SWAP - NEW YORK MERCANTILE EXCHANGE ;2011.05.10;    3236;       0;     275;     150;    3086;    2739;    3236;    3164;       0;      72
SING JET KERO SWAP - NEW YORK MERCANTILE EXCHANGE ;2011.05.03;    3086;       0;     275;     150;    2936;    2589;    3086;    3014;       0;      72
SING JET KERO SWAP - NEW YORK MERCANTILE EXCHANGE ;2011.04.26;    4041;     100;      25;     400;    3541;    3508;    4041;    3933;       0;     108
SING JET KERO SWAP - NEW YORK MERCANTILE EXCHANGE ;2011.04.19;    3941;     100;      25;     400;    3441;    3408;    3941;    3833;       0;     108
SING JET KERO SWAP - NEW YORK MERCANTILE EXCHANGE ;2011.04.12;    3728;     150;       0;     350;    3228;    3270;    3728;    3620;       0;     108
SING JET KERO SWAP - NEW YORK MERCANTILE EXCHANGE ;2011.04.05;    3578;     150;       0;     350;    3078;    3120;    3578;    3470;       0;     108
SING JET KERO SWAP - NEW YORK MERCANTILE EXCHANGE ;2011.03.29;    5347;     460;      50;     150;    4737;    5039;    5347;    5239;       0;     108
SING JET KERO SWAP - NEW YORK MERCANTILE EXCHANGE ;2011.03.22;    5147;     460;      50;     150;    4537;    4947;    5147;    5147;       0;       0
SING JET KERO SWAP - NEW YORK MERCANTILE EXCHANGE ;2011.03.15;    5018;     460;      50;     150;    4408;    4818;    5018;    5018;       0;       0
SING JET KERO SWAP - NEW YORK MERCANTILE EXCHANGE ;2011.03.08;    4868;     460;      50;     150;    4240;    4668;    4850;    4868;      18;       0
SING JET KERO SWAP - NEW YORK MERCANTILE EXCHANGE ;2011.03.01;    7228;     550;       0;     410;    6268;    6818;    7228;    7228;       0;       0
SING JET KERO SWAP - NEW YORK MERCANTILE EXCHANGE ;2011.02.22;    7078;     350;       0;     560;    6168;    6518;    7078;    7078;       0;       0
SING JET KERO SWAP - NEW YORK MERCANTILE EXCHANGE ;2011.02.15;    6453;     350;       0;     660;    5393;    5743;    6403;    6403;      50;      50
SING JET KERO SWAP - NEW YORK MERCANTILE EXCHANGE ;2011.02.08;    5970;     350;       0;     560;    5060;    5410;    5970;    5970;       0;       0
SING JET KERO SWAP - NEW YORK MERCANTILE EXCHANGE ;2011.02.01;    7543;     450;     100;     560;    6483;    6833;    7493;    7493;      50;      50
SING JET KERO SWAP - NEW YORK MERCANTILE EXCHANGE ;2011.01.25;    6239;     450;     100;     150;    5539;    5889;    6139;    6139;     100;     100
SING JET KERO SWAP - NEW YORK MERCANTILE EXCHANGE ;2011.01.18;    5944;     500;     100;     313;    5031;    5431;    5844;    5844;     100;     100
SING JET KERO SWAP - NEW YORK MERCANTILE EXCHANGE ;2011.01.11;    5061;     200;     100;     163;    4498;    4698;    4861;    4961;     200;     100
SING JET KERO SWAP - NEW YORK MERCANTILE EXCHANGE ;2011.01.04;    4511;     250;     100;     113;    4048;    4198;    4411;    4411;     100;     100
SING JET KERO SWAP - NEW YORK MERCANTILE EXCHANGE ;2011.07.12;    5092;     414;     300;       0;    4678;    4792;    5092;    5092;       0;       0
SING JET KERO SWAP - NEW YORK MERCANTILE EXCHANGE ;2011.07.05;    4892;     300;     300;       0;    4592;    4592;    4892;    4892;       0;       0
SING JET KERO SWAP - NEW YORK MERCANTILE EXCHANGE ;2011.06.28;    5869;     200;       0;     500;    5169;    5369;    5869;    5869;       0;       0
SING JET KERO SWAP - NEW YORK MERCANTILE EXCHANGE ;2011.06.21;    5219;     200;       0;     500;    4519;    4719;    5219;    5219;       0;       0
SING JET KERO SWAP - NEW YORK MERCANTILE EXCHANGE ;2011.06.14;    4926;     100;       0;     450;    4376;    4476;    4926;    4926;       0;       0
SING JET KERO SWAP - NEW YORK MERCANTILE EXCHANGE ;2011.06.07;    4576;       0;       0;     400;    4176;    4176;    4576;    4576;       0;       0
SING JET KERO SWAP - NEW YORK MERCANTILE EXCHANGE ;2011.05.31;    4933;       0;     325;     400;    4483;    4208;    4883;    4933;      50;       0
SING JET KERO SWAP - NEW YORK MERCANTILE EXCHANGE ;2011.05.24;    4134;       0;     325;     100;    4034;    3709;    4134;    4134;       0;       0
SING JET KERO SWAP - NEW YORK MERCANTILE EXCHANGE ;2011.05.17;    3448;       0;     275;     150;    3298;    2951;    3448;    3376;       0;      72
SING JET KERO SWAP - NEW YORK MERCANTILE EXCHANGE ;2011.05.10;    3236;       0;     275;     150;    3086;    2739;    3236;    3164;       0;      72
SING JET KERO SWAP - NEW YORK MERCANTILE EXCHANGE ;2011.05.03;    3086;       0;     275;     150;    2936;    2589;    3086;    3014;       0;      72
SING JET KERO SWAP - NEW YORK MERCANTILE EXCHANGE ;2011.04.26;    4041;     100;      25;     400;    3541;    3508;    4041;    3933;       0;     108
SING JET KERO SWAP - NEW YORK MERCANTILE EXCHANGE ;2011.04.19;    3941;     100;      25;     400;    3441;    3408;    3941;    3833;       0;     108
SING JET KERO SWAP - NEW YORK MERCANTILE EXCHANGE ;2011.04.12;    3728;     150;       0;     350;    3228;    3270;    3728;    3620;       0;     108
SING JET KERO SWAP - NEW YORK MERCANTILE EXCHANGE ;2011.04.05;    3578;     150;       0;     350;    3078;    3120;    3578;    3470;       0;     108
SING JET KERO SWAP - NEW YORK MERCANTILE EXCHANGE ;2011.03.29;    5347;     460;      50;     150;    4737;    5039;    5347;    5239;       0;     108
SING JET KERO SWAP - NEW YORK MERCANTILE EXCHANGE ;2011.03.22;    5147;     460;      50;     150;    4537;    4947;    5147;    5147;       0;       0
SING JET KERO SWAP - NEW YORK MERCANTILE EXCHANGE ;2011.03.15;    5018;     460;      50;     150;    4408;    4818;    5018;    5018;       0;       0
SING JET KERO SWAP - NEW YORK MERCANTILE EXCHANGE ;2011.03.08;    4868;     460;      50;     150;    4240;    4668;    4850;    4868;      18;       0
SING JET KERO SWAP - NEW YORK MERCANTILE EXCHANGE ;2011.03.01;    7228;     550;       0;     410;    6268;    6818;    7228;    7228;       0;       0
SING JET KERO SWAP - NEW YORK MERCANTILE EXCHANGE ;2011.02.22;    7078;     350;       0;     560;    6168;    6518;    7078;    7078;       0;       0
SING JET KERO SWAP - NEW YORK MERCANTILE EXCHANGE ;2011.02.15;    6453;     350;       0;     660;    5393;    5743;    6403;    6403;      50;      50
SING JET KERO SWAP - NEW YORK MERCANTILE EXCHANGE ;2011.02.08;    5970;     350;       0;     560;    5060;    5410;    5970;    5970;       0;       0
SING JET KERO SWAP - NEW YORK MERCANTILE EXCHANGE ;2011.02.01;    7543;     450;     100;     560;    6483;    6833;    7493;    7493;      50;      50
SING JET KERO SWAP - NEW YORK MERCANTILE EXCHANGE ;2011.01.25;    6239;     450;     100;     150;    5539;    5889;    6139;    6139;     100;     100
SING JET KERO SWAP - NEW YORK MERCANTILE EXCHANGE ;2011.01.18;    5944;     500;     100;     313;    5031;    5431;    5844;    5844;     100;     100
SING JET KERO SWAP - NEW YORK MERCANTILE EXCHANGE ;2011.01.11;    5061;     200;     100;     163;    4498;    4698;    4861;    4961;     200;     100
SING JET KERO SWAP - NEW YORK MERCANTILE EXCHANGE ;2011.01.04;    4511;     250;     100;     113;    4048;    4198;    4411;    4411;     100;     100
SING JET KERO SWAP - NEW YORK MERCANTILE EXCHANGE ;2010.12.28;    6170;      86;     200;     300;    5647;    5557;    6033;    6057;     137;     113
SING JET KERO SWAP - NEW YORK MERCANTILE EXCHANGE ;2010.12.21;    5582;      86;     200;     150;    5259;    5169;    5495;    5519;      87;      63
SING JET KERO SWAP - NEW YORK MERCANTILE EXCHANGE ;2010.12.14;    5156;     186;     200;       0;    4883;    4893;    5069;    5093;      87;      63
SING JET KERO SWAP - NEW YORK MERCANTILE EXCHANGE ;2010.12.07;    4706;      86;     150;       0;    4333;    4543;    4419;    4693;     287;      13
SING JET KERO SWAP - NEW YORK MERCANTILE EXCHANGE ;2010.11.30;    5891;     222;     310;      20;    5515;    5448;    5757;    5778;     134;     113
SING JET KERO SWAP - NEW YORK MERCANTILE EXCHANGE ;2010.11.23;    5452;     222;     260;      20;    5076;    5059;    5318;    5339;     134;     113
SING JET KERO SWAP - NEW YORK MERCANTILE EXCHANGE ;2010.11.16;    5402;     222;     260;      20;    5026;    5009;    5268;    5289;     134;     113
SING JET KERO SWAP - NEW YORK MERCANTILE EXCHANGE ;2010.11.09;    4996;     222;     310;       0;    4640;    4573;    4862;    4883;     134;     113
SING JET KERO SWAP - NEW YORK MERCANTILE EXCHANGE ;2010.11.02;    4996;     222;     310;       0;    4640;    4573;    4862;    4883;     134;     113
SING JET KERO SWAP - NEW YORK MERCANTILE EXCHANGE ;2010.10.26;    6772;     250;     132;     322;    5999;    6218;    6571;    6672;     201;     100
SING JET KERO SWAP - NEW YORK MERCANTILE EXCHANGE ;2010.10.19;    6586;     250;     132;     336;    5799;    6018;    6385;    6486;     201;     100
SING JET KERO SWAP - NEW YORK MERCANTILE EXCHANGE ;2010.10.12;    6286;     250;     132;     336;    5499;    5718;    6085;    6186;     201;     100
SING JET KERO SWAP - NEW YORK MERCANTILE EXCHANGE ;2010.10.05;    6024;     200;     132;     436;    5287;    5456;    5923;    6024;     101;       0
SING JET KERO SWAP - NEW YORK MERCANTILE EXCHANGE ;2010.09.28;    8288;     250;     382;     286;    7644;    7620;    8180;    8288;     108;       0
SING JET KERO SWAP - NEW YORK MERCANTILE EXCHANGE ;2010.09.21;    7760;     250;     332;     286;    7116;    7142;    7652;    7760;     108;       0
SING JET KERO SWAP - NEW YORK MERCANTILE EXCHANGE ;2010.09.14;    7474;     250;     282;     236;    6880;    6956;    7366;    7474;     108;       0
SING JET KERO SWAP - NEW YORK MERCANTILE EXCHANGE ;2010.09.07;    7476;     250;     282;     236;    6750;    6826;    7236;    7344;     240;     132
SING JET KERO SWAP - NEW YORK MERCANTILE EXCHANGE ;2010.08.31;    9594;     250;      65;     450;    8686;    8944;    9386;    9459;     208;     135
SING JET KERO SWAP - NEW YORK MERCANTILE EXCHANGE ;2010.08.24;    8270;     250;      40;     400;    7462;    7720;    8112;    8160;     158;     110
SING JET KERO SWAP - NEW YORK MERCANTILE EXCHANGE ;2010.08.17;    7842;     250;      40;     400;    7084;    7342;    7734;    7782;     108;      60
SING JET KERO SWAP - NEW YORK MERCANTILE EXCHANGE ;2010.08.10;    7699;     250;      40;     400;    6891;    7149;    7541;    7589;     158;     110
SING JET KERO SWAP - NEW YORK MERCANTILE EXCHANGE ;2010.08.03;    7276;     200;      40;     400;    6418;    6626;    7018;    7066;     258;     210
SING JET KERO SWAP - NEW YORK MERCANTILE EXCHANGE ;2010.07.27;    7772;     200;     190;     400;    7122;    7132;    7722;    7722;      50;      50
SING JET KERO SWAP - NEW YORK MERCANTILE EXCHANGE ;2010.07.20;    6723;     250;     190;     300;    6123;    6183;    6673;    6673;      50;      50
SING JET KERO SWAP - NEW YORK MERCANTILE EXCHANGE ;2010.07.13;    6313;     200;     190;     300;    5813;    5823;    6313;    6313;       0;       0
SING JET KERO SWAP - NEW YORK MERCANTILE EXCHANGE ;2010.07.06;    6166;     200;     190;     250;    5516;    5526;    5966;    5966;     200;     200
SING JET KERO SWAP - NEW YORK MERCANTILE EXCHANGE ;2010.06.29;    8485;     500;     390;     300;    7535;    7645;    8335;    8335;     150;     150
SING JET KERO SWAP - NEW YORK MERCANTILE EXCHANGE ;2010.06.22;    8122;     500;     290;     300;    7222;    7432;    8022;    8022;     100;     100
SING JET KERO SWAP - NEW YORK MERCANTILE EXCHANGE ;2010.06.15;    8322;     500;     240;     350;    7072;    7332;    7922;    7922;     400;     400
SING JET KERO SWAP - NEW YORK MERCANTILE EXCHANGE ;2010.06.08;    7897;     600;     240;     300;    6597;    6957;    7497;    7497;     400;     400
SING JET KERO SWAP - NEW YORK MERCANTILE EXCHANGE ;2010.06.01;    9927;     650;      90;     500;    8377;    8937;    9527;    9527;     400;     400
SING JET KERO SWAP - NEW YORK MERCANTILE EXCHANGE ;2010.05.25;    9096;     600;      90;     300;    7846;    8356;    8746;    8746;     350;     350
SING JET KERO SWAP - NEW YORK MERCANTILE EXCHANGE ;2010.05.18;    8431;     500;       0;     300;    7331;    7831;    8131;    8131;     300;     300
SING JET KERO SWAP - NEW YORK MERCANTILE EXCHANGE ;2010.05.11;    8074;     475;       0;     325;    7024;    7499;    7824;    7824;     250;     250
SING JET KERO SWAP - NEW YORK MERCANTILE EXCHANGE ;2010.05.04;    8044;     450;       0;     350;    6944;    7394;    7744;    7744;     300;     300
SING JET KERO SWAP - NEW YORK MERCANTILE EXCHANGE ;2010.04.27;    9523;     550;     150;     350;    8323;    8723;    9223;    9223;     300;     300
SING JET KERO SWAP - NEW YORK MERCANTILE EXCHANGE ;2010.04.20;    8612;     550;     150;     300;    7562;    7962;    8412;    8412;     200;     200
SING JET KERO SWAP - NEW YORK MERCANTILE EXCHANGE ;2010.04.13;    7937;     658;     150;     275;    6804;    7195;    7737;    7620;     200;     317
SING JET KERO SWAP - NEW YORK MERCANTILE EXCHANGE ;2010.04.06;    7051;     658;     100;     325;    6068;    6509;    7051;    6934;       0;     117
SING JET KERO SWAP - NEW YORK MERCANTILE EXCHANGE ;2010.03.30;    9561;    1168;     100;     625;    7707;    8656;    9500;    9381;      61;     180
SING JET KERO SWAP - NEW YORK MERCANTILE EXCHANGE ;2010.03.23;    9111;    1268;     100;     525;    7307;    8356;    9100;    8981;      11;     130
SING JET KERO SWAP - NEW YORK MERCANTILE EXCHANGE ;2010.03.16;    8651;    1218;     100;     525;    6897;    7896;    8640;    8521;      11;     130
SING JET KERO SWAP - NEW YORK MERCANTILE EXCHANGE ;2010.03.09;    8226;    1218;     100;     375;    6622;    7621;    8215;    8096;      11;     130
SING JET KERO SWAP - NEW YORK MERCANTILE EXCHANGE ;2010.03.02;    7793;    1185;     175;     375;    6222;    7113;    7782;    7663;      11;     130
SING JET KERO SWAP - NEW YORK MERCANTILE EXCHANGE ;2010.02.23;    9194;    1446;     175;     225;    7492;    8642;    9163;    9042;      31;     152
SING JET KERO SWAP - NEW YORK MERCANTILE EXCHANGE ;2010.02.16;    8312;    1446;     100;     225;    6610;    7835;    8281;    8160;      31;     152
SING JET KERO SWAP - NEW YORK MERCANTILE EXCHANGE ;2010.02.09;    8087;    1346;     100;     225;    6385;    7510;    7956;    7835;     131;     252
SING JET KERO SWAP - NEW YORK MERCANTILE EXCHANGE ;2010.02.02;    8022;    1346;     100;     275;    6270;    7395;    7891;    7770;     131;     252
SING JET KERO SWAP - NEW YORK MERCANTILE EXCHANGE ;2010.01.26;    9260;    1572;      86;     450;    6946;    8415;    8968;    8951;     292;     309
SING JET KERO SWAP - NEW YORK MERCANTILE EXCHANGE ;2010.01.19;    8778;    1606;       0;     566;    6414;    8003;    8586;    8569;     192;     209
SING JET KERO SWAP - NEW YORK MERCANTILE EXCHANGE ;2010.01.12;    7809;    1606;       0;     416;    5704;    7293;    7726;    7709;      83;     100
SING JET KERO SWAP - NEW YORK MERCANTILE EXCHANGE ;2010.01.05;    7791;    1206;       0;     266;    5746;    7335;    7218;    7601;     573;     190
SING JET KERO SWAP - NEW YORK MERCANTILE EXCHANGE ;2009.12.29;    9547;    1581;       0;     316;    7002;    9116;    8899;    9432;     648;     115
SING JET KERO SWAP - NEW YORK MERCANTILE EXCHANGE ;2009.12.22;    9307;    1622;       0;     175;    6862;    9017;    8659;    9192;     648;     115
SING JET KERO SWAP - NEW YORK MERCANTILE EXCHANGE ;2009.12.15;    8837;    1672;       0;      75;    6382;    8587;    8129;    8662;     708;     175
SING JET KERO SWAP - NEW YORK MERCANTILE EXCHANGE ;2009.12.08;    8742;    1622;       0;     175;    6337;    8542;    8134;    8717;     608;      25
SING JET KERO SWAP - NEW YORK MERCANTILE EXCHANGE ;2009.12.01;   10100;    1813;       0;     175;    7504;    9344;    9492;    9519;     608;     581
SING JET KERO SWAP - NEW YORK MERCANTILE EXCHANGE ;2009.11.24;    9041;    1454;       0;     125;    6959;    8410;    8538;    8535;     503;     506
SING JET KERO SWAP - NEW YORK MERCANTILE EXCHANGE ;2009.11.17;    8474;    1454;       0;      75;    6492;    7993;    8021;    8068;     453;     406
SING JET KERO SWAP - NEW YORK MERCANTILE EXCHANGE ;2009.11.09;    8239;    1454;       0;      50;    6232;    7583;    7736;    7633;     503;     606
SING JET KERO SWAP - NEW YORK MERCANTILE EXCHANGE ;2009.11.03;    8189;    1454;       0;      50;    6182;    7633;    7686;    7683;     503;     506
SING JET KERO SWAP - NEW YORK MERCANTILE EXCHANGE ;2009.10.27;   10607;    2129;      50;     150;    7660;    9636;    9939;    9836;     668;     771
SING JET KERO SWAP - NEW YORK MERCANTILE EXCHANGE ;2009.10.20;   10267;    2054;     150;      50;    7310;    9111;    9414;    9311;     853;     956
SING JET KERO SWAP - NEW YORK MERCANTILE EXCHANGE ;2009.10.13;    9494;    2004;     150;      50;    6857;    8638;    8911;    8838;     583;     656
SING JET KERO SWAP - NEW YORK MERCANTILE EXCHANGE ;2009.10.06;    8766;    2004;     100;      50;    6217;    8048;    8271;    8198;     495;     568
SING JET KERO SWAP - NEW YORK MERCANTILE EXCHANGE ;2009.09.29;   11421;    2104;      50;     150;    8484;   10415;   10738;   10615;     683;     806
SING JET KERO SWAP - NEW YORK MERCANTILE EXCHANGE ;2009.09.22;   11474;    2104;      50;     150;    8437;   10368;   10691;   10568;     783;     906
SING JET KERO SWAP - NEW YORK MERCANTILE EXCHANGE ;2009.09.15;   11324;    2204;       0;     100;    8137;   10118;   10441;   10218;     883;    1106
SING JET KERO SWAP - NEW YORK MERCANTILE EXCHANGE ;2009.09.08;   10910;    1954;       0;     100;    8173;    9904;   10227;   10004;     683;     906
SING JET KERO SWAP - NEW YORK MERCANTILE EXCHANGE ;2009.09.01;   13074;    2304;       0;     100;    9937;   12074;   12341;   12174;     733;     900
SING JET KERO SWAP - NEW YORK MERCANTILE EXCHANGE ;2009.08.25;   12514;    2254;       0;       0;    9727;   11764;   11981;   11764;     533;     750
SING JET KERO SWAP - NEW YORK MERCANTILE EXCHANGE ;2009.08.18;   12015;    2154;       0;       0;    9378;   11415;   11532;   11415;     483;     600
SING JET KERO SWAP - NEW YORK MERCANTILE EXCHANGE ;2009.08.11;   10825;    2104;       0;     150;    8088;   10075;   10342;   10225;     483;     600
SING JET KERO SWAP - NEW YORK MERCANTILE EXCHANGE ;2009.08.04;    9138;    1954;       0;     150;    6901;    8738;    9005;    8888;     133;     250
SING JET KERO SWAP - NEW YORK MERCANTILE EXCHANGE ;2009.07.28;   10748;    1404;     100;     400;    8844;    9998;   10648;   10498;     100;     250
SING JET KERO SWAP - NEW YORK MERCANTILE EXCHANGE ;2009.07.21;   10203;    1404;     200;     250;    8449;    9503;   10103;    9953;     100;     250
SING JET KERO SWAP - NEW YORK MERCANTILE EXCHANGE ;2009.07.14;    9321;    1354;     150;     300;    7517;    8571;    9171;    9021;     150;     300
SING JET KERO SWAP - NEW YORK MERCANTILE EXCHANGE ;2009.07.07;   10246;    1354;     920;     300;    8492;    8776;   10146;    9996;     100;     250
SING JET KERO SWAP - NEW YORK MERCANTILE EXCHANGE ;2009.06.30;   12282;    1454;     820;     400;   10278;   10812;   12132;   12032;     150;     250
SING JET KERO SWAP - NEW YORK MERCANTILE EXCHANGE ;2009.06.23;   11379;    1404;     950;     100;    9725;   10079;   11229;   11129;     150;     250
SING JET KERO SWAP - NEW YORK MERCANTILE EXCHANGE ;2009.06.16;   10779;    1280;     900;     100;    9125;    9629;   10505;   10629;     274;     150
SING JET KERO SWAP - NEW YORK MERCANTILE EXCHANGE ;2009.06.09;   10223;    1250;     900;     100;    8623;    8973;    9973;    9973;     250;     250
SING JET KERO SWAP - NEW YORK MERCANTILE EXCHANGE ;2009.06.02;    9484;    1250;     900;     100;    7834;    7534;    9184;    8534;     300;     950
SING JET KERO SWAP - NEW YORK MERCANTILE EXCHANGE ;2009.05.26;   10112;    1250;     900;       0;    8562;    8312;    9812;    9212;     300;     900
SING JET KERO SWAP - NEW YORK MERCANTILE EXCHANGE ;2009.05.19;    9325;    1150;     900;       0;    8025;    7555;    9175;    8455;     150;     870
SING JET KERO SWAP - NEW YORK MERCANTILE EXCHANGE ;2009.05.12;    8725;    1050;     900;       0;    7575;    7005;    8625;    7905;     100;     820
SING JET KERO SWAP - NEW YORK MERCANTILE EXCHANGE ;2009.05.05;    8195;    1050;     600;       0;    7045;    6775;    8095;    7375;     100;     820
SING JET KERO SWAP - NEW YORK MERCANTILE EXCHANGE ;2009.04.28;    9668;    1150;     600;       0;    8244;    8098;    9394;    8698;     274;     970
SING JET KERO SWAP - NEW YORK MERCANTILE EXCHANGE ;2009.04.21;    8346;     850;       0;       0;    7222;    7376;    8072;    7376;     274;     970
SING JET KERO SWAP - NEW YORK MERCANTILE EXCHANGE ;2009.04.14;    7645;     900;       0;       0;    6521;    6725;    7421;    6725;     224;     920
SING JET KERO SWAP - NEW YORK MERCANTILE EXCHANGE ;2009.04.07;    7063;     900;       0;       0;    5939;    6043;    6839;    6043;     224;    1020
SING JET KERO SWAP - NEW YORK MERCANTILE EXCHANGE ;2009.03.31;    9058;     850;       0;      50;    7784;    8538;    8684;    8588;     374;     470
SING JET KERO SWAP - NEW YORK MERCANTILE EXCHANGE ;2009.03.24;    8008;      50;       0;      50;    7708;    7662;    7808;    7712;     200;     296
SING JET KERO SWAP - NEW YORK MERCANTILE EXCHANGE ;2009.03.17;    7683;      50;       0;      50;    7383;    7337;    7483;    7387;     200;     296
SING JET KERO SWAP - NEW YORK MERCANTILE EXCHANGE ;2009.03.10;    7191;      50;       0;      50;    6891;    6845;    6991;    6895;     200;     296
SING JET KERO SWAP - NEW YORK MERCANTILE EXCHANGE ;2009.03.03;    5673;       0;      50;       0;    5473;    5327;    5473;    5377;     200;     296
SING JET KERO SWAP - NEW YORK MERCANTILE EXCHANGE ;2009.02.24;    6418;       0;      50;       0;    6118;    5972;    6118;    6022;     300;     396
SING JET KERO SWAP - NEW YORK MERCANTILE EXCHANGE ;2009.02.17;    5860;       0;      50;       0;    5760;    5614;    5760;    5664;     100;     196
SING JET KERO SWAP - NEW YORK MERCANTILE EXCHANGE ;2009.02.10;    5253;       0;      50;       0;    5153;    5007;    5153;    5057;     100;     196
SING JET KERO SWAP - NEW YORK MERCANTILE EXCHANGE ;2009.02.03;    4143;       0;      50;       0;    4043;    3897;    4043;    3947;     100;     196
SING JET KERO SWAP - NEW YORK MERCANTILE EXCHANGE ;2009.01.27;    4822;     150;       0;       0;    4672;    4822;    4822;    4822;       0;       0
SING JET KERO SWAP - NEW YORK MERCANTILE EXCHANGE ;2009.01.20;    4522;      50;       0;       0;    4472;    4522;    4522;    4522;       0;       0
SING JET KERO SWAP - NEW YORK MERCANTILE EXCHANGE ;2009.01.13;    4334;     150;       0;       0;    4084;    4234;    4234;    4234;     100;     100
SING JET KERO SWAP - NEW YORK MERCANTILE EXCHANGE ;2009.01.06;    3809;     150;       0;       0;    3609;    3759;    3759;    3759;      50;      50
SING JET KERO SWAP - NEW YORK MERCANTILE EXCHANGE ;2008.12.30;    6877;       0;      50;     150;    6527;    6477;    6677;    6677;     200;     200
SING JET KERO SWAP - NEW YORK MERCANTILE EXCHANGE ;2008.12.22;    6727;       0;      50;     150;    6377;    6327;    6527;    6527;     200;     200
SING JET KERO SWAP - NEW YORK MERCANTILE EXCHANGE ;2008.12.16;    6852;     100;      50;     150;    6402;    6452;    6652;    6652;     200;     200
SING JET KERO SWAP - NEW YORK MERCANTILE EXCHANGE ;2008.12.09;    6702;     100;      50;     150;    6252;    6302;    6502;    6502;     200;     200
SING JET KERO SWAP - NEW YORK MERCANTILE EXCHANGE ;2008.12.02;    6327;     100;      50;     150;    5877;    5927;    6127;    6127;     200;     200
SING JET KERO SWAP - NEW YORK MERCANTILE EXCHANGE ;2008.11.25;    7432;     100;     350;      50;    7062;    6832;    7212;    7232;     220;     200
SING JET KERO SWAP - NEW YORK MERCANTILE EXCHANGE ;2008.11.18;    7507;     300;     300;       0;    7007;    7007;    7307;    7307;     200;     200
SING JET KERO SWAP - NEW YORK MERCANTILE EXCHANGE ;2008.11.11;    7407;     250;     250;       0;    6957;    6957;    7207;    7207;     200;     200
SING JET KERO SWAP - NEW YORK MERCANTILE EXCHANGE ;2008.11.04;    6572;     250;     150;       0;    6122;    6222;    6372;    6372;     200;     200
SING JET KERO SWAP - NEW YORK MERCANTILE EXCHANGE ;2008.10.28;    7886;     150;     100;     100;    7378;    7390;    7628;    7590;     258;     296
SING JET KERO SWAP - NEW YORK MERCANTILE EXCHANGE ;2008.10.21;    7364;     150;     100;     100;    7056;    7118;    7306;    7318;      58;      46
SING JET KERO SWAP - NEW YORK MERCANTILE EXCHANGE ;2008.10.14;    6536;     150;       0;     150;    6028;    6340;    6328;    6490;     208;      46
SING JET KERO SWAP - NEW YORK MERCANTILE EXCHANGE ;2008.10.07;    5139;     150;       0;     100;    4715;    4839;    4965;    4939;     174;     200
SING JET KERO SWAP - NEW YORK MERCANTILE EXCHANGE ;2008.09.30;    5956;     250;     100;     100;    5306;    5506;    5656;    5706;     300;     250
SING JET KERO SWAP - NEW YORK MERCANTILE EXCHANGE ;2008.09.23;    4925;     250;     100;     100;    4350;    4450;    4700;    4650;     225;     275
SING JET KERO SWAP - NEW YORK MERCANTILE EXCHANGE ;2008.09.16;    4700;     250;     100;     100;    4150;    4250;    4500;    4450;     200;     250
SING JET KERO SWAP - NEW YORK MERCANTILE EXCHANGE ;2008.09.09;    4600;     250;     100;       0;    4175;    4250;    4425;    4350;     175;     250
SING JET KERO SWAP - NEW YORK MERCANTILE EXCHANGE ;2008.09.02;    5575;     200;     200;      50;    5175;    5175;    5425;    5425;     150;     150
SING JET KERO SWAP - NEW YORK MERCANTILE EXCHANGE ;2008.08.26;    4975;     200;     150;      50;    4625;    4675;    4875;    4875;     100;     100
SING JET KERO SWAP - NEW YORK MERCANTILE EXCHANGE ;2008.08.19;    4725;     200;     100;      50;    4350;    4525;    4600;    4675;     125;      50
SING JET KERO SWAP - NEW YORK MERCANTILE EXCHANGE ;2008.08.12;    4550;     150;     100;      50;    3775;    3900;    3975;    4050;     575;     500
SING JET KERO SWAP - NEW YORK MERCANTILE EXCHANGE ;2008.08.05;    3450;     150;     150;       0;    3225;    3300;    3375;    3450;      75;       0
SING JET KERO SWAP - NEW YORK MERCANTILE EXCHANGE ;2008.07.29;    4377;     150;     100;      50;    4060;    4227;    4260;    4377;     117;       0
SING JET KERO SWAP - NEW YORK MERCANTILE EXCHANGE ;2008.07.22;    4052;     200;       0;       0;    3735;    4052;    3935;    4052;     117;       0
SING JET KERO SWAP - NEW YORK MERCANTILE EXCHANGE ;2008.07.15;    4352;     200;       0;       0;    4010;    4342;    4210;    4342;     142;      10
SING JET KERO SWAP - NEW YORK MERCANTILE EXCHANGE ;2008.07.08;    3752;     200;       0;       0;    3310;    3642;    3510;    3642;     242;     110
SING JET KERO SWAP - NEW YORK MERCANTILE EXCHANGE ;2008.07.01;    4602;     100;      50;     200;    4260;    4242;    4560;    4492;      42;     110
SING JET KERO SWAP - NEW YORK MERCANTILE EXCHANGE ;2008.06.24;    3760;       0;      50;     200;    3203;    3360;    3403;    3610;     357;     150
SING JET KERO SWAP - NEW YORK MERCANTILE EXCHANGE ;2008.06.17;    3510;       0;      50;     200;    2925;    3110;    3125;    3360;     385;     150
SING JET KERO SWAP - NEW YORK MERCANTILE EXCHANGE ;2008.06.10;    3110;       0;      50;     200;    2525;    2710;    2725;    2960;     385;     150
SING JET KERO SWAP - NEW YORK MERCANTILE EXCHANGE ;2008.06.03;    3110;       0;      50;     200;    2525;    2710;    2725;    2960;     385;     150
SING JET KERO SWAP - NEW YORK MERCANTILE EXCHANGE ;2008.05.27;    3235;       0;      50;     250;    2650;    2635;    2900;    2935;     335;     300
SING JET KERO SWAP - NEW YORK MERCANTILE EXCHANGE ;2008.05.20;    2775;       0;      50;     200;    2375;    2510;    2575;    2760;     200;      15
SING JET KERO SWAP - NEW YORK MERCANTILE EXCHANGE ;2008.05.13;    2725;       0;      50;     200;    2325;    2460;    2525;    2710;     200;      15
SING JET KERO SWAP - NEW YORK MERCANTILE EXCHANGE ;2008.05.06;    2660;       0;       0;     250;    2225;    2310;    2475;    2560;     185;     100
SING JET KERO SWAP - NEW YORK MERCANTILE EXCHANGE ;2008.04.01;    3220;     100;       0;     200;    2835;    2835;    3135;    3035;      85;     185
SING JET KERO SWAP - NEW YORK MERCANTILE EXCHANGE ;2008.02.26;    2550;      50;       0;     200;    2300;    2350;    2550;    2550;       0;       0
SING JET KERO SWAP - NEW YORK MERCANTILE EXCHANGE ;2008.02.19;    2450;      50;       0;     200;    2200;    2250;    2450;    2450;       0;       0
SING JET KERO SWAP - NEW YORK MERCANTILE EXCHANGE ;2008.02.12;    2450;      50;       0;     200;    2200;    2250;    2450;    2450;       0;       0
SING JET KERO SWAP - NEW YORK MERCANTILE EXCHANGE ;2008.02.05;    2450;      50;       0;     200;    2200;    2250;    2450;    2450;       0;       0
SING JET KERO SWAP - NEW YORK MERCANTILE EXCHANGE ;2008.01.29;    3375;       0;       0;     250;    3125;    3075;    3375;    3325;       0;      50
SING JET KERO SWAP - NEW YORK MERCANTILE EXCHANGE ;2008.01.22;    3275;       0;       0;     250;    3025;    2975;    3275;    3225;       0;      50
SING JET KERO SWAP - NEW YORK MERCANTILE EXCHANGE ;2008.01.15;    3275;       0;       0;     250;    3025;    2975;    3275;    3225;       0;      50
SING JET KERO SWAP - NEW YORK MERCANTILE EXCHANGE ;2008.01.08;    3275;       0;       0;     250;    3025;    2975;    3275;    3225;       0;      50
SING JET KERO SWAP - NEW YORK MERCANTILE EXCHANGE ;2007.12.31;    3825;     150;       0;     250;    3425;    3525;    3825;    3775;       0;      50
SING JET KERO SWAP - NEW YORK MERCANTILE EXCHANGE ;2007.12.24;    3825;     150;       0;     250;    3425;    3575;    3825;    3825;       0;       0
SING JET KERO SWAP - NEW YORK MERCANTILE EXCHANGE ;2007.12.18;    3825;       0;       0;     250;    3425;    3575;    3675;    3825;     150;       0
SING JET KERO SWAP - NEW YORK MERCANTILE EXCHANGE ;2007.12.11;    3625;     150;       0;     250;    3225;    3375;    3625;    3625;       0;       0
SING JET KERO SWAP - NEW YORK MERCANTILE EXCHANGE ;2007.12.04;    3650;     150;       0;     250;    3250;    3400;    3650;    3650;       0;       0
SING JET KERO SWAP - NEW YORK MERCANTILE EXCHANGE ;2007.11.27;    3900;       0;       0;     300;    3600;    3600;    3900;    3900;       0;       0
SING JET KERO SWAP - NEW YORK MERCANTILE EXCHANGE ;2007.11.20;    3650;       0;       0;     300;    3350;    3350;    3650;    3650;       0;       0
SING JET KERO SWAP - NEW YORK MERCANTILE EXCHANGE ;2007.11.13;    3600;       0;       0;     300;    3300;    3300;    3600;    3600;       0;       0
SING JET KERO SWAP - NEW YORK MERCANTILE EXCHANGE ;2007.11.06;    3450;       0;       0;     300;    3150;    3150;    3450;    3450;       0;       0
SING JET KERO SWAP - NEW YORK MERCANTILE EXCHANGE ;2007.10.30;    2800;       0;       0;     250;    2500;    2500;    2750;    2750;      50;      50
SING JET KERO SWAP - NEW YORK MERCANTILE EXCHANGE ;2007.07.31;    3290;       0;       0;       0;    3290;    3290;    3290;    3290;       0;       0
SING JET KERO SWAP - NEW YORK MERCANTILE EXCHANGE ;2007.07.24;    3040;      50;       0;      50;    2940;    2990;    3040;    3040;       0;       0
SING JET KERO SWAP - NEW YORK MERCANTILE EXCHANGE ;2007.07.17;    3040;      50;       0;      50;    2940;    2990;    3040;    3040;       0;       0
SING JET KERO SWAP - NEW YORK MERCANTILE EXCHANGE ;2007.07.10;    2940;       0;      50;       0;    2940;    2890;    2940;    2940;       0;       0
SING JET KERO SWAP - NEW YORK MERCANTILE EXCHANGE ;2007.06.26;    3560;       0;     150;       0;    3540;    3260;    3540;    3410;      20;     150
SING JET KERO SWAP - NEW YORK MERCANTILE EXCHANGE ;2007.06.19;    3560;       0;     150;       0;    3540;    3410;    3540;    3560;      20;       0
SING JET KERO SWAP - NEW YORK MERCANTILE EXCHANGE ;2007.06.12;    3510;       0;     150;       0;    3490;    3360;    3490;    3510;      20;       0
SING JET KERO SWAP - NEW YORK MERCANTILE EXCHANGE ;2007.06.05;    3010;       0;     150;       0;    2990;    2860;    2990;    3010;      20;       0
SING JET KERO SWAP - NEW YORK MERCANTILE EXCHANGE ;2011.07.12;    5092;     414;     300;       0;    4678;    4792;    5092;    5092;       0;       0
