COTTON NO. 2 - ICE FUTURES U.S. ;2011.07.12;  227679;   49964;   10427;   60083;  103801;  145908;  213848;  216418;   13832;   11262
COTTON NO. 2 - ICE FUTURES U.S. ;2011.07.12;  227679;   49964;   10427;   60083;  103801;  145908;  213848;  216418;   13832;   11262
COTTON NO. 2 - ICE FUTURES U.S. ;2010.12.28;  361915;   58221;    7573;  108650;  174388;  234788;  341260;  351011;   20655;   10904
COTTON NO. 2 - ICE FUTURES U.S. ;2010.12.21;  366170;   59244;    7475;  110335;  176257;  236142;  345836;  353951;   20333;   12218
COTTON NO. 2 - ICE FUTURES U.S. ;2010.12.14;  365971;   58556;    6872;  108353;  179784;  239519;  346693;  354744;   19278;   11227
COTTON NO. 2 - ICE FUTURES U.S. ;2010.12.07;  350709;   57261;    5404;   98741;  174536;  234708;  330538;  338853;   20171;   11856
COTTON NO. 2 - ICE FUTURES U.S. ;2010.11.30;  333790;   55536;    4783;   90821;  166869;  226846;  313226;  322450;   20564;   11339
COTTON NO. 2 - ICE FUTURES U.S. ;2010.11.23;  327205;   53599;    5359;   86386;  166925;  224013;  306911;  315758;   20294;   11446
COTTON NO. 2 - ICE FUTURES U.S. ;2010.11.16;  331006;   56659;    6197;   82096;  171638;  230622;  310392;  318915;   20614;   12091
COTTON NO. 2 - ICE FUTURES U.S. ;2010.11.09;  459691;   67173;    6873;  144322;  225047;  296383;  436542;  447578;   23149;   12113
COTTON NO. 2 - ICE FUTURES U.S. ;2010.11.02;  449411;   71370;    7087;  134591;  220574;  293060;  426535;  434738;   22875;   14672
COTTON NO. 2 - ICE FUTURES U.S. ;2010.10.26;  442630;   71597;    6655;  131277;  216493;  288712;  419367;  426644;   23262;   15986
COTTON NO. 2 - ICE FUTURES U.S. ;2010.10.19;  408053;   67570;    5112;  118182;  200581;  272555;  386333;  395850;   21719;   12202
COTTON NO. 2 - ICE FUTURES U.S. ;2010.10.12;  410101;   72782;    5718;  119759;  195449;  273729;  387990;  399206;   22111;   10895
COTTON NO. 2 - ICE FUTURES U.S. ;2010.10.05;  391535;   71988;    6057;  106271;  191629;  268496;  369888;  380825;   21647;   10710
COTTON NO. 2 - ICE FUTURES U.S. ;2010.09.28;  398257;   80455;    6081;  100753;  193273;  279800;  374480;  386634;   23777;   11623
COTTON NO. 2 - ICE FUTURES U.S. ;2010.09.21;  381700;   83242;    6432;   92221;  182048;  272519;  357511;  371172;   24189;   10528
COTTON NO. 2 - ICE FUTURES U.S. ;2010.09.14;  357385;   90396;    5987;   79826;  162879;  261329;  333101;  347142;   24284;   10243
COTTON NO. 2 - ICE FUTURES U.S. ;2010.09.07;  344538;   90326;    7725;   76344;  153672;  250537;  320342;  334606;   24196;    9932
COTTON NO. 2 - ICE FUTURES U.S. ;2010.08.31;  318896;   90095;   11569;   67083;  139761;  230630;  296939;  309282;   21957;    9614
COTTON NO. 2 - ICE FUTURES U.S. ;2010.08.24;  302375;   86497;   11756;   62979;  131279;  217627;  280755;  292362;   21620;   10013
COTTON NO. 2 - ICE FUTURES U.S. ;2010.08.17;  296765;   82167;   12410;   64550;  128085;  210726;  274803;  287686;   21962;    9079
COTTON NO. 2 - ICE FUTURES U.S. ;2010.08.10;  267341;   71398;   12230;   54767;  121177;  191675;  247342;  258672;   19999;    8669
COTTON NO. 2 - ICE FUTURES U.S. ;2010.08.03;  250681;   59610;   13461;   50729;  120630;  177298;  230969;  241487;   19712;    9194
COTTON NO. 2 - ICE FUTURES U.S. ;2010.07.27;  229545;   47583;   15488;   45725;  119301;  158075;  212609;  219288;   16936;   10257
COTTON NO. 2 - ICE FUTURES U.S. ;2010.07.20;  218393;   45166;   17730;   47988;  111225;  141848;  204379;  207567;   14014;   10826
COTTON NO. 2 - ICE FUTURES U.S. ;2010.07.13;  213276;   48540;   16848;   43666;  106716;  142987;  198922;  203501;   14354;    9775
COTTON NO. 2 - ICE FUTURES U.S. ;2010.07.06;  213171;   50801;   14898;   40440;  107028;  148788;  198270;  204126;   14902;    9046
COTTON NO. 2 - ICE FUTURES U.S. ;2010.06.29;  219190;   60441;   10827;   41146;  103425;  158884;  205013;  210858;   14177;    8332
COTTON NO. 2 - ICE FUTURES U.S. ;2010.06.22;  219853;   60139;   10856;   39778;  103188;  160107;  203104;  210741;   16749;    9112
COTTON NO. 2 - ICE FUTURES U.S. ;2010.06.15;  225036;   57823;   12055;   40091;  109188;  162037;  207102;  214182;   17934;   10854
COTTON NO. 2 - ICE FUTURES U.S. ;2010.06.08;  255121;   46873;   16706;   65100;  126382;  159708;  238355;  241514;   16767;   13608
COTTON NO. 2 - ICE FUTURES U.S. ;2010.06.01;  264894;   55469;   10790;   66608;  125273;  175047;  247350;  252445;   17543;   12448
COTTON NO. 2 - ICE FUTURES U.S. ;2010.05.25;  270662;   64866;    6661;   65868;  121584;  188009;  252319;  260537;   18343;   10124
COTTON NO. 2 - ICE FUTURES U.S. ;2010.05.18;  262670;   62119;    6433;   64781;  116033;  179783;  242933;  250997;   19736;   11672
COTTON NO. 2 - ICE FUTURES U.S. ;2010.05.11;  253444;   60165;    5890;   62732;  110777;  173529;  233673;  242151;   19771;   11294
COTTON NO. 2 - ICE FUTURES U.S. ;2010.05.04;  263655;   70003;    5759;   63378;  109736;  184353;  243117;  253489;   20538;   10166
COTTON NO. 2 - ICE FUTURES U.S. ;2010.04.27;  272750;   74316;    4948;   62591;  114204;  196026;  251112;  263566;   21638;    9185
COTTON NO. 2 - ICE FUTURES U.S. ;2010.04.20;  260283;   70071;    6056;   58849;  111078;  186703;  239998;  251608;   20285;    8675
COTTON NO. 2 - ICE FUTURES U.S. ;2010.04.13;  282494;   66234;    6638;   73158;  122733;  190672;  262125;  270468;   20369;   12026
COTTON NO. 2 - ICE FUTURES U.S. ;2010.04.06;  296158;   75033;    6537;   68584;  129958;  209391;  273575;  284513;   22583;   11645
COTTON NO. 2 - ICE FUTURES U.S. ;2010.03.30;  276886;   68125;    6775;   64553;  124067;  194954;  256745;  266282;   20141;   10604
COTTON NO. 2 - ICE FUTURES U.S. ;2010.03.23;  284058;   74380;    6130;   66032;  122121;  201428;  262533;  273590;   21525;   10469
COTTON NO. 2 - ICE FUTURES U.S. ;2010.03.16;  275250;   73367;    7084;   63940;  117238;  194273;  254546;  265297;   20704;    9953
COTTON NO. 2 - ICE FUTURES U.S. ;2010.03.09;  273370;   71372;    7499;   62871;  117593;  192820;  251836;  263190;   21534;   10180
COTTON NO. 2 - ICE FUTURES U.S. ;2010.03.02;  263675;   67271;    7086;   58807;  116339;  187766;  242418;  253660;   21256;   10015
COTTON NO. 2 - ICE FUTURES U.S. ;2010.02.23;  239186;   63087;    7586;   49105;  106437;  174251;  218629;  230943;   20557;    8243
COTTON NO. 2 - ICE FUTURES U.S. ;2010.02.16;  227544;   52698;   11276;   42767;  113296;  164833;  208762;  218876;   18783;    8669
COTTON NO. 2 - ICE FUTURES U.S. ;2010.02.09;  216653;   48782;   14998;   39252;  111838;  151105;  199872;  205355;   16781;   11298
COTTON NO. 2 - ICE FUTURES U.S. ;2010.02.02;  237225;   48692;   15275;   53196;  116065;  156482;  217953;  224953;   19272;   12271
COTTON NO. 2 - ICE FUTURES U.S. ;2010.01.26;  235030;   51379;   10760;   53216;  111855;  160687;  216450;  224663;   18580;   10368
COTTON NO. 2 - ICE FUTURES U.S. ;2010.01.19;  239011;   59448;    8807;   50918;  108976;  170022;  219342;  229748;   19669;    9263
COTTON NO. 2 - ICE FUTURES U.S. ;2010.01.12;  247038;   63498;   10769;   50326;  112690;  177647;  226513;  238742;   20525;    8296
COTTON NO. 2 - ICE FUTURES U.S. ;2010.01.05;  251227;   68163;    9924;   49629;  113046;  183594;  230838;  243147;   20389;    8080
COTTON NO. 2 - ICE FUTURES U.S. ;2009.12.29;  251292;   73726;    9167;   45612;  111339;  189063;  230677;  243842;   20614;    7450
COTTON NO. 2 - ICE FUTURES U.S. ;2009.12.22;  247428;   70993;    9462;   45342;  110392;  185042;  226727;  239846;   20700;    7582
COTTON NO. 2 - ICE FUTURES U.S. ;2009.12.15;  246645;   73731;    9563;   46137;  105199;  184175;  225067;  239875;   21578;    6770
COTTON NO. 2 - ICE FUTURES U.S. ;2009.12.08;  236317;   70278;    8515;   43313;  102246;  177924;  215837;  229752;   20481;    6566
COTTON NO. 2 - ICE FUTURES U.S. ;2009.12.01;  232131;   68859;    8349;   41680;  101746;  175585;  212284;  225614;   19846;    6517
COTTON NO. 2 - ICE FUTURES U.S. ;2009.11.24;  231364;   71062;    7481;   39613;   99561;  177118;  210235;  224211;   21129;    7153
COTTON NO. 2 - ICE FUTURES U.S. ;2009.11.17;  217321;   62100;    8078;   35818;   98218;  165701;  196136;  209597;   21185;    7724
COTTON NO. 2 - ICE FUTURES U.S. ;2009.11.09;  269053;   63440;    6804;   59433;  121293;  193585;  244167;  259822;   24886;    9232
COTTON NO. 2 - ICE FUTURES U.S. ;2009.11.03;  267579;   65183;    6209;   59456;  120926;  193160;  245565;  258825;   22014;    8754
COTTON NO. 2 - ICE FUTURES U.S. ;2009.10.27;  259084;   61823;    6575;   60801;  115757;  183360;  238382;  250737;   20702;    8347
COTTON NO. 2 - ICE FUTURES U.S. ;2009.10.20;  249121;   59684;    5285;   61314;  109104;  176164;  230102;  242763;   19019;    6359
COTTON NO. 2 - ICE FUTURES U.S. ;2009.10.13;  225737;   48462;    3337;   53677;  104128;  160430;  206266;  217443;   19471;    8293
COTTON NO. 2 - ICE FUTURES U.S. ;2009.10.06;  206397;   42182;    3152;   46479;  101370;  149516;  190030;  199147;   16366;    7250
COTTON NO. 2 - ICE FUTURES U.S. ;2009.09.29;  206244;   44466;    2966;   46191;   99680;  149145;  190337;  198302;   15907;    7942
COTTON NO. 2 - ICE FUTURES U.S. ;2009.09.22;  205895;   45960;    3497;   47015;   97493;  147721;  190468;  198232;   15427;    7663
COTTON NO. 2 - ICE FUTURES U.S. ;2009.09.15;  187701;   37665;    5156;   42030;   92996;  133186;  172691;  180372;   15009;    7328
COTTON NO. 2 - ICE FUTURES U.S. ;2009.09.08;  178346;   32236;    8931;   40225;   92821;  119524;  165282;  168679;   13064;    9667
COTTON NO. 2 - ICE FUTURES U.S. ;2009.09.01;  174819;   30006;   11248;   39478;   93020;  114098;  162505;  164824;   12315;    9996
COTTON NO. 2 - ICE FUTURES U.S. ;2009.08.25;  176769;   32192;    8188;   38921;   92508;  120189;  163621;  167298;   13147;    9471
COTTON NO. 2 - ICE FUTURES U.S. ;2009.08.18;  181434;   34836;    4764;   40224;   92370;  128306;  167430;  173294;   14004;    8140
COTTON NO. 2 - ICE FUTURES U.S. ;2009.08.11;  186606;   36472;    4112;   41508;   92968;  133950;  170949;  179570;   15658;    7036
COTTON NO. 2 - ICE FUTURES U.S. ;2009.08.04;  182502;   35406;    4921;   40880;   92334;  130603;  168620;  176405;   13882;    6097
COTTON NO. 2 - ICE FUTURES U.S. ;2009.07.28;  177290;   34828;    5621;   39138;   90255;  126099;  164221;  170859;   13069;    6431
COTTON NO. 2 - ICE FUTURES U.S. ;2009.07.21;  186550;   38301;    4197;   40701;   91892;  135530;  170895;  180428;   15656;    6122
COTTON NO. 2 - ICE FUTURES U.S. ;2009.07.14;  178007;   35932;    4573;   38147;   88449;  129256;  162528;  171977;   15479;    6030
COTTON NO. 2 - ICE FUTURES U.S. ;2009.07.07;  163208;   29109;    5761;   35800;   85421;  113623;  150329;  155184;   12879;    8023
COTTON NO. 2 - ICE FUTURES U.S. ;2009.06.30;  155415;   27699;   10096;   33656;   82438;  102429;  143793;  146181;   11623;    9234
COTTON NO. 2 - ICE FUTURES U.S. ;2009.06.23;  151430;   25367;    8530;   32361;   82489;  100942;  140216;  141833;   11214;    9597
COTTON NO. 2 - ICE FUTURES U.S. ;2009.06.16;  161620;   29855;    6047;   32990;   84067;  112110;  146911;  151147;   14709;   10473
COTTON NO. 2 - ICE FUTURES U.S. ;2009.06.09;  197308;   33521;    5274;   52917;   94219;  129141;  180658;  187332;   16650;    9975
COTTON NO. 2 - ICE FUTURES U.S. ;2009.06.02;  201736;   37909;    4205;   54291;   91729;  135587;  183929;  194083;   17806;    7653
COTTON NO. 2 - ICE FUTURES U.S. ;2009.05.26;  197183;   37907;    4760;   52086;   91897;  132019;  181890;  188865;   15292;    8318
COTTON NO. 2 - ICE FUTURES U.S. ;2009.05.19;  199071;   40287;    5087;   51635;   91066;  134644;  182988;  191366;   16083;    7706
COTTON NO. 2 - ICE FUTURES U.S. ;2009.05.12;  199798;   39723;    5863;   50604;   91409;  135310;  181736;  191777;   18062;    8021
COTTON NO. 2 - ICE FUTURES U.S. ;2009.05.05;  184510;   35003;    6500;   45258;   87148;  126134;  167409;  177892;   17102;    6619
COTTON NO. 2 - ICE FUTURES U.S. ;2009.04.28;  168526;   27516;   10980;   39835;   85907;  110733;  153257;  161548;   15268;    6978
COTTON NO. 2 - ICE FUTURES U.S. ;2009.04.21;  166387;   28345;   13424;   40032;   81170;  104363;  149547;  157818;   16840;    8569
COTTON NO. 2 - ICE FUTURES U.S. ;2009.04.14;  172678;   28089;   14573;   39682;   87742;  108044;  155513;  162299;   17165;   10378
COTTON NO. 2 - ICE FUTURES U.S. ;2009.04.07;  192724;   27393;   17692;   47527;  101020;  115864;  175940;  181084;   16784;   11640
COTTON NO. 2 - ICE FUTURES U.S. ;2009.03.31;  190884;   26521;   22982;   47050;  100182;  107644;  173753;  177676;   17131;   13208
COTTON NO. 2 - ICE FUTURES U.S. ;2009.03.24;  186137;   26603;   28601;   45241;   97911;   98415;  169756;  172257;   16382;   13880
COTTON NO. 2 - ICE FUTURES U.S. ;2009.03.17;  175903;   25265;   30972;   43643;   92332;   86603;  161240;  161219;   14663;   14684
COTTON NO. 2 - ICE FUTURES U.S. ;2009.03.10;  168460;   24686;   30854;   42214;   86903;   79191;  153803;  152259;   14657;   16202
COTTON NO. 2 - ICE FUTURES U.S. ;2009.03.03;  161757;   24480;   30291;   40657;   83583;   74579;  148720;  145527;   13037;   16230
COTTON NO. 2 - ICE FUTURES U.S. ;2009.02.24;  157426;   23075;   26573;   39545;   81708;   75814;  144328;  141931;   13097;   15495
COTTON NO. 2 - ICE FUTURES U.S. ;2009.02.17;  158471;   23867;   23533;   39874;   80901;   81005;  144643;  144412;   13828;   14058
COTTON NO. 2 - ICE FUTURES U.S. ;2009.02.10;  162477;   25663;   15168;   39762;   81115;   94246;  146539;  149176;   15937;   13301
COTTON NO. 2 - ICE FUTURES U.S. ;2009.02.03;  196776;   26944;   12744;   63651;   90151;  110640;  180746;  187035;   16030;    9741
COTTON NO. 2 - ICE FUTURES U.S. ;2009.01.27;  205769;   27270;   10918;   68753;   93570;  114280;  189593;  193951;   16176;   11818
COTTON NO. 2 - ICE FUTURES U.S. ;2009.01.20;  202131;   25089;   13480;   65767;   97073;  111482;  187928;  190729;   14203;   11403
COTTON NO. 2 - ICE FUTURES U.S. ;2009.01.13;  203702;   26994;   13397;   67737;   95660;  111236;  190391;  192371;   13311;   11331
COTTON NO. 2 - ICE FUTURES U.S. ;2009.01.06;  205131;   27893;   12936;   67253;   92073;  112278;  187219;  192467;   17912;   12664
COTTON NO. 2 - ICE FUTURES U.S. ;2008.12.30;  196756;   27240;   15650;   63681;   91263;  106214;  182184;  185544;   14573;   11212
COTTON NO. 2 - ICE FUTURES U.S. ;2008.12.22;  194933;   26202;   15697;   62617;   92362;  104936;  181180;  183250;   13753;   11683
COTTON NO. 2 - ICE FUTURES U.S. ;2008.12.16;  201242;   26269;   16173;   65185;   94180;  104379;  185633;  185737;   15609;   15506
COTTON NO. 2 - ICE FUTURES U.S. ;2008.12.09;  201747;   25558;   17771;   64535;   95703;  103279;  185796;  185585;   15952;   16163
COTTON NO. 2 - ICE FUTURES U.S. ;2008.12.02;  198256;   26476;   18444;   62952;   96105;  104392;  185533;  185788;   12723;   12467
COTTON NO. 2 - ICE FUTURES U.S. ;2008.11.25;  195132;   26101;   22651;   59308;   96828;  101098;  182236;  183057;   12896;   12075
COTTON NO. 2 - ICE FUTURES U.S. ;2008.11.18;  201926;   28194;   21901;   58580;  102515;  108366;  189289;  188847;   12637;   13078
COTTON NO. 2 - ICE FUTURES U.S. ;2008.11.11;  212420;   27428;   23669;   57076;  113271;  117893;  197775;  198639;   14645;   13781
COTTON NO. 2 - ICE FUTURES U.S. ;2008.11.04;  304540;   27418;   23674;  117125;  146796;  152001;  291339;  292800;   13201;   11740
COTTON NO. 2 - ICE FUTURES U.S. ;2008.10.28;  310220;   26869;   25493;  121094;  149916;  151892;  297879;  298480;   12342;   11741
COTTON NO. 2 - ICE FUTURES U.S. ;2008.10.21;  314919;   29000;   25938;  125089;  147547;  151326;  301636;  302353;   13283;   12566
COTTON NO. 2 - ICE FUTURES U.S. ;2008.10.14;  329306;   27384;   26564;  135410;  152873;  155327;  315667;  317301;   13639;   12005
COTTON NO. 2 - ICE FUTURES U.S. ;2008.10.07;  343138;   29806;   32350;  138449;  161425;  159732;  329679;  330530;   13459;   12608
COTTON NO. 2 - ICE FUTURES U.S. ;2008.09.30;  359892;   30912;   33177;  143353;  170682;  169164;  344947;  345695;   14945;   14197
COTTON NO. 2 - ICE FUTURES U.S. ;2008.09.23;  365481;   33360;   35180;  140209;  175425;  174609;  348994;  349998;   16488;   15484
COTTON NO. 2 - ICE FUTURES U.S. ;2008.09.16;  373141;   34008;   36756;  139980;  180005;  178519;  353994;  355255;   19147;   17886
COTTON NO. 2 - ICE FUTURES U.S. ;2008.09.09;  376193;   32752;   39050;  139496;  184769;  182331;  357018;  360877;   19174;   15315
COTTON NO. 2 - ICE FUTURES U.S. ;2008.09.02;  371698;   37492;   34815;  133026;  180264;  188249;  350782;  356091;   20916;   15607
COTTON NO. 2 - ICE FUTURES U.S. ;2008.08.26;  370625;   36898;   36953;  129820;  183448;  188415;  350167;  355188;   20458;   15437
COTTON NO. 2 - ICE FUTURES U.S. ;2008.08.19;  366511;   37035;   36991;  128718;  181931;  182565;  347684;  348274;   18827;   18237
COTTON NO. 2 - ICE FUTURES U.S. ;2008.08.12;  377303;   39173;   37156;  132091;  187012;  192284;  358276;  361531;   19027;   15772
COTTON NO. 2 - ICE FUTURES U.S. ;2008.08.05;  380635;   39298;   36903;  132165;  188425;  195123;  359888;  364191;   20747;   16444
COTTON NO. 2 - ICE FUTURES U.S. ;2008.07.29;  379775;   44733;   31361;  125969;  186898;  207266;  357600;  364596;   22175;   15178
COTTON NO. 2 - ICE FUTURES U.S. ;2008.07.22;  378315;   43845;   32578;  125174;  186379;  205026;  355399;  362778;   22916;   15537
COTTON NO. 2 - ICE FUTURES U.S. ;2008.07.15;  383575;   50883;   28376;  124937;  184978;  214906;  360799;  368220;   22776;   15356
COTTON NO. 2 - ICE FUTURES U.S. ;2008.07.08;  381097;   52338;   24145;  125869;  180777;  215141;  358984;  365155;   22113;   15942
COTTON NO. 2 - ICE FUTURES U.S. ;2008.07.01;  377877;   53876;   16699;  122086;  180320;  224981;  356283;  363766;   21595;   14111
COTTON NO. 2 - ICE FUTURES U.S. ;2008.06.24;  378675;   53270;   14831;  122319;  179975;  228816;  355565;  365967;   23111;   12708
COTTON NO. 2 - ICE FUTURES U.S. ;2008.06.17;  385674;   56092;   16858;  122113;  183955;  232388;  362160;  371360;   23514;   14314
COTTON NO. 2 - ICE FUTURES U.S. ;2008.06.10;  470129;   56116;   30436;  159498;  231624;  262377;  447237;  452311;   22892;   17819
COTTON NO. 2 - ICE FUTURES U.S. ;2008.06.03;  486379;   55127;   27494;  163793;  246816;  279042;  465736;  470329;   20643;   16050
COTTON NO. 2 - ICE FUTURES U.S. ;2008.05.27;  478182;   53001;   26853;  162136;  239805;  274573;  454942;  463562;   23240;   14620
COTTON NO. 2 - ICE FUTURES U.S. ;2008.05.20;  469680;   56704;   17713;  161176;  225271;  276520;  443152;  455409;   26528;   14271
COTTON NO. 2 - ICE FUTURES U.S. ;2008.05.13;  461132;   54959;   15669;  159411;  222239;  272360;  436609;  447439;   24523;   13692
COTTON NO. 2 - ICE FUTURES U.S. ;2008.05.06;  462725;   57238;   12827;  161313;  218988;  274926;  437539;  449065;   25186;   13660
COTTON NO. 2 - ICE FUTURES U.S. ;2008.04.29;  461674;   57785;   12582;  159024;  219837;  277768;  436645;  449374;   25029;   12300
COTTON NO. 2 - ICE FUTURES U.S. ;2008.04.22;  469070;   63227;    9915;  158347;  220702;  289475;  442276;  457736;   26794;   11334
COTTON NO. 2 - ICE FUTURES U.S. ;2008.04.15;  472583;   63626;   11486;  157537;  220790;  290935;  441953;  459957;   30631;   12626
COTTON NO. 2 - ICE FUTURES U.S. ;2008.04.08;  528299;   61359;   12441;  206717;  230826;  296952;  498902;  516109;   29398;   12190
COTTON NO. 2 - ICE FUTURES U.S. ;2008.04.01;  537160;   60682;   12200;  212982;  232558;  296950;  506222;  522132;   30938;   15028
COTTON NO. 2 - ICE FUTURES U.S. ;2008.03.25;  541058;   66094;    4972;  212042;  232686;  310521;  510822;  527535;   30236;   13524
COTTON NO. 2 - ICE FUTURES U.S. ;2008.03.18;  565626;   71546;    6853;  218569;  231864;  314209;  521979;  539631;   43647;   25995
COTTON NO. 2 - ICE FUTURES U.S. ;2008.03.11;  572626;   81173;    9666;  218733;  231111;  321277;  531016;  549675;   41610;   22951
COTTON NO. 2 - ICE FUTURES U.S. ;2008.03.04;  546650;   95547;    9607;  186426;  221670;  330319;  503643;  526352;   43007;   20298
COTTON NO. 2 - ICE FUTURES U.S. ;2008.02.26;  453167;  106396;    6530;  119068;  192772;  315871;  418237;  441469;   34930;   11698
COTTON NO. 2 - ICE FUTURES U.S. ;2008.02.19;  381346;   85332;   10171;   91099;  165896;  264753;  342326;  366023;   39020;   15323
COTTON NO. 2 - ICE FUTURES U.S. ;2008.02.12;  379535;   82583;   11646;   89765;  171926;  261671;  344274;  363082;   35262;   16453
COTTON NO. 2 - ICE FUTURES U.S. ;2008.02.05;  451174;   85444;   11338;  136256;  193779;  287648;  415480;  435243;   35695;   15932
COTTON NO. 2 - ICE FUTURES U.S. ;2008.01.29;  438556;   82449;    9624;  138439;  182054;  273869;  402942;  421932;   35614;   16624
COTTON NO. 2 - ICE FUTURES U.S. ;2008.01.22;  460276;   97328;   10532;  143222;  181654;  289450;  422203;  443203;   38073;   17072
COTTON NO. 2 - ICE FUTURES U.S. ;2008.01.15;  465029;   97937;   10867;  142343;  178222;  289208;  418502;  442418;   46527;   22611
COTTON NO. 2 - ICE FUTURES U.S. ;2008.01.08;  410450;   91797;   10729;  117492;  166866;  269418;  376155;  397639;   34295;   12812
COTTON NO. 2 - ICE FUTURES U.S. ;2007.12.31;  369243;   74195;   14820;  104195;  159664;  237754;  338054;  356769;   31189;   12474
COTTON NO. 2 - ICE FUTURES U.S. ;2007.12.24;  351237;   68859;   21279;   96619;  155188;  218789;  320666;  336686;   30572;   14551
COTTON NO. 2 - ICE FUTURES U.S. ;2007.12.18;  346930;   66064;   29650;   95975;  154874;  201166;  316913;  326791;   30018;   20140
COTTON NO. 2 - ICE FUTURES U.S. ;2007.12.11;  335977;   65219;   30919;   90132;  153635;  198679;  308985;  319730;   26992;   16247
COTTON NO. 2 - ICE FUTURES U.S. ;2007.12.04;  327130;   62085;   27878;   86089;  154845;  197767;  303019;  311734;   24111;   15396
COTTON NO. 2 - ICE FUTURES U.S. ;2007.11.27;  308475;   65739;   21838;   74451;  144698;  197790;  284888;  294078;   23586;   14396
COTTON NO. 2 - ICE FUTURES U.S. ;2007.11.20;  317264;   68332;   18363;   74270;  143387;  205622;  285990;  298255;   31274;   19009
COTTON NO. 2 - ICE FUTURES U.S. ;2007.11.13;  336737;   78450;   12051;   82901;  143852;  226288;  305203;  321241;   31534;   15497
COTTON NO. 2 - ICE FUTURES U.S. ;2007.11.06;  422388;   85367;   10461;  141094;  163520;  257580;  389981;  409135;   32406;   13253
COTTON NO. 2 - ICE FUTURES U.S. ;2007.10.30;  421505;   79074;    9246;  147508;  164504;  251483;  391086;  408237;   30419;   13268
COTTON NO. 2 - ICE FUTURES U.S. ;2007.10.23;  424585;   80777;    8517;  148644;  162359;  253140;  391781;  410301;   32804;   14284
COTTON NO. 2 - ICE FUTURES U.S. ;2007.10.16;  411640;   77871;    9145;  145246;  158987;  243916;  382104;  398307;   29536;   13333
COTTON NO. 2 - ICE FUTURES U.S. ;2007.10.09;  408486;   76562;    8916;  143551;  160244;  243777;  380357;  396244;   28129;   12242
COTTON NO. 2 - ICE FUTURES U.S. ;2007.10.02;  411964;   77661;    8492;  142419;  164683;  249415;  384762;  400325;   27202;   11639
COTTON NO. 2 - ICE FUTURES U.S. ;2007.09.25;  414218;   75481;    9045;  141758;  166713;  251464;  383951;  402267;   30267;   11951
COTTON NO. 2 - ICE FUTURES U.S. ;2007.09.18;  393309;   66841;   11359;  134180;  164364;  236265;  365385;  381804;   27924;   11505
COTTON NO. 2 - ICE FUTURES U.S. ;2007.09.11;  370640;   58396;   16076;  126110;  162790;  218248;  347296;  360434;   23344;   10206
COTTON NO. 2 - ICE FUTURES U.S. ;2007.09.04;  365542;   54906;   16177;  120866;  166938;  217888;  342710;  354930;   22831;   10611
COTTON NO. 2 - ICE FUTURES U.S. ;2011.07.12;  227679;   49964;   10427;   60083;  103801;  145908;  213848;  216418;   13832;   11262
COTTON NO. 2 - ICE FUTURES U.S. ;2011.07.05;  217807;   48364;    9937;   54688;  101577;  141558;  204629;  206183;   13178;   11624
COTTON NO. 2 - ICE FUTURES U.S. ;2011.06.28;  216904;   46639;    9078;   55837;  100209;  140730;  202685;  205645;   14219;   11259
COTTON NO. 2 - ICE FUTURES U.S. ;2011.06.21;  225452;   46112;    7906;   56208;  107158;  149748;  209478;  213861;   15974;   11591
COTTON NO. 2 - ICE FUTURES U.S. ;2011.06.14;  230594;   50490;    7456;   56942;  104797;  152995;  212229;  217393;   18365;   13201
COTTON NO. 2 - ICE FUTURES U.S. ;2011.06.07;  307585;   45377;    6872;  100472;  139642;  185533;  285491;  292877;   22094;   14708
COTTON NO. 2 - ICE FUTURES U.S. ;2011.05.31;  304256;   49475;    6313;  101271;  133229;  182201;  283975;  289785;   20281;   14471
COTTON NO. 2 - ICE FUTURES U.S. ;2011.05.24;  302469;   47398;    8514;  100045;  135510;  179820;  282953;  288378;   19516;   14091
COTTON NO. 2 - ICE FUTURES U.S. ;2011.05.17;  297674;   47279;    8187;  100526;  130796;  175159;  278601;  283872;   19074;   13802
COTTON NO. 2 - ICE FUTURES U.S. ;2011.05.10;  296907;   45728;    8664;  100420;  130680;  172943;  276827;  282027;   20079;   14880
COTTON NO. 2 - ICE FUTURES U.S. ;2011.05.03;  290380;   44537;    9032;   95706;  129253;  170649;  269496;  275388;   20884;   14992
COTTON NO. 2 - ICE FUTURES U.S. ;2011.04.26;  292030;   43075;   10083;   95158;  133132;  173090;  271365;  278330;   20666;   13700
COTTON NO. 2 - ICE FUTURES U.S. ;2011.04.19;  306621;   43499;    9827;   97312;  144914;  185356;  285724;  292495;   20896;   14126
COTTON NO. 2 - ICE FUTURES U.S. ;2011.04.12;  330688;   47035;    9060;   96705;  163600;  209940;  307339;  315704;   23349;   14984
COTTON NO. 2 - ICE FUTURES U.S. ;2011.04.05;  345655;   46399;    9092;  114263;  162496;  205993;  323157;  329348;   22498;   16308
COTTON NO. 2 - ICE FUTURES U.S. ;2011.03.29;  326310;   44557;    8046;  109486;  150641;  193358;  304684;  310889;   21626;   15421
COTTON NO. 2 - ICE FUTURES U.S. ;2011.03.22;  319395;   46110;    6881;  104313;  145565;  192925;  295988;  304119;   23408;   15277
COTTON NO. 2 - ICE FUTURES U.S. ;2011.03.15;  319294;   48556;    8299;  103786;  144331;  191451;  296674;  303536;   22620;   15758
COTTON NO. 2 - ICE FUTURES U.S. ;2011.03.08;  316831;   51204;    9887;  102208;  141317;  192388;  294729;  304483;   22101;   12347
COTTON NO. 2 - ICE FUTURES U.S. ;2011.03.01;  318126;   52363;    8615;  104214;  140118;  193618;  296695;  306446;   21431;   11680
COTTON NO. 2 - ICE FUTURES U.S. ;2011.02.22;  316164;   55905;    8010;   99719;  136071;  196499;  291695;  304228;   24469;   11936
COTTON NO. 2 - ICE FUTURES U.S. ;2011.02.15;  326812;   58149;    7329;   98201;  146182;  207595;  302531;  313125;   24281;   13688
COTTON NO. 2 - ICE FUTURES U.S. ;2011.02.08;  405104;   62898;    8282;  134538;  183715;  250387;  381151;  393207;   23954;   11897
COTTON NO. 2 - ICE FUTURES U.S. ;2011.02.01;  397224;   66720;    7487;  128227;  176949;  247762;  371896;  383477;   25328;   13747
COTTON NO. 2 - ICE FUTURES U.S. ;2011.01.25;  383620;   61315;    7264;  123557;  174884;  240159;  359756;  370980;   23864;   12640
COTTON NO. 2 - ICE FUTURES U.S. ;2011.01.18;  357270;   58050;    7338;  108288;  168247;  229356;  334585;  344982;   22686;   12288
COTTON NO. 2 - ICE FUTURES U.S. ;2011.01.11;  363614;   58031;    7300;  110325;  172848;  233533;  341204;  351158;   22410;   12456
COTTON NO. 2 - ICE FUTURES U.S. ;2011.01.04;  367637;   57764;    6875;  108894;  179599;  240137;  346257;  355906;   21380;   11731
COTTON NO. 2 - ICE FUTURES U.S. ;2011.07.12;  227679;   49964;   10427;   60083;  103801;  145908;  213848;  216418;   13832;   11262
COTTON NO. 2 - ICE FUTURES U.S. ;2010.12.28;  361915;   58221;    7573;  108650;  174388;  234788;  341260;  351011;   20655;   10904
COTTON NO. 2 - ICE FUTURES U.S. ;2010.12.21;  366170;   59244;    7475;  110335;  176257;  236142;  345836;  353951;   20333;   12218
COTTON NO. 2 - ICE FUTURES U.S. ;2010.12.14;  365971;   58556;    6872;  108353;  179784;  239519;  346693;  354744;   19278;   11227
COTTON NO. 2 - ICE FUTURES U.S. ;2010.12.07;  350709;   57261;    5404;   98741;  174536;  234708;  330538;  338853;   20171;   11856
COTTON NO. 2 - ICE FUTURES U.S. ;2010.11.30;  333790;   55536;    4783;   90821;  166869;  226846;  313226;  322450;   20564;   11339
COTTON NO. 2 - ICE FUTURES U.S. ;2010.11.23;  327205;   53599;    5359;   86386;  166925;  224013;  306911;  315758;   20294;   11446
COTTON NO. 2 - ICE FUTURES U.S. ;2010.11.16;  331006;   56659;    6197;   82096;  171638;  230622;  310392;  318915;   20614;   12091
COTTON NO. 2 - ICE FUTURES U.S. ;2010.11.09;  459691;   67173;    6873;  144322;  225047;  296383;  436542;  447578;   23149;   12113
COTTON NO. 2 - ICE FUTURES U.S. ;2010.11.02;  449411;   71370;    7087;  134591;  220574;  293060;  426535;  434738;   22875;   14672
COTTON NO. 2 - ICE FUTURES U.S. ;2010.10.26;  442630;   71597;    6655;  131277;  216493;  288712;  419367;  426644;   23262;   15986
COTTON NO. 2 - ICE FUTURES U.S. ;2010.10.19;  408053;   67570;    5112;  118182;  200581;  272555;  386333;  395850;   21719;   12202
COTTON NO. 2 - ICE FUTURES U.S. ;2010.10.12;  410101;   72782;    5718;  119759;  195449;  273729;  387990;  399206;   22111;   10895
COTTON NO. 2 - ICE FUTURES U.S. ;2010.10.05;  391535;   71988;    6057;  106271;  191629;  268496;  369888;  380825;   21647;   10710
COTTON NO. 2 - ICE FUTURES U.S. ;2010.09.28;  398257;   80455;    6081;  100753;  193273;  279800;  374480;  386634;   23777;   11623
COTTON NO. 2 - ICE FUTURES U.S. ;2010.09.21;  381700;   83242;    6432;   92221;  182048;  272519;  357511;  371172;   24189;   10528
COTTON NO. 2 - ICE FUTURES U.S. ;2010.09.14;  357385;   90396;    5987;   79826;  162879;  261329;  333101;  347142;   24284;   10243
COTTON NO. 2 - ICE FUTURES U.S. ;2010.09.07;  344538;   90326;    7725;   76344;  153672;  250537;  320342;  334606;   24196;    9932
COTTON NO. 2 - ICE FUTURES U.S. ;2010.08.31;  318896;   90095;   11569;   67083;  139761;  230630;  296939;  309282;   21957;    9614
COTTON NO. 2 - ICE FUTURES U.S. ;2010.08.24;  302375;   86497;   11756;   62979;  131279;  217627;  280755;  292362;   21620;   10013
COTTON NO. 2 - ICE FUTURES U.S. ;2010.08.17;  296765;   82167;   12410;   64550;  128085;  210726;  274803;  287686;   21962;    9079
COTTON NO. 2 - ICE FUTURES U.S. ;2010.08.10;  267341;   71398;   12230;   54767;  121177;  191675;  247342;  258672;   19999;    8669
COTTON NO. 2 - ICE FUTURES U.S. ;2010.08.03;  250681;   59610;   13461;   50729;  120630;  177298;  230969;  241487;   19712;    9194
COTTON NO. 2 - ICE FUTURES U.S. ;2010.07.27;  229545;   47583;   15488;   45725;  119301;  158075;  212609;  219288;   16936;   10257
COTTON NO. 2 - ICE FUTURES U.S. ;2010.07.20;  218393;   45166;   17730;   47988;  111225;  141848;  204379;  207567;   14014;   10826
COTTON NO. 2 - ICE FUTURES U.S. ;2010.07.13;  213276;   48540;   16848;   43666;  106716;  142987;  198922;  203501;   14354;    9775
COTTON NO. 2 - ICE FUTURES U.S. ;2010.07.06;  213171;   50801;   14898;   40440;  107028;  148788;  198270;  204126;   14902;    9046
COTTON NO. 2 - ICE FUTURES U.S. ;2010.06.29;  219190;   60441;   10827;   41146;  103425;  158884;  205013;  210858;   14177;    8332
COTTON NO. 2 - ICE FUTURES U.S. ;2010.06.22;  219853;   60139;   10856;   39778;  103188;  160107;  203104;  210741;   16749;    9112
COTTON NO. 2 - ICE FUTURES U.S. ;2010.06.15;  225036;   57823;   12055;   40091;  109188;  162037;  207102;  214182;   17934;   10854
COTTON NO. 2 - ICE FUTURES U.S. ;2010.06.08;  255121;   46873;   16706;   65100;  126382;  159708;  238355;  241514;   16767;   13608
COTTON NO. 2 - ICE FUTURES U.S. ;2010.06.01;  264894;   55469;   10790;   66608;  125273;  175047;  247350;  252445;   17543;   12448
COTTON NO. 2 - ICE FUTURES U.S. ;2010.05.25;  270662;   64866;    6661;   65868;  121584;  188009;  252319;  260537;   18343;   10124
COTTON NO. 2 - ICE FUTURES U.S. ;2010.05.18;  262670;   62119;    6433;   64781;  116033;  179783;  242933;  250997;   19736;   11672
COTTON NO. 2 - ICE FUTURES U.S. ;2010.05.11;  253444;   60165;    5890;   62732;  110777;  173529;  233673;  242151;   19771;   11294
COTTON NO. 2 - ICE FUTURES U.S. ;2010.05.04;  263655;   70003;    5759;   63378;  109736;  184353;  243117;  253489;   20538;   10166
COTTON NO. 2 - ICE FUTURES U.S. ;2010.04.27;  272750;   74316;    4948;   62591;  114204;  196026;  251112;  263566;   21638;    9185
COTTON NO. 2 - ICE FUTURES U.S. ;2010.04.20;  260283;   70071;    6056;   58849;  111078;  186703;  239998;  251608;   20285;    8675
COTTON NO. 2 - ICE FUTURES U.S. ;2010.04.13;  282494;   66234;    6638;   73158;  122733;  190672;  262125;  270468;   20369;   12026
COTTON NO. 2 - ICE FUTURES U.S. ;2010.04.06;  296158;   75033;    6537;   68584;  129958;  209391;  273575;  284513;   22583;   11645
COTTON NO. 2 - ICE FUTURES U.S. ;2010.03.30;  276886;   68125;    6775;   64553;  124067;  194954;  256745;  266282;   20141;   10604
COTTON NO. 2 - ICE FUTURES U.S. ;2010.03.23;  284058;   74380;    6130;   66032;  122121;  201428;  262533;  273590;   21525;   10469
COTTON NO. 2 - ICE FUTURES U.S. ;2010.03.16;  275250;   73367;    7084;   63940;  117238;  194273;  254546;  265297;   20704;    9953
COTTON NO. 2 - ICE FUTURES U.S. ;2010.03.09;  273370;   71372;    7499;   62871;  117593;  192820;  251836;  263190;   21534;   10180
COTTON NO. 2 - ICE FUTURES U.S. ;2010.03.02;  263675;   67271;    7086;   58807;  116339;  187766;  242418;  253660;   21256;   10015
COTTON NO. 2 - ICE FUTURES U.S. ;2010.02.23;  239186;   63087;    7586;   49105;  106437;  174251;  218629;  230943;   20557;    8243
COTTON NO. 2 - ICE FUTURES U.S. ;2010.02.16;  227544;   52698;   11276;   42767;  113296;  164833;  208762;  218876;   18783;    8669
COTTON NO. 2 - ICE FUTURES U.S. ;2010.02.09;  216653;   48782;   14998;   39252;  111838;  151105;  199872;  205355;   16781;   11298
COTTON NO. 2 - ICE FUTURES U.S. ;2010.02.02;  237225;   48692;   15275;   53196;  116065;  156482;  217953;  224953;   19272;   12271
COTTON NO. 2 - ICE FUTURES U.S. ;2010.01.26;  235030;   51379;   10760;   53216;  111855;  160687;  216450;  224663;   18580;   10368
COTTON NO. 2 - ICE FUTURES U.S. ;2010.01.19;  239011;   59448;    8807;   50918;  108976;  170022;  219342;  229748;   19669;    9263
COTTON NO. 2 - ICE FUTURES U.S. ;2010.01.12;  247038;   63498;   10769;   50326;  112690;  177647;  226513;  238742;   20525;    8296
COTTON NO. 2 - ICE FUTURES U.S. ;2010.01.05;  251227;   68163;    9924;   49629;  113046;  183594;  230838;  243147;   20389;    8080
COTTON NO. 2 - ICE FUTURES U.S. ;2009.12.29;  251292;   73726;    9167;   45612;  111339;  189063;  230677;  243842;   20614;    7450
COTTON NO. 2 - ICE FUTURES U.S. ;2009.12.22;  247428;   70993;    9462;   45342;  110392;  185042;  226727;  239846;   20700;    7582
COTTON NO. 2 - ICE FUTURES U.S. ;2009.12.15;  246645;   73731;    9563;   46137;  105199;  184175;  225067;  239875;   21578;    6770
COTTON NO. 2 - ICE FUTURES U.S. ;2009.12.08;  236317;   70278;    8515;   43313;  102246;  177924;  215837;  229752;   20481;    6566
COTTON NO. 2 - ICE FUTURES U.S. ;2009.12.01;  232131;   68859;    8349;   41680;  101746;  175585;  212284;  225614;   19846;    6517
COTTON NO. 2 - ICE FUTURES U.S. ;2009.11.24;  231364;   71062;    7481;   39613;   99561;  177118;  210235;  224211;   21129;    7153
COTTON NO. 2 - ICE FUTURES U.S. ;2009.11.17;  217321;   62100;    8078;   35818;   98218;  165701;  196136;  209597;   21185;    7724
COTTON NO. 2 - ICE FUTURES U.S. ;2009.11.09;  269053;   63440;    6804;   59433;  121293;  193585;  244167;  259822;   24886;    9232
COTTON NO. 2 - ICE FUTURES U.S. ;2009.11.03;  267579;   65183;    6209;   59456;  120926;  193160;  245565;  258825;   22014;    8754
COTTON NO. 2 - ICE FUTURES U.S. ;2009.10.27;  259084;   61823;    6575;   60801;  115757;  183360;  238382;  250737;   20702;    8347
COTTON NO. 2 - ICE FUTURES U.S. ;2009.10.20;  249121;   59684;    5285;   61314;  109104;  176164;  230102;  242763;   19019;    6359
COTTON NO. 2 - ICE FUTURES U.S. ;2009.10.13;  225737;   48462;    3337;   53677;  104128;  160430;  206266;  217443;   19471;    8293
COTTON NO. 2 - ICE FUTURES U.S. ;2009.10.06;  206397;   42182;    3152;   46479;  101370;  149516;  190030;  199147;   16366;    7250
COTTON NO. 2 - ICE FUTURES U.S. ;2009.09.29;  206244;   44466;    2966;   46191;   99680;  149145;  190337;  198302;   15907;    7942
COTTON NO. 2 - ICE FUTURES U.S. ;2009.09.22;  205895;   45960;    3497;   47015;   97493;  147721;  190468;  198232;   15427;    7663
COTTON NO. 2 - ICE FUTURES U.S. ;2009.09.15;  187701;   37665;    5156;   42030;   92996;  133186;  172691;  180372;   15009;    7328
COTTON NO. 2 - ICE FUTURES U.S. ;2009.09.08;  178346;   32236;    8931;   40225;   92821;  119524;  165282;  168679;   13064;    9667
COTTON NO. 2 - ICE FUTURES U.S. ;2009.09.01;  174819;   30006;   11248;   39478;   93020;  114098;  162505;  164824;   12315;    9996
COTTON NO. 2 - ICE FUTURES U.S. ;2009.08.25;  176769;   32192;    8188;   38921;   92508;  120189;  163621;  167298;   13147;    9471
COTTON NO. 2 - ICE FUTURES U.S. ;2009.08.18;  181434;   34836;    4764;   40224;   92370;  128306;  167430;  173294;   14004;    8140
COTTON NO. 2 - ICE FUTURES U.S. ;2009.08.11;  186606;   36472;    4112;   41508;   92968;  133950;  170949;  179570;   15658;    7036
COTTON NO. 2 - ICE FUTURES U.S. ;2009.08.04;  182502;   35406;    4921;   40880;   92334;  130603;  168620;  176405;   13882;    6097
COTTON NO. 2 - ICE FUTURES U.S. ;2009.07.28;  177290;   34828;    5621;   39138;   90255;  126099;  164221;  170859;   13069;    6431
COTTON NO. 2 - ICE FUTURES U.S. ;2009.07.21;  186550;   38301;    4197;   40701;   91892;  135530;  170895;  180428;   15656;    6122
COTTON NO. 2 - ICE FUTURES U.S. ;2009.07.14;  178007;   35932;    4573;   38147;   88449;  129256;  162528;  171977;   15479;    6030
COTTON NO. 2 - ICE FUTURES U.S. ;2009.07.07;  163208;   29109;    5761;   35800;   85421;  113623;  150329;  155184;   12879;    8023
COTTON NO. 2 - ICE FUTURES U.S. ;2009.06.30;  155415;   27699;   10096;   33656;   82438;  102429;  143793;  146181;   11623;    9234
COTTON NO. 2 - ICE FUTURES U.S. ;2009.06.23;  151430;   25367;    8530;   32361;   82489;  100942;  140216;  141833;   11214;    9597
COTTON NO. 2 - ICE FUTURES U.S. ;2009.06.16;  161620;   29855;    6047;   32990;   84067;  112110;  146911;  151147;   14709;   10473
COTTON NO. 2 - ICE FUTURES U.S. ;2009.06.09;  197308;   33521;    5274;   52917;   94219;  129141;  180658;  187332;   16650;    9975
COTTON NO. 2 - ICE FUTURES U.S. ;2009.06.02;  201736;   37909;    4205;   54291;   91729;  135587;  183929;  194083;   17806;    7653
COTTON NO. 2 - ICE FUTURES U.S. ;2009.05.26;  197183;   37907;    4760;   52086;   91897;  132019;  181890;  188865;   15292;    8318
COTTON NO. 2 - ICE FUTURES U.S. ;2009.05.19;  199071;   40287;    5087;   51635;   91066;  134644;  182988;  191366;   16083;    7706
COTTON NO. 2 - ICE FUTURES U.S. ;2009.05.12;  199798;   39723;    5863;   50604;   91409;  135310;  181736;  191777;   18062;    8021
COTTON NO. 2 - ICE FUTURES U.S. ;2009.05.05;  184510;   35003;    6500;   45258;   87148;  126134;  167409;  177892;   17102;    6619
COTTON NO. 2 - ICE FUTURES U.S. ;2009.04.28;  168526;   27516;   10980;   39835;   85907;  110733;  153257;  161548;   15268;    6978
COTTON NO. 2 - ICE FUTURES U.S. ;2009.04.21;  166387;   28345;   13424;   40032;   81170;  104363;  149547;  157818;   16840;    8569
COTTON NO. 2 - ICE FUTURES U.S. ;2009.04.14;  172678;   28089;   14573;   39682;   87742;  108044;  155513;  162299;   17165;   10378
COTTON NO. 2 - ICE FUTURES U.S. ;2009.04.07;  192724;   27393;   17692;   47527;  101020;  115864;  175940;  181084;   16784;   11640
COTTON NO. 2 - ICE FUTURES U.S. ;2009.03.31;  190884;   26521;   22982;   47050;  100182;  107644;  173753;  177676;   17131;   13208
COTTON NO. 2 - ICE FUTURES U.S. ;2009.03.24;  186137;   26603;   28601;   45241;   97911;   98415;  169756;  172257;   16382;   13880
COTTON NO. 2 - ICE FUTURES U.S. ;2009.03.17;  175903;   25265;   30972;   43643;   92332;   86603;  161240;  161219;   14663;   14684
COTTON NO. 2 - ICE FUTURES U.S. ;2009.03.10;  168460;   24686;   30854;   42214;   86903;   79191;  153803;  152259;   14657;   16202
COTTON NO. 2 - ICE FUTURES U.S. ;2009.03.03;  161757;   24480;   30291;   40657;   83583;   74579;  148720;  145527;   13037;   16230
COTTON NO. 2 - ICE FUTURES U.S. ;2009.02.24;  157426;   23075;   26573;   39545;   81708;   75814;  144328;  141931;   13097;   15495
COTTON NO. 2 - ICE FUTURES U.S. ;2009.02.17;  158471;   23867;   23533;   39874;   80901;   81005;  144643;  144412;   13828;   14058
COTTON NO. 2 - ICE FUTURES U.S. ;2009.02.10;  162477;   25663;   15168;   39762;   81115;   94246;  146539;  149176;   15937;   13301
COTTON NO. 2 - ICE FUTURES U.S. ;2009.02.03;  196776;   26944;   12744;   63651;   90151;  110640;  180746;  187035;   16030;    9741
COTTON NO. 2 - ICE FUTURES U.S. ;2009.01.27;  205769;   27270;   10918;   68753;   93570;  114280;  189593;  193951;   16176;   11818
COTTON NO. 2 - ICE FUTURES U.S. ;2009.01.20;  202131;   25089;   13480;   65767;   97073;  111482;  187928;  190729;   14203;   11403
COTTON NO. 2 - ICE FUTURES U.S. ;2009.01.13;  203702;   26994;   13397;   67737;   95660;  111236;  190391;  192371;   13311;   11331
COTTON NO. 2 - ICE FUTURES U.S. ;2009.01.06;  205131;   27893;   12936;   67253;   92073;  112278;  187219;  192467;   17912;   12664
COTTON NO. 2 - ICE FUTURES U.S. ;2008.12.30;  196756;   27240;   15650;   63681;   91263;  106214;  182184;  185544;   14573;   11212
COTTON NO. 2 - ICE FUTURES U.S. ;2008.12.22;  194933;   26202;   15697;   62617;   92362;  104936;  181180;  183250;   13753;   11683
COTTON NO. 2 - ICE FUTURES U.S. ;2008.12.16;  201242;   26269;   16173;   65185;   94180;  104379;  185633;  185737;   15609;   15506
COTTON NO. 2 - ICE FUTURES U.S. ;2008.12.09;  201747;   25558;   17771;   64535;   95703;  103279;  185796;  185585;   15952;   16163
COTTON NO. 2 - ICE FUTURES U.S. ;2008.12.02;  198256;   26476;   18444;   62952;   96105;  104392;  185533;  185788;   12723;   12467
COTTON NO. 2 - ICE FUTURES U.S. ;2008.11.25;  195132;   26101;   22651;   59308;   96828;  101098;  182236;  183057;   12896;   12075
COTTON NO. 2 - ICE FUTURES U.S. ;2008.11.18;  201926;   28194;   21901;   58580;  102515;  108366;  189289;  188847;   12637;   13078
COTTON NO. 2 - ICE FUTURES U.S. ;2008.11.11;  212420;   27428;   23669;   57076;  113271;  117893;  197775;  198639;   14645;   13781
COTTON NO. 2 - ICE FUTURES U.S. ;2008.11.04;  304540;   27418;   23674;  117125;  146796;  152001;  291339;  292800;   13201;   11740
COTTON NO. 2 - ICE FUTURES U.S. ;2008.10.28;  310220;   26869;   25493;  121094;  149916;  151892;  297879;  298480;   12342;   11741
COTTON NO. 2 - ICE FUTURES U.S. ;2008.10.21;  314919;   29000;   25938;  125089;  147547;  151326;  301636;  302353;   13283;   12566
COTTON NO. 2 - ICE FUTURES U.S. ;2008.10.14;  329306;   27384;   26564;  135410;  152873;  155327;  315667;  317301;   13639;   12005
COTTON NO. 2 - ICE FUTURES U.S. ;2008.10.07;  343138;   29806;   32350;  138449;  161425;  159732;  329679;  330530;   13459;   12608
COTTON NO. 2 - ICE FUTURES U.S. ;2008.09.30;  359892;   30912;   33177;  143353;  170682;  169164;  344947;  345695;   14945;   14197
COTTON NO. 2 - ICE FUTURES U.S. ;2008.09.23;  365481;   33360;   35180;  140209;  175425;  174609;  348994;  349998;   16488;   15484
COTTON NO. 2 - ICE FUTURES U.S. ;2008.09.16;  373141;   34008;   36756;  139980;  180005;  178519;  353994;  355255;   19147;   17886
COTTON NO. 2 - ICE FUTURES U.S. ;2008.09.09;  376193;   32752;   39050;  139496;  184769;  182331;  357018;  360877;   19174;   15315
COTTON NO. 2 - ICE FUTURES U.S. ;2008.09.02;  371698;   37492;   34815;  133026;  180264;  188249;  350782;  356091;   20916;   15607
COTTON NO. 2 - ICE FUTURES U.S. ;2008.08.26;  370625;   36898;   36953;  129820;  183448;  188415;  350167;  355188;   20458;   15437
COTTON NO. 2 - ICE FUTURES U.S. ;2008.08.19;  366511;   37035;   36991;  128718;  181931;  182565;  347684;  348274;   18827;   18237
COTTON NO. 2 - ICE FUTURES U.S. ;2008.08.12;  377303;   39173;   37156;  132091;  187012;  192284;  358276;  361531;   19027;   15772
COTTON NO. 2 - ICE FUTURES U.S. ;2008.08.05;  380635;   39298;   36903;  132165;  188425;  195123;  359888;  364191;   20747;   16444
COTTON NO. 2 - ICE FUTURES U.S. ;2008.07.29;  379775;   44733;   31361;  125969;  186898;  207266;  357600;  364596;   22175;   15178
COTTON NO. 2 - ICE FUTURES U.S. ;2008.07.22;  378315;   43845;   32578;  125174;  186379;  205026;  355399;  362778;   22916;   15537
COTTON NO. 2 - ICE FUTURES U.S. ;2008.07.15;  383575;   50883;   28376;  124937;  184978;  214906;  360799;  368220;   22776;   15356
COTTON NO. 2 - ICE FUTURES U.S. ;2008.07.08;  381097;   52338;   24145;  125869;  180777;  215141;  358984;  365155;   22113;   15942
COTTON NO. 2 - ICE FUTURES U.S. ;2008.07.01;  377877;   53876;   16699;  122086;  180320;  224981;  356283;  363766;   21595;   14111
COTTON NO. 2 - ICE FUTURES U.S. ;2008.06.24;  378675;   53270;   14831;  122319;  179975;  228816;  355565;  365967;   23111;   12708
COTTON NO. 2 - ICE FUTURES U.S. ;2008.06.17;  385674;   56092;   16858;  122113;  183955;  232388;  362160;  371360;   23514;   14314
COTTON NO. 2 - ICE FUTURES U.S. ;2008.06.10;  470129;   56116;   30436;  159498;  231624;  262377;  447237;  452311;   22892;   17819
COTTON NO. 2 - ICE FUTURES U.S. ;2008.06.03;  486379;   55127;   27494;  163793;  246816;  279042;  465736;  470329;   20643;   16050
COTTON NO. 2 - ICE FUTURES U.S. ;2008.05.27;  478182;   53001;   26853;  162136;  239805;  274573;  454942;  463562;   23240;   14620
COTTON NO. 2 - ICE FUTURES U.S. ;2008.05.20;  469680;   56704;   17713;  161176;  225271;  276520;  443152;  455409;   26528;   14271
COTTON NO. 2 - ICE FUTURES U.S. ;2008.05.13;  461132;   54959;   15669;  159411;  222239;  272360;  436609;  447439;   24523;   13692
COTTON NO. 2 - ICE FUTURES U.S. ;2008.05.06;  462725;   57238;   12827;  161313;  218988;  274926;  437539;  449065;   25186;   13660
COTTON NO. 2 - ICE FUTURES U.S. ;2008.04.29;  461674;   57785;   12582;  159024;  219837;  277768;  436645;  449374;   25029;   12300
COTTON NO. 2 - ICE FUTURES U.S. ;2008.04.22;  469070;   63227;    9915;  158347;  220702;  289475;  442276;  457736;   26794;   11334
COTTON NO. 2 - ICE FUTURES U.S. ;2008.04.15;  472583;   63626;   11486;  157537;  220790;  290935;  441953;  459957;   30631;   12626
COTTON NO. 2 - ICE FUTURES U.S. ;2008.04.08;  528299;   61359;   12441;  206717;  230826;  296952;  498902;  516109;   29398;   12190
COTTON NO. 2 - ICE FUTURES U.S. ;2008.04.01;  537160;   60682;   12200;  212982;  232558;  296950;  506222;  522132;   30938;   15028
COTTON NO. 2 - ICE FUTURES U.S. ;2008.03.25;  541058;   66094;    4972;  212042;  232686;  310521;  510822;  527535;   30236;   13524
COTTON NO. 2 - ICE FUTURES U.S. ;2008.03.18;  565626;   71546;    6853;  218569;  231864;  314209;  521979;  539631;   43647;   25995
COTTON NO. 2 - ICE FUTURES U.S. ;2008.03.11;  572626;   81173;    9666;  218733;  231111;  321277;  531016;  549675;   41610;   22951
COTTON NO. 2 - ICE FUTURES U.S. ;2008.03.04;  546650;   95547;    9607;  186426;  221670;  330319;  503643;  526352;   43007;   20298
COTTON NO. 2 - ICE FUTURES U.S. ;2008.02.26;  453167;  106396;    6530;  119068;  192772;  315871;  418237;  441469;   34930;   11698
COTTON NO. 2 - ICE FUTURES U.S. ;2008.02.19;  381346;   85332;   10171;   91099;  165896;  264753;  342326;  366023;   39020;   15323
COTTON NO. 2 - ICE FUTURES U.S. ;2008.02.12;  379535;   82583;   11646;   89765;  171926;  261671;  344274;  363082;   35262;   16453
COTTON NO. 2 - ICE FUTURES U.S. ;2008.02.05;  451174;   85444;   11338;  136256;  193779;  287648;  415480;  435243;   35695;   15932
COTTON NO. 2 - ICE FUTURES U.S. ;2008.01.29;  438556;   82449;    9624;  138439;  182054;  273869;  402942;  421932;   35614;   16624
COTTON NO. 2 - ICE FUTURES U.S. ;2008.01.22;  460276;   97328;   10532;  143222;  181654;  289450;  422203;  443203;   38073;   17072
COTTON NO. 2 - ICE FUTURES U.S. ;2008.01.15;  465029;   97937;   10867;  142343;  178222;  289208;  418502;  442418;   46527;   22611
COTTON NO. 2 - ICE FUTURES U.S. ;2008.01.08;  410450;   91797;   10729;  117492;  166866;  269418;  376155;  397639;   34295;   12812
COTTON NO. 2 - ICE FUTURES U.S. ;2007.12.31;  369243;   74195;   14820;  104195;  159664;  237754;  338054;  356769;   31189;   12474
COTTON NO. 2 - ICE FUTURES U.S. ;2007.12.24;  351237;   68859;   21279;   96619;  155188;  218789;  320666;  336686;   30572;   14551
COTTON NO. 2 - ICE FUTURES U.S. ;2007.12.18;  346930;   66064;   29650;   95975;  154874;  201166;  316913;  326791;   30018;   20140
COTTON NO. 2 - ICE FUTURES U.S. ;2007.12.11;  335977;   65219;   30919;   90132;  153635;  198679;  308985;  319730;   26992;   16247
COTTON NO. 2 - ICE FUTURES U.S. ;2007.12.04;  327130;   62085;   27878;   86089;  154845;  197767;  303019;  311734;   24111;   15396
COTTON NO. 2 - ICE FUTURES U.S. ;2007.11.27;  308475;   65739;   21838;   74451;  144698;  197790;  284888;  294078;   23586;   14396
COTTON NO. 2 - ICE FUTURES U.S. ;2007.11.20;  317264;   68332;   18363;   74270;  143387;  205622;  285990;  298255;   31274;   19009
COTTON NO. 2 - ICE FUTURES U.S. ;2007.11.13;  336737;   78450;   12051;   82901;  143852;  226288;  305203;  321241;   31534;   15497
COTTON NO. 2 - ICE FUTURES U.S. ;2007.11.06;  422388;   85367;   10461;  141094;  163520;  257580;  389981;  409135;   32406;   13253
COTTON NO. 2 - ICE FUTURES U.S. ;2007.10.30;  421505;   79074;    9246;  147508;  164504;  251483;  391086;  408237;   30419;   13268
COTTON NO. 2 - ICE FUTURES U.S. ;2007.10.23;  424585;   80777;    8517;  148644;  162359;  253140;  391781;  410301;   32804;   14284
COTTON NO. 2 - ICE FUTURES U.S. ;2007.10.16;  411640;   77871;    9145;  145246;  158987;  243916;  382104;  398307;   29536;   13333
COTTON NO. 2 - ICE FUTURES U.S. ;2007.10.09;  408486;   76562;    8916;  143551;  160244;  243777;  380357;  396244;   28129;   12242
COTTON NO. 2 - ICE FUTURES U.S. ;2007.10.02;  411964;   77661;    8492;  142419;  164683;  249415;  384762;  400325;   27202;   11639
COTTON NO. 2 - ICE FUTURES U.S. ;2007.09.25;  414218;   75481;    9045;  141758;  166713;  251464;  383951;  402267;   30267;   11951
COTTON NO. 2 - ICE FUTURES U.S. ;2007.09.18;  393309;   66841;   11359;  134180;  164364;  236265;  365385;  381804;   27924;   11505
COTTON NO. 2 - ICE FUTURES U.S. ;2007.09.11;  370640;   58396;   16076;  126110;  162790;  218248;  347296;  360434;   23344;   10206
COTTON NO. 2 - ICE FUTURES U.S. ;2007.09.04;  365542;   54906;   16177;  120866;  166938;  217888;  342710;  354930;   22831;   10611
COTTON NO. 2 - ICE FUTURES U.S. ;2011.07.12;  227679;   49964;   10427;   60083;  103801;  145908;  213848;  216418;   13832;   11262
COTTON NO. 2 - ICE FUTURES U.S. ;2011.07.05;  217807;   48364;    9937;   54688;  101577;  141558;  204629;  206183;   13178;   11624
COTTON NO. 2 - ICE FUTURES U.S. ;2011.06.28;  216904;   46639;    9078;   55837;  100209;  140730;  202685;  205645;   14219;   11259
COTTON NO. 2 - ICE FUTURES U.S. ;2011.06.21;  225452;   46112;    7906;   56208;  107158;  149748;  209478;  213861;   15974;   11591
COTTON NO. 2 - ICE FUTURES U.S. ;2011.06.14;  230594;   50490;    7456;   56942;  104797;  152995;  212229;  217393;   18365;   13201
COTTON NO. 2 - ICE FUTURES U.S. ;2011.06.07;  307585;   45377;    6872;  100472;  139642;  185533;  285491;  292877;   22094;   14708
COTTON NO. 2 - ICE FUTURES U.S. ;2011.05.31;  304256;   49475;    6313;  101271;  133229;  182201;  283975;  289785;   20281;   14471
COTTON NO. 2 - ICE FUTURES U.S. ;2011.05.24;  302469;   47398;    8514;  100045;  135510;  179820;  282953;  288378;   19516;   14091
COTTON NO. 2 - ICE FUTURES U.S. ;2011.05.17;  297674;   47279;    8187;  100526;  130796;  175159;  278601;  283872;   19074;   13802
COTTON NO. 2 - ICE FUTURES U.S. ;2011.05.10;  296907;   45728;    8664;  100420;  130680;  172943;  276827;  282027;   20079;   14880
COTTON NO. 2 - ICE FUTURES U.S. ;2011.05.03;  290380;   44537;    9032;   95706;  129253;  170649;  269496;  275388;   20884;   14992
COTTON NO. 2 - ICE FUTURES U.S. ;2011.04.26;  292030;   43075;   10083;   95158;  133132;  173090;  271365;  278330;   20666;   13700
COTTON NO. 2 - ICE FUTURES U.S. ;2011.04.19;  306621;   43499;    9827;   97312;  144914;  185356;  285724;  292495;   20896;   14126
COTTON NO. 2 - ICE FUTURES U.S. ;2011.04.12;  330688;   47035;    9060;   96705;  163600;  209940;  307339;  315704;   23349;   14984
COTTON NO. 2 - ICE FUTURES U.S. ;2011.04.05;  345655;   46399;    9092;  114263;  162496;  205993;  323157;  329348;   22498;   16308
COTTON NO. 2 - ICE FUTURES U.S. ;2011.03.29;  326310;   44557;    8046;  109486;  150641;  193358;  304684;  310889;   21626;   15421
COTTON NO. 2 - ICE FUTURES U.S. ;2011.03.22;  319395;   46110;    6881;  104313;  145565;  192925;  295988;  304119;   23408;   15277
COTTON NO. 2 - ICE FUTURES U.S. ;2011.03.15;  319294;   48556;    8299;  103786;  144331;  191451;  296674;  303536;   22620;   15758
COTTON NO. 2 - ICE FUTURES U.S. ;2011.03.08;  316831;   51204;    9887;  102208;  141317;  192388;  294729;  304483;   22101;   12347
COTTON NO. 2 - ICE FUTURES U.S. ;2011.03.01;  318126;   52363;    8615;  104214;  140118;  193618;  296695;  306446;   21431;   11680
COTTON NO. 2 - ICE FUTURES U.S. ;2011.02.22;  316164;   55905;    8010;   99719;  136071;  196499;  291695;  304228;   24469;   11936
COTTON NO. 2 - ICE FUTURES U.S. ;2011.02.15;  326812;   58149;    7329;   98201;  146182;  207595;  302531;  313125;   24281;   13688
COTTON NO. 2 - ICE FUTURES U.S. ;2011.02.08;  405104;   62898;    8282;  134538;  183715;  250387;  381151;  393207;   23954;   11897
COTTON NO. 2 - ICE FUTURES U.S. ;2011.02.01;  397224;   66720;    7487;  128227;  176949;  247762;  371896;  383477;   25328;   13747
COTTON NO. 2 - ICE FUTURES U.S. ;2011.01.25;  383620;   61315;    7264;  123557;  174884;  240159;  359756;  370980;   23864;   12640
COTTON NO. 2 - ICE FUTURES U.S. ;2011.01.18;  357270;   58050;    7338;  108288;  168247;  229356;  334585;  344982;   22686;   12288
COTTON NO. 2 - ICE FUTURES U.S. ;2011.01.11;  363614;   58031;    7300;  110325;  172848;  233533;  341204;  351158;   22410;   12456
COTTON NO. 2 - ICE FUTURES U.S. ;2011.01.04;  367637;   57764;    6875;  108894;  179599;  240137;  346257;  355906;   21380;   11731
COTTON NO. 2 - ICE FUTURES U.S. ;2011.07.12;  227679;   49964;   10427;   60083;  103801;  145908;  213848;  216418;   13832;   11262
COTTON NO. 2 - ICE FUTURES U.S. ;2011.07.05;  217807;   48364;    9937;   54688;  101577;  141558;  204629;  206183;   13178;   11624
COTTON NO. 2 - ICE FUTURES U.S. ;2011.06.28;  216904;   46639;    9078;   55837;  100209;  140730;  202685;  205645;   14219;   11259
COTTON NO. 2 - ICE FUTURES U.S. ;2011.06.21;  225452;   46112;    7906;   56208;  107158;  149748;  209478;  213861;   15974;   11591
COTTON NO. 2 - ICE FUTURES U.S. ;2011.06.14;  230594;   50490;    7456;   56942;  104797;  152995;  212229;  217393;   18365;   13201
COTTON NO. 2 - ICE FUTURES U.S. ;2011.06.07;  307585;   45377;    6872;  100472;  139642;  185533;  285491;  292877;   22094;   14708
COTTON NO. 2 - ICE FUTURES U.S. ;2011.05.31;  304256;   49475;    6313;  101271;  133229;  182201;  283975;  289785;   20281;   14471
COTTON NO. 2 - ICE FUTURES U.S. ;2011.05.24;  302469;   47398;    8514;  100045;  135510;  179820;  282953;  288378;   19516;   14091
COTTON NO. 2 - ICE FUTURES U.S. ;2011.05.17;  297674;   47279;    8187;  100526;  130796;  175159;  278601;  283872;   19074;   13802
COTTON NO. 2 - ICE FUTURES U.S. ;2011.05.10;  296907;   45728;    8664;  100420;  130680;  172943;  276827;  282027;   20079;   14880
COTTON NO. 2 - ICE FUTURES U.S. ;2011.05.03;  290380;   44537;    9032;   95706;  129253;  170649;  269496;  275388;   20884;   14992
COTTON NO. 2 - ICE FUTURES U.S. ;2011.04.26;  292030;   43075;   10083;   95158;  133132;  173090;  271365;  278330;   20666;   13700
COTTON NO. 2 - ICE FUTURES U.S. ;2011.04.19;  306621;   43499;    9827;   97312;  144914;  185356;  285724;  292495;   20896;   14126
COTTON NO. 2 - ICE FUTURES U.S. ;2011.04.12;  330688;   47035;    9060;   96705;  163600;  209940;  307339;  315704;   23349;   14984
COTTON NO. 2 - ICE FUTURES U.S. ;2011.04.05;  345655;   46399;    9092;  114263;  162496;  205993;  323157;  329348;   22498;   16308
COTTON NO. 2 - ICE FUTURES U.S. ;2011.03.29;  326310;   44557;    8046;  109486;  150641;  193358;  304684;  310889;   21626;   15421
COTTON NO. 2 - ICE FUTURES U.S. ;2011.03.22;  319395;   46110;    6881;  104313;  145565;  192925;  295988;  304119;   23408;   15277
COTTON NO. 2 - ICE FUTURES U.S. ;2011.03.15;  319294;   48556;    8299;  103786;  144331;  191451;  296674;  303536;   22620;   15758
COTTON NO. 2 - ICE FUTURES U.S. ;2011.03.08;  316831;   51204;    9887;  102208;  141317;  192388;  294729;  304483;   22101;   12347
COTTON NO. 2 - ICE FUTURES U.S. ;2011.03.01;  318126;   52363;    8615;  104214;  140118;  193618;  296695;  306446;   21431;   11680
COTTON NO. 2 - ICE FUTURES U.S. ;2011.02.22;  316164;   55905;    8010;   99719;  136071;  196499;  291695;  304228;   24469;   11936
COTTON NO. 2 - ICE FUTURES U.S. ;2011.02.15;  326812;   58149;    7329;   98201;  146182;  207595;  302531;  313125;   24281;   13688
COTTON NO. 2 - ICE FUTURES U.S. ;2011.02.08;  405104;   62898;    8282;  134538;  183715;  250387;  381151;  393207;   23954;   11897
COTTON NO. 2 - ICE FUTURES U.S. ;2011.02.01;  397224;   66720;    7487;  128227;  176949;  247762;  371896;  383477;   25328;   13747
COTTON NO. 2 - ICE FUTURES U.S. ;2011.01.25;  383620;   61315;    7264;  123557;  174884;  240159;  359756;  370980;   23864;   12640
COTTON NO. 2 - ICE FUTURES U.S. ;2011.01.18;  357270;   58050;    7338;  108288;  168247;  229356;  334585;  344982;   22686;   12288
COTTON NO. 2 - ICE FUTURES U.S. ;2011.01.11;  363614;   58031;    7300;  110325;  172848;  233533;  341204;  351158;   22410;   12456
COTTON NO. 2 - ICE FUTURES U.S. ;2011.01.04;  367637;   57764;    6875;  108894;  179599;  240137;  346257;  355906;   21380;   11731
COTTON NO. 2 - ICE FUTURES U.S. ;2010.12.28;  361915;   58221;    7573;  108650;  174388;  234788;  341260;  351011;   20655;   10904
COTTON NO. 2 - ICE FUTURES U.S. ;2010.12.21;  366170;   59244;    7475;  110335;  176257;  236142;  345836;  353951;   20333;   12218
COTTON NO. 2 - ICE FUTURES U.S. ;2010.12.14;  365971;   58556;    6872;  108353;  179784;  239519;  346693;  354744;   19278;   11227
COTTON NO. 2 - ICE FUTURES U.S. ;2010.12.07;  350709;   57261;    5404;   98741;  174536;  234708;  330538;  338853;   20171;   11856
COTTON NO. 2 - ICE FUTURES U.S. ;2010.11.30;  333790;   55536;    4783;   90821;  166869;  226846;  313226;  322450;   20564;   11339
COTTON NO. 2 - ICE FUTURES U.S. ;2010.11.23;  327205;   53599;    5359;   86386;  166925;  224013;  306911;  315758;   20294;   11446
COTTON NO. 2 - ICE FUTURES U.S. ;2010.11.16;  331006;   56659;    6197;   82096;  171638;  230622;  310392;  318915;   20614;   12091
COTTON NO. 2 - ICE FUTURES U.S. ;2010.11.09;  459691;   67173;    6873;  144322;  225047;  296383;  436542;  447578;   23149;   12113
COTTON NO. 2 - ICE FUTURES U.S. ;2010.11.02;  449411;   71370;    7087;  134591;  220574;  293060;  426535;  434738;   22875;   14672
COTTON NO. 2 - ICE FUTURES U.S. ;2010.10.26;  442630;   71597;    6655;  131277;  216493;  288712;  419367;  426644;   23262;   15986
COTTON NO. 2 - ICE FUTURES U.S. ;2010.10.19;  408053;   67570;    5112;  118182;  200581;  272555;  386333;  395850;   21719;   12202
COTTON NO. 2 - ICE FUTURES U.S. ;2010.10.12;  410101;   72782;    5718;  119759;  195449;  273729;  387990;  399206;   22111;   10895
COTTON NO. 2 - ICE FUTURES U.S. ;2010.10.05;  391535;   71988;    6057;  106271;  191629;  268496;  369888;  380825;   21647;   10710
COTTON NO. 2 - ICE FUTURES U.S. ;2010.09.28;  398257;   80455;    6081;  100753;  193273;  279800;  374480;  386634;   23777;   11623
COTTON NO. 2 - ICE FUTURES U.S. ;2010.09.21;  381700;   83242;    6432;   92221;  182048;  272519;  357511;  371172;   24189;   10528
COTTON NO. 2 - ICE FUTURES U.S. ;2010.09.14;  357385;   90396;    5987;   79826;  162879;  261329;  333101;  347142;   24284;   10243
COTTON NO. 2 - ICE FUTURES U.S. ;2010.09.07;  344538;   90326;    7725;   76344;  153672;  250537;  320342;  334606;   24196;    9932
COTTON NO. 2 - ICE FUTURES U.S. ;2010.08.31;  318896;   90095;   11569;   67083;  139761;  230630;  296939;  309282;   21957;    9614
COTTON NO. 2 - ICE FUTURES U.S. ;2010.08.24;  302375;   86497;   11756;   62979;  131279;  217627;  280755;  292362;   21620;   10013
COTTON NO. 2 - ICE FUTURES U.S. ;2010.08.17;  296765;   82167;   12410;   64550;  128085;  210726;  274803;  287686;   21962;    9079
COTTON NO. 2 - ICE FUTURES U.S. ;2010.08.10;  267341;   71398;   12230;   54767;  121177;  191675;  247342;  258672;   19999;    8669
COTTON NO. 2 - ICE FUTURES U.S. ;2010.08.03;  250681;   59610;   13461;   50729;  120630;  177298;  230969;  241487;   19712;    9194
COTTON NO. 2 - ICE FUTURES U.S. ;2010.07.27;  229545;   47583;   15488;   45725;  119301;  158075;  212609;  219288;   16936;   10257
COTTON NO. 2 - ICE FUTURES U.S. ;2010.07.20;  218393;   45166;   17730;   47988;  111225;  141848;  204379;  207567;   14014;   10826
COTTON NO. 2 - ICE FUTURES U.S. ;2010.07.13;  213276;   48540;   16848;   43666;  106716;  142987;  198922;  203501;   14354;    9775
COTTON NO. 2 - ICE FUTURES U.S. ;2010.07.06;  213171;   50801;   14898;   40440;  107028;  148788;  198270;  204126;   14902;    9046
COTTON NO. 2 - ICE FUTURES U.S. ;2010.06.29;  219190;   60441;   10827;   41146;  103425;  158884;  205013;  210858;   14177;    8332
COTTON NO. 2 - ICE FUTURES U.S. ;2010.06.22;  219853;   60139;   10856;   39778;  103188;  160107;  203104;  210741;   16749;    9112
COTTON NO. 2 - ICE FUTURES U.S. ;2010.06.15;  225036;   57823;   12055;   40091;  109188;  162037;  207102;  214182;   17934;   10854
COTTON NO. 2 - ICE FUTURES U.S. ;2010.06.08;  255121;   46873;   16706;   65100;  126382;  159708;  238355;  241514;   16767;   13608
COTTON NO. 2 - ICE FUTURES U.S. ;2010.06.01;  264894;   55469;   10790;   66608;  125273;  175047;  247350;  252445;   17543;   12448
COTTON NO. 2 - ICE FUTURES U.S. ;2010.05.25;  270662;   64866;    6661;   65868;  121584;  188009;  252319;  260537;   18343;   10124
COTTON NO. 2 - ICE FUTURES U.S. ;2010.05.18;  262670;   62119;    6433;   64781;  116033;  179783;  242933;  250997;   19736;   11672
COTTON NO. 2 - ICE FUTURES U.S. ;2010.05.11;  253444;   60165;    5890;   62732;  110777;  173529;  233673;  242151;   19771;   11294
COTTON NO. 2 - ICE FUTURES U.S. ;2010.05.04;  263655;   70003;    5759;   63378;  109736;  184353;  243117;  253489;   20538;   10166
COTTON NO. 2 - ICE FUTURES U.S. ;2010.04.27;  272750;   74316;    4948;   62591;  114204;  196026;  251112;  263566;   21638;    9185
COTTON NO. 2 - ICE FUTURES U.S. ;2010.04.20;  260283;   70071;    6056;   58849;  111078;  186703;  239998;  251608;   20285;    8675
COTTON NO. 2 - ICE FUTURES U.S. ;2010.04.13;  282494;   66234;    6638;   73158;  122733;  190672;  262125;  270468;   20369;   12026
COTTON NO. 2 - ICE FUTURES U.S. ;2010.04.06;  296158;   75033;    6537;   68584;  129958;  209391;  273575;  284513;   22583;   11645
COTTON NO. 2 - ICE FUTURES U.S. ;2010.03.30;  276886;   68125;    6775;   64553;  124067;  194954;  256745;  266282;   20141;   10604
COTTON NO. 2 - ICE FUTURES U.S. ;2010.03.23;  284058;   74380;    6130;   66032;  122121;  201428;  262533;  273590;   21525;   10469
COTTON NO. 2 - ICE FUTURES U.S. ;2010.03.16;  275250;   73367;    7084;   63940;  117238;  194273;  254546;  265297;   20704;    9953
COTTON NO. 2 - ICE FUTURES U.S. ;2010.03.09;  273370;   71372;    7499;   62871;  117593;  192820;  251836;  263190;   21534;   10180
COTTON NO. 2 - ICE FUTURES U.S. ;2010.03.02;  263675;   67271;    7086;   58807;  116339;  187766;  242418;  253660;   21256;   10015
COTTON NO. 2 - ICE FUTURES U.S. ;2010.02.23;  239186;   63087;    7586;   49105;  106437;  174251;  218629;  230943;   20557;    8243
COTTON NO. 2 - ICE FUTURES U.S. ;2010.02.16;  227544;   52698;   11276;   42767;  113296;  164833;  208762;  218876;   18783;    8669
COTTON NO. 2 - ICE FUTURES U.S. ;2010.02.09;  216653;   48782;   14998;   39252;  111838;  151105;  199872;  205355;   16781;   11298
COTTON NO. 2 - ICE FUTURES U.S. ;2010.02.02;  237225;   48692;   15275;   53196;  116065;  156482;  217953;  224953;   19272;   12271
COTTON NO. 2 - ICE FUTURES U.S. ;2010.01.26;  235030;   51379;   10760;   53216;  111855;  160687;  216450;  224663;   18580;   10368
COTTON NO. 2 - ICE FUTURES U.S. ;2010.01.19;  239011;   59448;    8807;   50918;  108976;  170022;  219342;  229748;   19669;    9263
COTTON NO. 2 - ICE FUTURES U.S. ;2010.01.12;  247038;   63498;   10769;   50326;  112690;  177647;  226513;  238742;   20525;    8296
COTTON NO. 2 - ICE FUTURES U.S. ;2010.01.05;  251227;   68163;    9924;   49629;  113046;  183594;  230838;  243147;   20389;    8080
COTTON NO. 2 - ICE FUTURES U.S. ;2009.12.29;  251292;   73726;    9167;   45612;  111339;  189063;  230677;  243842;   20614;    7450
COTTON NO. 2 - ICE FUTURES U.S. ;2009.12.22;  247428;   70993;    9462;   45342;  110392;  185042;  226727;  239846;   20700;    7582
COTTON NO. 2 - ICE FUTURES U.S. ;2009.12.15;  246645;   73731;    9563;   46137;  105199;  184175;  225067;  239875;   21578;    6770
COTTON NO. 2 - ICE FUTURES U.S. ;2009.12.08;  236317;   70278;    8515;   43313;  102246;  177924;  215837;  229752;   20481;    6566
COTTON NO. 2 - ICE FUTURES U.S. ;2009.12.01;  232131;   68859;    8349;   41680;  101746;  175585;  212284;  225614;   19846;    6517
COTTON NO. 2 - ICE FUTURES U.S. ;2009.11.24;  231364;   71062;    7481;   39613;   99561;  177118;  210235;  224211;   21129;    7153
COTTON NO. 2 - ICE FUTURES U.S. ;2009.11.17;  217321;   62100;    8078;   35818;   98218;  165701;  196136;  209597;   21185;    7724
COTTON NO. 2 - ICE FUTURES U.S. ;2009.11.09;  269053;   63440;    6804;   59433;  121293;  193585;  244167;  259822;   24886;    9232
COTTON NO. 2 - ICE FUTURES U.S. ;2009.11.03;  267579;   65183;    6209;   59456;  120926;  193160;  245565;  258825;   22014;    8754
COTTON NO. 2 - ICE FUTURES U.S. ;2009.10.27;  259084;   61823;    6575;   60801;  115757;  183360;  238382;  250737;   20702;    8347
COTTON NO. 2 - ICE FUTURES U.S. ;2009.10.20;  249121;   59684;    5285;   61314;  109104;  176164;  230102;  242763;   19019;    6359
COTTON NO. 2 - ICE FUTURES U.S. ;2009.10.13;  225737;   48462;    3337;   53677;  104128;  160430;  206266;  217443;   19471;    8293
COTTON NO. 2 - ICE FUTURES U.S. ;2009.10.06;  206397;   42182;    3152;   46479;  101370;  149516;  190030;  199147;   16366;    7250
COTTON NO. 2 - ICE FUTURES U.S. ;2009.09.29;  206244;   44466;    2966;   46191;   99680;  149145;  190337;  198302;   15907;    7942
COTTON NO. 2 - ICE FUTURES U.S. ;2009.09.22;  205895;   45960;    3497;   47015;   97493;  147721;  190468;  198232;   15427;    7663
COTTON NO. 2 - ICE FUTURES U.S. ;2009.09.15;  187701;   37665;    5156;   42030;   92996;  133186;  172691;  180372;   15009;    7328
COTTON NO. 2 - ICE FUTURES U.S. ;2009.09.08;  178346;   32236;    8931;   40225;   92821;  119524;  165282;  168679;   13064;    9667
COTTON NO. 2 - ICE FUTURES U.S. ;2009.09.01;  174819;   30006;   11248;   39478;   93020;  114098;  162505;  164824;   12315;    9996
COTTON NO. 2 - ICE FUTURES U.S. ;2009.08.25;  176769;   32192;    8188;   38921;   92508;  120189;  163621;  167298;   13147;    9471
COTTON NO. 2 - ICE FUTURES U.S. ;2009.08.18;  181434;   34836;    4764;   40224;   92370;  128306;  167430;  173294;   14004;    8140
COTTON NO. 2 - ICE FUTURES U.S. ;2009.08.11;  186606;   36472;    4112;   41508;   92968;  133950;  170949;  179570;   15658;    7036
COTTON NO. 2 - ICE FUTURES U.S. ;2009.08.04;  182502;   35406;    4921;   40880;   92334;  130603;  168620;  176405;   13882;    6097
COTTON NO. 2 - ICE FUTURES U.S. ;2009.07.28;  177290;   34828;    5621;   39138;   90255;  126099;  164221;  170859;   13069;    6431
COTTON NO. 2 - ICE FUTURES U.S. ;2009.07.21;  186550;   38301;    4197;   40701;   91892;  135530;  170895;  180428;   15656;    6122
COTTON NO. 2 - ICE FUTURES U.S. ;2009.07.14;  178007;   35932;    4573;   38147;   88449;  129256;  162528;  171977;   15479;    6030
COTTON NO. 2 - ICE FUTURES U.S. ;2009.07.07;  163208;   29109;    5761;   35800;   85421;  113623;  150329;  155184;   12879;    8023
COTTON NO. 2 - ICE FUTURES U.S. ;2009.06.30;  155415;   27699;   10096;   33656;   82438;  102429;  143793;  146181;   11623;    9234
COTTON NO. 2 - ICE FUTURES U.S. ;2009.06.23;  151430;   25367;    8530;   32361;   82489;  100942;  140216;  141833;   11214;    9597
COTTON NO. 2 - ICE FUTURES U.S. ;2009.06.16;  161620;   29855;    6047;   32990;   84067;  112110;  146911;  151147;   14709;   10473
COTTON NO. 2 - ICE FUTURES U.S. ;2009.06.09;  197308;   33521;    5274;   52917;   94219;  129141;  180658;  187332;   16650;    9975
COTTON NO. 2 - ICE FUTURES U.S. ;2009.06.02;  201736;   37909;    4205;   54291;   91729;  135587;  183929;  194083;   17806;    7653
COTTON NO. 2 - ICE FUTURES U.S. ;2009.05.26;  197183;   37907;    4760;   52086;   91897;  132019;  181890;  188865;   15292;    8318
COTTON NO. 2 - ICE FUTURES U.S. ;2009.05.19;  199071;   40287;    5087;   51635;   91066;  134644;  182988;  191366;   16083;    7706
COTTON NO. 2 - ICE FUTURES U.S. ;2009.05.12;  199798;   39723;    5863;   50604;   91409;  135310;  181736;  191777;   18062;    8021
COTTON NO. 2 - ICE FUTURES U.S. ;2009.05.05;  184510;   35003;    6500;   45258;   87148;  126134;  167409;  177892;   17102;    6619
COTTON NO. 2 - ICE FUTURES U.S. ;2009.04.28;  168526;   27516;   10980;   39835;   85907;  110733;  153257;  161548;   15268;    6978
COTTON NO. 2 - ICE FUTURES U.S. ;2009.04.21;  166387;   28345;   13424;   40032;   81170;  104363;  149547;  157818;   16840;    8569
COTTON NO. 2 - ICE FUTURES U.S. ;2009.04.14;  172678;   28089;   14573;   39682;   87742;  108044;  155513;  162299;   17165;   10378
COTTON NO. 2 - ICE FUTURES U.S. ;2009.04.07;  192724;   27393;   17692;   47527;  101020;  115864;  175940;  181084;   16784;   11640
COTTON NO. 2 - ICE FUTURES U.S. ;2009.03.31;  190884;   26521;   22982;   47050;  100182;  107644;  173753;  177676;   17131;   13208
COTTON NO. 2 - ICE FUTURES U.S. ;2009.03.24;  186137;   26603;   28601;   45241;   97911;   98415;  169756;  172257;   16382;   13880
COTTON NO. 2 - ICE FUTURES U.S. ;2009.03.17;  175903;   25265;   30972;   43643;   92332;   86603;  161240;  161219;   14663;   14684
COTTON NO. 2 - ICE FUTURES U.S. ;2009.03.10;  168460;   24686;   30854;   42214;   86903;   79191;  153803;  152259;   14657;   16202
COTTON NO. 2 - ICE FUTURES U.S. ;2009.03.03;  161757;   24480;   30291;   40657;   83583;   74579;  148720;  145527;   13037;   16230
COTTON NO. 2 - ICE FUTURES U.S. ;2009.02.24;  157426;   23075;   26573;   39545;   81708;   75814;  144328;  141931;   13097;   15495
COTTON NO. 2 - ICE FUTURES U.S. ;2009.02.17;  158471;   23867;   23533;   39874;   80901;   81005;  144643;  144412;   13828;   14058
COTTON NO. 2 - ICE FUTURES U.S. ;2009.02.10;  162477;   25663;   15168;   39762;   81115;   94246;  146539;  149176;   15937;   13301
COTTON NO. 2 - ICE FUTURES U.S. ;2009.02.03;  196776;   26944;   12744;   63651;   90151;  110640;  180746;  187035;   16030;    9741
COTTON NO. 2 - ICE FUTURES U.S. ;2009.01.27;  205769;   27270;   10918;   68753;   93570;  114280;  189593;  193951;   16176;   11818
COTTON NO. 2 - ICE FUTURES U.S. ;2009.01.20;  202131;   25089;   13480;   65767;   97073;  111482;  187928;  190729;   14203;   11403
COTTON NO. 2 - ICE FUTURES U.S. ;2009.01.13;  203702;   26994;   13397;   67737;   95660;  111236;  190391;  192371;   13311;   11331
COTTON NO. 2 - ICE FUTURES U.S. ;2009.01.06;  205131;   27893;   12936;   67253;   92073;  112278;  187219;  192467;   17912;   12664
COTTON NO. 2 - ICE FUTURES U.S. ;2008.12.30;  196756;   27240;   15650;   63681;   91263;  106214;  182184;  185544;   14573;   11212
COTTON NO. 2 - ICE FUTURES U.S. ;2008.12.22;  194933;   26202;   15697;   62617;   92362;  104936;  181180;  183250;   13753;   11683
COTTON NO. 2 - ICE FUTURES U.S. ;2008.12.16;  201242;   26269;   16173;   65185;   94180;  104379;  185633;  185737;   15609;   15506
COTTON NO. 2 - ICE FUTURES U.S. ;2008.12.09;  201747;   25558;   17771;   64535;   95703;  103279;  185796;  185585;   15952;   16163
COTTON NO. 2 - ICE FUTURES U.S. ;2008.12.02;  198256;   26476;   18444;   62952;   96105;  104392;  185533;  185788;   12723;   12467
COTTON NO. 2 - ICE FUTURES U.S. ;2008.11.25;  195132;   26101;   22651;   59308;   96828;  101098;  182236;  183057;   12896;   12075
COTTON NO. 2 - ICE FUTURES U.S. ;2008.11.18;  201926;   28194;   21901;   58580;  102515;  108366;  189289;  188847;   12637;   13078
COTTON NO. 2 - ICE FUTURES U.S. ;2008.11.11;  212420;   27428;   23669;   57076;  113271;  117893;  197775;  198639;   14645;   13781
COTTON NO. 2 - ICE FUTURES U.S. ;2008.11.04;  304540;   27418;   23674;  117125;  146796;  152001;  291339;  292800;   13201;   11740
COTTON NO. 2 - ICE FUTURES U.S. ;2008.10.28;  310220;   26869;   25493;  121094;  149916;  151892;  297879;  298480;   12342;   11741
COTTON NO. 2 - ICE FUTURES U.S. ;2008.10.21;  314919;   29000;   25938;  125089;  147547;  151326;  301636;  302353;   13283;   12566
COTTON NO. 2 - ICE FUTURES U.S. ;2008.10.14;  329306;   27384;   26564;  135410;  152873;  155327;  315667;  317301;   13639;   12005
COTTON NO. 2 - ICE FUTURES U.S. ;2008.10.07;  343138;   29806;   32350;  138449;  161425;  159732;  329679;  330530;   13459;   12608
COTTON NO. 2 - ICE FUTURES U.S. ;2008.09.30;  359892;   30912;   33177;  143353;  170682;  169164;  344947;  345695;   14945;   14197
COTTON NO. 2 - ICE FUTURES U.S. ;2008.09.23;  365481;   33360;   35180;  140209;  175425;  174609;  348994;  349998;   16488;   15484
COTTON NO. 2 - ICE FUTURES U.S. ;2008.09.16;  373141;   34008;   36756;  139980;  180005;  178519;  353994;  355255;   19147;   17886
COTTON NO. 2 - ICE FUTURES U.S. ;2008.09.09;  376193;   32752;   39050;  139496;  184769;  182331;  357018;  360877;   19174;   15315
COTTON NO. 2 - ICE FUTURES U.S. ;2008.09.02;  371698;   37492;   34815;  133026;  180264;  188249;  350782;  356091;   20916;   15607
COTTON NO. 2 - ICE FUTURES U.S. ;2008.08.26;  370625;   36898;   36953;  129820;  183448;  188415;  350167;  355188;   20458;   15437
COTTON NO. 2 - ICE FUTURES U.S. ;2008.08.19;  366511;   37035;   36991;  128718;  181931;  182565;  347684;  348274;   18827;   18237
COTTON NO. 2 - ICE FUTURES U.S. ;2008.08.12;  377303;   39173;   37156;  132091;  187012;  192284;  358276;  361531;   19027;   15772
COTTON NO. 2 - ICE FUTURES U.S. ;2008.08.05;  380635;   39298;   36903;  132165;  188425;  195123;  359888;  364191;   20747;   16444
COTTON NO. 2 - ICE FUTURES U.S. ;2008.07.29;  379775;   44733;   31361;  125969;  186898;  207266;  357600;  364596;   22175;   15178
COTTON NO. 2 - ICE FUTURES U.S. ;2008.07.22;  378315;   43845;   32578;  125174;  186379;  205026;  355399;  362778;   22916;   15537
COTTON NO. 2 - ICE FUTURES U.S. ;2008.07.15;  383575;   50883;   28376;  124937;  184978;  214906;  360799;  368220;   22776;   15356
COTTON NO. 2 - ICE FUTURES U.S. ;2008.07.08;  381097;   52338;   24145;  125869;  180777;  215141;  358984;  365155;   22113;   15942
COTTON NO. 2 - ICE FUTURES U.S. ;2008.07.01;  377877;   53876;   16699;  122086;  180320;  224981;  356283;  363766;   21595;   14111
COTTON NO. 2 - ICE FUTURES U.S. ;2008.06.24;  378675;   53270;   14831;  122319;  179975;  228816;  355565;  365967;   23111;   12708
COTTON NO. 2 - ICE FUTURES U.S. ;2008.06.17;  385674;   56092;   16858;  122113;  183955;  232388;  362160;  371360;   23514;   14314
COTTON NO. 2 - ICE FUTURES U.S. ;2008.06.10;  470129;   56116;   30436;  159498;  231624;  262377;  447237;  452311;   22892;   17819
COTTON NO. 2 - ICE FUTURES U.S. ;2008.06.03;  486379;   55127;   27494;  163793;  246816;  279042;  465736;  470329;   20643;   16050
COTTON NO. 2 - ICE FUTURES U.S. ;2008.05.27;  478182;   53001;   26853;  162136;  239805;  274573;  454942;  463562;   23240;   14620
COTTON NO. 2 - ICE FUTURES U.S. ;2008.05.20;  469680;   56704;   17713;  161176;  225271;  276520;  443152;  455409;   26528;   14271
COTTON NO. 2 - ICE FUTURES U.S. ;2008.05.13;  461132;   54959;   15669;  159411;  222239;  272360;  436609;  447439;   24523;   13692
COTTON NO. 2 - ICE FUTURES U.S. ;2008.05.06;  462725;   57238;   12827;  161313;  218988;  274926;  437539;  449065;   25186;   13660
COTTON NO. 2 - ICE FUTURES U.S. ;2008.04.29;  461674;   57785;   12582;  159024;  219837;  277768;  436645;  449374;   25029;   12300
COTTON NO. 2 - ICE FUTURES U.S. ;2008.04.22;  469070;   63227;    9915;  158347;  220702;  289475;  442276;  457736;   26794;   11334
COTTON NO. 2 - ICE FUTURES U.S. ;2008.04.15;  472583;   63626;   11486;  157537;  220790;  290935;  441953;  459957;   30631;   12626
COTTON NO. 2 - ICE FUTURES U.S. ;2008.04.08;  528299;   61359;   12441;  206717;  230826;  296952;  498902;  516109;   29398;   12190
COTTON NO. 2 - ICE FUTURES U.S. ;2008.04.01;  537160;   60682;   12200;  212982;  232558;  296950;  506222;  522132;   30938;   15028
COTTON NO. 2 - ICE FUTURES U.S. ;2008.03.25;  541058;   66094;    4972;  212042;  232686;  310521;  510822;  527535;   30236;   13524
COTTON NO. 2 - ICE FUTURES U.S. ;2008.03.18;  565626;   71546;    6853;  218569;  231864;  314209;  521979;  539631;   43647;   25995
COTTON NO. 2 - ICE FUTURES U.S. ;2008.03.11;  572626;   81173;    9666;  218733;  231111;  321277;  531016;  549675;   41610;   22951
COTTON NO. 2 - ICE FUTURES U.S. ;2008.03.04;  546650;   95547;    9607;  186426;  221670;  330319;  503643;  526352;   43007;   20298
COTTON NO. 2 - ICE FUTURES U.S. ;2008.02.26;  453167;  106396;    6530;  119068;  192772;  315871;  418237;  441469;   34930;   11698
COTTON NO. 2 - ICE FUTURES U.S. ;2008.02.19;  381346;   85332;   10171;   91099;  165896;  264753;  342326;  366023;   39020;   15323
COTTON NO. 2 - ICE FUTURES U.S. ;2008.02.12;  379535;   82583;   11646;   89765;  171926;  261671;  344274;  363082;   35262;   16453
COTTON NO. 2 - ICE FUTURES U.S. ;2008.02.05;  451174;   85444;   11338;  136256;  193779;  287648;  415480;  435243;   35695;   15932
COTTON NO. 2 - ICE FUTURES U.S. ;2008.01.29;  438556;   82449;    9624;  138439;  182054;  273869;  402942;  421932;   35614;   16624
COTTON NO. 2 - ICE FUTURES U.S. ;2008.01.22;  460276;   97328;   10532;  143222;  181654;  289450;  422203;  443203;   38073;   17072
COTTON NO. 2 - ICE FUTURES U.S. ;2008.01.15;  465029;   97937;   10867;  142343;  178222;  289208;  418502;  442418;   46527;   22611
COTTON NO. 2 - ICE FUTURES U.S. ;2008.01.08;  410450;   91797;   10729;  117492;  166866;  269418;  376155;  397639;   34295;   12812
COTTON NO. 2 - ICE FUTURES U.S. ;2007.12.31;  369243;   74195;   14820;  104195;  159664;  237754;  338054;  356769;   31189;   12474
COTTON NO. 2 - ICE FUTURES U.S. ;2007.12.24;  351237;   68859;   21279;   96619;  155188;  218789;  320666;  336686;   30572;   14551
COTTON NO. 2 - ICE FUTURES U.S. ;2007.12.18;  346930;   66064;   29650;   95975;  154874;  201166;  316913;  326791;   30018;   20140
COTTON NO. 2 - ICE FUTURES U.S. ;2007.12.11;  335977;   65219;   30919;   90132;  153635;  198679;  308985;  319730;   26992;   16247
COTTON NO. 2 - ICE FUTURES U.S. ;2007.12.04;  327130;   62085;   27878;   86089;  154845;  197767;  303019;  311734;   24111;   15396
COTTON NO. 2 - ICE FUTURES U.S. ;2007.11.27;  308475;   65739;   21838;   74451;  144698;  197790;  284888;  294078;   23586;   14396
COTTON NO. 2 - ICE FUTURES U.S. ;2007.11.20;  317264;   68332;   18363;   74270;  143387;  205622;  285990;  298255;   31274;   19009
COTTON NO. 2 - ICE FUTURES U.S. ;2007.11.13;  336737;   78450;   12051;   82901;  143852;  226288;  305203;  321241;   31534;   15497
COTTON NO. 2 - ICE FUTURES U.S. ;2007.11.06;  422388;   85367;   10461;  141094;  163520;  257580;  389981;  409135;   32406;   13253
COTTON NO. 2 - ICE FUTURES U.S. ;2007.10.30;  421505;   79074;    9246;  147508;  164504;  251483;  391086;  408237;   30419;   13268
COTTON NO. 2 - ICE FUTURES U.S. ;2007.10.23;  424585;   80777;    8517;  148644;  162359;  253140;  391781;  410301;   32804;   14284
COTTON NO. 2 - ICE FUTURES U.S. ;2007.10.16;  411640;   77871;    9145;  145246;  158987;  243916;  382104;  398307;   29536;   13333
COTTON NO. 2 - ICE FUTURES U.S. ;2007.10.09;  408486;   76562;    8916;  143551;  160244;  243777;  380357;  396244;   28129;   12242
COTTON NO. 2 - ICE FUTURES U.S. ;2007.10.02;  411964;   77661;    8492;  142419;  164683;  249415;  384762;  400325;   27202;   11639
COTTON NO. 2 - ICE FUTURES U.S. ;2007.09.25;  414218;   75481;    9045;  141758;  166713;  251464;  383951;  402267;   30267;   11951
COTTON NO. 2 - ICE FUTURES U.S. ;2007.09.18;  393309;   66841;   11359;  134180;  164364;  236265;  365385;  381804;   27924;   11505
COTTON NO. 2 - ICE FUTURES U.S. ;2007.09.11;  370640;   58396;   16076;  126110;  162790;  218248;  347296;  360434;   23344;   10206
COTTON NO. 2 - ICE FUTURES U.S. ;2007.09.04;  365542;   54906;   16177;  120866;  166938;  217888;  342710;  354930;   22831;   10611
COTTON NO. 2 - ICE FUTURES U.S. ;2011.07.12;  227679;   49964;   10427;   60083;  103801;  145908;  213848;  216418;   13832;   11262
