SOYBEAN OIL - CBT SOYBEAN OIL ;1995.04.11;   91167;   10720;    6813;    9591;   37973;   49882;   58284;   66286;   32883;   24881
SOYBEAN OIL - CBT SOYBEAN OIL ;1995.04.04;   92056;    9344;    6011;   11458;   40171;   50044;   60974;   67514;   31082;   24543
SOYBEAN OIL - CBT SOYBEAN OIL ;1995.03.28;   92633;   16565;    5089;   11138;   34755;   52146;   62458;   68372;   30175;   24261
SOYBEAN OIL - CBT SOYBEAN OIL ;1995.03.21;   95499;   18723;    3866;   10207;   33570;   57039;   62500;   71112;   32999;   24386
SOYBEAN OIL - CBT SOYBEAN OIL ;1995.04.11;   91167;   10720;    6813;    9591;   37973;   49882;   58284;   66286;   32883;   24881
SOYBEAN OIL - CBT SOYBEAN OIL ;1995.04.04;   92056;    9344;    6011;   11458;   40171;   50044;   60974;   67514;   31082;   24543
SOYBEAN OIL - CBT SOYBEAN OIL ;1995.03.28;   92633;   16565;    5089;   11138;   34755;   52146;   62458;   68372;   30175;   24261
SOYBEAN OIL - CBT SOYBEAN OIL ;1995.03.21;   95499;   18723;    3866;   10207;   33570;   57039;   62500;   71112;   32999;   24386
SOYBEAN OIL - CBT SOYBEAN OIL ;1995.04.11;   91167;   10720;    6813;    9591;   37973;   49882;   58284;   66286;   32883;   24881
SOYBEAN OIL - CBT SOYBEAN OIL ;1995.04.04;   92056;    9344;    6011;   11458;   40171;   50044;   60974;   67514;   31082;   24543
SOYBEAN OIL - CBT SOYBEAN OIL ;1995.03.28;   92633;   16565;    5089;   11138;   34755;   52146;   62458;   68372;   30175;   24261
SOYBEAN OIL - CBT SOYBEAN OIL ;1995.03.21;   95499;   18723;    3866;   10207;   33570;   57039;   62500;   71112;   32999;   24386
