W. GERMAN DEUTSCHE MARK - NEW YORK FUTURES EXCHANGE ;1996.06.04;     932;       0;     872;       0;     680;       0;     680;     872;     252;      60
W. GERMAN DEUTSCHE MARK - NEW YORK FUTURES EXCHANGE ;1996.05.28;     932;       0;     867;       0;     667;       0;     667;     867;     265;      65
W. GERMAN DEUTSCHE MARK - NEW YORK FUTURES EXCHANGE ;1996.05.21;     908;       0;     869;       0;     635;       0;     635;     869;     273;      39
W. GERMAN DEUTSCHE MARK - NEW YORK FUTURES EXCHANGE ;1996.05.14;     874;       0;     839;       0;     603;       0;     603;     839;     271;      35
W. GERMAN DEUTSCHE MARK - NEW YORK FUTURES EXCHANGE ;1996.05.07;     839;       0;     839;       0;     603;       0;     603;     839;     236;       0
W. GERMAN DEUTSCHE MARK - NEW YORK FUTURES EXCHANGE ;1996.04.30;     842;       0;     842;       0;     603;       0;     603;     842;     239;       0
W. GERMAN DEUTSCHE MARK - NEW YORK FUTURES EXCHANGE ;1996.04.23;     843;       0;     843;       0;     588;       0;     588;     843;     255;       0
W. GERMAN DEUTSCHE MARK - NEW YORK FUTURES EXCHANGE ;1996.02.06;    1699;       0;     732;       0;     828;       0;     828;     732;     871;     967
W. GERMAN DEUTSCHE MARK - NEW YORK FUTURES EXCHANGE ;1996.01.30;    1449;       0;     947;       0;    1124;       0;    1124;     947;     325;     502
W. GERMAN DEUTSCHE MARK - NEW YORK FUTURES EXCHANGE ;1996.01.23;    1242;       0;     744;       0;     801;       0;     801;     744;     441;     498
W. GERMAN DEUTSCHE MARK - NEW YORK FUTURES EXCHANGE ;1996.01.16;     942;       0;     753;       0;     643;       0;     643;     753;     299;     189
W. GERMAN DEUTSCHE MARK - NEW YORK FUTURES EXCHANGE ;1995.11.07;    1563;    1000;     277;       0;     223;    1003;    1223;    1280;     340;     283
W. GERMAN DEUTSCHE MARK - NEW YORK FUTURES EXCHANGE ;1996.06.04;     932;       0;     872;       0;     680;       0;     680;     872;     252;      60
W. GERMAN DEUTSCHE MARK - NEW YORK FUTURES EXCHANGE ;1996.05.28;     932;       0;     867;       0;     667;       0;     667;     867;     265;      65
W. GERMAN DEUTSCHE MARK - NEW YORK FUTURES EXCHANGE ;1996.05.21;     908;       0;     869;       0;     635;       0;     635;     869;     273;      39
W. GERMAN DEUTSCHE MARK - NEW YORK FUTURES EXCHANGE ;1996.05.14;     874;       0;     839;       0;     603;       0;     603;     839;     271;      35
W. GERMAN DEUTSCHE MARK - NEW YORK FUTURES EXCHANGE ;1996.05.07;     839;       0;     839;       0;     603;       0;     603;     839;     236;       0
W. GERMAN DEUTSCHE MARK - NEW YORK FUTURES EXCHANGE ;1996.04.30;     842;       0;     842;       0;     603;       0;     603;     842;     239;       0
W. GERMAN DEUTSCHE MARK - NEW YORK FUTURES EXCHANGE ;1996.04.23;     843;       0;     843;       0;     588;       0;     588;     843;     255;       0
W. GERMAN DEUTSCHE MARK - NEW YORK FUTURES EXCHANGE ;1996.02.06;    1699;       0;     732;       0;     828;       0;     828;     732;     871;     967
W. GERMAN DEUTSCHE MARK - NEW YORK FUTURES EXCHANGE ;1996.01.30;    1449;       0;     947;       0;    1124;       0;    1124;     947;     325;     502
W. GERMAN DEUTSCHE MARK - NEW YORK FUTURES EXCHANGE ;1996.01.23;    1242;       0;     744;       0;     801;       0;     801;     744;     441;     498
W. GERMAN DEUTSCHE MARK - NEW YORK FUTURES EXCHANGE ;1996.01.16;     942;       0;     753;       0;     643;       0;     643;     753;     299;     189
W. GERMAN DEUTSCHE MARK - NEW YORK FUTURES EXCHANGE ;1995.11.07;    1563;    1000;     277;       0;     223;    1003;    1223;    1280;     340;     283
W. GERMAN DEUTSCHE MARK - NEW YORK FUTURES EXCHANGE ;1996.06.04;     932;       0;     872;       0;     680;       0;     680;     872;     252;      60
W. GERMAN DEUTSCHE MARK - NEW YORK FUTURES EXCHANGE ;1996.05.28;     932;       0;     867;       0;     667;       0;     667;     867;     265;      65
W. GERMAN DEUTSCHE MARK - NEW YORK FUTURES EXCHANGE ;1996.05.21;     908;       0;     869;       0;     635;       0;     635;     869;     273;      39
W. GERMAN DEUTSCHE MARK - NEW YORK FUTURES EXCHANGE ;1996.05.14;     874;       0;     839;       0;     603;       0;     603;     839;     271;      35
W. GERMAN DEUTSCHE MARK - NEW YORK FUTURES EXCHANGE ;1996.05.07;     839;       0;     839;       0;     603;       0;     603;     839;     236;       0
W. GERMAN DEUTSCHE MARK - NEW YORK FUTURES EXCHANGE ;1996.04.30;     842;       0;     842;       0;     603;       0;     603;     842;     239;       0
W. GERMAN DEUTSCHE MARK - NEW YORK FUTURES EXCHANGE ;1996.04.23;     843;       0;     843;       0;     588;       0;     588;     843;     255;       0
W. GERMAN DEUTSCHE MARK - NEW YORK FUTURES EXCHANGE ;1996.02.06;    1699;       0;     732;       0;     828;       0;     828;     732;     871;     967
W. GERMAN DEUTSCHE MARK - NEW YORK FUTURES EXCHANGE ;1996.01.30;    1449;       0;     947;       0;    1124;       0;    1124;     947;     325;     502
W. GERMAN DEUTSCHE MARK - NEW YORK FUTURES EXCHANGE ;1996.01.23;    1242;       0;     744;       0;     801;       0;     801;     744;     441;     498
W. GERMAN DEUTSCHE MARK - NEW YORK FUTURES EXCHANGE ;1996.01.16;     942;       0;     753;       0;     643;       0;     643;     753;     299;     189
W. GERMAN DEUTSCHE MARK - NEW YORK FUTURES EXCHANGE ;1995.11.07;    1563;    1000;     277;       0;     223;    1003;    1223;    1280;     340;     283
