HEAT OIL CRACK SPRD CAL SWAP - NEW YORK MERCANTILE EXCHANGE ;2005.01.18;   18879;       0;    3251;    4578;   14046;   10975;   18624;   18804;     255;      75
HEAT OIL CRACK SPRD CAL SWAP - NEW YORK MERCANTILE EXCHANGE ;2005.01.11;   18790;       0;    3485;    4590;   13990;   10715;   18580;   18790;     210;       0
HEAT OIL CRACK SPRD CAL SWAP - NEW YORK MERCANTILE EXCHANGE ;2005.01.04;   18115;       0;    3805;    4320;   13615;    9990;   17935;   18115;     180;       0
HEAT OIL CRACK SPRD CAL SWAP - NEW YORK MERCANTILE EXCHANGE ;2004.12.28;   19208;      15;    3139;    5086;   13927;   10983;   19028;   19208;     180;       0
HEAT OIL CRACK SPRD CAL SWAP - NEW YORK MERCANTILE EXCHANGE ;2004.12.21;   18984;      15;    3220;    5071;   13598;   10693;   18684;   18984;     300;       0
HEAT OIL CRACK SPRD CAL SWAP - NEW YORK MERCANTILE EXCHANGE ;2004.12.14;   18834;      15;    3040;    5026;   13523;   10768;   18564;   18834;     270;       0
HEAT OIL CRACK SPRD CAL SWAP - NEW YORK MERCANTILE EXCHANGE ;2004.12.07;   18474;      15;    2875;    4951;   13328;   10648;   18294;   18474;     180;       0
HEAT OIL CRACK SPRD CAL SWAP - NEW YORK MERCANTILE EXCHANGE ;2004.11.30;   18591;     180;    1533;    5867;   12544;   11191;   18591;   18591;       0;       0
HEAT OIL CRACK SPRD CAL SWAP - NEW YORK MERCANTILE EXCHANGE ;2004.11.23;   18771;     180;    1683;    5867;   12649;   11146;   18696;   18696;      75;      75
HEAT OIL CRACK SPRD CAL SWAP - NEW YORK MERCANTILE EXCHANGE ;2004.11.16;   18706;     180;    1553;    6002;   12524;   11151;   18706;   18706;       0;       0
HEAT OIL CRACK SPRD CAL SWAP - NEW YORK MERCANTILE EXCHANGE ;2004.11.09;   18711;     397;    1075;    6135;   12179;   11501;   18711;   18711;       0;       0
HEAT OIL CRACK SPRD CAL SWAP - NEW YORK MERCANTILE EXCHANGE ;2004.11.02;   18156;    2257;    1130;    4800;   11099;   11746;   18156;   17676;       0;     480
HEAT OIL CRACK SPRD CAL SWAP - NEW YORK MERCANTILE EXCHANGE ;2004.10.26;   17734;    1248;    1320;    5755;   10731;   10659;   17734;   17734;       0;       0
HEAT OIL CRACK SPRD CAL SWAP - NEW YORK MERCANTILE EXCHANGE ;2004.10.19;   17019;     893;    1320;    5575;   10551;   10124;   17019;   17019;       0;       0
HEAT OIL CRACK SPRD CAL SWAP - NEW YORK MERCANTILE EXCHANGE ;2004.10.12;   17214;    1868;    1320;    5125;   10221;   10769;   17214;   17214;       0;       0
HEAT OIL CRACK SPRD CAL SWAP - NEW YORK MERCANTILE EXCHANGE ;2004.10.05;   17214;    1268;    1320;    5425;   10521;   10319;   17214;   17064;       0;     150
HEAT OIL CRACK SPRD CAL SWAP - NEW YORK MERCANTILE EXCHANGE ;2004.09.28;   17314;    1368;    1320;    5650;   10296;   10344;   17314;   17314;       0;       0
HEAT OIL CRACK SPRD CAL SWAP - NEW YORK MERCANTILE EXCHANGE ;2004.09.21;   15754;     345;    1677;    5098;   10311;    8859;   15754;   15634;       0;     120
HEAT OIL CRACK SPRD CAL SWAP - NEW YORK MERCANTILE EXCHANGE ;2004.09.14;   15574;     345;    2272;    4578;   10651;    8724;   15574;   15574;       0;       0
HEAT OIL CRACK SPRD CAL SWAP - NEW YORK MERCANTILE EXCHANGE ;2004.09.07;   15004;     345;    2227;    4143;   10516;    8634;   15004;   15004;       0;       0
HEAT OIL CRACK SPRD CAL SWAP - NEW YORK MERCANTILE EXCHANGE ;2004.08.31;   19399;    2548;    1625;    5170;   11681;   12604;   19399;   19399;       0;       0
HEAT OIL CRACK SPRD CAL SWAP - NEW YORK MERCANTILE EXCHANGE ;2004.08.24;   19024;    2853;    1325;    5100;   11071;   12599;   19024;   19024;       0;       0
HEAT OIL CRACK SPRD CAL SWAP - NEW YORK MERCANTILE EXCHANGE ;2004.08.17;   17959;    3948;    1325;    4320;    9691;   12314;   17959;   17959;       0;       0
HEAT OIL CRACK SPRD CAL SWAP - NEW YORK MERCANTILE EXCHANGE ;2004.08.10;   18154;    3173;    1025;    4965;   10016;   12164;   18154;   18154;       0;       0
HEAT OIL CRACK SPRD CAL SWAP - NEW YORK MERCANTILE EXCHANGE ;2004.08.03;   17734;    3323;    1025;    4470;    9941;   12239;   17734;   17734;       0;       0
HEAT OIL CRACK SPRD CAL SWAP - NEW YORK MERCANTILE EXCHANGE ;2004.07.27;   19674;    4163;    1275;    3285;   12226;   15114;   19674;   19674;       0;       0
HEAT OIL CRACK SPRD CAL SWAP - NEW YORK MERCANTILE EXCHANGE ;2004.07.20;   19619;    4313;    1275;    3285;   11766;   14909;   19364;   19469;     255;     150
HEAT OIL CRACK SPRD CAL SWAP - NEW YORK MERCANTILE EXCHANGE ;2004.07.13;   19019;    4648;    1275;    2910;   11121;   14684;   18679;   18869;     340;     150
HEAT OIL CRACK SPRD CAL SWAP - NEW YORK MERCANTILE EXCHANGE ;2004.07.06;   19024;    4688;    1575;    2985;   11201;   14314;   18874;   18874;     150;     150
HEAT OIL CRACK SPRD CAL SWAP - NEW YORK MERCANTILE EXCHANGE ;2004.06.29;   20979;    4473;    1625;    3405;   13051;   15899;   20929;   20929;      50;      50
HEAT OIL CRACK SPRD CAL SWAP - NEW YORK MERCANTILE EXCHANGE ;2004.06.22;   21039;    5028;    1625;    3510;   12501;   15904;   21039;   21039;       0;       0
HEAT OIL CRACK SPRD CAL SWAP - NEW YORK MERCANTILE EXCHANGE ;2004.06.15;   18795;    5349;    1625;    2700;   10671;   14470;   18720;   18795;      75;       0
HEAT OIL CRACK SPRD CAL SWAP - NEW YORK MERCANTILE EXCHANGE ;2004.06.08;   17295;    7449;    1625;    1650;    8196;   14020;   17295;   17295;       0;       0
HEAT OIL CRACK SPRD CAL SWAP - NEW YORK MERCANTILE EXCHANGE ;2004.06.01;   17720;   10799;    1625;     825;    6096;   15270;   17720;   17720;       0;       0
HEAT OIL CRACK SPRD CAL SWAP - NEW YORK MERCANTILE EXCHANGE ;2004.05.25;   20580;   13929;    1675;     825;    5826;   18080;   20580;   20580;       0;       0
HEAT OIL CRACK SPRD CAL SWAP - NEW YORK MERCANTILE EXCHANGE ;2004.05.18;   21705;   15015;    1600;     675;    6015;   19430;   21705;   21705;       0;       0
HEAT OIL CRACK SPRD CAL SWAP - NEW YORK MERCANTILE EXCHANGE ;2004.05.11;   21015;   14465;    1600;     600;    5950;   18815;   21015;   21015;       0;       0
HEAT OIL CRACK SPRD CAL SWAP - NEW YORK MERCANTILE EXCHANGE ;2004.05.04;   20085;   13490;    1450;     525;    5920;   17735;   19935;   19710;     150;     375
HEAT OIL CRACK SPRD CAL SWAP - NEW YORK MERCANTILE EXCHANGE ;2004.04.27;   21485;   14520;    1050;     750;    6065;   19535;   21335;   21335;     150;     150
HEAT OIL CRACK SPRD CAL SWAP - NEW YORK MERCANTILE EXCHANGE ;2004.04.20;   21335;   14595;    1050;     600;    5615;   19160;   20810;   20810;     525;     525
HEAT OIL CRACK SPRD CAL SWAP - NEW YORK MERCANTILE EXCHANGE ;2004.04.12;   20560;   13995;     450;     675;    5390;   19160;   20060;   20285;     500;     275
HEAT OIL CRACK SPRD CAL SWAP - NEW YORK MERCANTILE EXCHANGE ;2004.04.06;   17885;   11445;     450;     600;    5315;   16535;   17360;   17585;     525;     300
HEAT OIL CRACK SPRD CAL SWAP - NEW YORK MERCANTILE EXCHANGE ;2004.03.30;   21125;   14650;     500;     750;    5425;   19800;   20825;   21050;     300;      75
HEAT OIL CRACK SPRD CAL SWAP - NEW YORK MERCANTILE EXCHANGE ;2004.03.23;   19955;   14725;     500;     675;    4255;   18630;   19655;   19805;     300;     150
HEAT OIL CRACK SPRD CAL SWAP - NEW YORK MERCANTILE EXCHANGE ;2004.03.16;   18230;   13425;     500;     525;    3830;   16905;   17780;   17930;     450;     300
HEAT OIL CRACK SPRD CAL SWAP - NEW YORK MERCANTILE EXCHANGE ;2004.03.09;   16355;   12675;     500;     225;    2930;   15255;   15830;   15980;     525;     375
HEAT OIL CRACK SPRD CAL SWAP - NEW YORK MERCANTILE EXCHANGE ;2004.03.02;   16155;   12750;     500;     225;    2730;   14830;   15705;   15555;     450;     600
HEAT OIL CRACK SPRD CAL SWAP - NEW YORK MERCANTILE EXCHANGE ;2005.01.18;   18879;       0;    3251;    4578;   14046;   10975;   18624;   18804;     255;      75
HEAT OIL CRACK SPRD CAL SWAP - NEW YORK MERCANTILE EXCHANGE ;2005.01.11;   18790;       0;    3485;    4590;   13990;   10715;   18580;   18790;     210;       0
HEAT OIL CRACK SPRD CAL SWAP - NEW YORK MERCANTILE EXCHANGE ;2005.01.04;   18115;       0;    3805;    4320;   13615;    9990;   17935;   18115;     180;       0
HEAT OIL CRACK SPRD CAL SWAP - NEW YORK MERCANTILE EXCHANGE ;2004.12.28;   19208;      15;    3139;    5086;   13927;   10983;   19028;   19208;     180;       0
HEAT OIL CRACK SPRD CAL SWAP - NEW YORK MERCANTILE EXCHANGE ;2004.12.21;   18984;      15;    3220;    5071;   13598;   10693;   18684;   18984;     300;       0
HEAT OIL CRACK SPRD CAL SWAP - NEW YORK MERCANTILE EXCHANGE ;2004.12.14;   18834;      15;    3040;    5026;   13523;   10768;   18564;   18834;     270;       0
HEAT OIL CRACK SPRD CAL SWAP - NEW YORK MERCANTILE EXCHANGE ;2004.12.07;   18474;      15;    2875;    4951;   13328;   10648;   18294;   18474;     180;       0
HEAT OIL CRACK SPRD CAL SWAP - NEW YORK MERCANTILE EXCHANGE ;2004.11.30;   18591;     180;    1533;    5867;   12544;   11191;   18591;   18591;       0;       0
HEAT OIL CRACK SPRD CAL SWAP - NEW YORK MERCANTILE EXCHANGE ;2004.11.23;   18771;     180;    1683;    5867;   12649;   11146;   18696;   18696;      75;      75
HEAT OIL CRACK SPRD CAL SWAP - NEW YORK MERCANTILE EXCHANGE ;2004.11.16;   18706;     180;    1553;    6002;   12524;   11151;   18706;   18706;       0;       0
HEAT OIL CRACK SPRD CAL SWAP - NEW YORK MERCANTILE EXCHANGE ;2004.11.09;   18711;     397;    1075;    6135;   12179;   11501;   18711;   18711;       0;       0
HEAT OIL CRACK SPRD CAL SWAP - NEW YORK MERCANTILE EXCHANGE ;2004.11.02;   18156;    2257;    1130;    4800;   11099;   11746;   18156;   17676;       0;     480
HEAT OIL CRACK SPRD CAL SWAP - NEW YORK MERCANTILE EXCHANGE ;2004.10.26;   17734;    1248;    1320;    5755;   10731;   10659;   17734;   17734;       0;       0
HEAT OIL CRACK SPRD CAL SWAP - NEW YORK MERCANTILE EXCHANGE ;2004.10.19;   17019;     893;    1320;    5575;   10551;   10124;   17019;   17019;       0;       0
HEAT OIL CRACK SPRD CAL SWAP - NEW YORK MERCANTILE EXCHANGE ;2004.10.12;   17214;    1868;    1320;    5125;   10221;   10769;   17214;   17214;       0;       0
HEAT OIL CRACK SPRD CAL SWAP - NEW YORK MERCANTILE EXCHANGE ;2004.10.05;   17214;    1268;    1320;    5425;   10521;   10319;   17214;   17064;       0;     150
HEAT OIL CRACK SPRD CAL SWAP - NEW YORK MERCANTILE EXCHANGE ;2004.09.28;   17314;    1368;    1320;    5650;   10296;   10344;   17314;   17314;       0;       0
HEAT OIL CRACK SPRD CAL SWAP - NEW YORK MERCANTILE EXCHANGE ;2004.09.21;   15754;     345;    1677;    5098;   10311;    8859;   15754;   15634;       0;     120
HEAT OIL CRACK SPRD CAL SWAP - NEW YORK MERCANTILE EXCHANGE ;2004.09.14;   15574;     345;    2272;    4578;   10651;    8724;   15574;   15574;       0;       0
HEAT OIL CRACK SPRD CAL SWAP - NEW YORK MERCANTILE EXCHANGE ;2004.09.07;   15004;     345;    2227;    4143;   10516;    8634;   15004;   15004;       0;       0
HEAT OIL CRACK SPRD CAL SWAP - NEW YORK MERCANTILE EXCHANGE ;2004.08.31;   19399;    2548;    1625;    5170;   11681;   12604;   19399;   19399;       0;       0
HEAT OIL CRACK SPRD CAL SWAP - NEW YORK MERCANTILE EXCHANGE ;2004.08.24;   19024;    2853;    1325;    5100;   11071;   12599;   19024;   19024;       0;       0
HEAT OIL CRACK SPRD CAL SWAP - NEW YORK MERCANTILE EXCHANGE ;2004.08.17;   17959;    3948;    1325;    4320;    9691;   12314;   17959;   17959;       0;       0
HEAT OIL CRACK SPRD CAL SWAP - NEW YORK MERCANTILE EXCHANGE ;2004.08.10;   18154;    3173;    1025;    4965;   10016;   12164;   18154;   18154;       0;       0
HEAT OIL CRACK SPRD CAL SWAP - NEW YORK MERCANTILE EXCHANGE ;2004.08.03;   17734;    3323;    1025;    4470;    9941;   12239;   17734;   17734;       0;       0
HEAT OIL CRACK SPRD CAL SWAP - NEW YORK MERCANTILE EXCHANGE ;2004.07.27;   19674;    4163;    1275;    3285;   12226;   15114;   19674;   19674;       0;       0
HEAT OIL CRACK SPRD CAL SWAP - NEW YORK MERCANTILE EXCHANGE ;2004.07.20;   19619;    4313;    1275;    3285;   11766;   14909;   19364;   19469;     255;     150
HEAT OIL CRACK SPRD CAL SWAP - NEW YORK MERCANTILE EXCHANGE ;2004.07.13;   19019;    4648;    1275;    2910;   11121;   14684;   18679;   18869;     340;     150
HEAT OIL CRACK SPRD CAL SWAP - NEW YORK MERCANTILE EXCHANGE ;2004.07.06;   19024;    4688;    1575;    2985;   11201;   14314;   18874;   18874;     150;     150
HEAT OIL CRACK SPRD CAL SWAP - NEW YORK MERCANTILE EXCHANGE ;2004.06.29;   20979;    4473;    1625;    3405;   13051;   15899;   20929;   20929;      50;      50
HEAT OIL CRACK SPRD CAL SWAP - NEW YORK MERCANTILE EXCHANGE ;2004.06.22;   21039;    5028;    1625;    3510;   12501;   15904;   21039;   21039;       0;       0
HEAT OIL CRACK SPRD CAL SWAP - NEW YORK MERCANTILE EXCHANGE ;2004.06.15;   18795;    5349;    1625;    2700;   10671;   14470;   18720;   18795;      75;       0
HEAT OIL CRACK SPRD CAL SWAP - NEW YORK MERCANTILE EXCHANGE ;2004.06.08;   17295;    7449;    1625;    1650;    8196;   14020;   17295;   17295;       0;       0
HEAT OIL CRACK SPRD CAL SWAP - NEW YORK MERCANTILE EXCHANGE ;2004.06.01;   17720;   10799;    1625;     825;    6096;   15270;   17720;   17720;       0;       0
HEAT OIL CRACK SPRD CAL SWAP - NEW YORK MERCANTILE EXCHANGE ;2004.05.25;   20580;   13929;    1675;     825;    5826;   18080;   20580;   20580;       0;       0
HEAT OIL CRACK SPRD CAL SWAP - NEW YORK MERCANTILE EXCHANGE ;2004.05.18;   21705;   15015;    1600;     675;    6015;   19430;   21705;   21705;       0;       0
HEAT OIL CRACK SPRD CAL SWAP - NEW YORK MERCANTILE EXCHANGE ;2004.05.11;   21015;   14465;    1600;     600;    5950;   18815;   21015;   21015;       0;       0
HEAT OIL CRACK SPRD CAL SWAP - NEW YORK MERCANTILE EXCHANGE ;2004.05.04;   20085;   13490;    1450;     525;    5920;   17735;   19935;   19710;     150;     375
HEAT OIL CRACK SPRD CAL SWAP - NEW YORK MERCANTILE EXCHANGE ;2004.04.27;   21485;   14520;    1050;     750;    6065;   19535;   21335;   21335;     150;     150
HEAT OIL CRACK SPRD CAL SWAP - NEW YORK MERCANTILE EXCHANGE ;2004.04.20;   21335;   14595;    1050;     600;    5615;   19160;   20810;   20810;     525;     525
HEAT OIL CRACK SPRD CAL SWAP - NEW YORK MERCANTILE EXCHANGE ;2004.04.12;   20560;   13995;     450;     675;    5390;   19160;   20060;   20285;     500;     275
HEAT OIL CRACK SPRD CAL SWAP - NEW YORK MERCANTILE EXCHANGE ;2004.04.06;   17885;   11445;     450;     600;    5315;   16535;   17360;   17585;     525;     300
HEAT OIL CRACK SPRD CAL SWAP - NEW YORK MERCANTILE EXCHANGE ;2004.03.30;   21125;   14650;     500;     750;    5425;   19800;   20825;   21050;     300;      75
HEAT OIL CRACK SPRD CAL SWAP - NEW YORK MERCANTILE EXCHANGE ;2004.03.23;   19955;   14725;     500;     675;    4255;   18630;   19655;   19805;     300;     150
HEAT OIL CRACK SPRD CAL SWAP - NEW YORK MERCANTILE EXCHANGE ;2004.03.16;   18230;   13425;     500;     525;    3830;   16905;   17780;   17930;     450;     300
HEAT OIL CRACK SPRD CAL SWAP - NEW YORK MERCANTILE EXCHANGE ;2004.03.09;   16355;   12675;     500;     225;    2930;   15255;   15830;   15980;     525;     375
HEAT OIL CRACK SPRD CAL SWAP - NEW YORK MERCANTILE EXCHANGE ;2004.03.02;   16155;   12750;     500;     225;    2730;   14830;   15705;   15555;     450;     600
HEAT OIL CRACK SPRD CAL SWAP - NEW YORK MERCANTILE EXCHANGE ;2005.01.18;   18879;       0;    3251;    4578;   14046;   10975;   18624;   18804;     255;      75
HEAT OIL CRACK SPRD CAL SWAP - NEW YORK MERCANTILE EXCHANGE ;2005.01.11;   18790;       0;    3485;    4590;   13990;   10715;   18580;   18790;     210;       0
HEAT OIL CRACK SPRD CAL SWAP - NEW YORK MERCANTILE EXCHANGE ;2005.01.04;   18115;       0;    3805;    4320;   13615;    9990;   17935;   18115;     180;       0
HEAT OIL CRACK SPRD CAL SWAP - NEW YORK MERCANTILE EXCHANGE ;2004.12.28;   19208;      15;    3139;    5086;   13927;   10983;   19028;   19208;     180;       0
HEAT OIL CRACK SPRD CAL SWAP - NEW YORK MERCANTILE EXCHANGE ;2004.12.21;   18984;      15;    3220;    5071;   13598;   10693;   18684;   18984;     300;       0
HEAT OIL CRACK SPRD CAL SWAP - NEW YORK MERCANTILE EXCHANGE ;2004.12.14;   18834;      15;    3040;    5026;   13523;   10768;   18564;   18834;     270;       0
HEAT OIL CRACK SPRD CAL SWAP - NEW YORK MERCANTILE EXCHANGE ;2004.12.07;   18474;      15;    2875;    4951;   13328;   10648;   18294;   18474;     180;       0
HEAT OIL CRACK SPRD CAL SWAP - NEW YORK MERCANTILE EXCHANGE ;2004.11.30;   18591;     180;    1533;    5867;   12544;   11191;   18591;   18591;       0;       0
HEAT OIL CRACK SPRD CAL SWAP - NEW YORK MERCANTILE EXCHANGE ;2004.11.23;   18771;     180;    1683;    5867;   12649;   11146;   18696;   18696;      75;      75
HEAT OIL CRACK SPRD CAL SWAP - NEW YORK MERCANTILE EXCHANGE ;2004.11.16;   18706;     180;    1553;    6002;   12524;   11151;   18706;   18706;       0;       0
HEAT OIL CRACK SPRD CAL SWAP - NEW YORK MERCANTILE EXCHANGE ;2004.11.09;   18711;     397;    1075;    6135;   12179;   11501;   18711;   18711;       0;       0
HEAT OIL CRACK SPRD CAL SWAP - NEW YORK MERCANTILE EXCHANGE ;2004.11.02;   18156;    2257;    1130;    4800;   11099;   11746;   18156;   17676;       0;     480
HEAT OIL CRACK SPRD CAL SWAP - NEW YORK MERCANTILE EXCHANGE ;2004.10.26;   17734;    1248;    1320;    5755;   10731;   10659;   17734;   17734;       0;       0
HEAT OIL CRACK SPRD CAL SWAP - NEW YORK MERCANTILE EXCHANGE ;2004.10.19;   17019;     893;    1320;    5575;   10551;   10124;   17019;   17019;       0;       0
HEAT OIL CRACK SPRD CAL SWAP - NEW YORK MERCANTILE EXCHANGE ;2004.10.12;   17214;    1868;    1320;    5125;   10221;   10769;   17214;   17214;       0;       0
HEAT OIL CRACK SPRD CAL SWAP - NEW YORK MERCANTILE EXCHANGE ;2004.10.05;   17214;    1268;    1320;    5425;   10521;   10319;   17214;   17064;       0;     150
HEAT OIL CRACK SPRD CAL SWAP - NEW YORK MERCANTILE EXCHANGE ;2004.09.28;   17314;    1368;    1320;    5650;   10296;   10344;   17314;   17314;       0;       0
HEAT OIL CRACK SPRD CAL SWAP - NEW YORK MERCANTILE EXCHANGE ;2004.09.21;   15754;     345;    1677;    5098;   10311;    8859;   15754;   15634;       0;     120
HEAT OIL CRACK SPRD CAL SWAP - NEW YORK MERCANTILE EXCHANGE ;2004.09.14;   15574;     345;    2272;    4578;   10651;    8724;   15574;   15574;       0;       0
HEAT OIL CRACK SPRD CAL SWAP - NEW YORK MERCANTILE EXCHANGE ;2004.09.07;   15004;     345;    2227;    4143;   10516;    8634;   15004;   15004;       0;       0
HEAT OIL CRACK SPRD CAL SWAP - NEW YORK MERCANTILE EXCHANGE ;2004.08.31;   19399;    2548;    1625;    5170;   11681;   12604;   19399;   19399;       0;       0
HEAT OIL CRACK SPRD CAL SWAP - NEW YORK MERCANTILE EXCHANGE ;2004.08.24;   19024;    2853;    1325;    5100;   11071;   12599;   19024;   19024;       0;       0
HEAT OIL CRACK SPRD CAL SWAP - NEW YORK MERCANTILE EXCHANGE ;2004.08.17;   17959;    3948;    1325;    4320;    9691;   12314;   17959;   17959;       0;       0
HEAT OIL CRACK SPRD CAL SWAP - NEW YORK MERCANTILE EXCHANGE ;2004.08.10;   18154;    3173;    1025;    4965;   10016;   12164;   18154;   18154;       0;       0
HEAT OIL CRACK SPRD CAL SWAP - NEW YORK MERCANTILE EXCHANGE ;2004.08.03;   17734;    3323;    1025;    4470;    9941;   12239;   17734;   17734;       0;       0
HEAT OIL CRACK SPRD CAL SWAP - NEW YORK MERCANTILE EXCHANGE ;2004.07.27;   19674;    4163;    1275;    3285;   12226;   15114;   19674;   19674;       0;       0
HEAT OIL CRACK SPRD CAL SWAP - NEW YORK MERCANTILE EXCHANGE ;2004.07.20;   19619;    4313;    1275;    3285;   11766;   14909;   19364;   19469;     255;     150
HEAT OIL CRACK SPRD CAL SWAP - NEW YORK MERCANTILE EXCHANGE ;2004.07.13;   19019;    4648;    1275;    2910;   11121;   14684;   18679;   18869;     340;     150
HEAT OIL CRACK SPRD CAL SWAP - NEW YORK MERCANTILE EXCHANGE ;2004.07.06;   19024;    4688;    1575;    2985;   11201;   14314;   18874;   18874;     150;     150
HEAT OIL CRACK SPRD CAL SWAP - NEW YORK MERCANTILE EXCHANGE ;2004.06.29;   20979;    4473;    1625;    3405;   13051;   15899;   20929;   20929;      50;      50
HEAT OIL CRACK SPRD CAL SWAP - NEW YORK MERCANTILE EXCHANGE ;2004.06.22;   21039;    5028;    1625;    3510;   12501;   15904;   21039;   21039;       0;       0
HEAT OIL CRACK SPRD CAL SWAP - NEW YORK MERCANTILE EXCHANGE ;2004.06.15;   18795;    5349;    1625;    2700;   10671;   14470;   18720;   18795;      75;       0
HEAT OIL CRACK SPRD CAL SWAP - NEW YORK MERCANTILE EXCHANGE ;2004.06.08;   17295;    7449;    1625;    1650;    8196;   14020;   17295;   17295;       0;       0
HEAT OIL CRACK SPRD CAL SWAP - NEW YORK MERCANTILE EXCHANGE ;2004.06.01;   17720;   10799;    1625;     825;    6096;   15270;   17720;   17720;       0;       0
HEAT OIL CRACK SPRD CAL SWAP - NEW YORK MERCANTILE EXCHANGE ;2004.05.25;   20580;   13929;    1675;     825;    5826;   18080;   20580;   20580;       0;       0
HEAT OIL CRACK SPRD CAL SWAP - NEW YORK MERCANTILE EXCHANGE ;2004.05.18;   21705;   15015;    1600;     675;    6015;   19430;   21705;   21705;       0;       0
HEAT OIL CRACK SPRD CAL SWAP - NEW YORK MERCANTILE EXCHANGE ;2004.05.11;   21015;   14465;    1600;     600;    5950;   18815;   21015;   21015;       0;       0
HEAT OIL CRACK SPRD CAL SWAP - NEW YORK MERCANTILE EXCHANGE ;2004.05.04;   20085;   13490;    1450;     525;    5920;   17735;   19935;   19710;     150;     375
HEAT OIL CRACK SPRD CAL SWAP - NEW YORK MERCANTILE EXCHANGE ;2004.04.27;   21485;   14520;    1050;     750;    6065;   19535;   21335;   21335;     150;     150
HEAT OIL CRACK SPRD CAL SWAP - NEW YORK MERCANTILE EXCHANGE ;2004.04.20;   21335;   14595;    1050;     600;    5615;   19160;   20810;   20810;     525;     525
HEAT OIL CRACK SPRD CAL SWAP - NEW YORK MERCANTILE EXCHANGE ;2004.04.12;   20560;   13995;     450;     675;    5390;   19160;   20060;   20285;     500;     275
HEAT OIL CRACK SPRD CAL SWAP - NEW YORK MERCANTILE EXCHANGE ;2004.04.06;   17885;   11445;     450;     600;    5315;   16535;   17360;   17585;     525;     300
HEAT OIL CRACK SPRD CAL SWAP - NEW YORK MERCANTILE EXCHANGE ;2004.03.30;   21125;   14650;     500;     750;    5425;   19800;   20825;   21050;     300;      75
HEAT OIL CRACK SPRD CAL SWAP - NEW YORK MERCANTILE EXCHANGE ;2004.03.23;   19955;   14725;     500;     675;    4255;   18630;   19655;   19805;     300;     150
HEAT OIL CRACK SPRD CAL SWAP - NEW YORK MERCANTILE EXCHANGE ;2004.03.16;   18230;   13425;     500;     525;    3830;   16905;   17780;   17930;     450;     300
HEAT OIL CRACK SPRD CAL SWAP - NEW YORK MERCANTILE EXCHANGE ;2004.03.09;   16355;   12675;     500;     225;    2930;   15255;   15830;   15980;     525;     375
HEAT OIL CRACK SPRD CAL SWAP - NEW YORK MERCANTILE EXCHANGE ;2004.03.02;   16155;   12750;     500;     225;    2730;   14830;   15705;   15555;     450;     600
