NATIONAL CATASTROPHE INS. SC A - CHICAGO BOARD OF TRADE ;1999.12.14;     603;      40;      11;     207;     201;      94;     447;     312;     156;     291
NATIONAL CATASTROPHE INS. SC A - CHICAGO BOARD OF TRADE ;1999.12.07;     602;      40;      11;     205;     201;      95;     447;     312;     155;     290
NATIONAL CATASTROPHE INS. SC A - CHICAGO BOARD OF TRADE ;1999.11.30;     601;      41;      11;     205;     201;      95;     446;     311;     154;     290
NATIONAL CATASTROPHE INS. SC A - CHICAGO BOARD OF TRADE ;1999.11.23;     600;      41;      11;     204;     201;      96;     446;     311;     154;     289
NATIONAL CATASTROPHE INS. SC A - CHICAGO BOARD OF TRADE ;1999.11.16;     600;      41;      11;     204;     201;      96;     446;     311;     154;     289
NATIONAL CATASTROPHE INS. SC A - CHICAGO BOARD OF TRADE ;1999.11.09;     599;      42;      11;     203;     201;      97;     446;     311;     154;     288
NATIONAL CATASTROPHE INS. SC A - CHICAGO BOARD OF TRADE ;1999.11.02;     599;      42;      12;     202;     202;      98;     446;     311;     153;     288
NATIONAL CATASTROPHE INS. SC A - CHICAGO BOARD OF TRADE ;1999.10.26;     599;      42;      12;     201;     202;      98;     445;     311;     153;     287
NATIONAL CATASTROPHE INS. SC A - CHICAGO BOARD OF TRADE ;1999.10.19;     598;      42;      12;     201;     202;      99;     445;     311;     153;     287
NATIONAL CATASTROPHE INS. SC A - CHICAGO BOARD OF TRADE ;1999.10.12;     598;      43;      12;     201;     202;      99;     445;     311;     153;     287
NATIONAL CATASTROPHE INS. SC A - CHICAGO BOARD OF TRADE ;1999.10.05;     597;      43;      12;     200;     201;      99;     444;     311;     153;     286
NATIONAL CATASTROPHE INS. SC A - CHICAGO BOARD OF TRADE ;1999.09.28;     596;      43;      12;     200;     201;      99;     444;     311;     152;     286
NATIONAL CATASTROPHE INS. SC A - CHICAGO BOARD OF TRADE ;1999.09.21;     596;      43;      12;     200;     201;     100;     444;     311;     152;     285
NATIONAL CATASTROPHE INS. SC A - CHICAGO BOARD OF TRADE ;1999.09.14;     603;      43;      12;     200;     201;     100;     443;     311;     159;     292
NATIONAL CATASTROPHE INS. SC A - CHICAGO BOARD OF TRADE ;1999.09.07;     595;      43;      12;     199;     201;     100;     443;     310;     153;     285
NATIONAL CATASTROPHE INS. SC A - CHICAGO BOARD OF TRADE ;1999.08.31;     595;      43;      12;     199;     201;     100;     442;     310;     153;     285
NATIONAL CATASTROPHE INS. SC A - CHICAGO BOARD OF TRADE ;1999.08.24;     594;      43;      12;     198;     201;     100;     442;     310;     152;     284
NATIONAL CATASTROPHE INS. SC A - CHICAGO BOARD OF TRADE ;1999.08.17;     589;      43;      12;     198;     201;     100;     442;     310;     147;     279
NATIONAL CATASTROPHE INS. SC A - CHICAGO BOARD OF TRADE ;1999.08.10;     588;      43;      11;     198;     201;     101;     441;     310;     147;     279
NATIONAL CATASTROPHE INS. SC A - CHICAGO BOARD OF TRADE ;1999.08.03;     588;      43;      11;     198;     200;     101;     441;     310;     147;     278
NATIONAL CATASTROPHE INS. SC A - CHICAGO BOARD OF TRADE ;1999.07.27;     588;      43;      11;     197;     200;     101;     441;     310;     147;     278
NATIONAL CATASTROPHE INS. SC A - CHICAGO BOARD OF TRADE ;1999.07.20;     587;      43;      11;     197;     200;     101;     440;     309;     146;     277
NATIONAL CATASTROPHE INS. SC A - CHICAGO BOARD OF TRADE ;1999.07.13;     586;      43;      11;     197;     200;     101;     440;     309;     146;     277
NATIONAL CATASTROPHE INS. SC A - CHICAGO BOARD OF TRADE ;1999.07.06;     586;      43;      11;     196;     200;     101;     439;     309;     146;     276
NATIONAL CATASTROPHE INS. SC A - CHICAGO BOARD OF TRADE ;1999.06.29;     585;      43;      11;     196;     200;     101;     439;     309;     146;     276
NATIONAL CATASTROPHE INS. SC A - CHICAGO BOARD OF TRADE ;1999.06.22;     585;      43;      11;     196;     200;     102;     439;     309;     146;     276
NATIONAL CATASTROPHE INS. SC A - CHICAGO BOARD OF TRADE ;1999.06.15;     584;      43;      11;     196;     200;     102;     438;     309;     146;     275
NATIONAL CATASTROPHE INS. SC A - CHICAGO BOARD OF TRADE ;1999.06.08;     583;      43;      11;     195;     199;     102;     438;     308;     146;     275
NATIONAL CATASTROPHE INS. SC A - CHICAGO BOARD OF TRADE ;1999.06.01;     583;      43;      11;     195;     199;     102;     437;     309;     146;     275
NATIONAL CATASTROPHE INS. SC A - CHICAGO BOARD OF TRADE ;1999.05.25;     582;      43;      11;     195;     199;     102;     437;     308;     145;     274
NATIONAL CATASTROPHE INS. SC A - CHICAGO BOARD OF TRADE ;1999.12.14;     603;      40;      11;     207;     201;      94;     447;     312;     156;     291
NATIONAL CATASTROPHE INS. SC A - CHICAGO BOARD OF TRADE ;1999.12.07;     602;      40;      11;     205;     201;      95;     447;     312;     155;     290
NATIONAL CATASTROPHE INS. SC A - CHICAGO BOARD OF TRADE ;1999.11.30;     601;      41;      11;     205;     201;      95;     446;     311;     154;     290
NATIONAL CATASTROPHE INS. SC A - CHICAGO BOARD OF TRADE ;1999.11.23;     600;      41;      11;     204;     201;      96;     446;     311;     154;     289
NATIONAL CATASTROPHE INS. SC A - CHICAGO BOARD OF TRADE ;1999.11.16;     600;      41;      11;     204;     201;      96;     446;     311;     154;     289
NATIONAL CATASTROPHE INS. SC A - CHICAGO BOARD OF TRADE ;1999.11.09;     599;      42;      11;     203;     201;      97;     446;     311;     154;     288
NATIONAL CATASTROPHE INS. SC A - CHICAGO BOARD OF TRADE ;1999.11.02;     599;      42;      12;     202;     202;      98;     446;     311;     153;     288
NATIONAL CATASTROPHE INS. SC A - CHICAGO BOARD OF TRADE ;1999.10.26;     599;      42;      12;     201;     202;      98;     445;     311;     153;     287
NATIONAL CATASTROPHE INS. SC A - CHICAGO BOARD OF TRADE ;1999.10.19;     598;      42;      12;     201;     202;      99;     445;     311;     153;     287
NATIONAL CATASTROPHE INS. SC A - CHICAGO BOARD OF TRADE ;1999.10.12;     598;      43;      12;     201;     202;      99;     445;     311;     153;     287
NATIONAL CATASTROPHE INS. SC A - CHICAGO BOARD OF TRADE ;1999.10.05;     597;      43;      12;     200;     201;      99;     444;     311;     153;     286
NATIONAL CATASTROPHE INS. SC A - CHICAGO BOARD OF TRADE ;1999.09.28;     596;      43;      12;     200;     201;      99;     444;     311;     152;     286
NATIONAL CATASTROPHE INS. SC A - CHICAGO BOARD OF TRADE ;1999.09.21;     596;      43;      12;     200;     201;     100;     444;     311;     152;     285
NATIONAL CATASTROPHE INS. SC A - CHICAGO BOARD OF TRADE ;1999.09.14;     603;      43;      12;     200;     201;     100;     443;     311;     159;     292
NATIONAL CATASTROPHE INS. SC A - CHICAGO BOARD OF TRADE ;1999.09.07;     595;      43;      12;     199;     201;     100;     443;     310;     153;     285
NATIONAL CATASTROPHE INS. SC A - CHICAGO BOARD OF TRADE ;1999.08.31;     595;      43;      12;     199;     201;     100;     442;     310;     153;     285
NATIONAL CATASTROPHE INS. SC A - CHICAGO BOARD OF TRADE ;1999.08.24;     594;      43;      12;     198;     201;     100;     442;     310;     152;     284
NATIONAL CATASTROPHE INS. SC A - CHICAGO BOARD OF TRADE ;1999.08.17;     589;      43;      12;     198;     201;     100;     442;     310;     147;     279
NATIONAL CATASTROPHE INS. SC A - CHICAGO BOARD OF TRADE ;1999.08.10;     588;      43;      11;     198;     201;     101;     441;     310;     147;     279
NATIONAL CATASTROPHE INS. SC A - CHICAGO BOARD OF TRADE ;1999.08.03;     588;      43;      11;     198;     200;     101;     441;     310;     147;     278
NATIONAL CATASTROPHE INS. SC A - CHICAGO BOARD OF TRADE ;1999.07.27;     588;      43;      11;     197;     200;     101;     441;     310;     147;     278
NATIONAL CATASTROPHE INS. SC A - CHICAGO BOARD OF TRADE ;1999.07.20;     587;      43;      11;     197;     200;     101;     440;     309;     146;     277
NATIONAL CATASTROPHE INS. SC A - CHICAGO BOARD OF TRADE ;1999.07.13;     586;      43;      11;     197;     200;     101;     440;     309;     146;     277
NATIONAL CATASTROPHE INS. SC A - CHICAGO BOARD OF TRADE ;1999.07.06;     586;      43;      11;     196;     200;     101;     439;     309;     146;     276
NATIONAL CATASTROPHE INS. SC A - CHICAGO BOARD OF TRADE ;1999.06.29;     585;      43;      11;     196;     200;     101;     439;     309;     146;     276
NATIONAL CATASTROPHE INS. SC A - CHICAGO BOARD OF TRADE ;1999.06.22;     585;      43;      11;     196;     200;     102;     439;     309;     146;     276
NATIONAL CATASTROPHE INS. SC A - CHICAGO BOARD OF TRADE ;1999.06.15;     584;      43;      11;     196;     200;     102;     438;     309;     146;     275
NATIONAL CATASTROPHE INS. SC A - CHICAGO BOARD OF TRADE ;1999.06.08;     583;      43;      11;     195;     199;     102;     438;     308;     146;     275
NATIONAL CATASTROPHE INS. SC A - CHICAGO BOARD OF TRADE ;1999.06.01;     583;      43;      11;     195;     199;     102;     437;     309;     146;     275
NATIONAL CATASTROPHE INS. SC A - CHICAGO BOARD OF TRADE ;1999.05.25;     582;      43;      11;     195;     199;     102;     437;     308;     145;     274
NATIONAL CATASTROPHE INS. SC A - CHICAGO BOARD OF TRADE ;1999.12.14;     603;      40;      11;     207;     201;      94;     447;     312;     156;     291
NATIONAL CATASTROPHE INS. SC A - CHICAGO BOARD OF TRADE ;1999.12.07;     602;      40;      11;     205;     201;      95;     447;     312;     155;     290
NATIONAL CATASTROPHE INS. SC A - CHICAGO BOARD OF TRADE ;1999.11.30;     601;      41;      11;     205;     201;      95;     446;     311;     154;     290
NATIONAL CATASTROPHE INS. SC A - CHICAGO BOARD OF TRADE ;1999.11.23;     600;      41;      11;     204;     201;      96;     446;     311;     154;     289
NATIONAL CATASTROPHE INS. SC A - CHICAGO BOARD OF TRADE ;1999.11.16;     600;      41;      11;     204;     201;      96;     446;     311;     154;     289
NATIONAL CATASTROPHE INS. SC A - CHICAGO BOARD OF TRADE ;1999.11.09;     599;      42;      11;     203;     201;      97;     446;     311;     154;     288
NATIONAL CATASTROPHE INS. SC A - CHICAGO BOARD OF TRADE ;1999.11.02;     599;      42;      12;     202;     202;      98;     446;     311;     153;     288
NATIONAL CATASTROPHE INS. SC A - CHICAGO BOARD OF TRADE ;1999.10.26;     599;      42;      12;     201;     202;      98;     445;     311;     153;     287
NATIONAL CATASTROPHE INS. SC A - CHICAGO BOARD OF TRADE ;1999.10.19;     598;      42;      12;     201;     202;      99;     445;     311;     153;     287
NATIONAL CATASTROPHE INS. SC A - CHICAGO BOARD OF TRADE ;1999.10.12;     598;      43;      12;     201;     202;      99;     445;     311;     153;     287
NATIONAL CATASTROPHE INS. SC A - CHICAGO BOARD OF TRADE ;1999.10.05;     597;      43;      12;     200;     201;      99;     444;     311;     153;     286
NATIONAL CATASTROPHE INS. SC A - CHICAGO BOARD OF TRADE ;1999.09.28;     596;      43;      12;     200;     201;      99;     444;     311;     152;     286
NATIONAL CATASTROPHE INS. SC A - CHICAGO BOARD OF TRADE ;1999.09.21;     596;      43;      12;     200;     201;     100;     444;     311;     152;     285
NATIONAL CATASTROPHE INS. SC A - CHICAGO BOARD OF TRADE ;1999.09.14;     603;      43;      12;     200;     201;     100;     443;     311;     159;     292
NATIONAL CATASTROPHE INS. SC A - CHICAGO BOARD OF TRADE ;1999.09.07;     595;      43;      12;     199;     201;     100;     443;     310;     153;     285
NATIONAL CATASTROPHE INS. SC A - CHICAGO BOARD OF TRADE ;1999.08.31;     595;      43;      12;     199;     201;     100;     442;     310;     153;     285
NATIONAL CATASTROPHE INS. SC A - CHICAGO BOARD OF TRADE ;1999.08.24;     594;      43;      12;     198;     201;     100;     442;     310;     152;     284
NATIONAL CATASTROPHE INS. SC A - CHICAGO BOARD OF TRADE ;1999.08.17;     589;      43;      12;     198;     201;     100;     442;     310;     147;     279
NATIONAL CATASTROPHE INS. SC A - CHICAGO BOARD OF TRADE ;1999.08.10;     588;      43;      11;     198;     201;     101;     441;     310;     147;     279
NATIONAL CATASTROPHE INS. SC A - CHICAGO BOARD OF TRADE ;1999.08.03;     588;      43;      11;     198;     200;     101;     441;     310;     147;     278
NATIONAL CATASTROPHE INS. SC A - CHICAGO BOARD OF TRADE ;1999.07.27;     588;      43;      11;     197;     200;     101;     441;     310;     147;     278
NATIONAL CATASTROPHE INS. SC A - CHICAGO BOARD OF TRADE ;1999.07.20;     587;      43;      11;     197;     200;     101;     440;     309;     146;     277
NATIONAL CATASTROPHE INS. SC A - CHICAGO BOARD OF TRADE ;1999.07.13;     586;      43;      11;     197;     200;     101;     440;     309;     146;     277
NATIONAL CATASTROPHE INS. SC A - CHICAGO BOARD OF TRADE ;1999.07.06;     586;      43;      11;     196;     200;     101;     439;     309;     146;     276
NATIONAL CATASTROPHE INS. SC A - CHICAGO BOARD OF TRADE ;1999.06.29;     585;      43;      11;     196;     200;     101;     439;     309;     146;     276
NATIONAL CATASTROPHE INS. SC A - CHICAGO BOARD OF TRADE ;1999.06.22;     585;      43;      11;     196;     200;     102;     439;     309;     146;     276
NATIONAL CATASTROPHE INS. SC A - CHICAGO BOARD OF TRADE ;1999.06.15;     584;      43;      11;     196;     200;     102;     438;     309;     146;     275
NATIONAL CATASTROPHE INS. SC A - CHICAGO BOARD OF TRADE ;1999.06.08;     583;      43;      11;     195;     199;     102;     438;     308;     146;     275
NATIONAL CATASTROPHE INS. SC A - CHICAGO BOARD OF TRADE ;1999.06.01;     583;      43;      11;     195;     199;     102;     437;     309;     146;     275
NATIONAL CATASTROPHE INS. SC A - CHICAGO BOARD OF TRADE ;1999.05.25;     582;      43;      11;     195;     199;     102;     437;     308;     145;     274
