TRANSCO ZONE 3 SWAP - NEW YORK MERCANTILE EXCHANGE ;2009.06.30;   54089;       0;    1228;       0;   45803;   48795;   45803;   50023;    8286;    4066
TRANSCO ZONE 3 SWAP - NEW YORK MERCANTILE EXCHANGE ;2008.09.30;   51782;       0;    1270;       0;   45307;   45555;   45307;   46825;    6475;    4957
TRANSCO ZONE 3 SWAP - NEW YORK MERCANTILE EXCHANGE ;2008.09.23;   47744;       0;    1270;       0;   41447;   41610;   41447;   42880;    6297;    4864
TRANSCO ZONE 3 SWAP - NEW YORK MERCANTILE EXCHANGE ;2008.09.16;   47744;       0;    1270;       0;   40843;   41610;   40843;   42880;    6901;    4864
TRANSCO ZONE 3 SWAP - NEW YORK MERCANTILE EXCHANGE ;2008.09.09;   47744;       0;    3779;       0;   40843;   39492;   40843;   43271;    6901;    4473
TRANSCO ZONE 3 SWAP - NEW YORK MERCANTILE EXCHANGE ;2008.09.02;   46086;       0;    3779;       0;   38641;   38178;   38641;   41957;    7445;    4129
TRANSCO ZONE 3 SWAP - NEW YORK MERCANTILE EXCHANGE ;2008.08.26;   50407;       0;    4603;       0;   42061;   40954;   42061;   45557;    8346;    4850
TRANSCO ZONE 3 SWAP - NEW YORK MERCANTILE EXCHANGE ;2008.08.19;   49979;       0;    4603;       0;   42061;   40526;   42061;   45129;    7918;    4850
TRANSCO ZONE 3 SWAP - NEW YORK MERCANTILE EXCHANGE ;2008.08.12;   50955;       0;    5579;       0;   42917;   40526;   42917;   46105;    8038;    4850
TRANSCO ZONE 3 SWAP - NEW YORK MERCANTILE EXCHANGE ;2008.08.05;   50804;       0;    5428;       0;   42917;   40526;   42917;   45954;    7887;    4850
TRANSCO ZONE 3 SWAP - NEW YORK MERCANTILE EXCHANGE ;2008.07.29;   55330;       0;    6045;       0;   48106;   44424;   48106;   50469;    7224;    4861
TRANSCO ZONE 3 SWAP - NEW YORK MERCANTILE EXCHANGE ;2008.07.22;   55665;       0;    6045;       0;   48013;   44331;   48013;   50376;    7652;    5289
TRANSCO ZONE 3 SWAP - NEW YORK MERCANTILE EXCHANGE ;2008.07.15;   54721;       0;    6171;       0;   47711;   43903;   47711;   50074;    7010;    4647
TRANSCO ZONE 3 SWAP - NEW YORK MERCANTILE EXCHANGE ;2008.07.08;   54721;       0;    7883;       0;   47711;   43903;   47711;   51786;    7010;    2935
TRANSCO ZONE 3 SWAP - NEW YORK MERCANTILE EXCHANGE ;2008.07.01;   52936;       0;    6156;       0;   45185;   43543;   45185;   49699;    7751;    3237
TRANSCO ZONE 3 SWAP - NEW YORK MERCANTILE EXCHANGE ;2008.04.22;   58742;       0;    9698;    1510;   50520;   45331;   52030;   56539;    6712;    2203
TRANSCO ZONE 3 SWAP - NEW YORK MERCANTILE EXCHANGE ;2008.04.15;   54572;       0;    4914;    1510;   46350;   46247;   47860;   52671;    6712;    1901
TRANSCO ZONE 3 SWAP - NEW YORK MERCANTILE EXCHANGE ;2008.04.08;   55469;       0;    3070;    1973;   47086;   47309;   49059;   52352;    6410;    3117
TRANSCO ZONE 3 SWAP - NEW YORK MERCANTILE EXCHANGE ;2008.03.11;   57210;       0;    3064;    2310;   48622;   47075;   50932;   52449;    6278;    4761
TRANSCO ZONE 3 SWAP - NEW YORK MERCANTILE EXCHANGE ;2008.01.29;   55933;       0;    2489;    2005;   48238;   46059;   50243;   50553;    5690;    5380
TRANSCO ZONE 3 SWAP - NEW YORK MERCANTILE EXCHANGE ;2009.06.30;   54089;       0;    1228;       0;   45803;   48795;   45803;   50023;    8286;    4066
TRANSCO ZONE 3 SWAP - NEW YORK MERCANTILE EXCHANGE ;2008.09.30;   51782;       0;    1270;       0;   45307;   45555;   45307;   46825;    6475;    4957
TRANSCO ZONE 3 SWAP - NEW YORK MERCANTILE EXCHANGE ;2008.09.23;   47744;       0;    1270;       0;   41447;   41610;   41447;   42880;    6297;    4864
TRANSCO ZONE 3 SWAP - NEW YORK MERCANTILE EXCHANGE ;2008.09.16;   47744;       0;    1270;       0;   40843;   41610;   40843;   42880;    6901;    4864
TRANSCO ZONE 3 SWAP - NEW YORK MERCANTILE EXCHANGE ;2008.09.09;   47744;       0;    3779;       0;   40843;   39492;   40843;   43271;    6901;    4473
TRANSCO ZONE 3 SWAP - NEW YORK MERCANTILE EXCHANGE ;2008.09.02;   46086;       0;    3779;       0;   38641;   38178;   38641;   41957;    7445;    4129
TRANSCO ZONE 3 SWAP - NEW YORK MERCANTILE EXCHANGE ;2008.08.26;   50407;       0;    4603;       0;   42061;   40954;   42061;   45557;    8346;    4850
TRANSCO ZONE 3 SWAP - NEW YORK MERCANTILE EXCHANGE ;2008.08.19;   49979;       0;    4603;       0;   42061;   40526;   42061;   45129;    7918;    4850
TRANSCO ZONE 3 SWAP - NEW YORK MERCANTILE EXCHANGE ;2008.08.12;   50955;       0;    5579;       0;   42917;   40526;   42917;   46105;    8038;    4850
TRANSCO ZONE 3 SWAP - NEW YORK MERCANTILE EXCHANGE ;2008.08.05;   50804;       0;    5428;       0;   42917;   40526;   42917;   45954;    7887;    4850
TRANSCO ZONE 3 SWAP - NEW YORK MERCANTILE EXCHANGE ;2008.07.29;   55330;       0;    6045;       0;   48106;   44424;   48106;   50469;    7224;    4861
TRANSCO ZONE 3 SWAP - NEW YORK MERCANTILE EXCHANGE ;2008.07.22;   55665;       0;    6045;       0;   48013;   44331;   48013;   50376;    7652;    5289
TRANSCO ZONE 3 SWAP - NEW YORK MERCANTILE EXCHANGE ;2008.07.15;   54721;       0;    6171;       0;   47711;   43903;   47711;   50074;    7010;    4647
TRANSCO ZONE 3 SWAP - NEW YORK MERCANTILE EXCHANGE ;2008.07.08;   54721;       0;    7883;       0;   47711;   43903;   47711;   51786;    7010;    2935
TRANSCO ZONE 3 SWAP - NEW YORK MERCANTILE EXCHANGE ;2008.07.01;   52936;       0;    6156;       0;   45185;   43543;   45185;   49699;    7751;    3237
TRANSCO ZONE 3 SWAP - NEW YORK MERCANTILE EXCHANGE ;2008.04.22;   58742;       0;    9698;    1510;   50520;   45331;   52030;   56539;    6712;    2203
TRANSCO ZONE 3 SWAP - NEW YORK MERCANTILE EXCHANGE ;2008.04.15;   54572;       0;    4914;    1510;   46350;   46247;   47860;   52671;    6712;    1901
TRANSCO ZONE 3 SWAP - NEW YORK MERCANTILE EXCHANGE ;2008.04.08;   55469;       0;    3070;    1973;   47086;   47309;   49059;   52352;    6410;    3117
TRANSCO ZONE 3 SWAP - NEW YORK MERCANTILE EXCHANGE ;2008.03.11;   57210;       0;    3064;    2310;   48622;   47075;   50932;   52449;    6278;    4761
TRANSCO ZONE 3 SWAP - NEW YORK MERCANTILE EXCHANGE ;2008.01.29;   55933;       0;    2489;    2005;   48238;   46059;   50243;   50553;    5690;    5380
TRANSCO ZONE 3 SWAP - NEW YORK MERCANTILE EXCHANGE ;2009.06.30;   54089;       0;    1228;       0;   45803;   48795;   45803;   50023;    8286;    4066
TRANSCO ZONE 3 SWAP - NEW YORK MERCANTILE EXCHANGE ;2008.09.30;   51782;       0;    1270;       0;   45307;   45555;   45307;   46825;    6475;    4957
TRANSCO ZONE 3 SWAP - NEW YORK MERCANTILE EXCHANGE ;2008.09.23;   47744;       0;    1270;       0;   41447;   41610;   41447;   42880;    6297;    4864
TRANSCO ZONE 3 SWAP - NEW YORK MERCANTILE EXCHANGE ;2008.09.16;   47744;       0;    1270;       0;   40843;   41610;   40843;   42880;    6901;    4864
TRANSCO ZONE 3 SWAP - NEW YORK MERCANTILE EXCHANGE ;2008.09.09;   47744;       0;    3779;       0;   40843;   39492;   40843;   43271;    6901;    4473
TRANSCO ZONE 3 SWAP - NEW YORK MERCANTILE EXCHANGE ;2008.09.02;   46086;       0;    3779;       0;   38641;   38178;   38641;   41957;    7445;    4129
TRANSCO ZONE 3 SWAP - NEW YORK MERCANTILE EXCHANGE ;2008.08.26;   50407;       0;    4603;       0;   42061;   40954;   42061;   45557;    8346;    4850
TRANSCO ZONE 3 SWAP - NEW YORK MERCANTILE EXCHANGE ;2008.08.19;   49979;       0;    4603;       0;   42061;   40526;   42061;   45129;    7918;    4850
TRANSCO ZONE 3 SWAP - NEW YORK MERCANTILE EXCHANGE ;2008.08.12;   50955;       0;    5579;       0;   42917;   40526;   42917;   46105;    8038;    4850
TRANSCO ZONE 3 SWAP - NEW YORK MERCANTILE EXCHANGE ;2008.08.05;   50804;       0;    5428;       0;   42917;   40526;   42917;   45954;    7887;    4850
TRANSCO ZONE 3 SWAP - NEW YORK MERCANTILE EXCHANGE ;2008.07.29;   55330;       0;    6045;       0;   48106;   44424;   48106;   50469;    7224;    4861
TRANSCO ZONE 3 SWAP - NEW YORK MERCANTILE EXCHANGE ;2008.07.22;   55665;       0;    6045;       0;   48013;   44331;   48013;   50376;    7652;    5289
TRANSCO ZONE 3 SWAP - NEW YORK MERCANTILE EXCHANGE ;2008.07.15;   54721;       0;    6171;       0;   47711;   43903;   47711;   50074;    7010;    4647
TRANSCO ZONE 3 SWAP - NEW YORK MERCANTILE EXCHANGE ;2008.07.08;   54721;       0;    7883;       0;   47711;   43903;   47711;   51786;    7010;    2935
TRANSCO ZONE 3 SWAP - NEW YORK MERCANTILE EXCHANGE ;2008.07.01;   52936;       0;    6156;       0;   45185;   43543;   45185;   49699;    7751;    3237
TRANSCO ZONE 3 SWAP - NEW YORK MERCANTILE EXCHANGE ;2008.04.22;   58742;       0;    9698;    1510;   50520;   45331;   52030;   56539;    6712;    2203
TRANSCO ZONE 3 SWAP - NEW YORK MERCANTILE EXCHANGE ;2008.04.15;   54572;       0;    4914;    1510;   46350;   46247;   47860;   52671;    6712;    1901
TRANSCO ZONE 3 SWAP - NEW YORK MERCANTILE EXCHANGE ;2008.04.08;   55469;       0;    3070;    1973;   47086;   47309;   49059;   52352;    6410;    3117
TRANSCO ZONE 3 SWAP - NEW YORK MERCANTILE EXCHANGE ;2008.03.11;   57210;       0;    3064;    2310;   48622;   47075;   50932;   52449;    6278;    4761
TRANSCO ZONE 3 SWAP - NEW YORK MERCANTILE EXCHANGE ;2008.01.29;   55933;       0;    2489;    2005;   48238;   46059;   50243;   50553;    5690;    5380
