MIDWESTERN CATASTROPHE INS SC - CHICAGO BOARD OF TRADE ;1999.06.29;     743;      40;      99;     438;     223;     164;     701;     701;      42;      42
MIDWESTERN CATASTROPHE INS SC - CHICAGO BOARD OF TRADE ;1999.06.22;     743;      40;      99;     438;     223;     164;     701;     701;      42;      42
MIDWESTERN CATASTROPHE INS SC - CHICAGO BOARD OF TRADE ;1999.06.15;     725;      46;     114;     415;     223;     156;     684;     685;      41;      40
MIDWESTERN CATASTROPHE INS SC - CHICAGO BOARD OF TRADE ;1999.06.08;     723;      46;     115;     413;     222;     155;     682;     683;      41;      39
MIDWESTERN CATASTROPHE INS SC - CHICAGO BOARD OF TRADE ;1999.06.01;     720;      47;     116;     411;     222;     154;     679;     681;      41;      39
MIDWESTERN CATASTROPHE INS SC - CHICAGO BOARD OF TRADE ;1999.05.25;     719;      47;     116;     410;     221;     154;     678;     680;      41;      39
MIDWESTERN CATASTROPHE INS SC - CHICAGO BOARD OF TRADE ;1999.05.18;     717;      47;     116;     409;     221;     153;     677;     678;      41;      39
MIDWESTERN CATASTROPHE INS SC - CHICAGO BOARD OF TRADE ;1999.05.11;     716;      47;     116;     408;     221;     153;     675;     677;      40;      39
MIDWESTERN CATASTROPHE INS SC - CHICAGO BOARD OF TRADE ;1999.05.04;     714;      47;     117;     407;     220;     152;     674;     676;      40;      39
MIDWESTERN CATASTROPHE INS SC - CHICAGO BOARD OF TRADE ;1999.04.27;     713;      47;     116;     406;     220;     152;     673;     674;      40;      39
MIDWESTERN CATASTROPHE INS SC - CHICAGO BOARD OF TRADE ;1999.04.20;     712;      47;     116;     405;     220;     152;     672;     674;      40;      38
MIDWESTERN CATASTROPHE INS SC - CHICAGO BOARD OF TRADE ;1999.04.13;     711;      47;     116;     404;     219;     152;     671;     672;      40;      38
MIDWESTERN CATASTROPHE INS SC - CHICAGO BOARD OF TRADE ;1999.04.06;     710;      47;     116;     404;     219;     152;     670;     672;      40;      38
MIDWESTERN CATASTROPHE INS SC - CHICAGO BOARD OF TRADE ;1999.03.30;     708;      47;     116;     403;     219;     151;     668;     670;      40;      38
MIDWESTERN CATASTROPHE INS SC - CHICAGO BOARD OF TRADE ;1997.07.08;     416;       0;     124;      48;     267;      46;     314;     218;     102;     198
MIDWESTERN CATASTROPHE INS SC - CHICAGO BOARD OF TRADE ;1997.07.01;     961;       0;     153;     203;     588;     336;     792;     693;     169;     268
MIDWESTERN CATASTROPHE INS SC - CHICAGO BOARD OF TRADE ;1997.06.24;    1147;       0;     124;     288;     612;     398;     900;     810;     247;     337
MIDWESTERN CATASTROPHE INS SC - CHICAGO BOARD OF TRADE ;1997.06.17;    1153;       0;     122;     290;     614;     402;     904;     815;     249;     338
MIDWESTERN CATASTROPHE INS SC - CHICAGO BOARD OF TRADE ;1997.06.10;    1155;       0;     129;     284;     617;     407;     901;     821;     254;     335
MIDWESTERN CATASTROPHE INS SC - CHICAGO BOARD OF TRADE ;1997.06.03;    1161;       0;     128;     286;     619;     411;     905;     825;     256;     335
MIDWESTERN CATASTROPHE INS SC - CHICAGO BOARD OF TRADE ;1997.05.27;    1120;       0;     151;     324;     620;     414;     944;     889;     177;     231
MIDWESTERN CATASTROPHE INS SC - CHICAGO BOARD OF TRADE ;1997.05.20;    1127;       0;     150;     326;     622;     418;     948;     895;     178;     232
MIDWESTERN CATASTROPHE INS SC - CHICAGO BOARD OF TRADE ;1997.05.13;    1044;       0;     150;     297;     580;     378;     877;     825;     167;     219
MIDWESTERN CATASTROPHE INS SC - CHICAGO BOARD OF TRADE ;1997.05.06;    1050;       0;     148;     300;     582;     382;     882;     830;     168;     220
MIDWESTERN CATASTROPHE INS SC - CHICAGO BOARD OF TRADE ;1997.04.29;    1056;       0;     147;     303;     584;     386;     887;     835;     169;     220
MIDWESTERN CATASTROPHE INS SC - CHICAGO BOARD OF TRADE ;1997.04.22;    1062;       0;     146;     305;     586;     390;     892;     841;     170;     221
MIDWESTERN CATASTROPHE INS SC - CHICAGO BOARD OF TRADE ;1997.04.15;    1066;       0;     145;     307;     588;     392;     895;     845;     171;     221
MIDWESTERN CATASTROPHE INS SC - CHICAGO BOARD OF TRADE ;1997.04.08;    1072;       0;     144;     310;     590;     396;     900;     850;     172;     222
MIDWESTERN CATASTROPHE INS SC - CHICAGO BOARD OF TRADE ;1997.04.01;    1081;       0;     142;     314;     593;     402;     907;     857;     174;     223
MIDWESTERN CATASTROPHE INS SC - CHICAGO BOARD OF TRADE ;1997.03.25;    1081;       0;     130;     298;     593;     403;     891;     831;     191;     250
MIDWESTERN CATASTROPHE INS SC - CHICAGO BOARD OF TRADE ;1997.03.18;     844;       0;     106;     265;     435;     300;     700;     671;     144;     173
MIDWESTERN CATASTROPHE INS SC - CHICAGO BOARD OF TRADE ;1997.03.11;     848;       0;     106;     267;     437;     302;     703;     675;     145;     173
MIDWESTERN CATASTROPHE INS SC - CHICAGO BOARD OF TRADE ;1997.03.04;     852;       0;     105;     269;     438;     305;     706;     678;     145;     173
MIDWESTERN CATASTROPHE INS SC - CHICAGO BOARD OF TRADE ;1997.02.25;     851;       0;     104;     270;     436;     305;     707;     680;     144;     171
MIDWESTERN CATASTROPHE INS SC - CHICAGO BOARD OF TRADE ;1997.02.18;     816;       0;     104;     272;     408;     289;     680;     665;     135;     151
MIDWESTERN CATASTROPHE INS SC - CHICAGO BOARD OF TRADE ;1997.02.11;     821;       0;     103;     274;     411;     292;     685;     669;     136;     152
MIDWESTERN CATASTROPHE INS SC - CHICAGO BOARD OF TRADE ;1997.02.04;     822;       0;     102;     275;     410;     293;     685;     670;     137;     152
MIDWESTERN CATASTROPHE INS SC - CHICAGO BOARD OF TRADE ;1997.01.28;     828;       0;     101;     277;     412;     295;     688;     673;     139;     155
MIDWESTERN CATASTROPHE INS SC - CHICAGO BOARD OF TRADE ;1997.01.21;     831;       0;     100;     278;     412;     297;     691;     675;     140;     155
MIDWESTERN CATASTROPHE INS SC - CHICAGO BOARD OF TRADE ;1997.01.14;     831;       0;      99;     279;     413;     299;     692;     677;     139;     155
MIDWESTERN CATASTROPHE INS SC - CHICAGO BOARD OF TRADE ;1997.01.07;     835;       0;      98;     281;     415;     301;     695;     680;     140;     155
MIDWESTERN CATASTROPHE INS SC - CHICAGO BOARD OF TRADE ;1996.12.31;     804;       0;      95;     267;     411;     296;     678;     658;     126;     147
MIDWESTERN CATASTROPHE INS SC - CHICAGO BOARD OF TRADE ;1996.12.24;     807;       0;      94;     268;     412;     298;     680;     660;     127;     147
MIDWESTERN CATASTROPHE INS SC - CHICAGO BOARD OF TRADE ;1996.12.17;     812;       0;      63;     211;     414;     301;     625;     575;     187;     237
MIDWESTERN CATASTROPHE INS SC - CHICAGO BOARD OF TRADE ;1996.12.10;     815;       0;      62;     212;     415;     303;     627;     577;     188;     237
MIDWESTERN CATASTROPHE INS SC - CHICAGO BOARD OF TRADE ;1996.12.03;     630;       0;      33;      82;     334;     229;     416;     344;     214;     286
MIDWESTERN CATASTROPHE INS SC - CHICAGO BOARD OF TRADE ;1999.06.29;     743;      40;      99;     438;     223;     164;     701;     701;      42;      42
MIDWESTERN CATASTROPHE INS SC - CHICAGO BOARD OF TRADE ;1999.06.22;     743;      40;      99;     438;     223;     164;     701;     701;      42;      42
MIDWESTERN CATASTROPHE INS SC - CHICAGO BOARD OF TRADE ;1999.06.15;     725;      46;     114;     415;     223;     156;     684;     685;      41;      40
MIDWESTERN CATASTROPHE INS SC - CHICAGO BOARD OF TRADE ;1999.06.08;     723;      46;     115;     413;     222;     155;     682;     683;      41;      39
MIDWESTERN CATASTROPHE INS SC - CHICAGO BOARD OF TRADE ;1999.06.01;     720;      47;     116;     411;     222;     154;     679;     681;      41;      39
MIDWESTERN CATASTROPHE INS SC - CHICAGO BOARD OF TRADE ;1999.05.25;     719;      47;     116;     410;     221;     154;     678;     680;      41;      39
MIDWESTERN CATASTROPHE INS SC - CHICAGO BOARD OF TRADE ;1999.05.18;     717;      47;     116;     409;     221;     153;     677;     678;      41;      39
MIDWESTERN CATASTROPHE INS SC - CHICAGO BOARD OF TRADE ;1999.05.11;     716;      47;     116;     408;     221;     153;     675;     677;      40;      39
MIDWESTERN CATASTROPHE INS SC - CHICAGO BOARD OF TRADE ;1999.05.04;     714;      47;     117;     407;     220;     152;     674;     676;      40;      39
MIDWESTERN CATASTROPHE INS SC - CHICAGO BOARD OF TRADE ;1999.04.27;     713;      47;     116;     406;     220;     152;     673;     674;      40;      39
MIDWESTERN CATASTROPHE INS SC - CHICAGO BOARD OF TRADE ;1999.04.20;     712;      47;     116;     405;     220;     152;     672;     674;      40;      38
MIDWESTERN CATASTROPHE INS SC - CHICAGO BOARD OF TRADE ;1999.04.13;     711;      47;     116;     404;     219;     152;     671;     672;      40;      38
MIDWESTERN CATASTROPHE INS SC - CHICAGO BOARD OF TRADE ;1999.04.06;     710;      47;     116;     404;     219;     152;     670;     672;      40;      38
MIDWESTERN CATASTROPHE INS SC - CHICAGO BOARD OF TRADE ;1999.03.30;     708;      47;     116;     403;     219;     151;     668;     670;      40;      38
MIDWESTERN CATASTROPHE INS SC - CHICAGO BOARD OF TRADE ;1997.07.08;     416;       0;     124;      48;     267;      46;     314;     218;     102;     198
MIDWESTERN CATASTROPHE INS SC - CHICAGO BOARD OF TRADE ;1997.07.01;     961;       0;     153;     203;     588;     336;     792;     693;     169;     268
MIDWESTERN CATASTROPHE INS SC - CHICAGO BOARD OF TRADE ;1997.06.24;    1147;       0;     124;     288;     612;     398;     900;     810;     247;     337
MIDWESTERN CATASTROPHE INS SC - CHICAGO BOARD OF TRADE ;1997.06.17;    1153;       0;     122;     290;     614;     402;     904;     815;     249;     338
MIDWESTERN CATASTROPHE INS SC - CHICAGO BOARD OF TRADE ;1997.06.10;    1155;       0;     129;     284;     617;     407;     901;     821;     254;     335
MIDWESTERN CATASTROPHE INS SC - CHICAGO BOARD OF TRADE ;1997.06.03;    1161;       0;     128;     286;     619;     411;     905;     825;     256;     335
MIDWESTERN CATASTROPHE INS SC - CHICAGO BOARD OF TRADE ;1997.05.27;    1120;       0;     151;     324;     620;     414;     944;     889;     177;     231
MIDWESTERN CATASTROPHE INS SC - CHICAGO BOARD OF TRADE ;1997.05.20;    1127;       0;     150;     326;     622;     418;     948;     895;     178;     232
MIDWESTERN CATASTROPHE INS SC - CHICAGO BOARD OF TRADE ;1997.05.13;    1044;       0;     150;     297;     580;     378;     877;     825;     167;     219
MIDWESTERN CATASTROPHE INS SC - CHICAGO BOARD OF TRADE ;1997.05.06;    1050;       0;     148;     300;     582;     382;     882;     830;     168;     220
MIDWESTERN CATASTROPHE INS SC - CHICAGO BOARD OF TRADE ;1997.04.29;    1056;       0;     147;     303;     584;     386;     887;     835;     169;     220
MIDWESTERN CATASTROPHE INS SC - CHICAGO BOARD OF TRADE ;1997.04.22;    1062;       0;     146;     305;     586;     390;     892;     841;     170;     221
MIDWESTERN CATASTROPHE INS SC - CHICAGO BOARD OF TRADE ;1997.04.15;    1066;       0;     145;     307;     588;     392;     895;     845;     171;     221
MIDWESTERN CATASTROPHE INS SC - CHICAGO BOARD OF TRADE ;1997.04.08;    1072;       0;     144;     310;     590;     396;     900;     850;     172;     222
MIDWESTERN CATASTROPHE INS SC - CHICAGO BOARD OF TRADE ;1997.04.01;    1081;       0;     142;     314;     593;     402;     907;     857;     174;     223
MIDWESTERN CATASTROPHE INS SC - CHICAGO BOARD OF TRADE ;1997.03.25;    1081;       0;     130;     298;     593;     403;     891;     831;     191;     250
MIDWESTERN CATASTROPHE INS SC - CHICAGO BOARD OF TRADE ;1997.03.18;     844;       0;     106;     265;     435;     300;     700;     671;     144;     173
MIDWESTERN CATASTROPHE INS SC - CHICAGO BOARD OF TRADE ;1997.03.11;     848;       0;     106;     267;     437;     302;     703;     675;     145;     173
MIDWESTERN CATASTROPHE INS SC - CHICAGO BOARD OF TRADE ;1997.03.04;     852;       0;     105;     269;     438;     305;     706;     678;     145;     173
MIDWESTERN CATASTROPHE INS SC - CHICAGO BOARD OF TRADE ;1997.02.25;     851;       0;     104;     270;     436;     305;     707;     680;     144;     171
MIDWESTERN CATASTROPHE INS SC - CHICAGO BOARD OF TRADE ;1997.02.18;     816;       0;     104;     272;     408;     289;     680;     665;     135;     151
MIDWESTERN CATASTROPHE INS SC - CHICAGO BOARD OF TRADE ;1997.02.11;     821;       0;     103;     274;     411;     292;     685;     669;     136;     152
MIDWESTERN CATASTROPHE INS SC - CHICAGO BOARD OF TRADE ;1997.02.04;     822;       0;     102;     275;     410;     293;     685;     670;     137;     152
MIDWESTERN CATASTROPHE INS SC - CHICAGO BOARD OF TRADE ;1997.01.28;     828;       0;     101;     277;     412;     295;     688;     673;     139;     155
MIDWESTERN CATASTROPHE INS SC - CHICAGO BOARD OF TRADE ;1997.01.21;     831;       0;     100;     278;     412;     297;     691;     675;     140;     155
MIDWESTERN CATASTROPHE INS SC - CHICAGO BOARD OF TRADE ;1997.01.14;     831;       0;      99;     279;     413;     299;     692;     677;     139;     155
MIDWESTERN CATASTROPHE INS SC - CHICAGO BOARD OF TRADE ;1997.01.07;     835;       0;      98;     281;     415;     301;     695;     680;     140;     155
MIDWESTERN CATASTROPHE INS SC - CHICAGO BOARD OF TRADE ;1996.12.31;     804;       0;      95;     267;     411;     296;     678;     658;     126;     147
MIDWESTERN CATASTROPHE INS SC - CHICAGO BOARD OF TRADE ;1996.12.24;     807;       0;      94;     268;     412;     298;     680;     660;     127;     147
MIDWESTERN CATASTROPHE INS SC - CHICAGO BOARD OF TRADE ;1996.12.17;     812;       0;      63;     211;     414;     301;     625;     575;     187;     237
MIDWESTERN CATASTROPHE INS SC - CHICAGO BOARD OF TRADE ;1996.12.10;     815;       0;      62;     212;     415;     303;     627;     577;     188;     237
MIDWESTERN CATASTROPHE INS SC - CHICAGO BOARD OF TRADE ;1996.12.03;     630;       0;      33;      82;     334;     229;     416;     344;     214;     286
MIDWESTERN CATASTROPHE INS SC - CHICAGO BOARD OF TRADE ;1999.06.29;     743;      40;      99;     438;     223;     164;     701;     701;      42;      42
MIDWESTERN CATASTROPHE INS SC - CHICAGO BOARD OF TRADE ;1999.06.22;     743;      40;      99;     438;     223;     164;     701;     701;      42;      42
MIDWESTERN CATASTROPHE INS SC - CHICAGO BOARD OF TRADE ;1999.06.15;     725;      46;     114;     415;     223;     156;     684;     685;      41;      40
MIDWESTERN CATASTROPHE INS SC - CHICAGO BOARD OF TRADE ;1999.06.08;     723;      46;     115;     413;     222;     155;     682;     683;      41;      39
MIDWESTERN CATASTROPHE INS SC - CHICAGO BOARD OF TRADE ;1999.06.01;     720;      47;     116;     411;     222;     154;     679;     681;      41;      39
MIDWESTERN CATASTROPHE INS SC - CHICAGO BOARD OF TRADE ;1999.05.25;     719;      47;     116;     410;     221;     154;     678;     680;      41;      39
MIDWESTERN CATASTROPHE INS SC - CHICAGO BOARD OF TRADE ;1999.05.18;     717;      47;     116;     409;     221;     153;     677;     678;      41;      39
MIDWESTERN CATASTROPHE INS SC - CHICAGO BOARD OF TRADE ;1999.05.11;     716;      47;     116;     408;     221;     153;     675;     677;      40;      39
MIDWESTERN CATASTROPHE INS SC - CHICAGO BOARD OF TRADE ;1999.05.04;     714;      47;     117;     407;     220;     152;     674;     676;      40;      39
MIDWESTERN CATASTROPHE INS SC - CHICAGO BOARD OF TRADE ;1999.04.27;     713;      47;     116;     406;     220;     152;     673;     674;      40;      39
MIDWESTERN CATASTROPHE INS SC - CHICAGO BOARD OF TRADE ;1999.04.20;     712;      47;     116;     405;     220;     152;     672;     674;      40;      38
MIDWESTERN CATASTROPHE INS SC - CHICAGO BOARD OF TRADE ;1999.04.13;     711;      47;     116;     404;     219;     152;     671;     672;      40;      38
MIDWESTERN CATASTROPHE INS SC - CHICAGO BOARD OF TRADE ;1999.04.06;     710;      47;     116;     404;     219;     152;     670;     672;      40;      38
MIDWESTERN CATASTROPHE INS SC - CHICAGO BOARD OF TRADE ;1999.03.30;     708;      47;     116;     403;     219;     151;     668;     670;      40;      38
MIDWESTERN CATASTROPHE INS SC - CHICAGO BOARD OF TRADE ;1997.07.08;     416;       0;     124;      48;     267;      46;     314;     218;     102;     198
MIDWESTERN CATASTROPHE INS SC - CHICAGO BOARD OF TRADE ;1997.07.01;     961;       0;     153;     203;     588;     336;     792;     693;     169;     268
MIDWESTERN CATASTROPHE INS SC - CHICAGO BOARD OF TRADE ;1997.06.24;    1147;       0;     124;     288;     612;     398;     900;     810;     247;     337
MIDWESTERN CATASTROPHE INS SC - CHICAGO BOARD OF TRADE ;1997.06.17;    1153;       0;     122;     290;     614;     402;     904;     815;     249;     338
MIDWESTERN CATASTROPHE INS SC - CHICAGO BOARD OF TRADE ;1997.06.10;    1155;       0;     129;     284;     617;     407;     901;     821;     254;     335
MIDWESTERN CATASTROPHE INS SC - CHICAGO BOARD OF TRADE ;1997.06.03;    1161;       0;     128;     286;     619;     411;     905;     825;     256;     335
MIDWESTERN CATASTROPHE INS SC - CHICAGO BOARD OF TRADE ;1997.05.27;    1120;       0;     151;     324;     620;     414;     944;     889;     177;     231
MIDWESTERN CATASTROPHE INS SC - CHICAGO BOARD OF TRADE ;1997.05.20;    1127;       0;     150;     326;     622;     418;     948;     895;     178;     232
MIDWESTERN CATASTROPHE INS SC - CHICAGO BOARD OF TRADE ;1997.05.13;    1044;       0;     150;     297;     580;     378;     877;     825;     167;     219
MIDWESTERN CATASTROPHE INS SC - CHICAGO BOARD OF TRADE ;1997.05.06;    1050;       0;     148;     300;     582;     382;     882;     830;     168;     220
MIDWESTERN CATASTROPHE INS SC - CHICAGO BOARD OF TRADE ;1997.04.29;    1056;       0;     147;     303;     584;     386;     887;     835;     169;     220
MIDWESTERN CATASTROPHE INS SC - CHICAGO BOARD OF TRADE ;1997.04.22;    1062;       0;     146;     305;     586;     390;     892;     841;     170;     221
MIDWESTERN CATASTROPHE INS SC - CHICAGO BOARD OF TRADE ;1997.04.15;    1066;       0;     145;     307;     588;     392;     895;     845;     171;     221
MIDWESTERN CATASTROPHE INS SC - CHICAGO BOARD OF TRADE ;1997.04.08;    1072;       0;     144;     310;     590;     396;     900;     850;     172;     222
MIDWESTERN CATASTROPHE INS SC - CHICAGO BOARD OF TRADE ;1997.04.01;    1081;       0;     142;     314;     593;     402;     907;     857;     174;     223
MIDWESTERN CATASTROPHE INS SC - CHICAGO BOARD OF TRADE ;1997.03.25;    1081;       0;     130;     298;     593;     403;     891;     831;     191;     250
MIDWESTERN CATASTROPHE INS SC - CHICAGO BOARD OF TRADE ;1997.03.18;     844;       0;     106;     265;     435;     300;     700;     671;     144;     173
MIDWESTERN CATASTROPHE INS SC - CHICAGO BOARD OF TRADE ;1997.03.11;     848;       0;     106;     267;     437;     302;     703;     675;     145;     173
MIDWESTERN CATASTROPHE INS SC - CHICAGO BOARD OF TRADE ;1997.03.04;     852;       0;     105;     269;     438;     305;     706;     678;     145;     173
MIDWESTERN CATASTROPHE INS SC - CHICAGO BOARD OF TRADE ;1997.02.25;     851;       0;     104;     270;     436;     305;     707;     680;     144;     171
MIDWESTERN CATASTROPHE INS SC - CHICAGO BOARD OF TRADE ;1997.02.18;     816;       0;     104;     272;     408;     289;     680;     665;     135;     151
MIDWESTERN CATASTROPHE INS SC - CHICAGO BOARD OF TRADE ;1997.02.11;     821;       0;     103;     274;     411;     292;     685;     669;     136;     152
MIDWESTERN CATASTROPHE INS SC - CHICAGO BOARD OF TRADE ;1997.02.04;     822;       0;     102;     275;     410;     293;     685;     670;     137;     152
MIDWESTERN CATASTROPHE INS SC - CHICAGO BOARD OF TRADE ;1997.01.28;     828;       0;     101;     277;     412;     295;     688;     673;     139;     155
MIDWESTERN CATASTROPHE INS SC - CHICAGO BOARD OF TRADE ;1997.01.21;     831;       0;     100;     278;     412;     297;     691;     675;     140;     155
MIDWESTERN CATASTROPHE INS SC - CHICAGO BOARD OF TRADE ;1997.01.14;     831;       0;      99;     279;     413;     299;     692;     677;     139;     155
MIDWESTERN CATASTROPHE INS SC - CHICAGO BOARD OF TRADE ;1997.01.07;     835;       0;      98;     281;     415;     301;     695;     680;     140;     155
MIDWESTERN CATASTROPHE INS SC - CHICAGO BOARD OF TRADE ;1996.12.31;     804;       0;      95;     267;     411;     296;     678;     658;     126;     147
MIDWESTERN CATASTROPHE INS SC - CHICAGO BOARD OF TRADE ;1996.12.24;     807;       0;      94;     268;     412;     298;     680;     660;     127;     147
MIDWESTERN CATASTROPHE INS SC - CHICAGO BOARD OF TRADE ;1996.12.17;     812;       0;      63;     211;     414;     301;     625;     575;     187;     237
MIDWESTERN CATASTROPHE INS SC - CHICAGO BOARD OF TRADE ;1996.12.10;     815;       0;      62;     212;     415;     303;     627;     577;     188;     237
MIDWESTERN CATASTROPHE INS SC - CHICAGO BOARD OF TRADE ;1996.12.03;     630;       0;      33;      82;     334;     229;     416;     344;     214;     286
