CRUDE OIL BRENT - NEW YORK MERCANTILE EXCHANGE ;2005.04.19;   26899;     367;       0;    7205;   16126;   16454;   23698;   23659;    3201;    3240
CRUDE OIL BRENT - NEW YORK MERCANTILE EXCHANGE ;2005.04.19;   26899;     367;       0;    7205;   16126;   16454;   23698;   23659;    3201;    3240
CRUDE OIL BRENT - NEW YORK MERCANTILE EXCHANGE ;2005.04.19;   26899;     367;       0;    7205;   16126;   16454;   23698;   23659;    3201;    3240
