NO. 2 HEATING OIL N.Y. HARBOR - NYME HEATING OIL #2 ;1995.04.04;  124088;    2510;   10227;    9178;   68373;   72522;   80061;   91927;   44027;   32161
NO. 2 HEATING OIL N.Y. HARBOR - NYME HEATING OIL #2 ;1995.03.28;  122846;    1951;   12135;    6675;   68852;   74286;   77477;   93096;   45369;   29750
NO. 2 HEATING OIL N.Y. HARBOR - NYME HEATING OIL #2 ;1995.03.21;  132512;    2032;   19277;    8440;   73907;   69692;   84379;   97410;   48133;   35102
NO. 2 HEATING OIL N.Y. HARBOR - NYME HEATING OIL #2 ;1995.04.04;  124088;    2510;   10227;    9178;   68373;   72522;   80061;   91927;   44027;   32161
NO. 2 HEATING OIL N.Y. HARBOR - NYME HEATING OIL #2 ;1995.03.28;  122846;    1951;   12135;    6675;   68852;   74286;   77477;   93096;   45369;   29750
NO. 2 HEATING OIL N.Y. HARBOR - NYME HEATING OIL #2 ;1995.03.21;  132512;    2032;   19277;    8440;   73907;   69692;   84379;   97410;   48133;   35102
NO. 2 HEATING OIL N.Y. HARBOR - NYME HEATING OIL #2 ;1995.04.04;  124088;    2510;   10227;    9178;   68373;   72522;   80061;   91927;   44027;   32161
NO. 2 HEATING OIL N.Y. HARBOR - NYME HEATING OIL #2 ;1995.03.28;  122846;    1951;   12135;    6675;   68852;   74286;   77477;   93096;   45369;   29750
NO. 2 HEATING OIL N.Y. HARBOR - NYME HEATING OIL #2 ;1995.03.21;  132512;    2032;   19277;    8440;   73907;   69692;   84379;   97410;   48133;   35102
