ELECTRICITY (PJM) - NEW YORK MERCANTILE EXCHANGE ;1999.08.24;     552;       0;       0;       0;     521;     525;     521;     525;      31;      27
ELECTRICITY (PJM) - NEW YORK MERCANTILE EXCHANGE ;1999.08.17;     534;       0;       0;       0;     502;     494;     502;     494;      32;      40
ELECTRICITY (PJM) - NEW YORK MERCANTILE EXCHANGE ;1999.08.10;     536;       0;       0;       0;     504;     486;     504;     486;      32;      50
ELECTRICITY (PJM) - NEW YORK MERCANTILE EXCHANGE ;1999.08.03;     494;       0;       0;       0;     466;     461;     466;     461;      28;      33
ELECTRICITY (PJM) - NEW YORK MERCANTILE EXCHANGE ;1999.07.27;     570;       0;       0;       0;     517;     489;     517;     489;      53;      81
ELECTRICITY (PJM) - NEW YORK MERCANTILE EXCHANGE ;1999.07.20;     529;       0;       0;       0;     488;     461;     488;     461;      41;      68
ELECTRICITY (PJM) - NEW YORK MERCANTILE EXCHANGE ;1999.05.25;     670;       0;       0;       0;     649;     644;     649;     644;      21;      26
ELECTRICITY (PJM) - NEW YORK MERCANTILE EXCHANGE ;1999.05.18;     694;       0;       0;       0;     593;     615;     593;     615;     101;      79
ELECTRICITY (PJM) - NEW YORK MERCANTILE EXCHANGE ;1999.05.11;     671;       0;       0;       0;     560;     585;     560;     585;     111;      86
ELECTRICITY (PJM) - NEW YORK MERCANTILE EXCHANGE ;1999.05.04;     667;       0;       0;       0;     578;     577;     578;     577;      89;      90
ELECTRICITY (PJM) - NEW YORK MERCANTILE EXCHANGE ;1999.04.27;     676;       0;       0;       0;     621;     594;     621;     594;      55;      82
ELECTRICITY (PJM) - NEW YORK MERCANTILE EXCHANGE ;1999.04.20;     658;       0;       0;       0;     524;     539;     524;     539;     134;     119
ELECTRICITY (PJM) - NEW YORK MERCANTILE EXCHANGE ;1999.04.13;     608;       0;       0;       0;     497;     503;     497;     503;     111;     105
ELECTRICITY (PJM) - NEW YORK MERCANTILE EXCHANGE ;1999.04.06;     567;       0;       0;       0;     494;     499;     494;     499;      73;      68
ELECTRICITY (PJM) - NEW YORK MERCANTILE EXCHANGE ;1999.03.30;     506;       0;       0;       0;     427;     398;     427;     398;      79;     108
ELECTRICITY (PJM) - NEW YORK MERCANTILE EXCHANGE ;1999.03.23;     402;       0;       0;       0;     369;     293;     369;     293;      33;     109
ELECTRICITY (PJM) - NEW YORK MERCANTILE EXCHANGE ;1999.08.24;     552;       0;       0;       0;     521;     525;     521;     525;      31;      27
ELECTRICITY (PJM) - NEW YORK MERCANTILE EXCHANGE ;1999.08.17;     534;       0;       0;       0;     502;     494;     502;     494;      32;      40
ELECTRICITY (PJM) - NEW YORK MERCANTILE EXCHANGE ;1999.08.10;     536;       0;       0;       0;     504;     486;     504;     486;      32;      50
ELECTRICITY (PJM) - NEW YORK MERCANTILE EXCHANGE ;1999.08.03;     494;       0;       0;       0;     466;     461;     466;     461;      28;      33
ELECTRICITY (PJM) - NEW YORK MERCANTILE EXCHANGE ;1999.07.27;     570;       0;       0;       0;     517;     489;     517;     489;      53;      81
ELECTRICITY (PJM) - NEW YORK MERCANTILE EXCHANGE ;1999.07.20;     529;       0;       0;       0;     488;     461;     488;     461;      41;      68
ELECTRICITY (PJM) - NEW YORK MERCANTILE EXCHANGE ;1999.05.25;     670;       0;       0;       0;     649;     644;     649;     644;      21;      26
ELECTRICITY (PJM) - NEW YORK MERCANTILE EXCHANGE ;1999.05.18;     694;       0;       0;       0;     593;     615;     593;     615;     101;      79
ELECTRICITY (PJM) - NEW YORK MERCANTILE EXCHANGE ;1999.05.11;     671;       0;       0;       0;     560;     585;     560;     585;     111;      86
ELECTRICITY (PJM) - NEW YORK MERCANTILE EXCHANGE ;1999.05.04;     667;       0;       0;       0;     578;     577;     578;     577;      89;      90
ELECTRICITY (PJM) - NEW YORK MERCANTILE EXCHANGE ;1999.04.27;     676;       0;       0;       0;     621;     594;     621;     594;      55;      82
ELECTRICITY (PJM) - NEW YORK MERCANTILE EXCHANGE ;1999.04.20;     658;       0;       0;       0;     524;     539;     524;     539;     134;     119
ELECTRICITY (PJM) - NEW YORK MERCANTILE EXCHANGE ;1999.04.13;     608;       0;       0;       0;     497;     503;     497;     503;     111;     105
ELECTRICITY (PJM) - NEW YORK MERCANTILE EXCHANGE ;1999.04.06;     567;       0;       0;       0;     494;     499;     494;     499;      73;      68
ELECTRICITY (PJM) - NEW YORK MERCANTILE EXCHANGE ;1999.03.30;     506;       0;       0;       0;     427;     398;     427;     398;      79;     108
ELECTRICITY (PJM) - NEW YORK MERCANTILE EXCHANGE ;1999.03.23;     402;       0;       0;       0;     369;     293;     369;     293;      33;     109
ELECTRICITY (PJM) - NEW YORK MERCANTILE EXCHANGE ;1999.08.24;     552;       0;       0;       0;     521;     525;     521;     525;      31;      27
ELECTRICITY (PJM) - NEW YORK MERCANTILE EXCHANGE ;1999.08.17;     534;       0;       0;       0;     502;     494;     502;     494;      32;      40
ELECTRICITY (PJM) - NEW YORK MERCANTILE EXCHANGE ;1999.08.10;     536;       0;       0;       0;     504;     486;     504;     486;      32;      50
ELECTRICITY (PJM) - NEW YORK MERCANTILE EXCHANGE ;1999.08.03;     494;       0;       0;       0;     466;     461;     466;     461;      28;      33
ELECTRICITY (PJM) - NEW YORK MERCANTILE EXCHANGE ;1999.07.27;     570;       0;       0;       0;     517;     489;     517;     489;      53;      81
ELECTRICITY (PJM) - NEW YORK MERCANTILE EXCHANGE ;1999.07.20;     529;       0;       0;       0;     488;     461;     488;     461;      41;      68
ELECTRICITY (PJM) - NEW YORK MERCANTILE EXCHANGE ;1999.05.25;     670;       0;       0;       0;     649;     644;     649;     644;      21;      26
ELECTRICITY (PJM) - NEW YORK MERCANTILE EXCHANGE ;1999.05.18;     694;       0;       0;       0;     593;     615;     593;     615;     101;      79
ELECTRICITY (PJM) - NEW YORK MERCANTILE EXCHANGE ;1999.05.11;     671;       0;       0;       0;     560;     585;     560;     585;     111;      86
ELECTRICITY (PJM) - NEW YORK MERCANTILE EXCHANGE ;1999.05.04;     667;       0;       0;       0;     578;     577;     578;     577;      89;      90
ELECTRICITY (PJM) - NEW YORK MERCANTILE EXCHANGE ;1999.04.27;     676;       0;       0;       0;     621;     594;     621;     594;      55;      82
ELECTRICITY (PJM) - NEW YORK MERCANTILE EXCHANGE ;1999.04.20;     658;       0;       0;       0;     524;     539;     524;     539;     134;     119
ELECTRICITY (PJM) - NEW YORK MERCANTILE EXCHANGE ;1999.04.13;     608;       0;       0;       0;     497;     503;     497;     503;     111;     105
ELECTRICITY (PJM) - NEW YORK MERCANTILE EXCHANGE ;1999.04.06;     567;       0;       0;       0;     494;     499;     494;     499;      73;      68
ELECTRICITY (PJM) - NEW YORK MERCANTILE EXCHANGE ;1999.03.30;     506;       0;       0;       0;     427;     398;     427;     398;      79;     108
ELECTRICITY (PJM) - NEW YORK MERCANTILE EXCHANGE ;1999.03.23;     402;       0;       0;       0;     369;     293;     369;     293;      33;     109
