FRZN CONCENTRATED ORANGE JUICE - NEW YORK BOARD OF TRADE ;2007.08.28;   41895;    4839;    7963;   13924;   18333;   17002;   37096;   38890;    4799;    3006
FRZN CONCENTRATED ORANGE JUICE - NEW YORK BOARD OF TRADE ;2007.08.21;   43637;    4722;    7951;   14898;   18912;   17736;   38532;   40586;    5105;    3051
FRZN CONCENTRATED ORANGE JUICE - NEW YORK BOARD OF TRADE ;2007.08.14;   54589;    5245;    7664;   20412;   22572;   23224;   48229;   51300;    6360;    3289
FRZN CONCENTRATED ORANGE JUICE - NEW YORK BOARD OF TRADE ;2007.08.07;   52810;    5173;    7156;   19414;   22475;   23520;   47062;   50091;    5748;    2720
FRZN CONCENTRATED ORANGE JUICE - NEW YORK BOARD OF TRADE ;2007.07.31;   49949;    5235;    7529;   17427;   21612;   22340;   44274;   47296;    5675;    2653
FRZN CONCENTRATED ORANGE JUICE - NEW YORK BOARD OF TRADE ;2007.07.24;   49575;    5493;    8593;   16074;   22282;   22062;   43849;   46728;    5726;    2847
FRZN CONCENTRATED ORANGE JUICE - NEW YORK BOARD OF TRADE ;2007.07.17;   46438;    5444;    8599;   14096;   21813;   20374;   41353;   43068;    5085;    3370
FRZN CONCENTRATED ORANGE JUICE - NEW YORK BOARD OF TRADE ;2007.07.10;   46391;    5359;    8761;   14093;   22241;   20271;   41693;   43126;    4698;    3266
FRZN CONCENTRATED ORANGE JUICE - NEW YORK BOARD OF TRADE ;2007.07.03;   46512;    5321;    8607;   13786;   22638;   20839;   41745;   43231;    4766;    3280
FRZN CONCENTRATED ORANGE JUICE - NEW YORK BOARD OF TRADE ;2007.06.26;   48737;    4973;    7605;   14301;   24627;   23027;   43902;   44933;    4835;    3804
FRZN CONCENTRATED ORANGE JUICE - NEW YORK BOARD OF TRADE ;2007.06.19;   48091;    5216;    6382;   13827;   23832;   23519;   42874;   43728;    5217;    4363
FRZN CONCENTRATED ORANGE JUICE - NEW YORK BOARD OF TRADE ;2007.06.12;   50885;    5717;    5395;   17995;   22004;   22994;   45716;   46384;    5169;    4501
FRZN CONCENTRATED ORANGE JUICE - NEW YORK BOARD OF TRADE ;2007.06.05;   48478;    6016;    4260;   15598;   21024;   23600;   42638;   43458;    5840;    5020
FRZN CONCENTRATED ORANGE JUICE - NEW YORK BOARD OF TRADE ;2007.05.29;   46826;    6926;    3665;   14693;   20220;   24465;   41839;   42822;    4988;    4004
FRZN CONCENTRATED ORANGE JUICE - NEW YORK BOARD OF TRADE ;2007.05.22;   47646;    8456;    3643;   14740;   19329;   25286;   42525;   43668;    5120;    3977
FRZN CONCENTRATED ORANGE JUICE - NEW YORK BOARD OF TRADE ;2007.05.15;   48144;    7793;    4174;   15322;   19320;   25050;   42435;   44545;    5709;    3599
FRZN CONCENTRATED ORANGE JUICE - NEW YORK BOARD OF TRADE ;2007.05.08;   44770;    6692;    4227;   13811;   19118;   23220;   39621;   41259;    5149;    3511
FRZN CONCENTRATED ORANGE JUICE - NEW YORK BOARD OF TRADE ;2007.05.01;   43214;    6508;    3878;   12827;   18965;   23072;   38300;   39777;    4915;    3437
FRZN CONCENTRATED ORANGE JUICE - NEW YORK BOARD OF TRADE ;2007.04.24;   43166;    6622;    3240;   12410;   19572;   23629;   38603;   39278;    4562;    3888
FRZN CONCENTRATED ORANGE JUICE - NEW YORK BOARD OF TRADE ;2007.04.17;   49513;    8049;    2756;   15505;   21233;   26686;   44786;   44947;    4727;    4566
FRZN CONCENTRATED ORANGE JUICE - NEW YORK BOARD OF TRADE ;2007.04.10;   46372;   11113;    2188;   12254;   18199;   27222;   41566;   41664;    4806;    4708
FRZN CONCENTRATED ORANGE JUICE - NEW YORK BOARD OF TRADE ;2007.04.03;   45599;   11841;    1702;   11663;   16463;   28214;   39967;   41578;    5633;    4021
FRZN CONCENTRATED ORANGE JUICE - NEW YORK BOARD OF TRADE ;2007.03.27;   46447;   15212;    2367;   10465;   15294;   29766;   40971;   42599;    5476;    3849
FRZN CONCENTRATED ORANGE JUICE - NEW YORK BOARD OF TRADE ;2007.03.20;   44355;   16338;    2335;    9186;   13111;   29281;   38636;   40803;    5719;    3552
FRZN CONCENTRATED ORANGE JUICE - NEW YORK BOARD OF TRADE ;2007.03.13;   44045;   16181;    2215;    9594;   12987;   28528;   38761;   40338;    5283;    3707
FRZN CONCENTRATED ORANGE JUICE - NEW YORK BOARD OF TRADE ;2007.03.06;   43955;   15339;    1710;    9729;   13239;   28921;   38307;   40360;    5648;    3595
FRZN CONCENTRATED ORANGE JUICE - NEW YORK BOARD OF TRADE ;2007.02.27;   39302;   13609;    2036;    8092;   12043;   26026;   33743;   36154;    5559;    3148
FRZN CONCENTRATED ORANGE JUICE - NEW YORK BOARD OF TRADE ;2007.02.20;   35056;   10123;    1990;    6507;   13491;   22636;   30121;   31133;    4935;    3923
FRZN CONCENTRATED ORANGE JUICE - NEW YORK BOARD OF TRADE ;2007.02.13;   39633;    9492;    2104;    9901;   14759;   23321;   34152;   35326;    5481;    4308
FRZN CONCENTRATED ORANGE JUICE - NEW YORK BOARD OF TRADE ;2007.02.06;   41408;   10112;    2609;   10755;   15171;   23581;   36038;   36946;    5370;    4462
FRZN CONCENTRATED ORANGE JUICE - NEW YORK BOARD OF TRADE ;2007.01.30;   42538;   12833;    2931;    9397;   15004;   25428;   37235;   37757;    5303;    4781
FRZN CONCENTRATED ORANGE JUICE - NEW YORK BOARD OF TRADE ;2007.01.23;   43113;   16519;    1565;    9817;   12033;   28079;   38369;   39461;    4743;    3651
FRZN CONCENTRATED ORANGE JUICE - NEW YORK BOARD OF TRADE ;2007.01.16;   38836;   12556;    1505;    9192;   12649;   24331;   34397;   35027;    4439;    3809
FRZN CONCENTRATED ORANGE JUICE - NEW YORK BOARD OF TRADE ;2007.01.09;   37045;   11687;    1200;    8911;   12520;   22854;   33119;   32965;    3926;    4080
FRZN CONCENTRATED ORANGE JUICE - NEW YORK BOARD OF TRADE ;2007.01.03;   36561;   12409;    1167;    8706;   11319;   22924;   32434;   32797;    4126;    3764
FRZN CONCENTRATED ORANGE JUICE - NEW YORK BOARD OF TRADE ;2006.12.26;   36170;   10425;    1216;    8459;   12524;   21688;   31408;   31363;    4762;    4807
FRZN CONCENTRATED ORANGE JUICE - NEW YORK BOARD OF TRADE ;2006.12.19;   35498;   10519;    1402;    8451;   11430;   20940;   30399;   30793;    5098;    4705
FRZN CONCENTRATED ORANGE JUICE - NEW YORK BOARD OF TRADE ;2006.12.12;   42974;   11409;    1623;   11660;   13099;   23821;   36168;   37104;    6806;    5870
FRZN CONCENTRATED ORANGE JUICE - NEW YORK BOARD OF TRADE ;2006.12.05;   47941;   12445;    1532;   13608;   17625;   30017;   43678;   45157;    4263;    2784
FRZN CONCENTRATED ORANGE JUICE - NEW YORK BOARD OF TRADE ;2006.11.28;   49796;   11308;    1763;   14417;   19057;   30197;   44782;   46377;    5014;    3419
FRZN CONCENTRATED ORANGE JUICE - NEW YORK BOARD OF TRADE ;2006.11.21;   49132;   11514;    1578;   13254;   19321;   31261;   44089;   46093;    5043;    3039
FRZN CONCENTRATED ORANGE JUICE - NEW YORK BOARD OF TRADE ;2006.11.14;   49008;   10868;    1577;   12358;   19933;   31657;   43159;   45593;    5849;    3415
FRZN CONCENTRATED ORANGE JUICE - NEW YORK BOARD OF TRADE ;2006.11.07;   49115;   12111;    1737;   12319;   19306;   32401;   43735;   46457;    5380;    2658
FRZN CONCENTRATED ORANGE JUICE - NEW YORK BOARD OF TRADE ;2006.10.31;   48942;   11539;    1275;   11594;   20203;   33422;   43336;   46292;    5606;    2651
FRZN CONCENTRATED ORANGE JUICE - NEW YORK BOARD OF TRADE ;2006.10.24;   48412;   10596;    1226;   11272;   20910;   33350;   42778;   45848;    5634;    2563
FRZN CONCENTRATED ORANGE JUICE - NEW YORK BOARD OF TRADE ;2006.10.17;   58777;   10161;    1566;   17985;   24093;   35597;   52239;   55148;    6538;    3630
FRZN CONCENTRATED ORANGE JUICE - NEW YORK BOARD OF TRADE ;2006.10.10;   53805;    8311;    2507;   16074;   24815;   31223;   49200;   49804;    4605;    4001
FRZN CONCENTRATED ORANGE JUICE - NEW YORK BOARD OF TRADE ;2006.10.03;   54628;    8991;    1434;   15343;   23108;   32926;   47443;   49703;    7185;    4925
FRZN CONCENTRATED ORANGE JUICE - NEW YORK BOARD OF TRADE ;2006.09.26;   52695;    8661;    1843;   16010;   22476;   30949;   47148;   48802;    5547;    3893
FRZN CONCENTRATED ORANGE JUICE - NEW YORK BOARD OF TRADE ;2006.09.19;   52302;    9343;    1881;   14925;   22855;   31952;   47123;   48758;    5180;    3544
FRZN CONCENTRATED ORANGE JUICE - NEW YORK BOARD OF TRADE ;2006.09.12;   53905;   11463;    1294;   15159;   21444;   33910;   48067;   50363;    5838;    3542
FRZN CONCENTRATED ORANGE JUICE - NEW YORK BOARD OF TRADE ;2006.09.05;   51707;   12064;     968;   14176;   19014;   33187;   45253;   48330;    6453;    3376
FRZN CONCENTRATED ORANGE JUICE - NEW YORK BOARD OF TRADE ;2006.08.29;   55120;   12893;    1092;   14771;   20191;   35842;   47855;   51704;    7265;    3417
FRZN CONCENTRATED ORANGE JUICE - NEW YORK BOARD OF TRADE ;2006.08.22;   54494;   11908;     996;   14217;   20806;   36125;   46930;   51338;    7563;    3156
FRZN CONCENTRATED ORANGE JUICE - NEW YORK BOARD OF TRADE ;2006.08.15;   53705;   12573;    2146;   16168;   17975;   32373;   46715;   50688;    6990;    3017
FRZN CONCENTRATED ORANGE JUICE - NEW YORK BOARD OF TRADE ;2006.08.08;   52252;   12395;    2188;   15713;   16638;   31320;   44746;   49222;    7506;    3031
FRZN CONCENTRATED ORANGE JUICE - NEW YORK BOARD OF TRADE ;2006.08.01;   52927;   12244;    1694;   16179;   15468;   32143;   43891;   50016;    9036;    2911
FRZN CONCENTRATED ORANGE JUICE - NEW YORK BOARD OF TRADE ;2006.07.25;   47151;   11223;    1670;   14056;   13514;   29265;   38793;   44991;    8358;    2160
FRZN CONCENTRATED ORANGE JUICE - NEW YORK BOARD OF TRADE ;2006.07.18;   44145;   10789;    2434;   12903;   13395;   26337;   37088;   41674;    7057;    2471
FRZN CONCENTRATED ORANGE JUICE - NEW YORK BOARD OF TRADE ;2006.07.11;   44976;   13206;    1261;   12989;   11772;   28580;   37967;   42830;    7010;    2146
FRZN CONCENTRATED ORANGE JUICE - NEW YORK BOARD OF TRADE ;2006.07.03;   48267;   16742;     952;   12759;   10788;   32153;   40289;   45863;    7979;    2404
FRZN CONCENTRATED ORANGE JUICE - NEW YORK BOARD OF TRADE ;2006.06.27;   47601;   15833;    1380;   12916;   11252;   30964;   40002;   45260;    7599;    2341
FRZN CONCENTRATED ORANGE JUICE - NEW YORK BOARD OF TRADE ;2006.06.20;   44353;   13587;    1032;   12567;   10678;   27894;   36831;   41494;    7521;    2859
FRZN CONCENTRATED ORANGE JUICE - NEW YORK BOARD OF TRADE ;2006.06.13;   48861;   13724;    1113;   15992;   12600;   28859;   42316;   45964;    6545;    2897
FRZN CONCENTRATED ORANGE JUICE - NEW YORK BOARD OF TRADE ;2006.06.06;   48175;   13264;    1082;   15215;   11932;   28140;   40412;   44438;    7763;    3737
FRZN CONCENTRATED ORANGE JUICE - NEW YORK BOARD OF TRADE ;2006.05.30;   49204;   15343;    1128;   15467;   11667;   29870;   42477;   46465;    6727;    2740
FRZN CONCENTRATED ORANGE JUICE - NEW YORK BOARD OF TRADE ;2006.05.23;   47355;   15513;    1174;   14462;   11913;   29285;   41888;   44921;    5467;    2434
FRZN CONCENTRATED ORANGE JUICE - NEW YORK BOARD OF TRADE ;2006.05.16;   54200;   19412;    1539;   16119;   12484;   33580;   48015;   51237;    6185;    2963
FRZN CONCENTRATED ORANGE JUICE - NEW YORK BOARD OF TRADE ;2006.05.09;   52752;   19088;    1734;   14654;   12826;   33669;   46567;   50057;    6185;    2695
FRZN CONCENTRATED ORANGE JUICE - NEW YORK BOARD OF TRADE ;2006.05.02;   49207;   17610;    1529;   14174;   11460;   30529;   43244;   46232;    5963;    2975
FRZN CONCENTRATED ORANGE JUICE - NEW YORK BOARD OF TRADE ;2006.04.25;   50912;   15963;    1735;   13392;   14564;   30830;   43919;   45957;    6993;    4955
FRZN CONCENTRATED ORANGE JUICE - NEW YORK BOARD OF TRADE ;2006.04.18;   53159;   16303;    1732;   16031;   15970;   31859;   48305;   49622;    4854;    3537
FRZN CONCENTRATED ORANGE JUICE - NEW YORK BOARD OF TRADE ;2006.04.11;   53013;   17599;    1980;   15026;   15851;   32393;   48475;   49398;    4537;    3614
FRZN CONCENTRATED ORANGE JUICE - NEW YORK BOARD OF TRADE ;2006.04.04;   53298;   20656;    1317;   14006;   13226;   33862;   47888;   49184;    5410;    4113
FRZN CONCENTRATED ORANGE JUICE - NEW YORK BOARD OF TRADE ;2006.03.28;   54678;   19979;    1417;   14820;   14061;   34058;   48860;   50295;    5818;    4383
FRZN CONCENTRATED ORANGE JUICE - NEW YORK BOARD OF TRADE ;2006.03.21;   51858;   18162;    1644;   14056;   14896;   32965;   47114;   48665;    4744;    3193
FRZN CONCENTRATED ORANGE JUICE - NEW YORK BOARD OF TRADE ;2006.03.14;   49779;   17037;    1720;   13130;   15020;   31848;   45187;   46698;    4592;    3081
FRZN CONCENTRATED ORANGE JUICE - NEW YORK BOARD OF TRADE ;2006.03.07;   46408;   15791;    2156;   11731;   14624;   29486;   42146;   43374;    4262;    3034
FRZN CONCENTRATED ORANGE JUICE - NEW YORK BOARD OF TRADE ;2006.02.28;   46642;   15341;    2282;   11159;   15791;   30613;   42291;   44054;    4351;    2588
FRZN CONCENTRATED ORANGE JUICE - NEW YORK BOARD OF TRADE ;2006.02.21;   47570;   13847;    2673;    9889;   19485;   31563;   43221;   44125;    4349;    3445
FRZN CONCENTRATED ORANGE JUICE - NEW YORK BOARD OF TRADE ;2006.02.14;   52503;   13568;    2175;   13429;   21174;   33600;   48171;   49204;    4332;    3299
FRZN CONCENTRATED ORANGE JUICE - NEW YORK BOARD OF TRADE ;2006.02.07;   52000;   10918;    2324;   13943;   22589;   32683;   47450;   48950;    4550;    3050
FRZN CONCENTRATED ORANGE JUICE - NEW YORK BOARD OF TRADE ;2006.01.31;   47183;    7141;    2805;   13237;   22817;   28091;   43195;   44132;    3987;    3050
FRZN CONCENTRATED ORANGE JUICE - NEW YORK BOARD OF TRADE ;2006.01.24;   44911;    6830;    2778;   11862;   22513;   26787;   41205;   41427;    3706;    3484
FRZN CONCENTRATED ORANGE JUICE - NEW YORK BOARD OF TRADE ;2006.01.17;   47844;   10102;    2620;   12329;   21783;   30339;   44214;   45288;    3630;    2556
FRZN CONCENTRATED ORANGE JUICE - NEW YORK BOARD OF TRADE ;2006.01.10;   50854;   11860;    2208;   13621;   20827;   32634;   46307;   48463;    4547;    2391
FRZN CONCENTRATED ORANGE JUICE - NEW YORK BOARD OF TRADE ;2006.01.03;   48250;   10120;    2416;   12393;   21709;   30712;   44221;   45521;    4028;    2729
FRZN CONCENTRATED ORANGE JUICE - NEW YORK BOARD OF TRADE ;2005.12.27;   51425;   11648;    2469;   13049;   22109;   31930;   46806;   47448;    4619;    3977
FRZN CONCENTRATED ORANGE JUICE - NEW YORK BOARD OF TRADE ;2005.12.20;   57080;   13499;    2768;   14682;   23658;   35842;   51839;   53292;    5241;    3787
FRZN CONCENTRATED ORANGE JUICE - NEW YORK BOARD OF TRADE ;2005.12.13;   64003;   13914;    2074;   18100;   26162;   40200;   58176;   60374;    5827;    3629
FRZN CONCENTRATED ORANGE JUICE - NEW YORK BOARD OF TRADE ;2005.12.06;   56640;   14362;    2726;   14776;   21713;   35186;   50851;   52687;    5788;    3952
FRZN CONCENTRATED ORANGE JUICE - NEW YORK BOARD OF TRADE ;2005.11.29;   54317;   14114;    2318;   13866;   20695;   33912;   48674;   50096;    5642;    4221
FRZN CONCENTRATED ORANGE JUICE - NEW YORK BOARD OF TRADE ;2005.11.22;   53472;   14530;    2623;   12929;   20607;   33490;   48066;   49042;    5405;    4429
FRZN CONCENTRATED ORANGE JUICE - NEW YORK BOARD OF TRADE ;2005.11.15;   55112;   16884;    2252;   13496;   19492;   35272;   49872;   51021;    5240;    4091
FRZN CONCENTRATED ORANGE JUICE - NEW YORK BOARD OF TRADE ;2005.11.08;   55708;   16210;    2377;   13512;   20140;   35945;   49862;   51834;    5846;    3874
FRZN CONCENTRATED ORANGE JUICE - NEW YORK BOARD OF TRADE ;2005.11.01;   51750;   15308;    1552;   13287;   17731;   33257;   46326;   48096;    5424;    3653
FRZN CONCENTRATED ORANGE JUICE - NEW YORK BOARD OF TRADE ;2005.10.25;   48510;   14219;    1523;   12981;   15438;   31008;   42637;   45511;    5873;    2999
FRZN CONCENTRATED ORANGE JUICE - NEW YORK BOARD OF TRADE ;2005.10.18;   48960;   12086;    1768;   14453;   15855;   29982;   42395;   46203;    6566;    2757
FRZN CONCENTRATED ORANGE JUICE - NEW YORK BOARD OF TRADE ;2005.10.11;   45469;   11433;    1829;   12373;   16331;   28456;   40137;   42659;    5332;    2811
FRZN CONCENTRATED ORANGE JUICE - NEW YORK BOARD OF TRADE ;2005.10.04;   42873;    9958;    1601;   11496;   16003;   27286;   37457;   40383;    5416;    2489
FRZN CONCENTRATED ORANGE JUICE - NEW YORK BOARD OF TRADE ;2005.09.27;   39662;    8061;    2460;    9779;   16604;   24604;   34445;   36843;    5217;    2819
FRZN CONCENTRATED ORANGE JUICE - NEW YORK BOARD OF TRADE ;2005.09.20;   39191;    7421;    5048;    8629;   18049;   22260;   34098;   35937;    5093;    3254
FRZN CONCENTRATED ORANGE JUICE - NEW YORK BOARD OF TRADE ;2005.09.13;   40243;    7415;    6457;    9515;   17687;   21259;   34618;   37231;    5625;    3012
FRZN CONCENTRATED ORANGE JUICE - NEW YORK BOARD OF TRADE ;2005.09.06;   36931;    7037;    6427;    8327;   16438;   19314;   31802;   34067;    5129;    2864
FRZN CONCENTRATED ORANGE JUICE - NEW YORK BOARD OF TRADE ;2005.08.30;   38081;    7098;    6007;    8327;   17595;   21121;   33021;   35456;    5060;    2625
FRZN CONCENTRATED ORANGE JUICE - NEW YORK BOARD OF TRADE ;2005.08.23;   38435;    7807;    6265;    7444;   17977;   21790;   33228;   35498;    5207;    2937
FRZN CONCENTRATED ORANGE JUICE - NEW YORK BOARD OF TRADE ;2005.08.16;   46744;    9315;    4054;   11613;   20548;   28460;   41476;   44126;    5268;    2618
FRZN CONCENTRATED ORANGE JUICE - NEW YORK BOARD OF TRADE ;2005.08.09;   45874;   12320;    3117;    9373;   18579;   30410;   40272;   42901;    5602;    2973
FRZN CONCENTRATED ORANGE JUICE - NEW YORK BOARD OF TRADE ;2005.08.02;   44809;   12419;    2494;    9063;   17629;   30720;   39111;   42277;    5698;    2532
FRZN CONCENTRATED ORANGE JUICE - NEW YORK BOARD OF TRADE ;2005.07.26;   45357;   12766;    2024;    8913;   17752;   32115;   39432;   43052;    5925;    2305
FRZN CONCENTRATED ORANGE JUICE - NEW YORK BOARD OF TRADE ;2005.07.19;   46133;   14228;    2143;    8760;   17098;   32585;   40087;   43489;    6047;    2645
FRZN CONCENTRATED ORANGE JUICE - NEW YORK BOARD OF TRADE ;2005.07.12;   49498;   18312;    1948;    9750;   14831;   34828;   42893;   46526;    6605;    2972
FRZN CONCENTRATED ORANGE JUICE - NEW YORK BOARD OF TRADE ;2005.07.05;   44454;   17043;    2782;    8916;   12446;   30199;   38405;   41897;    6049;    2556
FRZN CONCENTRATED ORANGE JUICE - NEW YORK BOARD OF TRADE ;2005.06.28;   43225;   14484;    3296;    8561;   14095;   28776;   37140;   40633;    6086;    2593
FRZN CONCENTRATED ORANGE JUICE - NEW YORK BOARD OF TRADE ;2005.06.21;   39444;   12716;    3766;    8082;   12321;   25244;   33119;   37093;    6325;    2351
FRZN CONCENTRATED ORANGE JUICE - NEW YORK BOARD OF TRADE ;2005.06.14;   41860;   10852;    3678;   10070;   15262;   25747;   36185;   39494;    5676;    2366
FRZN CONCENTRATED ORANGE JUICE - NEW YORK BOARD OF TRADE ;2005.06.07;   39272;   10345;    3083;    8508;   14656;   24671;   33508;   36263;    5763;    3009
FRZN CONCENTRATED ORANGE JUICE - NEW YORK BOARD OF TRADE ;2005.05.31;   37448;   10008;    3451;    7922;   14007;   23498;   31937;   34871;    5512;    2577
FRZN CONCENTRATED ORANGE JUICE - NEW YORK BOARD OF TRADE ;2005.05.24;   35974;    9765;    3219;    7084;   13784;   23646;   30632;   33948;    5341;    2026
FRZN CONCENTRATED ORANGE JUICE - NEW YORK BOARD OF TRADE ;2005.05.17;   34376;    9185;    2634;    6787;   13813;   22832;   29785;   32252;    4591;    2124
FRZN CONCENTRATED ORANGE JUICE - NEW YORK BOARD OF TRADE ;2005.05.10;   34147;   10545;    3794;    5122;   13763;   22959;   29430;   31875;    4717;    2273
FRZN CONCENTRATED ORANGE JUICE - NEW YORK BOARD OF TRADE ;2005.05.03;   35965;   12811;    4136;    5690;   12595;   24228;   31097;   34055;    4868;    1911
FRZN CONCENTRATED ORANGE JUICE - NEW YORK BOARD OF TRADE ;2005.04.26;   40053;   13178;    3552;    6183;   14775;   28482;   34136;   38217;    5918;    1837
FRZN CONCENTRATED ORANGE JUICE - NEW YORK BOARD OF TRADE ;2005.04.19;   40823;   12276;    3434;    5867;   17059;   29421;   35202;   38722;    5620;    2101
FRZN CONCENTRATED ORANGE JUICE - NEW YORK BOARD OF TRADE ;2005.04.12;   44939;   14545;    3750;    7993;   16398;   30634;   38936;   42378;    6003;    2562
FRZN CONCENTRATED ORANGE JUICE - NEW YORK BOARD OF TRADE ;2005.04.05;   47107;   18413;    4389;    8655;   12812;   31715;   39880;   44759;    7227;    2348
FRZN CONCENTRATED ORANGE JUICE - NEW YORK BOARD OF TRADE ;2005.03.29;   44853;   16840;    4295;    8100;   12980;   30088;   37920;   42482;    6933;    2371
FRZN CONCENTRATED ORANGE JUICE - NEW YORK BOARD OF TRADE ;2005.03.22;   44333;   17339;    3968;    8176;   12558;   29684;   38073;   41828;    6259;    2505
FRZN CONCENTRATED ORANGE JUICE - NEW YORK BOARD OF TRADE ;2005.03.15;   43192;   15545;    4527;    9021;   11725;   27665;   36291;   41213;    6901;    1979
FRZN CONCENTRATED ORANGE JUICE - NEW YORK BOARD OF TRADE ;2005.03.08;   41313;   13200;    3678;    9106;   12279;   26742;   34585;   39525;    6728;    1788
FRZN CONCENTRATED ORANGE JUICE - NEW YORK BOARD OF TRADE ;2005.03.01;   40558;   11062;    2721;    9874;   13389;   26454;   34325;   39049;    6233;    1509
FRZN CONCENTRATED ORANGE JUICE - NEW YORK BOARD OF TRADE ;2005.02.22;   44692;    9569;    2427;   11355;   17323;   29070;   38246;   42853;    6445;    1839
FRZN CONCENTRATED ORANGE JUICE - NEW YORK BOARD OF TRADE ;2005.02.15;   59639;    9104;    2628;   19251;   24885;   35794;   53240;   57673;    6399;    1966
FRZN CONCENTRATED ORANGE JUICE - NEW YORK BOARD OF TRADE ;2005.02.08;   64883;    9519;    2384;   20627;   28740;   40271;   58886;   63282;    5997;    1601
FRZN CONCENTRATED ORANGE JUICE - NEW YORK BOARD OF TRADE ;2005.02.01;   62826;    7599;    1947;   21730;   28024;   37567;   57353;   61244;    5474;    1583
FRZN CONCENTRATED ORANGE JUICE - NEW YORK BOARD OF TRADE ;2005.01.25;   63052;    7619;    2082;   22563;   27469;   36738;   57651;   61383;    5401;    1669
FRZN CONCENTRATED ORANGE JUICE - NEW YORK BOARD OF TRADE ;2005.01.18;   63352;    8663;    2223;   21531;   27395;   38245;   57588;   61999;    5764;    1353
FRZN CONCENTRATED ORANGE JUICE - NEW YORK BOARD OF TRADE ;2005.01.11;   61894;   10068;    2956;   20019;   25904;   37209;   55992;   60184;    5902;    1710
FRZN CONCENTRATED ORANGE JUICE - NEW YORK BOARD OF TRADE ;2005.01.04;   63410;   11838;    2721;   19878;   25229;   38646;   56945;   61244;    6465;    2166
FRZN CONCENTRATED ORANGE JUICE - NEW YORK BOARD OF TRADE ;2007.08.28;   41895;    4839;    7963;   13924;   18333;   17002;   37096;   38890;    4799;    3006
FRZN CONCENTRATED ORANGE JUICE - NEW YORK BOARD OF TRADE ;2007.08.21;   43637;    4722;    7951;   14898;   18912;   17736;   38532;   40586;    5105;    3051
FRZN CONCENTRATED ORANGE JUICE - NEW YORK BOARD OF TRADE ;2007.08.14;   54589;    5245;    7664;   20412;   22572;   23224;   48229;   51300;    6360;    3289
FRZN CONCENTRATED ORANGE JUICE - NEW YORK BOARD OF TRADE ;2007.08.07;   52810;    5173;    7156;   19414;   22475;   23520;   47062;   50091;    5748;    2720
FRZN CONCENTRATED ORANGE JUICE - NEW YORK BOARD OF TRADE ;2007.07.31;   49949;    5235;    7529;   17427;   21612;   22340;   44274;   47296;    5675;    2653
FRZN CONCENTRATED ORANGE JUICE - NEW YORK BOARD OF TRADE ;2007.07.24;   49575;    5493;    8593;   16074;   22282;   22062;   43849;   46728;    5726;    2847
FRZN CONCENTRATED ORANGE JUICE - NEW YORK BOARD OF TRADE ;2007.07.17;   46438;    5444;    8599;   14096;   21813;   20374;   41353;   43068;    5085;    3370
FRZN CONCENTRATED ORANGE JUICE - NEW YORK BOARD OF TRADE ;2007.07.10;   46391;    5359;    8761;   14093;   22241;   20271;   41693;   43126;    4698;    3266
FRZN CONCENTRATED ORANGE JUICE - NEW YORK BOARD OF TRADE ;2007.07.03;   46512;    5321;    8607;   13786;   22638;   20839;   41745;   43231;    4766;    3280
FRZN CONCENTRATED ORANGE JUICE - NEW YORK BOARD OF TRADE ;2007.06.26;   48737;    4973;    7605;   14301;   24627;   23027;   43902;   44933;    4835;    3804
FRZN CONCENTRATED ORANGE JUICE - NEW YORK BOARD OF TRADE ;2007.06.19;   48091;    5216;    6382;   13827;   23832;   23519;   42874;   43728;    5217;    4363
FRZN CONCENTRATED ORANGE JUICE - NEW YORK BOARD OF TRADE ;2007.06.12;   50885;    5717;    5395;   17995;   22004;   22994;   45716;   46384;    5169;    4501
FRZN CONCENTRATED ORANGE JUICE - NEW YORK BOARD OF TRADE ;2007.06.05;   48478;    6016;    4260;   15598;   21024;   23600;   42638;   43458;    5840;    5020
FRZN CONCENTRATED ORANGE JUICE - NEW YORK BOARD OF TRADE ;2007.05.29;   46826;    6926;    3665;   14693;   20220;   24465;   41839;   42822;    4988;    4004
FRZN CONCENTRATED ORANGE JUICE - NEW YORK BOARD OF TRADE ;2007.05.22;   47646;    8456;    3643;   14740;   19329;   25286;   42525;   43668;    5120;    3977
FRZN CONCENTRATED ORANGE JUICE - NEW YORK BOARD OF TRADE ;2007.05.15;   48144;    7793;    4174;   15322;   19320;   25050;   42435;   44545;    5709;    3599
FRZN CONCENTRATED ORANGE JUICE - NEW YORK BOARD OF TRADE ;2007.05.08;   44770;    6692;    4227;   13811;   19118;   23220;   39621;   41259;    5149;    3511
FRZN CONCENTRATED ORANGE JUICE - NEW YORK BOARD OF TRADE ;2007.05.01;   43214;    6508;    3878;   12827;   18965;   23072;   38300;   39777;    4915;    3437
FRZN CONCENTRATED ORANGE JUICE - NEW YORK BOARD OF TRADE ;2007.04.24;   43166;    6622;    3240;   12410;   19572;   23629;   38603;   39278;    4562;    3888
FRZN CONCENTRATED ORANGE JUICE - NEW YORK BOARD OF TRADE ;2007.04.17;   49513;    8049;    2756;   15505;   21233;   26686;   44786;   44947;    4727;    4566
FRZN CONCENTRATED ORANGE JUICE - NEW YORK BOARD OF TRADE ;2007.04.10;   46372;   11113;    2188;   12254;   18199;   27222;   41566;   41664;    4806;    4708
FRZN CONCENTRATED ORANGE JUICE - NEW YORK BOARD OF TRADE ;2007.04.03;   45599;   11841;    1702;   11663;   16463;   28214;   39967;   41578;    5633;    4021
FRZN CONCENTRATED ORANGE JUICE - NEW YORK BOARD OF TRADE ;2007.03.27;   46447;   15212;    2367;   10465;   15294;   29766;   40971;   42599;    5476;    3849
FRZN CONCENTRATED ORANGE JUICE - NEW YORK BOARD OF TRADE ;2007.03.20;   44355;   16338;    2335;    9186;   13111;   29281;   38636;   40803;    5719;    3552
FRZN CONCENTRATED ORANGE JUICE - NEW YORK BOARD OF TRADE ;2007.03.13;   44045;   16181;    2215;    9594;   12987;   28528;   38761;   40338;    5283;    3707
FRZN CONCENTRATED ORANGE JUICE - NEW YORK BOARD OF TRADE ;2007.03.06;   43955;   15339;    1710;    9729;   13239;   28921;   38307;   40360;    5648;    3595
FRZN CONCENTRATED ORANGE JUICE - NEW YORK BOARD OF TRADE ;2007.02.27;   39302;   13609;    2036;    8092;   12043;   26026;   33743;   36154;    5559;    3148
FRZN CONCENTRATED ORANGE JUICE - NEW YORK BOARD OF TRADE ;2007.02.20;   35056;   10123;    1990;    6507;   13491;   22636;   30121;   31133;    4935;    3923
FRZN CONCENTRATED ORANGE JUICE - NEW YORK BOARD OF TRADE ;2007.02.13;   39633;    9492;    2104;    9901;   14759;   23321;   34152;   35326;    5481;    4308
FRZN CONCENTRATED ORANGE JUICE - NEW YORK BOARD OF TRADE ;2007.02.06;   41408;   10112;    2609;   10755;   15171;   23581;   36038;   36946;    5370;    4462
FRZN CONCENTRATED ORANGE JUICE - NEW YORK BOARD OF TRADE ;2007.01.30;   42538;   12833;    2931;    9397;   15004;   25428;   37235;   37757;    5303;    4781
FRZN CONCENTRATED ORANGE JUICE - NEW YORK BOARD OF TRADE ;2007.01.23;   43113;   16519;    1565;    9817;   12033;   28079;   38369;   39461;    4743;    3651
FRZN CONCENTRATED ORANGE JUICE - NEW YORK BOARD OF TRADE ;2007.01.16;   38836;   12556;    1505;    9192;   12649;   24331;   34397;   35027;    4439;    3809
FRZN CONCENTRATED ORANGE JUICE - NEW YORK BOARD OF TRADE ;2007.01.09;   37045;   11687;    1200;    8911;   12520;   22854;   33119;   32965;    3926;    4080
FRZN CONCENTRATED ORANGE JUICE - NEW YORK BOARD OF TRADE ;2007.01.03;   36561;   12409;    1167;    8706;   11319;   22924;   32434;   32797;    4126;    3764
FRZN CONCENTRATED ORANGE JUICE - NEW YORK BOARD OF TRADE ;2006.12.26;   36170;   10425;    1216;    8459;   12524;   21688;   31408;   31363;    4762;    4807
FRZN CONCENTRATED ORANGE JUICE - NEW YORK BOARD OF TRADE ;2006.12.19;   35498;   10519;    1402;    8451;   11430;   20940;   30399;   30793;    5098;    4705
FRZN CONCENTRATED ORANGE JUICE - NEW YORK BOARD OF TRADE ;2006.12.12;   42974;   11409;    1623;   11660;   13099;   23821;   36168;   37104;    6806;    5870
FRZN CONCENTRATED ORANGE JUICE - NEW YORK BOARD OF TRADE ;2006.12.05;   47941;   12445;    1532;   13608;   17625;   30017;   43678;   45157;    4263;    2784
FRZN CONCENTRATED ORANGE JUICE - NEW YORK BOARD OF TRADE ;2006.11.28;   49796;   11308;    1763;   14417;   19057;   30197;   44782;   46377;    5014;    3419
FRZN CONCENTRATED ORANGE JUICE - NEW YORK BOARD OF TRADE ;2006.11.21;   49132;   11514;    1578;   13254;   19321;   31261;   44089;   46093;    5043;    3039
FRZN CONCENTRATED ORANGE JUICE - NEW YORK BOARD OF TRADE ;2006.11.14;   49008;   10868;    1577;   12358;   19933;   31657;   43159;   45593;    5849;    3415
FRZN CONCENTRATED ORANGE JUICE - NEW YORK BOARD OF TRADE ;2006.11.07;   49115;   12111;    1737;   12319;   19306;   32401;   43735;   46457;    5380;    2658
FRZN CONCENTRATED ORANGE JUICE - NEW YORK BOARD OF TRADE ;2006.10.31;   48942;   11539;    1275;   11594;   20203;   33422;   43336;   46292;    5606;    2651
FRZN CONCENTRATED ORANGE JUICE - NEW YORK BOARD OF TRADE ;2006.10.24;   48412;   10596;    1226;   11272;   20910;   33350;   42778;   45848;    5634;    2563
FRZN CONCENTRATED ORANGE JUICE - NEW YORK BOARD OF TRADE ;2006.10.17;   58777;   10161;    1566;   17985;   24093;   35597;   52239;   55148;    6538;    3630
FRZN CONCENTRATED ORANGE JUICE - NEW YORK BOARD OF TRADE ;2006.10.10;   53805;    8311;    2507;   16074;   24815;   31223;   49200;   49804;    4605;    4001
FRZN CONCENTRATED ORANGE JUICE - NEW YORK BOARD OF TRADE ;2006.10.03;   54628;    8991;    1434;   15343;   23108;   32926;   47443;   49703;    7185;    4925
FRZN CONCENTRATED ORANGE JUICE - NEW YORK BOARD OF TRADE ;2006.09.26;   52695;    8661;    1843;   16010;   22476;   30949;   47148;   48802;    5547;    3893
FRZN CONCENTRATED ORANGE JUICE - NEW YORK BOARD OF TRADE ;2006.09.19;   52302;    9343;    1881;   14925;   22855;   31952;   47123;   48758;    5180;    3544
FRZN CONCENTRATED ORANGE JUICE - NEW YORK BOARD OF TRADE ;2006.09.12;   53905;   11463;    1294;   15159;   21444;   33910;   48067;   50363;    5838;    3542
FRZN CONCENTRATED ORANGE JUICE - NEW YORK BOARD OF TRADE ;2006.09.05;   51707;   12064;     968;   14176;   19014;   33187;   45253;   48330;    6453;    3376
FRZN CONCENTRATED ORANGE JUICE - NEW YORK BOARD OF TRADE ;2006.08.29;   55120;   12893;    1092;   14771;   20191;   35842;   47855;   51704;    7265;    3417
FRZN CONCENTRATED ORANGE JUICE - NEW YORK BOARD OF TRADE ;2006.08.22;   54494;   11908;     996;   14217;   20806;   36125;   46930;   51338;    7563;    3156
FRZN CONCENTRATED ORANGE JUICE - NEW YORK BOARD OF TRADE ;2006.08.15;   53705;   12573;    2146;   16168;   17975;   32373;   46715;   50688;    6990;    3017
FRZN CONCENTRATED ORANGE JUICE - NEW YORK BOARD OF TRADE ;2006.08.08;   52252;   12395;    2188;   15713;   16638;   31320;   44746;   49222;    7506;    3031
FRZN CONCENTRATED ORANGE JUICE - NEW YORK BOARD OF TRADE ;2006.08.01;   52927;   12244;    1694;   16179;   15468;   32143;   43891;   50016;    9036;    2911
FRZN CONCENTRATED ORANGE JUICE - NEW YORK BOARD OF TRADE ;2006.07.25;   47151;   11223;    1670;   14056;   13514;   29265;   38793;   44991;    8358;    2160
FRZN CONCENTRATED ORANGE JUICE - NEW YORK BOARD OF TRADE ;2006.07.18;   44145;   10789;    2434;   12903;   13395;   26337;   37088;   41674;    7057;    2471
FRZN CONCENTRATED ORANGE JUICE - NEW YORK BOARD OF TRADE ;2006.07.11;   44976;   13206;    1261;   12989;   11772;   28580;   37967;   42830;    7010;    2146
FRZN CONCENTRATED ORANGE JUICE - NEW YORK BOARD OF TRADE ;2006.07.03;   48267;   16742;     952;   12759;   10788;   32153;   40289;   45863;    7979;    2404
FRZN CONCENTRATED ORANGE JUICE - NEW YORK BOARD OF TRADE ;2006.06.27;   47601;   15833;    1380;   12916;   11252;   30964;   40002;   45260;    7599;    2341
FRZN CONCENTRATED ORANGE JUICE - NEW YORK BOARD OF TRADE ;2006.06.20;   44353;   13587;    1032;   12567;   10678;   27894;   36831;   41494;    7521;    2859
FRZN CONCENTRATED ORANGE JUICE - NEW YORK BOARD OF TRADE ;2006.06.13;   48861;   13724;    1113;   15992;   12600;   28859;   42316;   45964;    6545;    2897
FRZN CONCENTRATED ORANGE JUICE - NEW YORK BOARD OF TRADE ;2006.06.06;   48175;   13264;    1082;   15215;   11932;   28140;   40412;   44438;    7763;    3737
FRZN CONCENTRATED ORANGE JUICE - NEW YORK BOARD OF TRADE ;2006.05.30;   49204;   15343;    1128;   15467;   11667;   29870;   42477;   46465;    6727;    2740
FRZN CONCENTRATED ORANGE JUICE - NEW YORK BOARD OF TRADE ;2006.05.23;   47355;   15513;    1174;   14462;   11913;   29285;   41888;   44921;    5467;    2434
FRZN CONCENTRATED ORANGE JUICE - NEW YORK BOARD OF TRADE ;2006.05.16;   54200;   19412;    1539;   16119;   12484;   33580;   48015;   51237;    6185;    2963
FRZN CONCENTRATED ORANGE JUICE - NEW YORK BOARD OF TRADE ;2006.05.09;   52752;   19088;    1734;   14654;   12826;   33669;   46567;   50057;    6185;    2695
FRZN CONCENTRATED ORANGE JUICE - NEW YORK BOARD OF TRADE ;2006.05.02;   49207;   17610;    1529;   14174;   11460;   30529;   43244;   46232;    5963;    2975
FRZN CONCENTRATED ORANGE JUICE - NEW YORK BOARD OF TRADE ;2006.04.25;   50912;   15963;    1735;   13392;   14564;   30830;   43919;   45957;    6993;    4955
FRZN CONCENTRATED ORANGE JUICE - NEW YORK BOARD OF TRADE ;2006.04.18;   53159;   16303;    1732;   16031;   15970;   31859;   48305;   49622;    4854;    3537
FRZN CONCENTRATED ORANGE JUICE - NEW YORK BOARD OF TRADE ;2006.04.11;   53013;   17599;    1980;   15026;   15851;   32393;   48475;   49398;    4537;    3614
FRZN CONCENTRATED ORANGE JUICE - NEW YORK BOARD OF TRADE ;2006.04.04;   53298;   20656;    1317;   14006;   13226;   33862;   47888;   49184;    5410;    4113
FRZN CONCENTRATED ORANGE JUICE - NEW YORK BOARD OF TRADE ;2006.03.28;   54678;   19979;    1417;   14820;   14061;   34058;   48860;   50295;    5818;    4383
FRZN CONCENTRATED ORANGE JUICE - NEW YORK BOARD OF TRADE ;2006.03.21;   51858;   18162;    1644;   14056;   14896;   32965;   47114;   48665;    4744;    3193
FRZN CONCENTRATED ORANGE JUICE - NEW YORK BOARD OF TRADE ;2006.03.14;   49779;   17037;    1720;   13130;   15020;   31848;   45187;   46698;    4592;    3081
FRZN CONCENTRATED ORANGE JUICE - NEW YORK BOARD OF TRADE ;2006.03.07;   46408;   15791;    2156;   11731;   14624;   29486;   42146;   43374;    4262;    3034
FRZN CONCENTRATED ORANGE JUICE - NEW YORK BOARD OF TRADE ;2006.02.28;   46642;   15341;    2282;   11159;   15791;   30613;   42291;   44054;    4351;    2588
FRZN CONCENTRATED ORANGE JUICE - NEW YORK BOARD OF TRADE ;2006.02.21;   47570;   13847;    2673;    9889;   19485;   31563;   43221;   44125;    4349;    3445
FRZN CONCENTRATED ORANGE JUICE - NEW YORK BOARD OF TRADE ;2006.02.14;   52503;   13568;    2175;   13429;   21174;   33600;   48171;   49204;    4332;    3299
FRZN CONCENTRATED ORANGE JUICE - NEW YORK BOARD OF TRADE ;2006.02.07;   52000;   10918;    2324;   13943;   22589;   32683;   47450;   48950;    4550;    3050
FRZN CONCENTRATED ORANGE JUICE - NEW YORK BOARD OF TRADE ;2006.01.31;   47183;    7141;    2805;   13237;   22817;   28091;   43195;   44132;    3987;    3050
FRZN CONCENTRATED ORANGE JUICE - NEW YORK BOARD OF TRADE ;2006.01.24;   44911;    6830;    2778;   11862;   22513;   26787;   41205;   41427;    3706;    3484
FRZN CONCENTRATED ORANGE JUICE - NEW YORK BOARD OF TRADE ;2006.01.17;   47844;   10102;    2620;   12329;   21783;   30339;   44214;   45288;    3630;    2556
FRZN CONCENTRATED ORANGE JUICE - NEW YORK BOARD OF TRADE ;2006.01.10;   50854;   11860;    2208;   13621;   20827;   32634;   46307;   48463;    4547;    2391
FRZN CONCENTRATED ORANGE JUICE - NEW YORK BOARD OF TRADE ;2006.01.03;   48250;   10120;    2416;   12393;   21709;   30712;   44221;   45521;    4028;    2729
FRZN CONCENTRATED ORANGE JUICE - NEW YORK BOARD OF TRADE ;2005.12.27;   51425;   11648;    2469;   13049;   22109;   31930;   46806;   47448;    4619;    3977
FRZN CONCENTRATED ORANGE JUICE - NEW YORK BOARD OF TRADE ;2005.12.20;   57080;   13499;    2768;   14682;   23658;   35842;   51839;   53292;    5241;    3787
FRZN CONCENTRATED ORANGE JUICE - NEW YORK BOARD OF TRADE ;2005.12.13;   64003;   13914;    2074;   18100;   26162;   40200;   58176;   60374;    5827;    3629
FRZN CONCENTRATED ORANGE JUICE - NEW YORK BOARD OF TRADE ;2005.12.06;   56640;   14362;    2726;   14776;   21713;   35186;   50851;   52687;    5788;    3952
FRZN CONCENTRATED ORANGE JUICE - NEW YORK BOARD OF TRADE ;2005.11.29;   54317;   14114;    2318;   13866;   20695;   33912;   48674;   50096;    5642;    4221
FRZN CONCENTRATED ORANGE JUICE - NEW YORK BOARD OF TRADE ;2005.11.22;   53472;   14530;    2623;   12929;   20607;   33490;   48066;   49042;    5405;    4429
FRZN CONCENTRATED ORANGE JUICE - NEW YORK BOARD OF TRADE ;2005.11.15;   55112;   16884;    2252;   13496;   19492;   35272;   49872;   51021;    5240;    4091
FRZN CONCENTRATED ORANGE JUICE - NEW YORK BOARD OF TRADE ;2005.11.08;   55708;   16210;    2377;   13512;   20140;   35945;   49862;   51834;    5846;    3874
FRZN CONCENTRATED ORANGE JUICE - NEW YORK BOARD OF TRADE ;2005.11.01;   51750;   15308;    1552;   13287;   17731;   33257;   46326;   48096;    5424;    3653
FRZN CONCENTRATED ORANGE JUICE - NEW YORK BOARD OF TRADE ;2005.10.25;   48510;   14219;    1523;   12981;   15438;   31008;   42637;   45511;    5873;    2999
FRZN CONCENTRATED ORANGE JUICE - NEW YORK BOARD OF TRADE ;2005.10.18;   48960;   12086;    1768;   14453;   15855;   29982;   42395;   46203;    6566;    2757
FRZN CONCENTRATED ORANGE JUICE - NEW YORK BOARD OF TRADE ;2005.10.11;   45469;   11433;    1829;   12373;   16331;   28456;   40137;   42659;    5332;    2811
FRZN CONCENTRATED ORANGE JUICE - NEW YORK BOARD OF TRADE ;2005.10.04;   42873;    9958;    1601;   11496;   16003;   27286;   37457;   40383;    5416;    2489
FRZN CONCENTRATED ORANGE JUICE - NEW YORK BOARD OF TRADE ;2005.09.27;   39662;    8061;    2460;    9779;   16604;   24604;   34445;   36843;    5217;    2819
FRZN CONCENTRATED ORANGE JUICE - NEW YORK BOARD OF TRADE ;2005.09.20;   39191;    7421;    5048;    8629;   18049;   22260;   34098;   35937;    5093;    3254
FRZN CONCENTRATED ORANGE JUICE - NEW YORK BOARD OF TRADE ;2005.09.13;   40243;    7415;    6457;    9515;   17687;   21259;   34618;   37231;    5625;    3012
FRZN CONCENTRATED ORANGE JUICE - NEW YORK BOARD OF TRADE ;2005.09.06;   36931;    7037;    6427;    8327;   16438;   19314;   31802;   34067;    5129;    2864
FRZN CONCENTRATED ORANGE JUICE - NEW YORK BOARD OF TRADE ;2005.08.30;   38081;    7098;    6007;    8327;   17595;   21121;   33021;   35456;    5060;    2625
FRZN CONCENTRATED ORANGE JUICE - NEW YORK BOARD OF TRADE ;2005.08.23;   38435;    7807;    6265;    7444;   17977;   21790;   33228;   35498;    5207;    2937
FRZN CONCENTRATED ORANGE JUICE - NEW YORK BOARD OF TRADE ;2005.08.16;   46744;    9315;    4054;   11613;   20548;   28460;   41476;   44126;    5268;    2618
FRZN CONCENTRATED ORANGE JUICE - NEW YORK BOARD OF TRADE ;2005.08.09;   45874;   12320;    3117;    9373;   18579;   30410;   40272;   42901;    5602;    2973
FRZN CONCENTRATED ORANGE JUICE - NEW YORK BOARD OF TRADE ;2005.08.02;   44809;   12419;    2494;    9063;   17629;   30720;   39111;   42277;    5698;    2532
FRZN CONCENTRATED ORANGE JUICE - NEW YORK BOARD OF TRADE ;2005.07.26;   45357;   12766;    2024;    8913;   17752;   32115;   39432;   43052;    5925;    2305
FRZN CONCENTRATED ORANGE JUICE - NEW YORK BOARD OF TRADE ;2005.07.19;   46133;   14228;    2143;    8760;   17098;   32585;   40087;   43489;    6047;    2645
FRZN CONCENTRATED ORANGE JUICE - NEW YORK BOARD OF TRADE ;2005.07.12;   49498;   18312;    1948;    9750;   14831;   34828;   42893;   46526;    6605;    2972
FRZN CONCENTRATED ORANGE JUICE - NEW YORK BOARD OF TRADE ;2005.07.05;   44454;   17043;    2782;    8916;   12446;   30199;   38405;   41897;    6049;    2556
FRZN CONCENTRATED ORANGE JUICE - NEW YORK BOARD OF TRADE ;2005.06.28;   43225;   14484;    3296;    8561;   14095;   28776;   37140;   40633;    6086;    2593
FRZN CONCENTRATED ORANGE JUICE - NEW YORK BOARD OF TRADE ;2005.06.21;   39444;   12716;    3766;    8082;   12321;   25244;   33119;   37093;    6325;    2351
FRZN CONCENTRATED ORANGE JUICE - NEW YORK BOARD OF TRADE ;2005.06.14;   41860;   10852;    3678;   10070;   15262;   25747;   36185;   39494;    5676;    2366
FRZN CONCENTRATED ORANGE JUICE - NEW YORK BOARD OF TRADE ;2005.06.07;   39272;   10345;    3083;    8508;   14656;   24671;   33508;   36263;    5763;    3009
FRZN CONCENTRATED ORANGE JUICE - NEW YORK BOARD OF TRADE ;2005.05.31;   37448;   10008;    3451;    7922;   14007;   23498;   31937;   34871;    5512;    2577
FRZN CONCENTRATED ORANGE JUICE - NEW YORK BOARD OF TRADE ;2005.05.24;   35974;    9765;    3219;    7084;   13784;   23646;   30632;   33948;    5341;    2026
FRZN CONCENTRATED ORANGE JUICE - NEW YORK BOARD OF TRADE ;2005.05.17;   34376;    9185;    2634;    6787;   13813;   22832;   29785;   32252;    4591;    2124
FRZN CONCENTRATED ORANGE JUICE - NEW YORK BOARD OF TRADE ;2005.05.10;   34147;   10545;    3794;    5122;   13763;   22959;   29430;   31875;    4717;    2273
FRZN CONCENTRATED ORANGE JUICE - NEW YORK BOARD OF TRADE ;2005.05.03;   35965;   12811;    4136;    5690;   12595;   24228;   31097;   34055;    4868;    1911
FRZN CONCENTRATED ORANGE JUICE - NEW YORK BOARD OF TRADE ;2005.04.26;   40053;   13178;    3552;    6183;   14775;   28482;   34136;   38217;    5918;    1837
FRZN CONCENTRATED ORANGE JUICE - NEW YORK BOARD OF TRADE ;2005.04.19;   40823;   12276;    3434;    5867;   17059;   29421;   35202;   38722;    5620;    2101
FRZN CONCENTRATED ORANGE JUICE - NEW YORK BOARD OF TRADE ;2005.04.12;   44939;   14545;    3750;    7993;   16398;   30634;   38936;   42378;    6003;    2562
FRZN CONCENTRATED ORANGE JUICE - NEW YORK BOARD OF TRADE ;2005.04.05;   47107;   18413;    4389;    8655;   12812;   31715;   39880;   44759;    7227;    2348
FRZN CONCENTRATED ORANGE JUICE - NEW YORK BOARD OF TRADE ;2005.03.29;   44853;   16840;    4295;    8100;   12980;   30088;   37920;   42482;    6933;    2371
FRZN CONCENTRATED ORANGE JUICE - NEW YORK BOARD OF TRADE ;2005.03.22;   44333;   17339;    3968;    8176;   12558;   29684;   38073;   41828;    6259;    2505
FRZN CONCENTRATED ORANGE JUICE - NEW YORK BOARD OF TRADE ;2005.03.15;   43192;   15545;    4527;    9021;   11725;   27665;   36291;   41213;    6901;    1979
FRZN CONCENTRATED ORANGE JUICE - NEW YORK BOARD OF TRADE ;2005.03.08;   41313;   13200;    3678;    9106;   12279;   26742;   34585;   39525;    6728;    1788
FRZN CONCENTRATED ORANGE JUICE - NEW YORK BOARD OF TRADE ;2005.03.01;   40558;   11062;    2721;    9874;   13389;   26454;   34325;   39049;    6233;    1509
FRZN CONCENTRATED ORANGE JUICE - NEW YORK BOARD OF TRADE ;2005.02.22;   44692;    9569;    2427;   11355;   17323;   29070;   38246;   42853;    6445;    1839
FRZN CONCENTRATED ORANGE JUICE - NEW YORK BOARD OF TRADE ;2005.02.15;   59639;    9104;    2628;   19251;   24885;   35794;   53240;   57673;    6399;    1966
FRZN CONCENTRATED ORANGE JUICE - NEW YORK BOARD OF TRADE ;2005.02.08;   64883;    9519;    2384;   20627;   28740;   40271;   58886;   63282;    5997;    1601
FRZN CONCENTRATED ORANGE JUICE - NEW YORK BOARD OF TRADE ;2005.02.01;   62826;    7599;    1947;   21730;   28024;   37567;   57353;   61244;    5474;    1583
FRZN CONCENTRATED ORANGE JUICE - NEW YORK BOARD OF TRADE ;2005.01.25;   63052;    7619;    2082;   22563;   27469;   36738;   57651;   61383;    5401;    1669
FRZN CONCENTRATED ORANGE JUICE - NEW YORK BOARD OF TRADE ;2005.01.18;   63352;    8663;    2223;   21531;   27395;   38245;   57588;   61999;    5764;    1353
FRZN CONCENTRATED ORANGE JUICE - NEW YORK BOARD OF TRADE ;2005.01.11;   61894;   10068;    2956;   20019;   25904;   37209;   55992;   60184;    5902;    1710
FRZN CONCENTRATED ORANGE JUICE - NEW YORK BOARD OF TRADE ;2005.01.04;   63410;   11838;    2721;   19878;   25229;   38646;   56945;   61244;    6465;    2166
FRZN CONCENTRATED ORANGE JUICE - NEW YORK BOARD OF TRADE ;2007.08.28;   41895;    4839;    7963;   13924;   18333;   17002;   37096;   38890;    4799;    3006
FRZN CONCENTRATED ORANGE JUICE - NEW YORK BOARD OF TRADE ;2007.08.21;   43637;    4722;    7951;   14898;   18912;   17736;   38532;   40586;    5105;    3051
FRZN CONCENTRATED ORANGE JUICE - NEW YORK BOARD OF TRADE ;2007.08.14;   54589;    5245;    7664;   20412;   22572;   23224;   48229;   51300;    6360;    3289
FRZN CONCENTRATED ORANGE JUICE - NEW YORK BOARD OF TRADE ;2007.08.07;   52810;    5173;    7156;   19414;   22475;   23520;   47062;   50091;    5748;    2720
FRZN CONCENTRATED ORANGE JUICE - NEW YORK BOARD OF TRADE ;2007.07.31;   49949;    5235;    7529;   17427;   21612;   22340;   44274;   47296;    5675;    2653
FRZN CONCENTRATED ORANGE JUICE - NEW YORK BOARD OF TRADE ;2007.07.24;   49575;    5493;    8593;   16074;   22282;   22062;   43849;   46728;    5726;    2847
FRZN CONCENTRATED ORANGE JUICE - NEW YORK BOARD OF TRADE ;2007.07.17;   46438;    5444;    8599;   14096;   21813;   20374;   41353;   43068;    5085;    3370
FRZN CONCENTRATED ORANGE JUICE - NEW YORK BOARD OF TRADE ;2007.07.10;   46391;    5359;    8761;   14093;   22241;   20271;   41693;   43126;    4698;    3266
FRZN CONCENTRATED ORANGE JUICE - NEW YORK BOARD OF TRADE ;2007.07.03;   46512;    5321;    8607;   13786;   22638;   20839;   41745;   43231;    4766;    3280
FRZN CONCENTRATED ORANGE JUICE - NEW YORK BOARD OF TRADE ;2007.06.26;   48737;    4973;    7605;   14301;   24627;   23027;   43902;   44933;    4835;    3804
FRZN CONCENTRATED ORANGE JUICE - NEW YORK BOARD OF TRADE ;2007.06.19;   48091;    5216;    6382;   13827;   23832;   23519;   42874;   43728;    5217;    4363
FRZN CONCENTRATED ORANGE JUICE - NEW YORK BOARD OF TRADE ;2007.06.12;   50885;    5717;    5395;   17995;   22004;   22994;   45716;   46384;    5169;    4501
FRZN CONCENTRATED ORANGE JUICE - NEW YORK BOARD OF TRADE ;2007.06.05;   48478;    6016;    4260;   15598;   21024;   23600;   42638;   43458;    5840;    5020
FRZN CONCENTRATED ORANGE JUICE - NEW YORK BOARD OF TRADE ;2007.05.29;   46826;    6926;    3665;   14693;   20220;   24465;   41839;   42822;    4988;    4004
FRZN CONCENTRATED ORANGE JUICE - NEW YORK BOARD OF TRADE ;2007.05.22;   47646;    8456;    3643;   14740;   19329;   25286;   42525;   43668;    5120;    3977
FRZN CONCENTRATED ORANGE JUICE - NEW YORK BOARD OF TRADE ;2007.05.15;   48144;    7793;    4174;   15322;   19320;   25050;   42435;   44545;    5709;    3599
FRZN CONCENTRATED ORANGE JUICE - NEW YORK BOARD OF TRADE ;2007.05.08;   44770;    6692;    4227;   13811;   19118;   23220;   39621;   41259;    5149;    3511
FRZN CONCENTRATED ORANGE JUICE - NEW YORK BOARD OF TRADE ;2007.05.01;   43214;    6508;    3878;   12827;   18965;   23072;   38300;   39777;    4915;    3437
FRZN CONCENTRATED ORANGE JUICE - NEW YORK BOARD OF TRADE ;2007.04.24;   43166;    6622;    3240;   12410;   19572;   23629;   38603;   39278;    4562;    3888
FRZN CONCENTRATED ORANGE JUICE - NEW YORK BOARD OF TRADE ;2007.04.17;   49513;    8049;    2756;   15505;   21233;   26686;   44786;   44947;    4727;    4566
FRZN CONCENTRATED ORANGE JUICE - NEW YORK BOARD OF TRADE ;2007.04.10;   46372;   11113;    2188;   12254;   18199;   27222;   41566;   41664;    4806;    4708
FRZN CONCENTRATED ORANGE JUICE - NEW YORK BOARD OF TRADE ;2007.04.03;   45599;   11841;    1702;   11663;   16463;   28214;   39967;   41578;    5633;    4021
FRZN CONCENTRATED ORANGE JUICE - NEW YORK BOARD OF TRADE ;2007.03.27;   46447;   15212;    2367;   10465;   15294;   29766;   40971;   42599;    5476;    3849
FRZN CONCENTRATED ORANGE JUICE - NEW YORK BOARD OF TRADE ;2007.03.20;   44355;   16338;    2335;    9186;   13111;   29281;   38636;   40803;    5719;    3552
FRZN CONCENTRATED ORANGE JUICE - NEW YORK BOARD OF TRADE ;2007.03.13;   44045;   16181;    2215;    9594;   12987;   28528;   38761;   40338;    5283;    3707
FRZN CONCENTRATED ORANGE JUICE - NEW YORK BOARD OF TRADE ;2007.03.06;   43955;   15339;    1710;    9729;   13239;   28921;   38307;   40360;    5648;    3595
FRZN CONCENTRATED ORANGE JUICE - NEW YORK BOARD OF TRADE ;2007.02.27;   39302;   13609;    2036;    8092;   12043;   26026;   33743;   36154;    5559;    3148
FRZN CONCENTRATED ORANGE JUICE - NEW YORK BOARD OF TRADE ;2007.02.20;   35056;   10123;    1990;    6507;   13491;   22636;   30121;   31133;    4935;    3923
FRZN CONCENTRATED ORANGE JUICE - NEW YORK BOARD OF TRADE ;2007.02.13;   39633;    9492;    2104;    9901;   14759;   23321;   34152;   35326;    5481;    4308
FRZN CONCENTRATED ORANGE JUICE - NEW YORK BOARD OF TRADE ;2007.02.06;   41408;   10112;    2609;   10755;   15171;   23581;   36038;   36946;    5370;    4462
FRZN CONCENTRATED ORANGE JUICE - NEW YORK BOARD OF TRADE ;2007.01.30;   42538;   12833;    2931;    9397;   15004;   25428;   37235;   37757;    5303;    4781
FRZN CONCENTRATED ORANGE JUICE - NEW YORK BOARD OF TRADE ;2007.01.23;   43113;   16519;    1565;    9817;   12033;   28079;   38369;   39461;    4743;    3651
FRZN CONCENTRATED ORANGE JUICE - NEW YORK BOARD OF TRADE ;2007.01.16;   38836;   12556;    1505;    9192;   12649;   24331;   34397;   35027;    4439;    3809
FRZN CONCENTRATED ORANGE JUICE - NEW YORK BOARD OF TRADE ;2007.01.09;   37045;   11687;    1200;    8911;   12520;   22854;   33119;   32965;    3926;    4080
FRZN CONCENTRATED ORANGE JUICE - NEW YORK BOARD OF TRADE ;2007.01.03;   36561;   12409;    1167;    8706;   11319;   22924;   32434;   32797;    4126;    3764
FRZN CONCENTRATED ORANGE JUICE - NEW YORK BOARD OF TRADE ;2006.12.26;   36170;   10425;    1216;    8459;   12524;   21688;   31408;   31363;    4762;    4807
FRZN CONCENTRATED ORANGE JUICE - NEW YORK BOARD OF TRADE ;2006.12.19;   35498;   10519;    1402;    8451;   11430;   20940;   30399;   30793;    5098;    4705
FRZN CONCENTRATED ORANGE JUICE - NEW YORK BOARD OF TRADE ;2006.12.12;   42974;   11409;    1623;   11660;   13099;   23821;   36168;   37104;    6806;    5870
FRZN CONCENTRATED ORANGE JUICE - NEW YORK BOARD OF TRADE ;2006.12.05;   47941;   12445;    1532;   13608;   17625;   30017;   43678;   45157;    4263;    2784
FRZN CONCENTRATED ORANGE JUICE - NEW YORK BOARD OF TRADE ;2006.11.28;   49796;   11308;    1763;   14417;   19057;   30197;   44782;   46377;    5014;    3419
FRZN CONCENTRATED ORANGE JUICE - NEW YORK BOARD OF TRADE ;2006.11.21;   49132;   11514;    1578;   13254;   19321;   31261;   44089;   46093;    5043;    3039
FRZN CONCENTRATED ORANGE JUICE - NEW YORK BOARD OF TRADE ;2006.11.14;   49008;   10868;    1577;   12358;   19933;   31657;   43159;   45593;    5849;    3415
FRZN CONCENTRATED ORANGE JUICE - NEW YORK BOARD OF TRADE ;2006.11.07;   49115;   12111;    1737;   12319;   19306;   32401;   43735;   46457;    5380;    2658
FRZN CONCENTRATED ORANGE JUICE - NEW YORK BOARD OF TRADE ;2006.10.31;   48942;   11539;    1275;   11594;   20203;   33422;   43336;   46292;    5606;    2651
FRZN CONCENTRATED ORANGE JUICE - NEW YORK BOARD OF TRADE ;2006.10.24;   48412;   10596;    1226;   11272;   20910;   33350;   42778;   45848;    5634;    2563
FRZN CONCENTRATED ORANGE JUICE - NEW YORK BOARD OF TRADE ;2006.10.17;   58777;   10161;    1566;   17985;   24093;   35597;   52239;   55148;    6538;    3630
FRZN CONCENTRATED ORANGE JUICE - NEW YORK BOARD OF TRADE ;2006.10.10;   53805;    8311;    2507;   16074;   24815;   31223;   49200;   49804;    4605;    4001
FRZN CONCENTRATED ORANGE JUICE - NEW YORK BOARD OF TRADE ;2006.10.03;   54628;    8991;    1434;   15343;   23108;   32926;   47443;   49703;    7185;    4925
FRZN CONCENTRATED ORANGE JUICE - NEW YORK BOARD OF TRADE ;2006.09.26;   52695;    8661;    1843;   16010;   22476;   30949;   47148;   48802;    5547;    3893
FRZN CONCENTRATED ORANGE JUICE - NEW YORK BOARD OF TRADE ;2006.09.19;   52302;    9343;    1881;   14925;   22855;   31952;   47123;   48758;    5180;    3544
FRZN CONCENTRATED ORANGE JUICE - NEW YORK BOARD OF TRADE ;2006.09.12;   53905;   11463;    1294;   15159;   21444;   33910;   48067;   50363;    5838;    3542
FRZN CONCENTRATED ORANGE JUICE - NEW YORK BOARD OF TRADE ;2006.09.05;   51707;   12064;     968;   14176;   19014;   33187;   45253;   48330;    6453;    3376
FRZN CONCENTRATED ORANGE JUICE - NEW YORK BOARD OF TRADE ;2006.08.29;   55120;   12893;    1092;   14771;   20191;   35842;   47855;   51704;    7265;    3417
FRZN CONCENTRATED ORANGE JUICE - NEW YORK BOARD OF TRADE ;2006.08.22;   54494;   11908;     996;   14217;   20806;   36125;   46930;   51338;    7563;    3156
FRZN CONCENTRATED ORANGE JUICE - NEW YORK BOARD OF TRADE ;2006.08.15;   53705;   12573;    2146;   16168;   17975;   32373;   46715;   50688;    6990;    3017
FRZN CONCENTRATED ORANGE JUICE - NEW YORK BOARD OF TRADE ;2006.08.08;   52252;   12395;    2188;   15713;   16638;   31320;   44746;   49222;    7506;    3031
FRZN CONCENTRATED ORANGE JUICE - NEW YORK BOARD OF TRADE ;2006.08.01;   52927;   12244;    1694;   16179;   15468;   32143;   43891;   50016;    9036;    2911
FRZN CONCENTRATED ORANGE JUICE - NEW YORK BOARD OF TRADE ;2006.07.25;   47151;   11223;    1670;   14056;   13514;   29265;   38793;   44991;    8358;    2160
FRZN CONCENTRATED ORANGE JUICE - NEW YORK BOARD OF TRADE ;2006.07.18;   44145;   10789;    2434;   12903;   13395;   26337;   37088;   41674;    7057;    2471
FRZN CONCENTRATED ORANGE JUICE - NEW YORK BOARD OF TRADE ;2006.07.11;   44976;   13206;    1261;   12989;   11772;   28580;   37967;   42830;    7010;    2146
FRZN CONCENTRATED ORANGE JUICE - NEW YORK BOARD OF TRADE ;2006.07.03;   48267;   16742;     952;   12759;   10788;   32153;   40289;   45863;    7979;    2404
FRZN CONCENTRATED ORANGE JUICE - NEW YORK BOARD OF TRADE ;2006.06.27;   47601;   15833;    1380;   12916;   11252;   30964;   40002;   45260;    7599;    2341
FRZN CONCENTRATED ORANGE JUICE - NEW YORK BOARD OF TRADE ;2006.06.20;   44353;   13587;    1032;   12567;   10678;   27894;   36831;   41494;    7521;    2859
FRZN CONCENTRATED ORANGE JUICE - NEW YORK BOARD OF TRADE ;2006.06.13;   48861;   13724;    1113;   15992;   12600;   28859;   42316;   45964;    6545;    2897
FRZN CONCENTRATED ORANGE JUICE - NEW YORK BOARD OF TRADE ;2006.06.06;   48175;   13264;    1082;   15215;   11932;   28140;   40412;   44438;    7763;    3737
FRZN CONCENTRATED ORANGE JUICE - NEW YORK BOARD OF TRADE ;2006.05.30;   49204;   15343;    1128;   15467;   11667;   29870;   42477;   46465;    6727;    2740
FRZN CONCENTRATED ORANGE JUICE - NEW YORK BOARD OF TRADE ;2006.05.23;   47355;   15513;    1174;   14462;   11913;   29285;   41888;   44921;    5467;    2434
FRZN CONCENTRATED ORANGE JUICE - NEW YORK BOARD OF TRADE ;2006.05.16;   54200;   19412;    1539;   16119;   12484;   33580;   48015;   51237;    6185;    2963
FRZN CONCENTRATED ORANGE JUICE - NEW YORK BOARD OF TRADE ;2006.05.09;   52752;   19088;    1734;   14654;   12826;   33669;   46567;   50057;    6185;    2695
FRZN CONCENTRATED ORANGE JUICE - NEW YORK BOARD OF TRADE ;2006.05.02;   49207;   17610;    1529;   14174;   11460;   30529;   43244;   46232;    5963;    2975
FRZN CONCENTRATED ORANGE JUICE - NEW YORK BOARD OF TRADE ;2006.04.25;   50912;   15963;    1735;   13392;   14564;   30830;   43919;   45957;    6993;    4955
FRZN CONCENTRATED ORANGE JUICE - NEW YORK BOARD OF TRADE ;2006.04.18;   53159;   16303;    1732;   16031;   15970;   31859;   48305;   49622;    4854;    3537
FRZN CONCENTRATED ORANGE JUICE - NEW YORK BOARD OF TRADE ;2006.04.11;   53013;   17599;    1980;   15026;   15851;   32393;   48475;   49398;    4537;    3614
FRZN CONCENTRATED ORANGE JUICE - NEW YORK BOARD OF TRADE ;2006.04.04;   53298;   20656;    1317;   14006;   13226;   33862;   47888;   49184;    5410;    4113
FRZN CONCENTRATED ORANGE JUICE - NEW YORK BOARD OF TRADE ;2006.03.28;   54678;   19979;    1417;   14820;   14061;   34058;   48860;   50295;    5818;    4383
FRZN CONCENTRATED ORANGE JUICE - NEW YORK BOARD OF TRADE ;2006.03.21;   51858;   18162;    1644;   14056;   14896;   32965;   47114;   48665;    4744;    3193
FRZN CONCENTRATED ORANGE JUICE - NEW YORK BOARD OF TRADE ;2006.03.14;   49779;   17037;    1720;   13130;   15020;   31848;   45187;   46698;    4592;    3081
FRZN CONCENTRATED ORANGE JUICE - NEW YORK BOARD OF TRADE ;2006.03.07;   46408;   15791;    2156;   11731;   14624;   29486;   42146;   43374;    4262;    3034
FRZN CONCENTRATED ORANGE JUICE - NEW YORK BOARD OF TRADE ;2006.02.28;   46642;   15341;    2282;   11159;   15791;   30613;   42291;   44054;    4351;    2588
FRZN CONCENTRATED ORANGE JUICE - NEW YORK BOARD OF TRADE ;2006.02.21;   47570;   13847;    2673;    9889;   19485;   31563;   43221;   44125;    4349;    3445
FRZN CONCENTRATED ORANGE JUICE - NEW YORK BOARD OF TRADE ;2006.02.14;   52503;   13568;    2175;   13429;   21174;   33600;   48171;   49204;    4332;    3299
FRZN CONCENTRATED ORANGE JUICE - NEW YORK BOARD OF TRADE ;2006.02.07;   52000;   10918;    2324;   13943;   22589;   32683;   47450;   48950;    4550;    3050
FRZN CONCENTRATED ORANGE JUICE - NEW YORK BOARD OF TRADE ;2006.01.31;   47183;    7141;    2805;   13237;   22817;   28091;   43195;   44132;    3987;    3050
FRZN CONCENTRATED ORANGE JUICE - NEW YORK BOARD OF TRADE ;2006.01.24;   44911;    6830;    2778;   11862;   22513;   26787;   41205;   41427;    3706;    3484
FRZN CONCENTRATED ORANGE JUICE - NEW YORK BOARD OF TRADE ;2006.01.17;   47844;   10102;    2620;   12329;   21783;   30339;   44214;   45288;    3630;    2556
FRZN CONCENTRATED ORANGE JUICE - NEW YORK BOARD OF TRADE ;2006.01.10;   50854;   11860;    2208;   13621;   20827;   32634;   46307;   48463;    4547;    2391
FRZN CONCENTRATED ORANGE JUICE - NEW YORK BOARD OF TRADE ;2006.01.03;   48250;   10120;    2416;   12393;   21709;   30712;   44221;   45521;    4028;    2729
FRZN CONCENTRATED ORANGE JUICE - NEW YORK BOARD OF TRADE ;2005.12.27;   51425;   11648;    2469;   13049;   22109;   31930;   46806;   47448;    4619;    3977
FRZN CONCENTRATED ORANGE JUICE - NEW YORK BOARD OF TRADE ;2005.12.20;   57080;   13499;    2768;   14682;   23658;   35842;   51839;   53292;    5241;    3787
FRZN CONCENTRATED ORANGE JUICE - NEW YORK BOARD OF TRADE ;2005.12.13;   64003;   13914;    2074;   18100;   26162;   40200;   58176;   60374;    5827;    3629
FRZN CONCENTRATED ORANGE JUICE - NEW YORK BOARD OF TRADE ;2005.12.06;   56640;   14362;    2726;   14776;   21713;   35186;   50851;   52687;    5788;    3952
FRZN CONCENTRATED ORANGE JUICE - NEW YORK BOARD OF TRADE ;2005.11.29;   54317;   14114;    2318;   13866;   20695;   33912;   48674;   50096;    5642;    4221
FRZN CONCENTRATED ORANGE JUICE - NEW YORK BOARD OF TRADE ;2005.11.22;   53472;   14530;    2623;   12929;   20607;   33490;   48066;   49042;    5405;    4429
FRZN CONCENTRATED ORANGE JUICE - NEW YORK BOARD OF TRADE ;2005.11.15;   55112;   16884;    2252;   13496;   19492;   35272;   49872;   51021;    5240;    4091
FRZN CONCENTRATED ORANGE JUICE - NEW YORK BOARD OF TRADE ;2005.11.08;   55708;   16210;    2377;   13512;   20140;   35945;   49862;   51834;    5846;    3874
FRZN CONCENTRATED ORANGE JUICE - NEW YORK BOARD OF TRADE ;2005.11.01;   51750;   15308;    1552;   13287;   17731;   33257;   46326;   48096;    5424;    3653
FRZN CONCENTRATED ORANGE JUICE - NEW YORK BOARD OF TRADE ;2005.10.25;   48510;   14219;    1523;   12981;   15438;   31008;   42637;   45511;    5873;    2999
FRZN CONCENTRATED ORANGE JUICE - NEW YORK BOARD OF TRADE ;2005.10.18;   48960;   12086;    1768;   14453;   15855;   29982;   42395;   46203;    6566;    2757
FRZN CONCENTRATED ORANGE JUICE - NEW YORK BOARD OF TRADE ;2005.10.11;   45469;   11433;    1829;   12373;   16331;   28456;   40137;   42659;    5332;    2811
FRZN CONCENTRATED ORANGE JUICE - NEW YORK BOARD OF TRADE ;2005.10.04;   42873;    9958;    1601;   11496;   16003;   27286;   37457;   40383;    5416;    2489
FRZN CONCENTRATED ORANGE JUICE - NEW YORK BOARD OF TRADE ;2005.09.27;   39662;    8061;    2460;    9779;   16604;   24604;   34445;   36843;    5217;    2819
FRZN CONCENTRATED ORANGE JUICE - NEW YORK BOARD OF TRADE ;2005.09.20;   39191;    7421;    5048;    8629;   18049;   22260;   34098;   35937;    5093;    3254
FRZN CONCENTRATED ORANGE JUICE - NEW YORK BOARD OF TRADE ;2005.09.13;   40243;    7415;    6457;    9515;   17687;   21259;   34618;   37231;    5625;    3012
FRZN CONCENTRATED ORANGE JUICE - NEW YORK BOARD OF TRADE ;2005.09.06;   36931;    7037;    6427;    8327;   16438;   19314;   31802;   34067;    5129;    2864
FRZN CONCENTRATED ORANGE JUICE - NEW YORK BOARD OF TRADE ;2005.08.30;   38081;    7098;    6007;    8327;   17595;   21121;   33021;   35456;    5060;    2625
FRZN CONCENTRATED ORANGE JUICE - NEW YORK BOARD OF TRADE ;2005.08.23;   38435;    7807;    6265;    7444;   17977;   21790;   33228;   35498;    5207;    2937
FRZN CONCENTRATED ORANGE JUICE - NEW YORK BOARD OF TRADE ;2005.08.16;   46744;    9315;    4054;   11613;   20548;   28460;   41476;   44126;    5268;    2618
FRZN CONCENTRATED ORANGE JUICE - NEW YORK BOARD OF TRADE ;2005.08.09;   45874;   12320;    3117;    9373;   18579;   30410;   40272;   42901;    5602;    2973
FRZN CONCENTRATED ORANGE JUICE - NEW YORK BOARD OF TRADE ;2005.08.02;   44809;   12419;    2494;    9063;   17629;   30720;   39111;   42277;    5698;    2532
FRZN CONCENTRATED ORANGE JUICE - NEW YORK BOARD OF TRADE ;2005.07.26;   45357;   12766;    2024;    8913;   17752;   32115;   39432;   43052;    5925;    2305
FRZN CONCENTRATED ORANGE JUICE - NEW YORK BOARD OF TRADE ;2005.07.19;   46133;   14228;    2143;    8760;   17098;   32585;   40087;   43489;    6047;    2645
FRZN CONCENTRATED ORANGE JUICE - NEW YORK BOARD OF TRADE ;2005.07.12;   49498;   18312;    1948;    9750;   14831;   34828;   42893;   46526;    6605;    2972
FRZN CONCENTRATED ORANGE JUICE - NEW YORK BOARD OF TRADE ;2005.07.05;   44454;   17043;    2782;    8916;   12446;   30199;   38405;   41897;    6049;    2556
FRZN CONCENTRATED ORANGE JUICE - NEW YORK BOARD OF TRADE ;2005.06.28;   43225;   14484;    3296;    8561;   14095;   28776;   37140;   40633;    6086;    2593
FRZN CONCENTRATED ORANGE JUICE - NEW YORK BOARD OF TRADE ;2005.06.21;   39444;   12716;    3766;    8082;   12321;   25244;   33119;   37093;    6325;    2351
FRZN CONCENTRATED ORANGE JUICE - NEW YORK BOARD OF TRADE ;2005.06.14;   41860;   10852;    3678;   10070;   15262;   25747;   36185;   39494;    5676;    2366
FRZN CONCENTRATED ORANGE JUICE - NEW YORK BOARD OF TRADE ;2005.06.07;   39272;   10345;    3083;    8508;   14656;   24671;   33508;   36263;    5763;    3009
FRZN CONCENTRATED ORANGE JUICE - NEW YORK BOARD OF TRADE ;2005.05.31;   37448;   10008;    3451;    7922;   14007;   23498;   31937;   34871;    5512;    2577
FRZN CONCENTRATED ORANGE JUICE - NEW YORK BOARD OF TRADE ;2005.05.24;   35974;    9765;    3219;    7084;   13784;   23646;   30632;   33948;    5341;    2026
FRZN CONCENTRATED ORANGE JUICE - NEW YORK BOARD OF TRADE ;2005.05.17;   34376;    9185;    2634;    6787;   13813;   22832;   29785;   32252;    4591;    2124
FRZN CONCENTRATED ORANGE JUICE - NEW YORK BOARD OF TRADE ;2005.05.10;   34147;   10545;    3794;    5122;   13763;   22959;   29430;   31875;    4717;    2273
FRZN CONCENTRATED ORANGE JUICE - NEW YORK BOARD OF TRADE ;2005.05.03;   35965;   12811;    4136;    5690;   12595;   24228;   31097;   34055;    4868;    1911
FRZN CONCENTRATED ORANGE JUICE - NEW YORK BOARD OF TRADE ;2005.04.26;   40053;   13178;    3552;    6183;   14775;   28482;   34136;   38217;    5918;    1837
FRZN CONCENTRATED ORANGE JUICE - NEW YORK BOARD OF TRADE ;2005.04.19;   40823;   12276;    3434;    5867;   17059;   29421;   35202;   38722;    5620;    2101
FRZN CONCENTRATED ORANGE JUICE - NEW YORK BOARD OF TRADE ;2005.04.12;   44939;   14545;    3750;    7993;   16398;   30634;   38936;   42378;    6003;    2562
FRZN CONCENTRATED ORANGE JUICE - NEW YORK BOARD OF TRADE ;2005.04.05;   47107;   18413;    4389;    8655;   12812;   31715;   39880;   44759;    7227;    2348
FRZN CONCENTRATED ORANGE JUICE - NEW YORK BOARD OF TRADE ;2005.03.29;   44853;   16840;    4295;    8100;   12980;   30088;   37920;   42482;    6933;    2371
FRZN CONCENTRATED ORANGE JUICE - NEW YORK BOARD OF TRADE ;2005.03.22;   44333;   17339;    3968;    8176;   12558;   29684;   38073;   41828;    6259;    2505
FRZN CONCENTRATED ORANGE JUICE - NEW YORK BOARD OF TRADE ;2005.03.15;   43192;   15545;    4527;    9021;   11725;   27665;   36291;   41213;    6901;    1979
FRZN CONCENTRATED ORANGE JUICE - NEW YORK BOARD OF TRADE ;2005.03.08;   41313;   13200;    3678;    9106;   12279;   26742;   34585;   39525;    6728;    1788
FRZN CONCENTRATED ORANGE JUICE - NEW YORK BOARD OF TRADE ;2005.03.01;   40558;   11062;    2721;    9874;   13389;   26454;   34325;   39049;    6233;    1509
FRZN CONCENTRATED ORANGE JUICE - NEW YORK BOARD OF TRADE ;2005.02.22;   44692;    9569;    2427;   11355;   17323;   29070;   38246;   42853;    6445;    1839
FRZN CONCENTRATED ORANGE JUICE - NEW YORK BOARD OF TRADE ;2005.02.15;   59639;    9104;    2628;   19251;   24885;   35794;   53240;   57673;    6399;    1966
FRZN CONCENTRATED ORANGE JUICE - NEW YORK BOARD OF TRADE ;2005.02.08;   64883;    9519;    2384;   20627;   28740;   40271;   58886;   63282;    5997;    1601
FRZN CONCENTRATED ORANGE JUICE - NEW YORK BOARD OF TRADE ;2005.02.01;   62826;    7599;    1947;   21730;   28024;   37567;   57353;   61244;    5474;    1583
FRZN CONCENTRATED ORANGE JUICE - NEW YORK BOARD OF TRADE ;2005.01.25;   63052;    7619;    2082;   22563;   27469;   36738;   57651;   61383;    5401;    1669
FRZN CONCENTRATED ORANGE JUICE - NEW YORK BOARD OF TRADE ;2005.01.18;   63352;    8663;    2223;   21531;   27395;   38245;   57588;   61999;    5764;    1353
FRZN CONCENTRATED ORANGE JUICE - NEW YORK BOARD OF TRADE ;2005.01.11;   61894;   10068;    2956;   20019;   25904;   37209;   55992;   60184;    5902;    1710
FRZN CONCENTRATED ORANGE JUICE - NEW YORK BOARD OF TRADE ;2005.01.04;   63410;   11838;    2721;   19878;   25229;   38646;   56945;   61244;    6465;    2166
