FRENCH FRANCDMARK XRATE - NEW YORK COTTON EXCHANGE ;1998.09.08;    3048;     470;       0;       0;    2212;    2712;    2682;    2712;     366;     336
FRENCH FRANCDMARK XRATE - NEW YORK COTTON EXCHANGE ;1998.09.01;    2942;     470;       0;       0;    2212;    2563;    2682;    2563;     260;     379
FRENCH FRANCDMARK XRATE - NEW YORK COTTON EXCHANGE ;1998.08.25;    2957;     470;       0;       0;    2130;    2563;    2600;    2563;     357;     394
FRENCH FRANCDMARK XRATE - NEW YORK COTTON EXCHANGE ;1998.08.18;    2957;     470;       0;       0;    2130;    2563;    2600;    2563;     357;     394
FRENCH FRANCDMARK XRATE - NEW YORK COTTON EXCHANGE ;1998.08.11;    2880;     470;       0;       0;    2150;    2563;    2620;    2563;     260;     317
FRENCH FRANCDMARK XRATE - NEW YORK COTTON EXCHANGE ;1998.08.04;    2901;     470;       0;       0;    2150;    2800;    2620;    2800;     281;     101
FRENCH FRANCDMARK XRATE - NEW YORK COTTON EXCHANGE ;1998.07.28;    2952;     470;       0;       0;    2044;    2768;    2514;    2768;     438;     184
FRENCH FRANCDMARK XRATE - NEW YORK COTTON EXCHANGE ;1998.07.21;    3109;     470;       0;       0;    1830;    2810;    2300;    2810;     809;     299
FRENCH FRANCDMARK XRATE - NEW YORK COTTON EXCHANGE ;1998.07.14;    3173;     470;       0;       0;    1830;    2912;    2300;    2912;     873;     261
FRENCH FRANCDMARK XRATE - NEW YORK COTTON EXCHANGE ;1998.07.07;    3158;    1597;       0;       0;     600;    2912;    2197;    2912;     961;     246
FRENCH FRANCDMARK XRATE - NEW YORK COTTON EXCHANGE ;1998.06.30;    3140;    1594;       0;       0;     600;    2975;    2194;    2975;     946;     165
FRENCH FRANCDMARK XRATE - NEW YORK COTTON EXCHANGE ;1998.06.23;    3911;    2799;       0;       0;     600;    3822;    3399;    3822;     512;      89
FRENCH FRANCDMARK XRATE - NEW YORK COTTON EXCHANGE ;1998.06.16;    4237;    3750;       0;       0;       0;    4129;    3750;    4129;     487;     108
FRENCH FRANCDMARK XRATE - NEW YORK COTTON EXCHANGE ;1998.06.09;    7099;    3918;      83;       0;    2893;    6894;    6811;    6977;     288;     122
FRENCH FRANCDMARK XRATE - NEW YORK COTTON EXCHANGE ;1998.06.02;    7527;    7021;      77;       0;     233;    7334;    7254;    7411;     273;     116
FRENCH FRANCDMARK XRATE - NEW YORK COTTON EXCHANGE ;1998.05.26;    7860;    7365;     169;       0;     223;    7523;    7588;    7692;     272;     168
FRENCH FRANCDMARK XRATE - NEW YORK COTTON EXCHANGE ;1998.05.19;    7750;    7225;     167;       0;     223;    7426;    7448;    7593;     302;     157
FRENCH FRANCDMARK XRATE - NEW YORK COTTON EXCHANGE ;1998.05.12;    7756;    7253;     168;       0;     223;    7381;    7476;    7549;     280;     207
FRENCH FRANCDMARK XRATE - NEW YORK COTTON EXCHANGE ;1998.05.05;    7711;    7254;     141;       0;     174;    7397;    7428;    7538;     283;     173
FRENCH FRANCDMARK XRATE - NEW YORK COTTON EXCHANGE ;1998.04.28;    8160;    7772;     188;       0;     130;    7893;    7902;    8081;     258;      79
FRENCH FRANCDMARK XRATE - NEW YORK COTTON EXCHANGE ;1998.04.21;    8033;    7662;     271;       0;     130;    7614;    7792;    7885;     241;     148
FRENCH FRANCDMARK XRATE - NEW YORK COTTON EXCHANGE ;1998.04.14;    7955;    7600;     238;       0;     130;    7552;    7730;    7790;     225;     165
FRENCH FRANCDMARK XRATE - NEW YORK COTTON EXCHANGE ;1998.04.07;    7961;    7538;     249;       0;     185;    7583;    7723;    7832;     238;     129
FRENCH FRANCDMARK XRATE - NEW YORK COTTON EXCHANGE ;1998.03.31;    8019;    7488;     381;       0;     270;    7600;    7758;    7981;     261;      38
FRENCH FRANCDMARK XRATE - NEW YORK COTTON EXCHANGE ;1998.03.24;    8033;    7523;     402;       0;     270;    7602;    7793;    8004;     240;      29
FRENCH FRANCDMARK XRATE - NEW YORK COTTON EXCHANGE ;1998.03.17;    8212;    7660;     402;       0;     293;    7762;    7953;    8164;     259;      48
FRENCH FRANCDMARK XRATE - NEW YORK COTTON EXCHANGE ;1998.03.10;   10444;    7869;     658;       0;    1473;    9664;    9342;   10322;    1102;     122
FRENCH FRANCDMARK XRATE - NEW YORK COTTON EXCHANGE ;1998.03.03;   14266;    7776;     659;      50;    6091;   13446;   13917;   14155;     349;     111
FRENCH FRANCDMARK XRATE - NEW YORK COTTON EXCHANGE ;1998.02.24;   15659;    4518;    5531;       0;   10982;   10039;   15500;   15570;     159;      89
FRENCH FRANCDMARK XRATE - NEW YORK COTTON EXCHANGE ;1998.02.17;   16457;    4512;   10260;       0;   11792;    6107;   16304;   16367;     153;      90
FRENCH FRANCDMARK XRATE - NEW YORK COTTON EXCHANGE ;1998.02.10;   13341;    1274;   10276;       0;   11846;    2980;   13120;   13256;     221;      85
FRENCH FRANCDMARK XRATE - NEW YORK COTTON EXCHANGE ;1998.02.03;   13353;    1222;   10398;       0;   11937;    2856;   13159;   13254;     194;      99
FRENCH FRANCDMARK XRATE - NEW YORK COTTON EXCHANGE ;1998.01.27;   13372;    1310;   10547;       0;   11946;    2191;   13256;   12738;     116;     634
FRENCH FRANCDMARK XRATE - NEW YORK COTTON EXCHANGE ;1998.01.20;   13261;    1292;   10895;       0;   11827;    2216;   13119;   13111;     142;     150
FRENCH FRANCDMARK XRATE - NEW YORK COTTON EXCHANGE ;1998.01.13;   13414;    1014;   11469;       0;   12284;    1672;   13298;   13141;     116;     273
FRENCH FRANCDMARK XRATE - NEW YORK COTTON EXCHANGE ;1998.01.06;   14066;    1222;   12408;       0;   12648;    1407;   13870;   13815;     196;     251
FRENCH FRANCDMARK XRATE - NEW YORK COTTON EXCHANGE ;1997.12.30;   13188;    1076;   12432;       0;   12099;     590;   13175;   13022;      13;     166
FRENCH FRANCDMARK XRATE - NEW YORK COTTON EXCHANGE ;1997.12.23;   12813;    1254;   11860;       0;   11542;     782;   12796;   12642;      17;     171
FRENCH FRANCDMARK XRATE - NEW YORK COTTON EXCHANGE ;1997.12.16;   11261;     751;   10588;       0;   10489;     508;   11240;   11096;      21;     165
FRENCH FRANCDMARK XRATE - NEW YORK COTTON EXCHANGE ;1997.12.09;   16241;     676;   13119;      95;   15455;    2811;   16226;   16025;      15;     216
FRENCH FRANCDMARK XRATE - NEW YORK COTTON EXCHANGE ;1997.12.02;   14879;     580;   13075;       0;   13701;    1014;   14281;   14089;     598;     790
FRENCH FRANCDMARK XRATE - NEW YORK COTTON EXCHANGE ;1997.11.25;   14217;     798;   12196;       0;   13282;    1397;   14080;   13593;     137;     624
FRENCH FRANCDMARK XRATE - NEW YORK COTTON EXCHANGE ;1997.11.18;   14366;     513;   13152;       0;   13706;     907;   14219;   14059;     147;     307
FRENCH FRANCDMARK XRATE - NEW YORK COTTON EXCHANGE ;1997.11.11;   13885;     579;   12278;       0;   13179;    1265;   13758;   13543;     127;     342
FRENCH FRANCDMARK XRATE - NEW YORK COTTON EXCHANGE ;1997.11.04;   14164;     578;   12555;      14;   13441;    1334;   14033;   13903;     131;     261
FRENCH FRANCDMARK XRATE - NEW YORK COTTON EXCHANGE ;1997.10.28;   14582;     716;   13206;      40;   13758;    1049;   14514;   14295;      68;     287
FRENCH FRANCDMARK XRATE - NEW YORK COTTON EXCHANGE ;1997.10.21;   14590;     773;   13206;      40;   13714;    1052;   14527;   14298;      63;     292
FRENCH FRANCDMARK XRATE - NEW YORK COTTON EXCHANGE ;1997.10.14;   11254;     767;    9666;      40;    9318;    1237;   10125;   10943;    1129;     311
FRENCH FRANCDMARK XRATE - NEW YORK COTTON EXCHANGE ;1997.10.07;    6511;     660;    5317;       0;    5771;     902;    6431;    6219;      80;     292
FRENCH FRANCDMARK XRATE - NEW YORK COTTON EXCHANGE ;1997.09.30;    7382;     839;    6665;       0;    6449;     374;    7288;    7039;      94;     343
FRENCH FRANCDMARK XRATE - NEW YORK COTTON EXCHANGE ;1997.09.23;    7318;     886;    6556;      40;    6318;     401;    7244;    6997;      74;     321
FRENCH FRANCDMARK XRATE - NEW YORK COTTON EXCHANGE ;1997.09.16;    7447;     873;    6677;      40;    6430;     426;    7343;    7143;     104;     304
FRENCH FRANCDMARK XRATE - NEW YORK COTTON EXCHANGE ;1997.09.09;    8070;     760;    6780;      19;    6954;     705;    7733;    7504;     337;     566
FRENCH FRANCDMARK XRATE - NEW YORK COTTON EXCHANGE ;1997.08.26;    3847;     506;    1967;       0;    3246;    1600;    3752;    3567;      95;     280
FRENCH FRANCDMARK XRATE - NEW YORK COTTON EXCHANGE ;1997.08.19;    3656;     327;    1875;       0;    3236;    1515;    3563;    3390;      93;     266
FRENCH FRANCDMARK XRATE - NEW YORK COTTON EXCHANGE ;1997.08.12;    3719;     321;    1868;       0;    3245;    1533;    3566;    3401;     153;     318
FRENCH FRANCDMARK XRATE - NEW YORK COTTON EXCHANGE ;1997.08.05;    2345;     988;     572;       0;    1111;    1603;    2099;    2175;     246;     170
FRENCH FRANCDMARK XRATE - NEW YORK COTTON EXCHANGE ;1997.07.29;    2521;     313;     952;       0;    2101;    1215;    2414;    2167;     107;     354
FRENCH FRANCDMARK XRATE - NEW YORK COTTON EXCHANGE ;1997.07.22;    1729;     279;     444;       0;    1360;    1218;    1639;    1662;      90;      67
FRENCH FRANCDMARK XRATE - NEW YORK COTTON EXCHANGE ;1997.07.15;    1694;     276;     437;       0;    1363;    1229;    1639;    1666;      55;      28
FRENCH FRANCDMARK XRATE - NEW YORK COTTON EXCHANGE ;1997.07.08;     923;     215;     309;       0;     639;     517;     854;     826;      69;      97
FRENCH FRANCDMARK XRATE - NEW YORK COTTON EXCHANGE ;1997.07.01;    1078;     479;     309;       0;     488;     652;     967;     961;     111;     117
FRENCH FRANCDMARK XRATE - NEW YORK COTTON EXCHANGE ;1997.06.17;     979;     570;     287;       0;     256;     672;     826;     959;     153;      20
FRENCH FRANCDMARK XRATE - NEW YORK COTTON EXCHANGE ;1997.06.10;    3422;     825;     344;       0;    2440;    3043;    3265;    3387;     157;      35
FRENCH FRANCDMARK XRATE - NEW YORK COTTON EXCHANGE ;1997.06.03;    4333;    1047;     344;       0;    2809;    3432;    3856;    3776;     477;     557
FRENCH FRANCDMARK XRATE - NEW YORK COTTON EXCHANGE ;1997.05.27;    3652;     454;     968;       0;    2819;    2337;    3273;    3305;     379;     347
FRENCH FRANCDMARK XRATE - NEW YORK COTTON EXCHANGE ;1997.05.20;    4510;     585;    2456;       0;    3797;    1812;    4382;    4268;     128;     242
FRENCH FRANCDMARK XRATE - NEW YORK COTTON EXCHANGE ;1997.05.13;    3895;     589;    1677;       0;    3241;    2107;    3830;    3784;      65;     111
FRENCH FRANCDMARK XRATE - NEW YORK COTTON EXCHANGE ;1997.05.06;    3095;     666;     835;       0;    2253;    2139;    2919;    2974;     176;     121
FRENCH FRANCDMARK XRATE - NEW YORK COTTON EXCHANGE ;1997.04.29;    4501;     520;    3232;       0;    3920;    1120;    4440;    4352;      61;     149
FRENCH FRANCDMARK XRATE - NEW YORK COTTON EXCHANGE ;1997.04.22;    4773;     543;    3339;       0;    3769;    1012;    4312;    4351;     461;     422
FRENCH FRANCDMARK XRATE - NEW YORK COTTON EXCHANGE ;1997.04.15;    7461;     704;    7211;       0;    6757;      37;    7461;    7248;       0;     213
FRENCH FRANCDMARK XRATE - NEW YORK COTTON EXCHANGE ;1997.04.08;    7311;     933;    6489;       0;    6329;     453;    7262;    6942;      49;     369
FRENCH FRANCDMARK XRATE - NEW YORK COTTON EXCHANGE ;1997.04.01;    6038;     880;    5148;       0;    5013;     581;    5893;    5729;     145;     309
FRENCH FRANCDMARK XRATE - NEW YORK COTTON EXCHANGE ;1997.03.25;    2737;     290;    1466;       0;    2261;    1002;    2551;    2468;     186;     269
FRENCH FRANCDMARK XRATE - NEW YORK COTTON EXCHANGE ;1997.03.18;    2616;     272;    1448;       0;    2139;     999;    2411;    2447;     205;     169
FRENCH FRANCDMARK XRATE - NEW YORK COTTON EXCHANGE ;1997.03.11;    3529;     102;    1469;       0;    3333;    1902;    3435;    3371;      94;     158
FRENCH FRANCDMARK XRATE - NEW YORK COTTON EXCHANGE ;1997.03.04;    3202;     150;    1331;       0;    2932;    1685;    3082;    3016;     120;     186
FRENCH FRANCDMARK XRATE - NEW YORK COTTON EXCHANGE ;1997.02.25;    3868;     386;    2031;       0;    3273;    1511;    3659;    3542;     209;     326
FRENCH FRANCDMARK XRATE - NEW YORK COTTON EXCHANGE ;1997.02.18;    2512;     243;     382;      48;    2168;    1940;    2459;    2370;      53;     142
FRENCH FRANCDMARK XRATE - NEW YORK COTTON EXCHANGE ;1997.02.11;    2455;     131;     336;       0;    2201;    2019;    2332;    2355;     123;     100
FRENCH FRANCDMARK XRATE - NEW YORK COTTON EXCHANGE ;1997.02.04;    2673;    1241;     315;       0;    1182;    2247;    2423;    2562;     250;     111
FRENCH FRANCDMARK XRATE - NEW YORK COTTON EXCHANGE ;1997.01.28;    2164;     364;     445;       0;    1643;    1475;    2007;    1920;     157;     244
FRENCH FRANCDMARK XRATE - NEW YORK COTTON EXCHANGE ;1997.01.21;    1616;     263;     160;       0;    1243;    1307;    1506;    1467;     110;     149
FRENCH FRANCDMARK XRATE - NEW YORK COTTON EXCHANGE ;1997.01.14;    1611;     239;     160;       0;    1243;    1275;    1482;    1435;     129;     176
FRENCH FRANCDMARK XRATE - NEW YORK COTTON EXCHANGE ;1997.01.07;    2615;    1302;     206;       0;     465;    1498;    1767;    1704;     848;     911
FRENCH FRANCDMARK XRATE - NEW YORK COTTON EXCHANGE ;1996.12.31;    1000;     280;     471;       0;     631;     302;     911;     773;      89;     227
FRENCH FRANCDMARK XRATE - NEW YORK COTTON EXCHANGE ;1996.12.24;     952;     280;     455;       0;     542;     307;     822;     762;     130;     190
FRENCH FRANCDMARK XRATE - NEW YORK COTTON EXCHANGE ;1996.12.17;     948;     280;     455;       0;     542;     307;     822;     762;     126;     186
FRENCH FRANCDMARK XRATE - NEW YORK COTTON EXCHANGE ;1996.12.10;    2941;     802;     199;     202;    1764;    2409;    2768;    2810;     173;     131
FRENCH FRANCDMARK XRATE - NEW YORK COTTON EXCHANGE ;1996.12.03;    3407;     917;     160;       0;    2113;    3224;    3030;    3384;     377;      23
FRENCH FRANCDMARK XRATE - NEW YORK COTTON EXCHANGE ;1996.11.26;    3418;     945;     141;       0;    2131;    3192;    3075;    3333;     343;      85
FRENCH FRANCDMARK XRATE - NEW YORK COTTON EXCHANGE ;1996.11.19;    3357;     801;     539;       0;    2373;    2514;    3174;    3053;     184;     304
FRENCH FRANCDMARK XRATE - NEW YORK COTTON EXCHANGE ;1996.11.12;    3296;    1061;     954;       1;    2123;    2078;    3185;    3033;     112;     263
FRENCH FRANCDMARK XRATE - NEW YORK COTTON EXCHANGE ;1996.11.05;    3337;    1081;    1449;       0;    2139;    1597;    3220;    3046;     118;     291
FRENCH FRANCDMARK XRATE - NEW YORK COTTON EXCHANGE ;1996.10.29;    2793;     584;     811;       0;    2020;    1605;    2604;    2416;     189;     377
FRENCH FRANCDMARK XRATE - NEW YORK COTTON EXCHANGE ;1996.10.22;    2455;     946;     571;       0;    1323;    1660;    2269;    2231;     187;     224
FRENCH FRANCDMARK XRATE - NEW YORK COTTON EXCHANGE ;1996.10.15;    2523;     637;     994;       0;    1751;    1328;    2388;    2322;     135;     201
FRENCH FRANCDMARK XRATE - NEW YORK COTTON EXCHANGE ;1996.10.08;    2347;     637;     763;       0;    1650;    1297;    2287;    2060;      59;     287
FRENCH FRANCDMARK XRATE - NEW YORK COTTON EXCHANGE ;1996.10.01;    2386;     618;     755;       0;    1635;    1367;    2253;    2122;     133;     264
FRENCH FRANCDMARK XRATE - NEW YORK COTTON EXCHANGE ;1996.09.24;    2477;     622;     838;       0;    1730;    1353;    2352;    2191;     125;     286
FRENCH FRANCDMARK XRATE - NEW YORK COTTON EXCHANGE ;1996.09.17;    2144;     638;     286;      14;    1069;    1441;    1720;    1741;     423;     403
FRENCH FRANCDMARK XRATE - NEW YORK COTTON EXCHANGE ;1996.09.10;    4403;    2709;      14;     174;    1333;    4159;    4216;    4347;     187;      56
FRENCH FRANCDMARK XRATE - NEW YORK COTTON EXCHANGE ;1996.08.27;    4043;    2752;      83;       0;     939;    3908;    3691;    3991;     352;      52
FRENCH FRANCDMARK XRATE - NEW YORK COTTON EXCHANGE ;1996.08.20;    3424;    2138;       0;       0;     925;    3367;    3063;    3367;     361;      57
FRENCH FRANCDMARK XRATE - NEW YORK COTTON EXCHANGE ;1996.08.13;    4554;    2767;     998;       5;    1311;    3497;    4083;    4500;     471;      54
FRENCH FRANCDMARK XRATE - NEW YORK COTTON EXCHANGE ;1996.08.06;    4011;    2002;    1022;       8;    1406;    2884;    3416;    3914;     595;      97
FRENCH FRANCDMARK XRATE - NEW YORK COTTON EXCHANGE ;1996.07.30;    2381;     679;     475;       9;    1563;    1720;    2251;    2204;     130;     177
FRENCH FRANCDMARK XRATE - NEW YORK COTTON EXCHANGE ;1996.07.23;    2621;     680;    1056;       9;    1837;    1298;    2526;    2363;      95;     258
FRENCH FRANCDMARK XRATE - NEW YORK COTTON EXCHANGE ;1996.07.16;    2541;     687;     983;       1;    1648;    1258;    2336;    2242;     205;     299
FRENCH FRANCDMARK XRATE - NEW YORK COTTON EXCHANGE ;1996.07.09;    2007;     547;     577;       1;    1358;    1115;    1906;    1693;     101;     314
FRENCH FRANCDMARK XRATE - NEW YORK COTTON EXCHANGE ;1996.07.02;    2002;     552;     587;       1;    1386;    1115;    1939;    1703;      63;     299
FRENCH FRANCDMARK XRATE - NEW YORK COTTON EXCHANGE ;1996.06.25;    1365;     555;     104;       0;     712;    1115;    1267;    1219;      98;     146
FRENCH FRANCDMARK XRATE - NEW YORK COTTON EXCHANGE ;1996.06.18;    1401;     554;     132;       0;     702;     701;    1256;     833;     145;     568
FRENCH FRANCDMARK XRATE - NEW YORK COTTON EXCHANGE ;1996.06.11;    3632;     512;    1175;     170;    2753;    1992;    3435;    3337;     197;     295
FRENCH FRANCDMARK XRATE - NEW YORK COTTON EXCHANGE ;1996.06.04;    3382;     911;    1629;       0;    2314;    1463;    3225;    3092;     157;     290
FRENCH FRANCDMARK XRATE - NEW YORK COTTON EXCHANGE ;1996.05.28;    3411;     364;    1528;       0;    2912;    1627;    3276;    3155;     135;     256
FRENCH FRANCDMARK XRATE - NEW YORK COTTON EXCHANGE ;1996.05.21;    3443;     355;    1522;       0;    2914;    1671;    3269;    3193;     174;     249
FRENCH FRANCDMARK XRATE - NEW YORK COTTON EXCHANGE ;1996.05.14;    3344;     470;    1800;       0;    2157;    1238;    2627;    3038;     717;     305
FRENCH FRANCDMARK XRATE - NEW YORK COTTON EXCHANGE ;1996.05.07;    3927;     770;    2838;       2;    3037;     763;    3809;    3603;     118;     324
FRENCH FRANCDMARK XRATE - NEW YORK COTTON EXCHANGE ;1996.04.30;    4104;     999;    2945;      35;    2790;     816;    3824;    3796;     280;     308
FRENCH FRANCDMARK XRATE - NEW YORK COTTON EXCHANGE ;1996.04.23;    3915;     985;    2726;      53;    2770;     855;    3808;    3634;     107;     281
FRENCH FRANCDMARK XRATE - NEW YORK COTTON EXCHANGE ;1996.04.16;    3944;     608;    3260;       0;    3266;     455;    3874;    3715;      70;     229
FRENCH FRANCDMARK XRATE - NEW YORK COTTON EXCHANGE ;1996.04.09;    3411;     601;    2676;       0;    2743;     539;    3344;    3215;      67;     196
FRENCH FRANCDMARK XRATE - NEW YORK COTTON EXCHANGE ;1996.04.02;    2969;     390;    2155;       0;    2471;     557;    2861;    2712;     108;     257
FRENCH FRANCDMARK XRATE - NEW YORK COTTON EXCHANGE ;1996.03.26;    2417;     500;    1040;      26;    1822;    1090;    2348;    2156;      69;     261
FRENCH FRANCDMARK XRATE - NEW YORK COTTON EXCHANGE ;1996.03.19;    2492;      69;    1453;       0;    1916;     800;    1985;    2253;     507;     239
FRENCH FRANCDMARK XRATE - NEW YORK COTTON EXCHANGE ;1996.03.12;    3244;     357;    1644;       0;    2625;    1263;    2982;    2907;     262;     337
FRENCH FRANCDMARK XRATE - NEW YORK COTTON EXCHANGE ;1996.03.05;    2074;     390;    1387;       0;    1424;     348;    1814;    1735;     260;     339
FRENCH FRANCDMARK XRATE - NEW YORK COTTON EXCHANGE ;1996.02.27;    1041;     178;     105;       0;     630;     793;     808;     898;     233;     143
FRENCH FRANCDMARK XRATE - NEW YORK COTTON EXCHANGE ;1996.02.20;     867;     107;     131;       0;     472;     609;     579;     740;     288;     127
FRENCH FRANCDMARK XRATE - NEW YORK COTTON EXCHANGE ;1996.02.13;     854;      80;     131;       0;     499;     585;     579;     716;     275;     138
FRENCH FRANCDMARK XRATE - NEW YORK COTTON EXCHANGE ;1996.02.06;     760;      50;      87;       0;     460;     566;     510;     653;     250;     107
FRENCH FRANCDMARK XRATE - NEW YORK COTTON EXCHANGE ;1996.01.30;     683;     172;      51;       0;     246;     541;     418;     592;     265;      91
FRENCH FRANCDMARK XRATE - NEW YORK COTTON EXCHANGE ;1996.01.23;     545;      25;     103;       0;     322;     205;     347;     308;     198;     237
FRENCH FRANCDMARK XRATE - NEW YORK COTTON EXCHANGE ;1996.01.16;     527;      25;     102;       0;     298;     218;     323;     320;     204;     207
FRENCH FRANCDMARK XRATE - NEW YORK COTTON EXCHANGE ;1996.01.09;     556;      26;     218;       0;     323;     123;     349;     341;     207;     215
FRENCH FRANCDMARK XRATE - NEW YORK COTTON EXCHANGE ;1996.01.02;     276;       0;     152;       0;     171;       0;     171;     152;     105;     124
FRENCH FRANCDMARK XRATE - NEW YORK COTTON EXCHANGE ;1995.12.12;    1473;      35;      80;     443;     884;     871;    1362;    1394;     111;      79
FRENCH FRANCDMARK XRATE - NEW YORK COTTON EXCHANGE ;1995.12.05;    1432;     119;      22;     423;     733;     868;    1275;    1313;     157;     119
FRENCH FRANCDMARK XRATE - NEW YORK COTTON EXCHANGE ;1995.11.28;    1268;      13;     103;     438;     733;     578;    1184;    1119;      84;     149
FRENCH FRANCDMARK XRATE - NEW YORK COTTON EXCHANGE ;1995.11.21;    1280;      28;      33;     445;     733;     725;    1206;    1203;      74;      77
FRENCH FRANCDMARK XRATE - NEW YORK COTTON EXCHANGE ;1995.11.14;    1245;      28;      44;     439;     723;     701;    1190;    1184;      55;      61
FRENCH FRANCDMARK XRATE - NEW YORK COTTON EXCHANGE ;1995.11.07;    1353;      30;      69;     420;     729;     699;    1179;    1188;     173;     165
FRENCH FRANCDMARK XRATE - NEW YORK COTTON EXCHANGE ;1995.10.31;    1492;      90;      87;     420;     728;     838;    1238;    1345;     254;     147
FRENCH FRANCDMARK XRATE - NEW YORK COTTON EXCHANGE ;1995.10.24;    1411;     391;     104;     411;     328;     764;    1130;    1279;     281;     132
FRENCH FRANCDMARK XRATE - NEW YORK COTTON EXCHANGE ;1995.10.17;     977;     295;     108;       2;     425;     746;     722;     856;     255;     121
FRENCH FRANCDMARK XRATE - NEW YORK COTTON EXCHANGE ;1995.10.10;     886;     162;      45;       0;     376;     712;     538;     757;     348;     129
FRENCH FRANCDMARK XRATE - NEW YORK COTTON EXCHANGE ;1995.09.12;    1227;      36;     338;       2;    1111;     704;    1149;    1044;      78;     183
FRENCH FRANCDMARK XRATE - NEW YORK COTTON EXCHANGE ;1995.09.05;     839;      31;     677;       2;     756;      28;     789;     707;      50;     132
FRENCH FRANCDMARK XRATE - NEW YORK COTTON EXCHANGE ;1995.08.29;     840;      31;     689;       2;     754;      28;     787;     719;      53;     121
FRENCH FRANCDMARK XRATE - NEW YORK COTTON EXCHANGE ;1995.08.22;    1074;      30;     911;       1;     997;      26;    1028;     938;      46;     136
FRENCH FRANCDMARK XRATE - NEW YORK COTTON EXCHANGE ;1995.08.15;    1088;      34;     911;       0;    1000;      26;    1034;     937;      54;     151
FRENCH FRANCDMARK XRATE - NEW YORK COTTON EXCHANGE ;1995.08.08;    1062;       0;     911;       0;    1002;      14;    1002;     925;      60;     137
FRENCH FRANCDMARK XRATE - NEW YORK COTTON EXCHANGE ;1995.08.01;     641;       0;     520;       0;     600;      30;     600;     550;      41;      91
FRENCH FRANCDMARK XRATE - NEW YORK COTTON EXCHANGE ;1995.07.25;     428;       0;     316;       0;     409;      28;     409;     344;      19;      84
FRENCH FRANCDMARK XRATE - NEW YORK COTTON EXCHANGE ;1995.07.18;     428;       0;     316;       0;     407;      28;     407;     344;      21;      84
FRENCH FRANCDMARK XRATE - NEW YORK COTTON EXCHANGE ;1995.07.11;     457;       0;     350;       0;     330;      25;     330;     375;     127;      82
FRENCH FRANCDMARK XRATE - NEW YORK COTTON EXCHANGE ;1995.06.13;    1479;      57;       0;       0;    1401;    1469;    1458;    1469;      21;      10
FRENCH FRANCDMARK XRATE - NEW YORK COTTON EXCHANGE ;1995.06.06;    1781;      56;       0;       0;    1592;    1767;    1648;    1767;     133;      14
FRENCH FRANCDMARK XRATE - NEW YORK COTTON EXCHANGE ;1995.05.30;    2216;     500;       0;       0;    1690;    2208;    2190;    2208;      26;       8
FRENCH FRANCDMARK XRATE - NEW YORK COTTON EXCHANGE ;1995.05.23;    2219;     500;       0;       0;    1693;    2211;    2193;    2211;      26;       8
FRENCH FRANCDMARK XRATE - NEW YORK COTTON EXCHANGE ;1995.05.16;    1877;      28;       0;       0;    1841;    1869;    1869;    1869;       8;       8
FRENCH FRANCDMARK XRATE - NEW YORK COTTON EXCHANGE ;1995.05.09;    1928;      28;       0;       0;    1835;    1909;    1863;    1909;      65;      19
FRENCH FRANCDMARK XRATE - NEW YORK COTTON EXCHANGE ;1995.05.02;    2184;     528;       0;       0;    1563;    2173;    2091;    2173;      93;      11
FRENCH FRANCDMARK XRATE - NEW YORK COTTON EXCHANGE ;1995.04.25;    2119;     526;       0;       0;    1563;    2112;    2089;    2112;      30;       7
FRENCH FRANCDMARK XRATE - NEW YORK COTTON EXCHANGE ;1995.04.18;    1998;     500;       0;       0;    1441;    1956;    1941;    1956;      57;      42
FRENCH FRANCDMARK XRATE - NEW YORK COTTON EXCHANGE ;1998.09.08;    3048;     470;       0;       0;    2212;    2712;    2682;    2712;     366;     336
FRENCH FRANCDMARK XRATE - NEW YORK COTTON EXCHANGE ;1998.09.01;    2942;     470;       0;       0;    2212;    2563;    2682;    2563;     260;     379
FRENCH FRANCDMARK XRATE - NEW YORK COTTON EXCHANGE ;1998.08.25;    2957;     470;       0;       0;    2130;    2563;    2600;    2563;     357;     394
FRENCH FRANCDMARK XRATE - NEW YORK COTTON EXCHANGE ;1998.08.18;    2957;     470;       0;       0;    2130;    2563;    2600;    2563;     357;     394
FRENCH FRANCDMARK XRATE - NEW YORK COTTON EXCHANGE ;1998.08.11;    2880;     470;       0;       0;    2150;    2563;    2620;    2563;     260;     317
FRENCH FRANCDMARK XRATE - NEW YORK COTTON EXCHANGE ;1998.08.04;    2901;     470;       0;       0;    2150;    2800;    2620;    2800;     281;     101
FRENCH FRANCDMARK XRATE - NEW YORK COTTON EXCHANGE ;1998.07.28;    2952;     470;       0;       0;    2044;    2768;    2514;    2768;     438;     184
FRENCH FRANCDMARK XRATE - NEW YORK COTTON EXCHANGE ;1998.07.21;    3109;     470;       0;       0;    1830;    2810;    2300;    2810;     809;     299
FRENCH FRANCDMARK XRATE - NEW YORK COTTON EXCHANGE ;1998.07.14;    3173;     470;       0;       0;    1830;    2912;    2300;    2912;     873;     261
FRENCH FRANCDMARK XRATE - NEW YORK COTTON EXCHANGE ;1998.07.07;    3158;    1597;       0;       0;     600;    2912;    2197;    2912;     961;     246
FRENCH FRANCDMARK XRATE - NEW YORK COTTON EXCHANGE ;1998.06.30;    3140;    1594;       0;       0;     600;    2975;    2194;    2975;     946;     165
FRENCH FRANCDMARK XRATE - NEW YORK COTTON EXCHANGE ;1998.06.23;    3911;    2799;       0;       0;     600;    3822;    3399;    3822;     512;      89
FRENCH FRANCDMARK XRATE - NEW YORK COTTON EXCHANGE ;1998.06.16;    4237;    3750;       0;       0;       0;    4129;    3750;    4129;     487;     108
FRENCH FRANCDMARK XRATE - NEW YORK COTTON EXCHANGE ;1998.06.09;    7099;    3918;      83;       0;    2893;    6894;    6811;    6977;     288;     122
FRENCH FRANCDMARK XRATE - NEW YORK COTTON EXCHANGE ;1998.06.02;    7527;    7021;      77;       0;     233;    7334;    7254;    7411;     273;     116
FRENCH FRANCDMARK XRATE - NEW YORK COTTON EXCHANGE ;1998.05.26;    7860;    7365;     169;       0;     223;    7523;    7588;    7692;     272;     168
FRENCH FRANCDMARK XRATE - NEW YORK COTTON EXCHANGE ;1998.05.19;    7750;    7225;     167;       0;     223;    7426;    7448;    7593;     302;     157
FRENCH FRANCDMARK XRATE - NEW YORK COTTON EXCHANGE ;1998.05.12;    7756;    7253;     168;       0;     223;    7381;    7476;    7549;     280;     207
FRENCH FRANCDMARK XRATE - NEW YORK COTTON EXCHANGE ;1998.05.05;    7711;    7254;     141;       0;     174;    7397;    7428;    7538;     283;     173
FRENCH FRANCDMARK XRATE - NEW YORK COTTON EXCHANGE ;1998.04.28;    8160;    7772;     188;       0;     130;    7893;    7902;    8081;     258;      79
FRENCH FRANCDMARK XRATE - NEW YORK COTTON EXCHANGE ;1998.04.21;    8033;    7662;     271;       0;     130;    7614;    7792;    7885;     241;     148
FRENCH FRANCDMARK XRATE - NEW YORK COTTON EXCHANGE ;1998.04.14;    7955;    7600;     238;       0;     130;    7552;    7730;    7790;     225;     165
FRENCH FRANCDMARK XRATE - NEW YORK COTTON EXCHANGE ;1998.04.07;    7961;    7538;     249;       0;     185;    7583;    7723;    7832;     238;     129
FRENCH FRANCDMARK XRATE - NEW YORK COTTON EXCHANGE ;1998.03.31;    8019;    7488;     381;       0;     270;    7600;    7758;    7981;     261;      38
FRENCH FRANCDMARK XRATE - NEW YORK COTTON EXCHANGE ;1998.03.24;    8033;    7523;     402;       0;     270;    7602;    7793;    8004;     240;      29
FRENCH FRANCDMARK XRATE - NEW YORK COTTON EXCHANGE ;1998.03.17;    8212;    7660;     402;       0;     293;    7762;    7953;    8164;     259;      48
FRENCH FRANCDMARK XRATE - NEW YORK COTTON EXCHANGE ;1998.03.10;   10444;    7869;     658;       0;    1473;    9664;    9342;   10322;    1102;     122
FRENCH FRANCDMARK XRATE - NEW YORK COTTON EXCHANGE ;1998.03.03;   14266;    7776;     659;      50;    6091;   13446;   13917;   14155;     349;     111
FRENCH FRANCDMARK XRATE - NEW YORK COTTON EXCHANGE ;1998.02.24;   15659;    4518;    5531;       0;   10982;   10039;   15500;   15570;     159;      89
FRENCH FRANCDMARK XRATE - NEW YORK COTTON EXCHANGE ;1998.02.17;   16457;    4512;   10260;       0;   11792;    6107;   16304;   16367;     153;      90
FRENCH FRANCDMARK XRATE - NEW YORK COTTON EXCHANGE ;1998.02.10;   13341;    1274;   10276;       0;   11846;    2980;   13120;   13256;     221;      85
FRENCH FRANCDMARK XRATE - NEW YORK COTTON EXCHANGE ;1998.02.03;   13353;    1222;   10398;       0;   11937;    2856;   13159;   13254;     194;      99
FRENCH FRANCDMARK XRATE - NEW YORK COTTON EXCHANGE ;1998.01.27;   13372;    1310;   10547;       0;   11946;    2191;   13256;   12738;     116;     634
FRENCH FRANCDMARK XRATE - NEW YORK COTTON EXCHANGE ;1998.01.20;   13261;    1292;   10895;       0;   11827;    2216;   13119;   13111;     142;     150
FRENCH FRANCDMARK XRATE - NEW YORK COTTON EXCHANGE ;1998.01.13;   13414;    1014;   11469;       0;   12284;    1672;   13298;   13141;     116;     273
FRENCH FRANCDMARK XRATE - NEW YORK COTTON EXCHANGE ;1998.01.06;   14066;    1222;   12408;       0;   12648;    1407;   13870;   13815;     196;     251
FRENCH FRANCDMARK XRATE - NEW YORK COTTON EXCHANGE ;1997.12.30;   13188;    1076;   12432;       0;   12099;     590;   13175;   13022;      13;     166
FRENCH FRANCDMARK XRATE - NEW YORK COTTON EXCHANGE ;1997.12.23;   12813;    1254;   11860;       0;   11542;     782;   12796;   12642;      17;     171
FRENCH FRANCDMARK XRATE - NEW YORK COTTON EXCHANGE ;1997.12.16;   11261;     751;   10588;       0;   10489;     508;   11240;   11096;      21;     165
FRENCH FRANCDMARK XRATE - NEW YORK COTTON EXCHANGE ;1997.12.09;   16241;     676;   13119;      95;   15455;    2811;   16226;   16025;      15;     216
FRENCH FRANCDMARK XRATE - NEW YORK COTTON EXCHANGE ;1997.12.02;   14879;     580;   13075;       0;   13701;    1014;   14281;   14089;     598;     790
FRENCH FRANCDMARK XRATE - NEW YORK COTTON EXCHANGE ;1997.11.25;   14217;     798;   12196;       0;   13282;    1397;   14080;   13593;     137;     624
FRENCH FRANCDMARK XRATE - NEW YORK COTTON EXCHANGE ;1997.11.18;   14366;     513;   13152;       0;   13706;     907;   14219;   14059;     147;     307
FRENCH FRANCDMARK XRATE - NEW YORK COTTON EXCHANGE ;1997.11.11;   13885;     579;   12278;       0;   13179;    1265;   13758;   13543;     127;     342
FRENCH FRANCDMARK XRATE - NEW YORK COTTON EXCHANGE ;1997.11.04;   14164;     578;   12555;      14;   13441;    1334;   14033;   13903;     131;     261
FRENCH FRANCDMARK XRATE - NEW YORK COTTON EXCHANGE ;1997.10.28;   14582;     716;   13206;      40;   13758;    1049;   14514;   14295;      68;     287
FRENCH FRANCDMARK XRATE - NEW YORK COTTON EXCHANGE ;1997.10.21;   14590;     773;   13206;      40;   13714;    1052;   14527;   14298;      63;     292
FRENCH FRANCDMARK XRATE - NEW YORK COTTON EXCHANGE ;1997.10.14;   11254;     767;    9666;      40;    9318;    1237;   10125;   10943;    1129;     311
FRENCH FRANCDMARK XRATE - NEW YORK COTTON EXCHANGE ;1997.10.07;    6511;     660;    5317;       0;    5771;     902;    6431;    6219;      80;     292
FRENCH FRANCDMARK XRATE - NEW YORK COTTON EXCHANGE ;1997.09.30;    7382;     839;    6665;       0;    6449;     374;    7288;    7039;      94;     343
FRENCH FRANCDMARK XRATE - NEW YORK COTTON EXCHANGE ;1997.09.23;    7318;     886;    6556;      40;    6318;     401;    7244;    6997;      74;     321
FRENCH FRANCDMARK XRATE - NEW YORK COTTON EXCHANGE ;1997.09.16;    7447;     873;    6677;      40;    6430;     426;    7343;    7143;     104;     304
FRENCH FRANCDMARK XRATE - NEW YORK COTTON EXCHANGE ;1997.09.09;    8070;     760;    6780;      19;    6954;     705;    7733;    7504;     337;     566
FRENCH FRANCDMARK XRATE - NEW YORK COTTON EXCHANGE ;1997.08.26;    3847;     506;    1967;       0;    3246;    1600;    3752;    3567;      95;     280
FRENCH FRANCDMARK XRATE - NEW YORK COTTON EXCHANGE ;1997.08.19;    3656;     327;    1875;       0;    3236;    1515;    3563;    3390;      93;     266
FRENCH FRANCDMARK XRATE - NEW YORK COTTON EXCHANGE ;1997.08.12;    3719;     321;    1868;       0;    3245;    1533;    3566;    3401;     153;     318
FRENCH FRANCDMARK XRATE - NEW YORK COTTON EXCHANGE ;1997.08.05;    2345;     988;     572;       0;    1111;    1603;    2099;    2175;     246;     170
FRENCH FRANCDMARK XRATE - NEW YORK COTTON EXCHANGE ;1997.07.29;    2521;     313;     952;       0;    2101;    1215;    2414;    2167;     107;     354
FRENCH FRANCDMARK XRATE - NEW YORK COTTON EXCHANGE ;1997.07.22;    1729;     279;     444;       0;    1360;    1218;    1639;    1662;      90;      67
FRENCH FRANCDMARK XRATE - NEW YORK COTTON EXCHANGE ;1997.07.15;    1694;     276;     437;       0;    1363;    1229;    1639;    1666;      55;      28
FRENCH FRANCDMARK XRATE - NEW YORK COTTON EXCHANGE ;1997.07.08;     923;     215;     309;       0;     639;     517;     854;     826;      69;      97
FRENCH FRANCDMARK XRATE - NEW YORK COTTON EXCHANGE ;1997.07.01;    1078;     479;     309;       0;     488;     652;     967;     961;     111;     117
FRENCH FRANCDMARK XRATE - NEW YORK COTTON EXCHANGE ;1997.06.17;     979;     570;     287;       0;     256;     672;     826;     959;     153;      20
FRENCH FRANCDMARK XRATE - NEW YORK COTTON EXCHANGE ;1997.06.10;    3422;     825;     344;       0;    2440;    3043;    3265;    3387;     157;      35
FRENCH FRANCDMARK XRATE - NEW YORK COTTON EXCHANGE ;1997.06.03;    4333;    1047;     344;       0;    2809;    3432;    3856;    3776;     477;     557
FRENCH FRANCDMARK XRATE - NEW YORK COTTON EXCHANGE ;1997.05.27;    3652;     454;     968;       0;    2819;    2337;    3273;    3305;     379;     347
FRENCH FRANCDMARK XRATE - NEW YORK COTTON EXCHANGE ;1997.05.20;    4510;     585;    2456;       0;    3797;    1812;    4382;    4268;     128;     242
FRENCH FRANCDMARK XRATE - NEW YORK COTTON EXCHANGE ;1997.05.13;    3895;     589;    1677;       0;    3241;    2107;    3830;    3784;      65;     111
FRENCH FRANCDMARK XRATE - NEW YORK COTTON EXCHANGE ;1997.05.06;    3095;     666;     835;       0;    2253;    2139;    2919;    2974;     176;     121
FRENCH FRANCDMARK XRATE - NEW YORK COTTON EXCHANGE ;1997.04.29;    4501;     520;    3232;       0;    3920;    1120;    4440;    4352;      61;     149
FRENCH FRANCDMARK XRATE - NEW YORK COTTON EXCHANGE ;1997.04.22;    4773;     543;    3339;       0;    3769;    1012;    4312;    4351;     461;     422
FRENCH FRANCDMARK XRATE - NEW YORK COTTON EXCHANGE ;1997.04.15;    7461;     704;    7211;       0;    6757;      37;    7461;    7248;       0;     213
FRENCH FRANCDMARK XRATE - NEW YORK COTTON EXCHANGE ;1997.04.08;    7311;     933;    6489;       0;    6329;     453;    7262;    6942;      49;     369
FRENCH FRANCDMARK XRATE - NEW YORK COTTON EXCHANGE ;1997.04.01;    6038;     880;    5148;       0;    5013;     581;    5893;    5729;     145;     309
FRENCH FRANCDMARK XRATE - NEW YORK COTTON EXCHANGE ;1997.03.25;    2737;     290;    1466;       0;    2261;    1002;    2551;    2468;     186;     269
FRENCH FRANCDMARK XRATE - NEW YORK COTTON EXCHANGE ;1997.03.18;    2616;     272;    1448;       0;    2139;     999;    2411;    2447;     205;     169
FRENCH FRANCDMARK XRATE - NEW YORK COTTON EXCHANGE ;1997.03.11;    3529;     102;    1469;       0;    3333;    1902;    3435;    3371;      94;     158
FRENCH FRANCDMARK XRATE - NEW YORK COTTON EXCHANGE ;1997.03.04;    3202;     150;    1331;       0;    2932;    1685;    3082;    3016;     120;     186
FRENCH FRANCDMARK XRATE - NEW YORK COTTON EXCHANGE ;1997.02.25;    3868;     386;    2031;       0;    3273;    1511;    3659;    3542;     209;     326
FRENCH FRANCDMARK XRATE - NEW YORK COTTON EXCHANGE ;1997.02.18;    2512;     243;     382;      48;    2168;    1940;    2459;    2370;      53;     142
FRENCH FRANCDMARK XRATE - NEW YORK COTTON EXCHANGE ;1997.02.11;    2455;     131;     336;       0;    2201;    2019;    2332;    2355;     123;     100
FRENCH FRANCDMARK XRATE - NEW YORK COTTON EXCHANGE ;1997.02.04;    2673;    1241;     315;       0;    1182;    2247;    2423;    2562;     250;     111
FRENCH FRANCDMARK XRATE - NEW YORK COTTON EXCHANGE ;1997.01.28;    2164;     364;     445;       0;    1643;    1475;    2007;    1920;     157;     244
FRENCH FRANCDMARK XRATE - NEW YORK COTTON EXCHANGE ;1997.01.21;    1616;     263;     160;       0;    1243;    1307;    1506;    1467;     110;     149
FRENCH FRANCDMARK XRATE - NEW YORK COTTON EXCHANGE ;1997.01.14;    1611;     239;     160;       0;    1243;    1275;    1482;    1435;     129;     176
FRENCH FRANCDMARK XRATE - NEW YORK COTTON EXCHANGE ;1997.01.07;    2615;    1302;     206;       0;     465;    1498;    1767;    1704;     848;     911
FRENCH FRANCDMARK XRATE - NEW YORK COTTON EXCHANGE ;1996.12.31;    1000;     280;     471;       0;     631;     302;     911;     773;      89;     227
FRENCH FRANCDMARK XRATE - NEW YORK COTTON EXCHANGE ;1996.12.24;     952;     280;     455;       0;     542;     307;     822;     762;     130;     190
FRENCH FRANCDMARK XRATE - NEW YORK COTTON EXCHANGE ;1996.12.17;     948;     280;     455;       0;     542;     307;     822;     762;     126;     186
FRENCH FRANCDMARK XRATE - NEW YORK COTTON EXCHANGE ;1996.12.10;    2941;     802;     199;     202;    1764;    2409;    2768;    2810;     173;     131
FRENCH FRANCDMARK XRATE - NEW YORK COTTON EXCHANGE ;1996.12.03;    3407;     917;     160;       0;    2113;    3224;    3030;    3384;     377;      23
FRENCH FRANCDMARK XRATE - NEW YORK COTTON EXCHANGE ;1996.11.26;    3418;     945;     141;       0;    2131;    3192;    3075;    3333;     343;      85
FRENCH FRANCDMARK XRATE - NEW YORK COTTON EXCHANGE ;1996.11.19;    3357;     801;     539;       0;    2373;    2514;    3174;    3053;     184;     304
FRENCH FRANCDMARK XRATE - NEW YORK COTTON EXCHANGE ;1996.11.12;    3296;    1061;     954;       1;    2123;    2078;    3185;    3033;     112;     263
FRENCH FRANCDMARK XRATE - NEW YORK COTTON EXCHANGE ;1996.11.05;    3337;    1081;    1449;       0;    2139;    1597;    3220;    3046;     118;     291
FRENCH FRANCDMARK XRATE - NEW YORK COTTON EXCHANGE ;1996.10.29;    2793;     584;     811;       0;    2020;    1605;    2604;    2416;     189;     377
FRENCH FRANCDMARK XRATE - NEW YORK COTTON EXCHANGE ;1996.10.22;    2455;     946;     571;       0;    1323;    1660;    2269;    2231;     187;     224
FRENCH FRANCDMARK XRATE - NEW YORK COTTON EXCHANGE ;1996.10.15;    2523;     637;     994;       0;    1751;    1328;    2388;    2322;     135;     201
FRENCH FRANCDMARK XRATE - NEW YORK COTTON EXCHANGE ;1996.10.08;    2347;     637;     763;       0;    1650;    1297;    2287;    2060;      59;     287
FRENCH FRANCDMARK XRATE - NEW YORK COTTON EXCHANGE ;1996.10.01;    2386;     618;     755;       0;    1635;    1367;    2253;    2122;     133;     264
FRENCH FRANCDMARK XRATE - NEW YORK COTTON EXCHANGE ;1996.09.24;    2477;     622;     838;       0;    1730;    1353;    2352;    2191;     125;     286
FRENCH FRANCDMARK XRATE - NEW YORK COTTON EXCHANGE ;1996.09.17;    2144;     638;     286;      14;    1069;    1441;    1720;    1741;     423;     403
FRENCH FRANCDMARK XRATE - NEW YORK COTTON EXCHANGE ;1996.09.10;    4403;    2709;      14;     174;    1333;    4159;    4216;    4347;     187;      56
FRENCH FRANCDMARK XRATE - NEW YORK COTTON EXCHANGE ;1996.08.27;    4043;    2752;      83;       0;     939;    3908;    3691;    3991;     352;      52
FRENCH FRANCDMARK XRATE - NEW YORK COTTON EXCHANGE ;1996.08.20;    3424;    2138;       0;       0;     925;    3367;    3063;    3367;     361;      57
FRENCH FRANCDMARK XRATE - NEW YORK COTTON EXCHANGE ;1996.08.13;    4554;    2767;     998;       5;    1311;    3497;    4083;    4500;     471;      54
FRENCH FRANCDMARK XRATE - NEW YORK COTTON EXCHANGE ;1996.08.06;    4011;    2002;    1022;       8;    1406;    2884;    3416;    3914;     595;      97
FRENCH FRANCDMARK XRATE - NEW YORK COTTON EXCHANGE ;1996.07.30;    2381;     679;     475;       9;    1563;    1720;    2251;    2204;     130;     177
FRENCH FRANCDMARK XRATE - NEW YORK COTTON EXCHANGE ;1996.07.23;    2621;     680;    1056;       9;    1837;    1298;    2526;    2363;      95;     258
FRENCH FRANCDMARK XRATE - NEW YORK COTTON EXCHANGE ;1996.07.16;    2541;     687;     983;       1;    1648;    1258;    2336;    2242;     205;     299
FRENCH FRANCDMARK XRATE - NEW YORK COTTON EXCHANGE ;1996.07.09;    2007;     547;     577;       1;    1358;    1115;    1906;    1693;     101;     314
FRENCH FRANCDMARK XRATE - NEW YORK COTTON EXCHANGE ;1996.07.02;    2002;     552;     587;       1;    1386;    1115;    1939;    1703;      63;     299
FRENCH FRANCDMARK XRATE - NEW YORK COTTON EXCHANGE ;1996.06.25;    1365;     555;     104;       0;     712;    1115;    1267;    1219;      98;     146
FRENCH FRANCDMARK XRATE - NEW YORK COTTON EXCHANGE ;1996.06.18;    1401;     554;     132;       0;     702;     701;    1256;     833;     145;     568
FRENCH FRANCDMARK XRATE - NEW YORK COTTON EXCHANGE ;1996.06.11;    3632;     512;    1175;     170;    2753;    1992;    3435;    3337;     197;     295
FRENCH FRANCDMARK XRATE - NEW YORK COTTON EXCHANGE ;1996.06.04;    3382;     911;    1629;       0;    2314;    1463;    3225;    3092;     157;     290
FRENCH FRANCDMARK XRATE - NEW YORK COTTON EXCHANGE ;1996.05.28;    3411;     364;    1528;       0;    2912;    1627;    3276;    3155;     135;     256
FRENCH FRANCDMARK XRATE - NEW YORK COTTON EXCHANGE ;1996.05.21;    3443;     355;    1522;       0;    2914;    1671;    3269;    3193;     174;     249
FRENCH FRANCDMARK XRATE - NEW YORK COTTON EXCHANGE ;1996.05.14;    3344;     470;    1800;       0;    2157;    1238;    2627;    3038;     717;     305
FRENCH FRANCDMARK XRATE - NEW YORK COTTON EXCHANGE ;1996.05.07;    3927;     770;    2838;       2;    3037;     763;    3809;    3603;     118;     324
FRENCH FRANCDMARK XRATE - NEW YORK COTTON EXCHANGE ;1996.04.30;    4104;     999;    2945;      35;    2790;     816;    3824;    3796;     280;     308
FRENCH FRANCDMARK XRATE - NEW YORK COTTON EXCHANGE ;1996.04.23;    3915;     985;    2726;      53;    2770;     855;    3808;    3634;     107;     281
FRENCH FRANCDMARK XRATE - NEW YORK COTTON EXCHANGE ;1996.04.16;    3944;     608;    3260;       0;    3266;     455;    3874;    3715;      70;     229
FRENCH FRANCDMARK XRATE - NEW YORK COTTON EXCHANGE ;1996.04.09;    3411;     601;    2676;       0;    2743;     539;    3344;    3215;      67;     196
FRENCH FRANCDMARK XRATE - NEW YORK COTTON EXCHANGE ;1996.04.02;    2969;     390;    2155;       0;    2471;     557;    2861;    2712;     108;     257
FRENCH FRANCDMARK XRATE - NEW YORK COTTON EXCHANGE ;1996.03.26;    2417;     500;    1040;      26;    1822;    1090;    2348;    2156;      69;     261
FRENCH FRANCDMARK XRATE - NEW YORK COTTON EXCHANGE ;1996.03.19;    2492;      69;    1453;       0;    1916;     800;    1985;    2253;     507;     239
FRENCH FRANCDMARK XRATE - NEW YORK COTTON EXCHANGE ;1996.03.12;    3244;     357;    1644;       0;    2625;    1263;    2982;    2907;     262;     337
FRENCH FRANCDMARK XRATE - NEW YORK COTTON EXCHANGE ;1996.03.05;    2074;     390;    1387;       0;    1424;     348;    1814;    1735;     260;     339
FRENCH FRANCDMARK XRATE - NEW YORK COTTON EXCHANGE ;1996.02.27;    1041;     178;     105;       0;     630;     793;     808;     898;     233;     143
FRENCH FRANCDMARK XRATE - NEW YORK COTTON EXCHANGE ;1996.02.20;     867;     107;     131;       0;     472;     609;     579;     740;     288;     127
FRENCH FRANCDMARK XRATE - NEW YORK COTTON EXCHANGE ;1996.02.13;     854;      80;     131;       0;     499;     585;     579;     716;     275;     138
FRENCH FRANCDMARK XRATE - NEW YORK COTTON EXCHANGE ;1996.02.06;     760;      50;      87;       0;     460;     566;     510;     653;     250;     107
FRENCH FRANCDMARK XRATE - NEW YORK COTTON EXCHANGE ;1996.01.30;     683;     172;      51;       0;     246;     541;     418;     592;     265;      91
FRENCH FRANCDMARK XRATE - NEW YORK COTTON EXCHANGE ;1996.01.23;     545;      25;     103;       0;     322;     205;     347;     308;     198;     237
FRENCH FRANCDMARK XRATE - NEW YORK COTTON EXCHANGE ;1996.01.16;     527;      25;     102;       0;     298;     218;     323;     320;     204;     207
FRENCH FRANCDMARK XRATE - NEW YORK COTTON EXCHANGE ;1996.01.09;     556;      26;     218;       0;     323;     123;     349;     341;     207;     215
FRENCH FRANCDMARK XRATE - NEW YORK COTTON EXCHANGE ;1996.01.02;     276;       0;     152;       0;     171;       0;     171;     152;     105;     124
FRENCH FRANCDMARK XRATE - NEW YORK COTTON EXCHANGE ;1995.12.12;    1473;      35;      80;     443;     884;     871;    1362;    1394;     111;      79
FRENCH FRANCDMARK XRATE - NEW YORK COTTON EXCHANGE ;1995.12.05;    1432;     119;      22;     423;     733;     868;    1275;    1313;     157;     119
FRENCH FRANCDMARK XRATE - NEW YORK COTTON EXCHANGE ;1995.11.28;    1268;      13;     103;     438;     733;     578;    1184;    1119;      84;     149
FRENCH FRANCDMARK XRATE - NEW YORK COTTON EXCHANGE ;1995.11.21;    1280;      28;      33;     445;     733;     725;    1206;    1203;      74;      77
FRENCH FRANCDMARK XRATE - NEW YORK COTTON EXCHANGE ;1995.11.14;    1245;      28;      44;     439;     723;     701;    1190;    1184;      55;      61
FRENCH FRANCDMARK XRATE - NEW YORK COTTON EXCHANGE ;1995.11.07;    1353;      30;      69;     420;     729;     699;    1179;    1188;     173;     165
FRENCH FRANCDMARK XRATE - NEW YORK COTTON EXCHANGE ;1995.10.31;    1492;      90;      87;     420;     728;     838;    1238;    1345;     254;     147
FRENCH FRANCDMARK XRATE - NEW YORK COTTON EXCHANGE ;1995.10.24;    1411;     391;     104;     411;     328;     764;    1130;    1279;     281;     132
FRENCH FRANCDMARK XRATE - NEW YORK COTTON EXCHANGE ;1995.10.17;     977;     295;     108;       2;     425;     746;     722;     856;     255;     121
FRENCH FRANCDMARK XRATE - NEW YORK COTTON EXCHANGE ;1995.10.10;     886;     162;      45;       0;     376;     712;     538;     757;     348;     129
FRENCH FRANCDMARK XRATE - NEW YORK COTTON EXCHANGE ;1995.09.12;    1227;      36;     338;       2;    1111;     704;    1149;    1044;      78;     183
FRENCH FRANCDMARK XRATE - NEW YORK COTTON EXCHANGE ;1995.09.05;     839;      31;     677;       2;     756;      28;     789;     707;      50;     132
FRENCH FRANCDMARK XRATE - NEW YORK COTTON EXCHANGE ;1995.08.29;     840;      31;     689;       2;     754;      28;     787;     719;      53;     121
FRENCH FRANCDMARK XRATE - NEW YORK COTTON EXCHANGE ;1995.08.22;    1074;      30;     911;       1;     997;      26;    1028;     938;      46;     136
FRENCH FRANCDMARK XRATE - NEW YORK COTTON EXCHANGE ;1995.08.15;    1088;      34;     911;       0;    1000;      26;    1034;     937;      54;     151
FRENCH FRANCDMARK XRATE - NEW YORK COTTON EXCHANGE ;1995.08.08;    1062;       0;     911;       0;    1002;      14;    1002;     925;      60;     137
FRENCH FRANCDMARK XRATE - NEW YORK COTTON EXCHANGE ;1995.08.01;     641;       0;     520;       0;     600;      30;     600;     550;      41;      91
FRENCH FRANCDMARK XRATE - NEW YORK COTTON EXCHANGE ;1995.07.25;     428;       0;     316;       0;     409;      28;     409;     344;      19;      84
FRENCH FRANCDMARK XRATE - NEW YORK COTTON EXCHANGE ;1995.07.18;     428;       0;     316;       0;     407;      28;     407;     344;      21;      84
FRENCH FRANCDMARK XRATE - NEW YORK COTTON EXCHANGE ;1995.07.11;     457;       0;     350;       0;     330;      25;     330;     375;     127;      82
FRENCH FRANCDMARK XRATE - NEW YORK COTTON EXCHANGE ;1995.06.13;    1479;      57;       0;       0;    1401;    1469;    1458;    1469;      21;      10
FRENCH FRANCDMARK XRATE - NEW YORK COTTON EXCHANGE ;1995.06.06;    1781;      56;       0;       0;    1592;    1767;    1648;    1767;     133;      14
FRENCH FRANCDMARK XRATE - NEW YORK COTTON EXCHANGE ;1995.05.30;    2216;     500;       0;       0;    1690;    2208;    2190;    2208;      26;       8
FRENCH FRANCDMARK XRATE - NEW YORK COTTON EXCHANGE ;1995.05.23;    2219;     500;       0;       0;    1693;    2211;    2193;    2211;      26;       8
FRENCH FRANCDMARK XRATE - NEW YORK COTTON EXCHANGE ;1995.05.16;    1877;      28;       0;       0;    1841;    1869;    1869;    1869;       8;       8
FRENCH FRANCDMARK XRATE - NEW YORK COTTON EXCHANGE ;1995.05.09;    1928;      28;       0;       0;    1835;    1909;    1863;    1909;      65;      19
FRENCH FRANCDMARK XRATE - NEW YORK COTTON EXCHANGE ;1995.05.02;    2184;     528;       0;       0;    1563;    2173;    2091;    2173;      93;      11
FRENCH FRANCDMARK XRATE - NEW YORK COTTON EXCHANGE ;1995.04.25;    2119;     526;       0;       0;    1563;    2112;    2089;    2112;      30;       7
FRENCH FRANCDMARK XRATE - NEW YORK COTTON EXCHANGE ;1995.04.18;    1998;     500;       0;       0;    1441;    1956;    1941;    1956;      57;      42
FRENCH FRANCDMARK XRATE - NEW YORK COTTON EXCHANGE ;1998.09.08;    3048;     470;       0;       0;    2212;    2712;    2682;    2712;     366;     336
FRENCH FRANCDMARK XRATE - NEW YORK COTTON EXCHANGE ;1998.09.01;    2942;     470;       0;       0;    2212;    2563;    2682;    2563;     260;     379
FRENCH FRANCDMARK XRATE - NEW YORK COTTON EXCHANGE ;1998.08.25;    2957;     470;       0;       0;    2130;    2563;    2600;    2563;     357;     394
FRENCH FRANCDMARK XRATE - NEW YORK COTTON EXCHANGE ;1998.08.18;    2957;     470;       0;       0;    2130;    2563;    2600;    2563;     357;     394
FRENCH FRANCDMARK XRATE - NEW YORK COTTON EXCHANGE ;1998.08.11;    2880;     470;       0;       0;    2150;    2563;    2620;    2563;     260;     317
FRENCH FRANCDMARK XRATE - NEW YORK COTTON EXCHANGE ;1998.08.04;    2901;     470;       0;       0;    2150;    2800;    2620;    2800;     281;     101
FRENCH FRANCDMARK XRATE - NEW YORK COTTON EXCHANGE ;1998.07.28;    2952;     470;       0;       0;    2044;    2768;    2514;    2768;     438;     184
FRENCH FRANCDMARK XRATE - NEW YORK COTTON EXCHANGE ;1998.07.21;    3109;     470;       0;       0;    1830;    2810;    2300;    2810;     809;     299
FRENCH FRANCDMARK XRATE - NEW YORK COTTON EXCHANGE ;1998.07.14;    3173;     470;       0;       0;    1830;    2912;    2300;    2912;     873;     261
FRENCH FRANCDMARK XRATE - NEW YORK COTTON EXCHANGE ;1998.07.07;    3158;    1597;       0;       0;     600;    2912;    2197;    2912;     961;     246
FRENCH FRANCDMARK XRATE - NEW YORK COTTON EXCHANGE ;1998.06.30;    3140;    1594;       0;       0;     600;    2975;    2194;    2975;     946;     165
FRENCH FRANCDMARK XRATE - NEW YORK COTTON EXCHANGE ;1998.06.23;    3911;    2799;       0;       0;     600;    3822;    3399;    3822;     512;      89
FRENCH FRANCDMARK XRATE - NEW YORK COTTON EXCHANGE ;1998.06.16;    4237;    3750;       0;       0;       0;    4129;    3750;    4129;     487;     108
FRENCH FRANCDMARK XRATE - NEW YORK COTTON EXCHANGE ;1998.06.09;    7099;    3918;      83;       0;    2893;    6894;    6811;    6977;     288;     122
FRENCH FRANCDMARK XRATE - NEW YORK COTTON EXCHANGE ;1998.06.02;    7527;    7021;      77;       0;     233;    7334;    7254;    7411;     273;     116
FRENCH FRANCDMARK XRATE - NEW YORK COTTON EXCHANGE ;1998.05.26;    7860;    7365;     169;       0;     223;    7523;    7588;    7692;     272;     168
FRENCH FRANCDMARK XRATE - NEW YORK COTTON EXCHANGE ;1998.05.19;    7750;    7225;     167;       0;     223;    7426;    7448;    7593;     302;     157
FRENCH FRANCDMARK XRATE - NEW YORK COTTON EXCHANGE ;1998.05.12;    7756;    7253;     168;       0;     223;    7381;    7476;    7549;     280;     207
FRENCH FRANCDMARK XRATE - NEW YORK COTTON EXCHANGE ;1998.05.05;    7711;    7254;     141;       0;     174;    7397;    7428;    7538;     283;     173
FRENCH FRANCDMARK XRATE - NEW YORK COTTON EXCHANGE ;1998.04.28;    8160;    7772;     188;       0;     130;    7893;    7902;    8081;     258;      79
FRENCH FRANCDMARK XRATE - NEW YORK COTTON EXCHANGE ;1998.04.21;    8033;    7662;     271;       0;     130;    7614;    7792;    7885;     241;     148
FRENCH FRANCDMARK XRATE - NEW YORK COTTON EXCHANGE ;1998.04.14;    7955;    7600;     238;       0;     130;    7552;    7730;    7790;     225;     165
FRENCH FRANCDMARK XRATE - NEW YORK COTTON EXCHANGE ;1998.04.07;    7961;    7538;     249;       0;     185;    7583;    7723;    7832;     238;     129
FRENCH FRANCDMARK XRATE - NEW YORK COTTON EXCHANGE ;1998.03.31;    8019;    7488;     381;       0;     270;    7600;    7758;    7981;     261;      38
FRENCH FRANCDMARK XRATE - NEW YORK COTTON EXCHANGE ;1998.03.24;    8033;    7523;     402;       0;     270;    7602;    7793;    8004;     240;      29
FRENCH FRANCDMARK XRATE - NEW YORK COTTON EXCHANGE ;1998.03.17;    8212;    7660;     402;       0;     293;    7762;    7953;    8164;     259;      48
FRENCH FRANCDMARK XRATE - NEW YORK COTTON EXCHANGE ;1998.03.10;   10444;    7869;     658;       0;    1473;    9664;    9342;   10322;    1102;     122
FRENCH FRANCDMARK XRATE - NEW YORK COTTON EXCHANGE ;1998.03.03;   14266;    7776;     659;      50;    6091;   13446;   13917;   14155;     349;     111
FRENCH FRANCDMARK XRATE - NEW YORK COTTON EXCHANGE ;1998.02.24;   15659;    4518;    5531;       0;   10982;   10039;   15500;   15570;     159;      89
FRENCH FRANCDMARK XRATE - NEW YORK COTTON EXCHANGE ;1998.02.17;   16457;    4512;   10260;       0;   11792;    6107;   16304;   16367;     153;      90
FRENCH FRANCDMARK XRATE - NEW YORK COTTON EXCHANGE ;1998.02.10;   13341;    1274;   10276;       0;   11846;    2980;   13120;   13256;     221;      85
FRENCH FRANCDMARK XRATE - NEW YORK COTTON EXCHANGE ;1998.02.03;   13353;    1222;   10398;       0;   11937;    2856;   13159;   13254;     194;      99
FRENCH FRANCDMARK XRATE - NEW YORK COTTON EXCHANGE ;1998.01.27;   13372;    1310;   10547;       0;   11946;    2191;   13256;   12738;     116;     634
FRENCH FRANCDMARK XRATE - NEW YORK COTTON EXCHANGE ;1998.01.20;   13261;    1292;   10895;       0;   11827;    2216;   13119;   13111;     142;     150
FRENCH FRANCDMARK XRATE - NEW YORK COTTON EXCHANGE ;1998.01.13;   13414;    1014;   11469;       0;   12284;    1672;   13298;   13141;     116;     273
FRENCH FRANCDMARK XRATE - NEW YORK COTTON EXCHANGE ;1998.01.06;   14066;    1222;   12408;       0;   12648;    1407;   13870;   13815;     196;     251
FRENCH FRANCDMARK XRATE - NEW YORK COTTON EXCHANGE ;1997.12.30;   13188;    1076;   12432;       0;   12099;     590;   13175;   13022;      13;     166
FRENCH FRANCDMARK XRATE - NEW YORK COTTON EXCHANGE ;1997.12.23;   12813;    1254;   11860;       0;   11542;     782;   12796;   12642;      17;     171
FRENCH FRANCDMARK XRATE - NEW YORK COTTON EXCHANGE ;1997.12.16;   11261;     751;   10588;       0;   10489;     508;   11240;   11096;      21;     165
FRENCH FRANCDMARK XRATE - NEW YORK COTTON EXCHANGE ;1997.12.09;   16241;     676;   13119;      95;   15455;    2811;   16226;   16025;      15;     216
FRENCH FRANCDMARK XRATE - NEW YORK COTTON EXCHANGE ;1997.12.02;   14879;     580;   13075;       0;   13701;    1014;   14281;   14089;     598;     790
FRENCH FRANCDMARK XRATE - NEW YORK COTTON EXCHANGE ;1997.11.25;   14217;     798;   12196;       0;   13282;    1397;   14080;   13593;     137;     624
FRENCH FRANCDMARK XRATE - NEW YORK COTTON EXCHANGE ;1997.11.18;   14366;     513;   13152;       0;   13706;     907;   14219;   14059;     147;     307
FRENCH FRANCDMARK XRATE - NEW YORK COTTON EXCHANGE ;1997.11.11;   13885;     579;   12278;       0;   13179;    1265;   13758;   13543;     127;     342
FRENCH FRANCDMARK XRATE - NEW YORK COTTON EXCHANGE ;1997.11.04;   14164;     578;   12555;      14;   13441;    1334;   14033;   13903;     131;     261
FRENCH FRANCDMARK XRATE - NEW YORK COTTON EXCHANGE ;1997.10.28;   14582;     716;   13206;      40;   13758;    1049;   14514;   14295;      68;     287
FRENCH FRANCDMARK XRATE - NEW YORK COTTON EXCHANGE ;1997.10.21;   14590;     773;   13206;      40;   13714;    1052;   14527;   14298;      63;     292
FRENCH FRANCDMARK XRATE - NEW YORK COTTON EXCHANGE ;1997.10.14;   11254;     767;    9666;      40;    9318;    1237;   10125;   10943;    1129;     311
FRENCH FRANCDMARK XRATE - NEW YORK COTTON EXCHANGE ;1997.10.07;    6511;     660;    5317;       0;    5771;     902;    6431;    6219;      80;     292
FRENCH FRANCDMARK XRATE - NEW YORK COTTON EXCHANGE ;1997.09.30;    7382;     839;    6665;       0;    6449;     374;    7288;    7039;      94;     343
FRENCH FRANCDMARK XRATE - NEW YORK COTTON EXCHANGE ;1997.09.23;    7318;     886;    6556;      40;    6318;     401;    7244;    6997;      74;     321
FRENCH FRANCDMARK XRATE - NEW YORK COTTON EXCHANGE ;1997.09.16;    7447;     873;    6677;      40;    6430;     426;    7343;    7143;     104;     304
FRENCH FRANCDMARK XRATE - NEW YORK COTTON EXCHANGE ;1997.09.09;    8070;     760;    6780;      19;    6954;     705;    7733;    7504;     337;     566
FRENCH FRANCDMARK XRATE - NEW YORK COTTON EXCHANGE ;1997.08.26;    3847;     506;    1967;       0;    3246;    1600;    3752;    3567;      95;     280
FRENCH FRANCDMARK XRATE - NEW YORK COTTON EXCHANGE ;1997.08.19;    3656;     327;    1875;       0;    3236;    1515;    3563;    3390;      93;     266
FRENCH FRANCDMARK XRATE - NEW YORK COTTON EXCHANGE ;1997.08.12;    3719;     321;    1868;       0;    3245;    1533;    3566;    3401;     153;     318
FRENCH FRANCDMARK XRATE - NEW YORK COTTON EXCHANGE ;1997.08.05;    2345;     988;     572;       0;    1111;    1603;    2099;    2175;     246;     170
FRENCH FRANCDMARK XRATE - NEW YORK COTTON EXCHANGE ;1997.07.29;    2521;     313;     952;       0;    2101;    1215;    2414;    2167;     107;     354
FRENCH FRANCDMARK XRATE - NEW YORK COTTON EXCHANGE ;1997.07.22;    1729;     279;     444;       0;    1360;    1218;    1639;    1662;      90;      67
FRENCH FRANCDMARK XRATE - NEW YORK COTTON EXCHANGE ;1997.07.15;    1694;     276;     437;       0;    1363;    1229;    1639;    1666;      55;      28
FRENCH FRANCDMARK XRATE - NEW YORK COTTON EXCHANGE ;1997.07.08;     923;     215;     309;       0;     639;     517;     854;     826;      69;      97
FRENCH FRANCDMARK XRATE - NEW YORK COTTON EXCHANGE ;1997.07.01;    1078;     479;     309;       0;     488;     652;     967;     961;     111;     117
FRENCH FRANCDMARK XRATE - NEW YORK COTTON EXCHANGE ;1997.06.17;     979;     570;     287;       0;     256;     672;     826;     959;     153;      20
FRENCH FRANCDMARK XRATE - NEW YORK COTTON EXCHANGE ;1997.06.10;    3422;     825;     344;       0;    2440;    3043;    3265;    3387;     157;      35
FRENCH FRANCDMARK XRATE - NEW YORK COTTON EXCHANGE ;1997.06.03;    4333;    1047;     344;       0;    2809;    3432;    3856;    3776;     477;     557
FRENCH FRANCDMARK XRATE - NEW YORK COTTON EXCHANGE ;1997.05.27;    3652;     454;     968;       0;    2819;    2337;    3273;    3305;     379;     347
FRENCH FRANCDMARK XRATE - NEW YORK COTTON EXCHANGE ;1997.05.20;    4510;     585;    2456;       0;    3797;    1812;    4382;    4268;     128;     242
FRENCH FRANCDMARK XRATE - NEW YORK COTTON EXCHANGE ;1997.05.13;    3895;     589;    1677;       0;    3241;    2107;    3830;    3784;      65;     111
FRENCH FRANCDMARK XRATE - NEW YORK COTTON EXCHANGE ;1997.05.06;    3095;     666;     835;       0;    2253;    2139;    2919;    2974;     176;     121
FRENCH FRANCDMARK XRATE - NEW YORK COTTON EXCHANGE ;1997.04.29;    4501;     520;    3232;       0;    3920;    1120;    4440;    4352;      61;     149
FRENCH FRANCDMARK XRATE - NEW YORK COTTON EXCHANGE ;1997.04.22;    4773;     543;    3339;       0;    3769;    1012;    4312;    4351;     461;     422
FRENCH FRANCDMARK XRATE - NEW YORK COTTON EXCHANGE ;1997.04.15;    7461;     704;    7211;       0;    6757;      37;    7461;    7248;       0;     213
FRENCH FRANCDMARK XRATE - NEW YORK COTTON EXCHANGE ;1997.04.08;    7311;     933;    6489;       0;    6329;     453;    7262;    6942;      49;     369
FRENCH FRANCDMARK XRATE - NEW YORK COTTON EXCHANGE ;1997.04.01;    6038;     880;    5148;       0;    5013;     581;    5893;    5729;     145;     309
FRENCH FRANCDMARK XRATE - NEW YORK COTTON EXCHANGE ;1997.03.25;    2737;     290;    1466;       0;    2261;    1002;    2551;    2468;     186;     269
FRENCH FRANCDMARK XRATE - NEW YORK COTTON EXCHANGE ;1997.03.18;    2616;     272;    1448;       0;    2139;     999;    2411;    2447;     205;     169
FRENCH FRANCDMARK XRATE - NEW YORK COTTON EXCHANGE ;1997.03.11;    3529;     102;    1469;       0;    3333;    1902;    3435;    3371;      94;     158
FRENCH FRANCDMARK XRATE - NEW YORK COTTON EXCHANGE ;1997.03.04;    3202;     150;    1331;       0;    2932;    1685;    3082;    3016;     120;     186
FRENCH FRANCDMARK XRATE - NEW YORK COTTON EXCHANGE ;1997.02.25;    3868;     386;    2031;       0;    3273;    1511;    3659;    3542;     209;     326
FRENCH FRANCDMARK XRATE - NEW YORK COTTON EXCHANGE ;1997.02.18;    2512;     243;     382;      48;    2168;    1940;    2459;    2370;      53;     142
FRENCH FRANCDMARK XRATE - NEW YORK COTTON EXCHANGE ;1997.02.11;    2455;     131;     336;       0;    2201;    2019;    2332;    2355;     123;     100
FRENCH FRANCDMARK XRATE - NEW YORK COTTON EXCHANGE ;1997.02.04;    2673;    1241;     315;       0;    1182;    2247;    2423;    2562;     250;     111
FRENCH FRANCDMARK XRATE - NEW YORK COTTON EXCHANGE ;1997.01.28;    2164;     364;     445;       0;    1643;    1475;    2007;    1920;     157;     244
FRENCH FRANCDMARK XRATE - NEW YORK COTTON EXCHANGE ;1997.01.21;    1616;     263;     160;       0;    1243;    1307;    1506;    1467;     110;     149
FRENCH FRANCDMARK XRATE - NEW YORK COTTON EXCHANGE ;1997.01.14;    1611;     239;     160;       0;    1243;    1275;    1482;    1435;     129;     176
FRENCH FRANCDMARK XRATE - NEW YORK COTTON EXCHANGE ;1997.01.07;    2615;    1302;     206;       0;     465;    1498;    1767;    1704;     848;     911
FRENCH FRANCDMARK XRATE - NEW YORK COTTON EXCHANGE ;1996.12.31;    1000;     280;     471;       0;     631;     302;     911;     773;      89;     227
FRENCH FRANCDMARK XRATE - NEW YORK COTTON EXCHANGE ;1996.12.24;     952;     280;     455;       0;     542;     307;     822;     762;     130;     190
FRENCH FRANCDMARK XRATE - NEW YORK COTTON EXCHANGE ;1996.12.17;     948;     280;     455;       0;     542;     307;     822;     762;     126;     186
FRENCH FRANCDMARK XRATE - NEW YORK COTTON EXCHANGE ;1996.12.10;    2941;     802;     199;     202;    1764;    2409;    2768;    2810;     173;     131
FRENCH FRANCDMARK XRATE - NEW YORK COTTON EXCHANGE ;1996.12.03;    3407;     917;     160;       0;    2113;    3224;    3030;    3384;     377;      23
FRENCH FRANCDMARK XRATE - NEW YORK COTTON EXCHANGE ;1996.11.26;    3418;     945;     141;       0;    2131;    3192;    3075;    3333;     343;      85
FRENCH FRANCDMARK XRATE - NEW YORK COTTON EXCHANGE ;1996.11.19;    3357;     801;     539;       0;    2373;    2514;    3174;    3053;     184;     304
FRENCH FRANCDMARK XRATE - NEW YORK COTTON EXCHANGE ;1996.11.12;    3296;    1061;     954;       1;    2123;    2078;    3185;    3033;     112;     263
FRENCH FRANCDMARK XRATE - NEW YORK COTTON EXCHANGE ;1996.11.05;    3337;    1081;    1449;       0;    2139;    1597;    3220;    3046;     118;     291
FRENCH FRANCDMARK XRATE - NEW YORK COTTON EXCHANGE ;1996.10.29;    2793;     584;     811;       0;    2020;    1605;    2604;    2416;     189;     377
FRENCH FRANCDMARK XRATE - NEW YORK COTTON EXCHANGE ;1996.10.22;    2455;     946;     571;       0;    1323;    1660;    2269;    2231;     187;     224
FRENCH FRANCDMARK XRATE - NEW YORK COTTON EXCHANGE ;1996.10.15;    2523;     637;     994;       0;    1751;    1328;    2388;    2322;     135;     201
FRENCH FRANCDMARK XRATE - NEW YORK COTTON EXCHANGE ;1996.10.08;    2347;     637;     763;       0;    1650;    1297;    2287;    2060;      59;     287
FRENCH FRANCDMARK XRATE - NEW YORK COTTON EXCHANGE ;1996.10.01;    2386;     618;     755;       0;    1635;    1367;    2253;    2122;     133;     264
FRENCH FRANCDMARK XRATE - NEW YORK COTTON EXCHANGE ;1996.09.24;    2477;     622;     838;       0;    1730;    1353;    2352;    2191;     125;     286
FRENCH FRANCDMARK XRATE - NEW YORK COTTON EXCHANGE ;1996.09.17;    2144;     638;     286;      14;    1069;    1441;    1720;    1741;     423;     403
FRENCH FRANCDMARK XRATE - NEW YORK COTTON EXCHANGE ;1996.09.10;    4403;    2709;      14;     174;    1333;    4159;    4216;    4347;     187;      56
FRENCH FRANCDMARK XRATE - NEW YORK COTTON EXCHANGE ;1996.08.27;    4043;    2752;      83;       0;     939;    3908;    3691;    3991;     352;      52
FRENCH FRANCDMARK XRATE - NEW YORK COTTON EXCHANGE ;1996.08.20;    3424;    2138;       0;       0;     925;    3367;    3063;    3367;     361;      57
FRENCH FRANCDMARK XRATE - NEW YORK COTTON EXCHANGE ;1996.08.13;    4554;    2767;     998;       5;    1311;    3497;    4083;    4500;     471;      54
FRENCH FRANCDMARK XRATE - NEW YORK COTTON EXCHANGE ;1996.08.06;    4011;    2002;    1022;       8;    1406;    2884;    3416;    3914;     595;      97
FRENCH FRANCDMARK XRATE - NEW YORK COTTON EXCHANGE ;1996.07.30;    2381;     679;     475;       9;    1563;    1720;    2251;    2204;     130;     177
FRENCH FRANCDMARK XRATE - NEW YORK COTTON EXCHANGE ;1996.07.23;    2621;     680;    1056;       9;    1837;    1298;    2526;    2363;      95;     258
FRENCH FRANCDMARK XRATE - NEW YORK COTTON EXCHANGE ;1996.07.16;    2541;     687;     983;       1;    1648;    1258;    2336;    2242;     205;     299
FRENCH FRANCDMARK XRATE - NEW YORK COTTON EXCHANGE ;1996.07.09;    2007;     547;     577;       1;    1358;    1115;    1906;    1693;     101;     314
FRENCH FRANCDMARK XRATE - NEW YORK COTTON EXCHANGE ;1996.07.02;    2002;     552;     587;       1;    1386;    1115;    1939;    1703;      63;     299
FRENCH FRANCDMARK XRATE - NEW YORK COTTON EXCHANGE ;1996.06.25;    1365;     555;     104;       0;     712;    1115;    1267;    1219;      98;     146
FRENCH FRANCDMARK XRATE - NEW YORK COTTON EXCHANGE ;1996.06.18;    1401;     554;     132;       0;     702;     701;    1256;     833;     145;     568
FRENCH FRANCDMARK XRATE - NEW YORK COTTON EXCHANGE ;1996.06.11;    3632;     512;    1175;     170;    2753;    1992;    3435;    3337;     197;     295
FRENCH FRANCDMARK XRATE - NEW YORK COTTON EXCHANGE ;1996.06.04;    3382;     911;    1629;       0;    2314;    1463;    3225;    3092;     157;     290
FRENCH FRANCDMARK XRATE - NEW YORK COTTON EXCHANGE ;1996.05.28;    3411;     364;    1528;       0;    2912;    1627;    3276;    3155;     135;     256
FRENCH FRANCDMARK XRATE - NEW YORK COTTON EXCHANGE ;1996.05.21;    3443;     355;    1522;       0;    2914;    1671;    3269;    3193;     174;     249
FRENCH FRANCDMARK XRATE - NEW YORK COTTON EXCHANGE ;1996.05.14;    3344;     470;    1800;       0;    2157;    1238;    2627;    3038;     717;     305
FRENCH FRANCDMARK XRATE - NEW YORK COTTON EXCHANGE ;1996.05.07;    3927;     770;    2838;       2;    3037;     763;    3809;    3603;     118;     324
FRENCH FRANCDMARK XRATE - NEW YORK COTTON EXCHANGE ;1996.04.30;    4104;     999;    2945;      35;    2790;     816;    3824;    3796;     280;     308
FRENCH FRANCDMARK XRATE - NEW YORK COTTON EXCHANGE ;1996.04.23;    3915;     985;    2726;      53;    2770;     855;    3808;    3634;     107;     281
FRENCH FRANCDMARK XRATE - NEW YORK COTTON EXCHANGE ;1996.04.16;    3944;     608;    3260;       0;    3266;     455;    3874;    3715;      70;     229
FRENCH FRANCDMARK XRATE - NEW YORK COTTON EXCHANGE ;1996.04.09;    3411;     601;    2676;       0;    2743;     539;    3344;    3215;      67;     196
FRENCH FRANCDMARK XRATE - NEW YORK COTTON EXCHANGE ;1996.04.02;    2969;     390;    2155;       0;    2471;     557;    2861;    2712;     108;     257
FRENCH FRANCDMARK XRATE - NEW YORK COTTON EXCHANGE ;1996.03.26;    2417;     500;    1040;      26;    1822;    1090;    2348;    2156;      69;     261
FRENCH FRANCDMARK XRATE - NEW YORK COTTON EXCHANGE ;1996.03.19;    2492;      69;    1453;       0;    1916;     800;    1985;    2253;     507;     239
FRENCH FRANCDMARK XRATE - NEW YORK COTTON EXCHANGE ;1996.03.12;    3244;     357;    1644;       0;    2625;    1263;    2982;    2907;     262;     337
FRENCH FRANCDMARK XRATE - NEW YORK COTTON EXCHANGE ;1996.03.05;    2074;     390;    1387;       0;    1424;     348;    1814;    1735;     260;     339
FRENCH FRANCDMARK XRATE - NEW YORK COTTON EXCHANGE ;1996.02.27;    1041;     178;     105;       0;     630;     793;     808;     898;     233;     143
FRENCH FRANCDMARK XRATE - NEW YORK COTTON EXCHANGE ;1996.02.20;     867;     107;     131;       0;     472;     609;     579;     740;     288;     127
FRENCH FRANCDMARK XRATE - NEW YORK COTTON EXCHANGE ;1996.02.13;     854;      80;     131;       0;     499;     585;     579;     716;     275;     138
FRENCH FRANCDMARK XRATE - NEW YORK COTTON EXCHANGE ;1996.02.06;     760;      50;      87;       0;     460;     566;     510;     653;     250;     107
FRENCH FRANCDMARK XRATE - NEW YORK COTTON EXCHANGE ;1996.01.30;     683;     172;      51;       0;     246;     541;     418;     592;     265;      91
FRENCH FRANCDMARK XRATE - NEW YORK COTTON EXCHANGE ;1996.01.23;     545;      25;     103;       0;     322;     205;     347;     308;     198;     237
FRENCH FRANCDMARK XRATE - NEW YORK COTTON EXCHANGE ;1996.01.16;     527;      25;     102;       0;     298;     218;     323;     320;     204;     207
FRENCH FRANCDMARK XRATE - NEW YORK COTTON EXCHANGE ;1996.01.09;     556;      26;     218;       0;     323;     123;     349;     341;     207;     215
FRENCH FRANCDMARK XRATE - NEW YORK COTTON EXCHANGE ;1996.01.02;     276;       0;     152;       0;     171;       0;     171;     152;     105;     124
FRENCH FRANCDMARK XRATE - NEW YORK COTTON EXCHANGE ;1995.12.12;    1473;      35;      80;     443;     884;     871;    1362;    1394;     111;      79
FRENCH FRANCDMARK XRATE - NEW YORK COTTON EXCHANGE ;1995.12.05;    1432;     119;      22;     423;     733;     868;    1275;    1313;     157;     119
FRENCH FRANCDMARK XRATE - NEW YORK COTTON EXCHANGE ;1995.11.28;    1268;      13;     103;     438;     733;     578;    1184;    1119;      84;     149
FRENCH FRANCDMARK XRATE - NEW YORK COTTON EXCHANGE ;1995.11.21;    1280;      28;      33;     445;     733;     725;    1206;    1203;      74;      77
FRENCH FRANCDMARK XRATE - NEW YORK COTTON EXCHANGE ;1995.11.14;    1245;      28;      44;     439;     723;     701;    1190;    1184;      55;      61
FRENCH FRANCDMARK XRATE - NEW YORK COTTON EXCHANGE ;1995.11.07;    1353;      30;      69;     420;     729;     699;    1179;    1188;     173;     165
FRENCH FRANCDMARK XRATE - NEW YORK COTTON EXCHANGE ;1995.10.31;    1492;      90;      87;     420;     728;     838;    1238;    1345;     254;     147
FRENCH FRANCDMARK XRATE - NEW YORK COTTON EXCHANGE ;1995.10.24;    1411;     391;     104;     411;     328;     764;    1130;    1279;     281;     132
FRENCH FRANCDMARK XRATE - NEW YORK COTTON EXCHANGE ;1995.10.17;     977;     295;     108;       2;     425;     746;     722;     856;     255;     121
FRENCH FRANCDMARK XRATE - NEW YORK COTTON EXCHANGE ;1995.10.10;     886;     162;      45;       0;     376;     712;     538;     757;     348;     129
FRENCH FRANCDMARK XRATE - NEW YORK COTTON EXCHANGE ;1995.09.12;    1227;      36;     338;       2;    1111;     704;    1149;    1044;      78;     183
FRENCH FRANCDMARK XRATE - NEW YORK COTTON EXCHANGE ;1995.09.05;     839;      31;     677;       2;     756;      28;     789;     707;      50;     132
FRENCH FRANCDMARK XRATE - NEW YORK COTTON EXCHANGE ;1995.08.29;     840;      31;     689;       2;     754;      28;     787;     719;      53;     121
FRENCH FRANCDMARK XRATE - NEW YORK COTTON EXCHANGE ;1995.08.22;    1074;      30;     911;       1;     997;      26;    1028;     938;      46;     136
FRENCH FRANCDMARK XRATE - NEW YORK COTTON EXCHANGE ;1995.08.15;    1088;      34;     911;       0;    1000;      26;    1034;     937;      54;     151
FRENCH FRANCDMARK XRATE - NEW YORK COTTON EXCHANGE ;1995.08.08;    1062;       0;     911;       0;    1002;      14;    1002;     925;      60;     137
FRENCH FRANCDMARK XRATE - NEW YORK COTTON EXCHANGE ;1995.08.01;     641;       0;     520;       0;     600;      30;     600;     550;      41;      91
FRENCH FRANCDMARK XRATE - NEW YORK COTTON EXCHANGE ;1995.07.25;     428;       0;     316;       0;     409;      28;     409;     344;      19;      84
FRENCH FRANCDMARK XRATE - NEW YORK COTTON EXCHANGE ;1995.07.18;     428;       0;     316;       0;     407;      28;     407;     344;      21;      84
FRENCH FRANCDMARK XRATE - NEW YORK COTTON EXCHANGE ;1995.07.11;     457;       0;     350;       0;     330;      25;     330;     375;     127;      82
FRENCH FRANCDMARK XRATE - NEW YORK COTTON EXCHANGE ;1995.06.13;    1479;      57;       0;       0;    1401;    1469;    1458;    1469;      21;      10
FRENCH FRANCDMARK XRATE - NEW YORK COTTON EXCHANGE ;1995.06.06;    1781;      56;       0;       0;    1592;    1767;    1648;    1767;     133;      14
FRENCH FRANCDMARK XRATE - NEW YORK COTTON EXCHANGE ;1995.05.30;    2216;     500;       0;       0;    1690;    2208;    2190;    2208;      26;       8
FRENCH FRANCDMARK XRATE - NEW YORK COTTON EXCHANGE ;1995.05.23;    2219;     500;       0;       0;    1693;    2211;    2193;    2211;      26;       8
FRENCH FRANCDMARK XRATE - NEW YORK COTTON EXCHANGE ;1995.05.16;    1877;      28;       0;       0;    1841;    1869;    1869;    1869;       8;       8
FRENCH FRANCDMARK XRATE - NEW YORK COTTON EXCHANGE ;1995.05.09;    1928;      28;       0;       0;    1835;    1909;    1863;    1909;      65;      19
FRENCH FRANCDMARK XRATE - NEW YORK COTTON EXCHANGE ;1995.05.02;    2184;     528;       0;       0;    1563;    2173;    2091;    2173;      93;      11
FRENCH FRANCDMARK XRATE - NEW YORK COTTON EXCHANGE ;1995.04.25;    2119;     526;       0;       0;    1563;    2112;    2089;    2112;      30;       7
FRENCH FRANCDMARK XRATE - NEW YORK COTTON EXCHANGE ;1995.04.18;    1998;     500;       0;       0;    1441;    1956;    1941;    1956;      57;      42
