DMARKPOUND CROSSRATE - NYCE DMBP XRATE ;1995.04.04;    1698;    1000;     333;       0;     679;    1263;    1679;    1596;      19;     102
DMARKPOUND CROSSRATE - NYCE DMBP XRATE ;1995.03.28;     914;       0;     448;       0;     881;     335;     881;     783;      33;     131
DMARKPOUND CROSSRATE - NYCE DMBP XRATE ;1995.03.21;    1147;     500;     447;       0;     580;     564;    1080;    1011;      67;     136
DMARKPOUND CROSSRATE - NYCE DMBP XRATE ;1995.04.04;    1698;    1000;     333;       0;     679;    1263;    1679;    1596;      19;     102
DMARKPOUND CROSSRATE - NYCE DMBP XRATE ;1995.03.28;     914;       0;     448;       0;     881;     335;     881;     783;      33;     131
DMARKPOUND CROSSRATE - NYCE DMBP XRATE ;1995.03.21;    1147;     500;     447;       0;     580;     564;    1080;    1011;      67;     136
DMARKPOUND CROSSRATE - NYCE DMBP XRATE ;1995.04.04;    1698;    1000;     333;       0;     679;    1263;    1679;    1596;      19;     102
DMARKPOUND CROSSRATE - NYCE DMBP XRATE ;1995.03.28;     914;       0;     448;       0;     881;     335;     881;     783;      33;     131
DMARKPOUND CROSSRATE - NYCE DMBP XRATE ;1995.03.21;    1147;     500;     447;       0;     580;     564;    1080;    1011;      67;     136
