Data;Open Interest;Noncomm Long;Noncomm Short;Operators Long;Operators Short;Nonrep Long;Nonrep Short;% Noncomm Long in OI;% Noncomm Short in OI;% Operators Long in OI;% Operators Short in OI;% Nonrep Long in OI;% Nonrep Short in OI;Net Noncomm;Net Operators;Net Nonrep;Index OI;Index Noncomm;Index Operators;Index Nonrep;WILLCO Noncomm;WILLCO Operators;WIllCO Nonrep;Movement Index OI;Movement Index Noncomm;Movement Index Operators;Movement Index Nonrep
2011.07.12;224784;60766;49158;80552;95155;57904;54909;0.27;0.22;0.36;0.42;0.26;0.24;11608;-14603;2995;2147483647.00;2147483647.00;2147483647.00;2147483647.00;2147483647.00;2147483647.00;2147483647.00;0;2147483647;2147483647;2147483647
2011.07.12;224784;35792;41262;31564;26668;58928;19858;0.16;0.18;0.14;0.12;0.26;0.09;-5470;4896;39070;2147483647.00;2147483647.00;2147483647.00;2147483647.00;2147483647.00;2147483647.00;2147483647.00;0;2147483647;2147483647;2147483647
