SULFUR FINANCIAL INSTR 2009 - CHICAGO CLIMATE FUTURES EXCHANGE ;2010.12.28;   18112;   13188;       0;       0;    4840;   18103;   18028;   18103;      84;       9
SULFUR FINANCIAL INSTR 2009 - CHICAGO CLIMATE FUTURES EXCHANGE ;2010.12.21;   19693;   14353;       0;       0;    5239;   19641;   19592;   19641;     101;      52
SULFUR FINANCIAL INSTR 2009 - CHICAGO CLIMATE FUTURES EXCHANGE ;2010.12.14;   24442;   18465;      39;       0;    5905;   24403;   24370;   24442;      72;       0
SULFUR FINANCIAL INSTR 2009 - CHICAGO CLIMATE FUTURES EXCHANGE ;2010.12.07;   24561;   18612;      39;      56;    5848;   24448;   24517;   24544;      44;      17
SULFUR FINANCIAL INSTR 2009 - CHICAGO CLIMATE FUTURES EXCHANGE ;2010.11.30;   25801;   18736;      35;      66;    6985;   25695;   25787;   25796;      14;       5
SULFUR FINANCIAL INSTR 2009 - CHICAGO CLIMATE FUTURES EXCHANGE ;2010.11.23;   25772;   18794;      36;      50;    6912;   25676;   25756;   25762;      16;      10
SULFUR FINANCIAL INSTR 2009 - CHICAGO CLIMATE FUTURES EXCHANGE ;2010.11.16;   25546;   18674;      38;      38;    6811;   25461;   25523;   25537;      23;       9
SULFUR FINANCIAL INSTR 2009 - CHICAGO CLIMATE FUTURES EXCHANGE ;2010.11.09;   25518;   18602;      42;      41;    6845;   25430;   25487;   25513;      31;       5
SULFUR FINANCIAL INSTR 2009 - CHICAGO CLIMATE FUTURES EXCHANGE ;2010.11.02;   25216;   18545;      40;      22;    6637;   25149;   25203;   25211;      13;       5
SULFUR FINANCIAL INSTR 2009 - CHICAGO CLIMATE FUTURES EXCHANGE ;2010.10.26;   24946;   17943;      39;       4;    6987;   24903;   24934;   24946;      12;      -0
SULFUR FINANCIAL INSTR 2009 - CHICAGO CLIMATE FUTURES EXCHANGE ;2010.10.19;   25699;   18206;      37;       6;    7466;   25636;   25678;   25679;      21;      20
SULFUR FINANCIAL INSTR 2009 - CHICAGO CLIMATE FUTURES EXCHANGE ;2010.10.12;   25676;   18128;      39;       4;    7529;   25627;   25661;   25670;      15;       6
SULFUR FINANCIAL INSTR 2009 - CHICAGO CLIMATE FUTURES EXCHANGE ;2010.10.05;   24098;   16741;      33;       8;    7332;   24052;   24082;   24093;      16;       5
SULFUR FINANCIAL INSTR 2009 - CHICAGO CLIMATE FUTURES EXCHANGE ;2010.09.28;   23600;   16203;      30;      14;    7322;   23534;   23539;   23578;      61;      22
SULFUR FINANCIAL INSTR 2009 - CHICAGO CLIMATE FUTURES EXCHANGE ;2010.09.21;   23131;   15656;      28;      16;    7430;   23082;   23102;   23126;      29;       5
SULFUR FINANCIAL INSTR 2009 - CHICAGO CLIMATE FUTURES EXCHANGE ;2010.09.14;   22844;   15378;      37;      14;    7421;   22787;   22813;   22839;      31;       5
SULFUR FINANCIAL INSTR 2009 - CHICAGO CLIMATE FUTURES EXCHANGE ;2010.09.07;   22195;   14575;      43;      16;    7566;   22131;   22157;   22190;      38;       5
SULFUR FINANCIAL INSTR 2009 - CHICAGO CLIMATE FUTURES EXCHANGE ;2010.08.31;   22174;   14796;      35;      25;    7276;   22090;   22097;   22149;      77;      25
SULFUR FINANCIAL INSTR 2009 - CHICAGO CLIMATE FUTURES EXCHANGE ;2010.08.24;   23235;   15037;      30;      50;    8098;   23124;   23186;   23205;      49;      30
SULFUR FINANCIAL INSTR 2009 - CHICAGO CLIMATE FUTURES EXCHANGE ;2010.08.17;   23437;   15088;      36;      86;    8226;   23315;   23400;   23437;      37;       0
SULFUR FINANCIAL INSTR 2009 - CHICAGO CLIMATE FUTURES EXCHANGE ;2010.08.10;   23630;   15064;      31;     100;    8427;   23500;   23591;   23630;      39;       0
SULFUR FINANCIAL INSTR 2009 - CHICAGO CLIMATE FUTURES EXCHANGE ;2010.08.03;   23902;   14901;      24;     150;    8822;   23725;   23872;   23898;      30;       4
SULFUR FINANCIAL INSTR 2009 - CHICAGO CLIMATE FUTURES EXCHANGE ;2010.07.27;   24065;   14935;     166;     141;    8918;   23737;   23993;   24043;      72;      22
SULFUR FINANCIAL INSTR 2009 - CHICAGO CLIMATE FUTURES EXCHANGE ;2010.07.20;   22929;   14429;     156;     156;    8051;   22372;   22636;   22685;     293;     244
SULFUR FINANCIAL INSTR 2009 - CHICAGO CLIMATE FUTURES EXCHANGE ;2010.07.13;   20768;   13920;     164;      80;    6457;   20254;   20457;   20499;     311;     269
SULFUR FINANCIAL INSTR 2009 - CHICAGO CLIMATE FUTURES EXCHANGE ;2010.07.06;   20572;   13747;     179;      39;    6499;   20116;   20285;   20334;     287;     238
SULFUR FINANCIAL INSTR 2009 - CHICAGO CLIMATE FUTURES EXCHANGE ;2010.06.29;   21863;   14066;     157;     108;    7601;   21543;   21775;   21808;      88;      55
SULFUR FINANCIAL INSTR 2009 - CHICAGO CLIMATE FUTURES EXCHANGE ;2010.06.22;   21447;   14512;     175;     112;    6738;   21119;   21362;   21406;      85;      41
SULFUR FINANCIAL INSTR 2009 - CHICAGO CLIMATE FUTURES EXCHANGE ;2010.06.15;   29179;   21336;    6706;     196;    7560;   22262;   29092;   29164;      87;      15
SULFUR FINANCIAL INSTR 2009 - CHICAGO CLIMATE FUTURES EXCHANGE ;2010.06.08;   30120;   21583;    6742;     268;    8180;   23077;   30031;   30087;      89;      33
SULFUR FINANCIAL INSTR 2009 - CHICAGO CLIMATE FUTURES EXCHANGE ;2010.06.01;   30681;   21911;    6736;     298;    8378;   23619;   30587;   30653;      94;      28
SULFUR FINANCIAL INSTR 2009 - CHICAGO CLIMATE FUTURES EXCHANGE ;2010.05.25;   31239;   21975;    6825;     311;    8741;   23966;   31027;   31102;     212;     137
SULFUR FINANCIAL INSTR 2009 - CHICAGO CLIMATE FUTURES EXCHANGE ;2010.05.18;   31301;   22192;    7067;      65;    8968;   24154;   31224;   31285;      77;      16
SULFUR FINANCIAL INSTR 2009 - CHICAGO CLIMATE FUTURES EXCHANGE ;2010.05.11;   30126;   22191;    7064;      62;    7792;   22992;   30046;   30119;      80;       7
SULFUR FINANCIAL INSTR 2009 - CHICAGO CLIMATE FUTURES EXCHANGE ;2010.05.04;   31779;   22821;    7206;     187;    8679;   24361;   31688;   31755;      91;      24
SULFUR FINANCIAL INSTR 2009 - CHICAGO CLIMATE FUTURES EXCHANGE ;2010.04.27;   33694;   22967;    7326;     414;   10223;   25921;   33603;   33661;      91;      33
SULFUR FINANCIAL INSTR 2009 - CHICAGO CLIMATE FUTURES EXCHANGE ;2010.04.20;   30681;   22265;    7133;     373;    7925;   23135;   30563;   30641;     118;      40
SULFUR FINANCIAL INSTR 2009 - CHICAGO CLIMATE FUTURES EXCHANGE ;2010.04.13;   25362;   20715;    6894;     175;    4390;   18270;   25280;   25339;      82;      23
SULFUR FINANCIAL INSTR 2009 - CHICAGO CLIMATE FUTURES EXCHANGE ;2010.04.06;   25245;   19869;    6881;     391;    4956;   17968;   25216;   25240;      29;       5
SULFUR FINANCIAL INSTR 2009 - CHICAGO CLIMATE FUTURES EXCHANGE ;2010.03.30;   26183;   18288;    5387;    1962;    5549;   18482;   25798;   25831;     385;     352
SULFUR FINANCIAL INSTR 2009 - CHICAGO CLIMATE FUTURES EXCHANGE ;2010.03.23;   25181;   18282;    5514;    2054;    4780;   17600;   25116;   25168;      65;      13
SULFUR FINANCIAL INSTR 2009 - CHICAGO CLIMATE FUTURES EXCHANGE ;2010.03.16;   25189;   18601;    5493;    1849;    4318;   17489;   24768;   24831;     421;     358
SULFUR FINANCIAL INSTR 2009 - CHICAGO CLIMATE FUTURES EXCHANGE ;2010.03.09;   24968;   17767;    4882;    2337;    4745;   17675;   24849;   24893;     119;      75
SULFUR FINANCIAL INSTR 2009 - CHICAGO CLIMATE FUTURES EXCHANGE ;2010.03.02;   25356;   16847;    4863;    2877;    5578;   17607;   25302;   25347;      54;       9
SULFUR FINANCIAL INSTR 2009 - CHICAGO CLIMATE FUTURES EXCHANGE ;2010.02.23;   24223;   16058;    5118;    2512;    5525;   16511;   24094;   24140;     129;      83
SULFUR FINANCIAL INSTR 2009 - CHICAGO CLIMATE FUTURES EXCHANGE ;2010.02.16;   18953;   15518;    7160;     722;    2632;   11023;   18872;   18905;      81;      48
SULFUR FINANCIAL INSTR 2009 - CHICAGO CLIMATE FUTURES EXCHANGE ;2010.02.09;   18625;   15384;    6954;     739;    2399;   10846;   18522;   18539;     103;      86
SULFUR FINANCIAL INSTR 2009 - CHICAGO CLIMATE FUTURES EXCHANGE ;2010.02.02;   17460;   14340;    7660;     735;    2305;    8935;   17380;   17330;      80;     130
SULFUR FINANCIAL INSTR 2009 - CHICAGO CLIMATE FUTURES EXCHANGE ;2010.01.26;   13742;   11347;    7205;     799;    1596;    5707;   13742;   13711;       0;      31
SULFUR FINANCIAL INSTR 2009 - CHICAGO CLIMATE FUTURES EXCHANGE ;2010.01.19;   13057;   10989;    7304;     580;    1483;    5150;   13052;   13034;       5;      23
SULFUR FINANCIAL INSTR 2009 - CHICAGO CLIMATE FUTURES EXCHANGE ;2010.12.28;   18112;   13188;       0;       0;    4840;   18103;   18028;   18103;      84;       9
SULFUR FINANCIAL INSTR 2009 - CHICAGO CLIMATE FUTURES EXCHANGE ;2010.12.21;   19693;   14353;       0;       0;    5239;   19641;   19592;   19641;     101;      52
SULFUR FINANCIAL INSTR 2009 - CHICAGO CLIMATE FUTURES EXCHANGE ;2010.12.14;   24442;   18465;      39;       0;    5905;   24403;   24370;   24442;      72;       0
SULFUR FINANCIAL INSTR 2009 - CHICAGO CLIMATE FUTURES EXCHANGE ;2010.12.07;   24561;   18612;      39;      56;    5848;   24448;   24517;   24544;      44;      17
SULFUR FINANCIAL INSTR 2009 - CHICAGO CLIMATE FUTURES EXCHANGE ;2010.11.30;   25801;   18736;      35;      66;    6985;   25695;   25787;   25796;      14;       5
SULFUR FINANCIAL INSTR 2009 - CHICAGO CLIMATE FUTURES EXCHANGE ;2010.11.23;   25772;   18794;      36;      50;    6912;   25676;   25756;   25762;      16;      10
SULFUR FINANCIAL INSTR 2009 - CHICAGO CLIMATE FUTURES EXCHANGE ;2010.11.16;   25546;   18674;      38;      38;    6811;   25461;   25523;   25537;      23;       9
SULFUR FINANCIAL INSTR 2009 - CHICAGO CLIMATE FUTURES EXCHANGE ;2010.11.09;   25518;   18602;      42;      41;    6845;   25430;   25487;   25513;      31;       5
SULFUR FINANCIAL INSTR 2009 - CHICAGO CLIMATE FUTURES EXCHANGE ;2010.11.02;   25216;   18545;      40;      22;    6637;   25149;   25203;   25211;      13;       5
SULFUR FINANCIAL INSTR 2009 - CHICAGO CLIMATE FUTURES EXCHANGE ;2010.10.26;   24946;   17943;      39;       4;    6987;   24903;   24934;   24946;      12;      -0
SULFUR FINANCIAL INSTR 2009 - CHICAGO CLIMATE FUTURES EXCHANGE ;2010.10.19;   25699;   18206;      37;       6;    7466;   25636;   25678;   25679;      21;      20
SULFUR FINANCIAL INSTR 2009 - CHICAGO CLIMATE FUTURES EXCHANGE ;2010.10.12;   25676;   18128;      39;       4;    7529;   25627;   25661;   25670;      15;       6
SULFUR FINANCIAL INSTR 2009 - CHICAGO CLIMATE FUTURES EXCHANGE ;2010.10.05;   24098;   16741;      33;       8;    7332;   24052;   24082;   24093;      16;       5
SULFUR FINANCIAL INSTR 2009 - CHICAGO CLIMATE FUTURES EXCHANGE ;2010.09.28;   23600;   16203;      30;      14;    7322;   23534;   23539;   23578;      61;      22
SULFUR FINANCIAL INSTR 2009 - CHICAGO CLIMATE FUTURES EXCHANGE ;2010.09.21;   23131;   15656;      28;      16;    7430;   23082;   23102;   23126;      29;       5
SULFUR FINANCIAL INSTR 2009 - CHICAGO CLIMATE FUTURES EXCHANGE ;2010.09.14;   22844;   15378;      37;      14;    7421;   22787;   22813;   22839;      31;       5
SULFUR FINANCIAL INSTR 2009 - CHICAGO CLIMATE FUTURES EXCHANGE ;2010.09.07;   22195;   14575;      43;      16;    7566;   22131;   22157;   22190;      38;       5
SULFUR FINANCIAL INSTR 2009 - CHICAGO CLIMATE FUTURES EXCHANGE ;2010.08.31;   22174;   14796;      35;      25;    7276;   22090;   22097;   22149;      77;      25
SULFUR FINANCIAL INSTR 2009 - CHICAGO CLIMATE FUTURES EXCHANGE ;2010.08.24;   23235;   15037;      30;      50;    8098;   23124;   23186;   23205;      49;      30
SULFUR FINANCIAL INSTR 2009 - CHICAGO CLIMATE FUTURES EXCHANGE ;2010.08.17;   23437;   15088;      36;      86;    8226;   23315;   23400;   23437;      37;       0
SULFUR FINANCIAL INSTR 2009 - CHICAGO CLIMATE FUTURES EXCHANGE ;2010.08.10;   23630;   15064;      31;     100;    8427;   23500;   23591;   23630;      39;       0
SULFUR FINANCIAL INSTR 2009 - CHICAGO CLIMATE FUTURES EXCHANGE ;2010.08.03;   23902;   14901;      24;     150;    8822;   23725;   23872;   23898;      30;       4
SULFUR FINANCIAL INSTR 2009 - CHICAGO CLIMATE FUTURES EXCHANGE ;2010.07.27;   24065;   14935;     166;     141;    8918;   23737;   23993;   24043;      72;      22
SULFUR FINANCIAL INSTR 2009 - CHICAGO CLIMATE FUTURES EXCHANGE ;2010.07.20;   22929;   14429;     156;     156;    8051;   22372;   22636;   22685;     293;     244
SULFUR FINANCIAL INSTR 2009 - CHICAGO CLIMATE FUTURES EXCHANGE ;2010.07.13;   20768;   13920;     164;      80;    6457;   20254;   20457;   20499;     311;     269
SULFUR FINANCIAL INSTR 2009 - CHICAGO CLIMATE FUTURES EXCHANGE ;2010.07.06;   20572;   13747;     179;      39;    6499;   20116;   20285;   20334;     287;     238
SULFUR FINANCIAL INSTR 2009 - CHICAGO CLIMATE FUTURES EXCHANGE ;2010.06.29;   21863;   14066;     157;     108;    7601;   21543;   21775;   21808;      88;      55
SULFUR FINANCIAL INSTR 2009 - CHICAGO CLIMATE FUTURES EXCHANGE ;2010.06.22;   21447;   14512;     175;     112;    6738;   21119;   21362;   21406;      85;      41
SULFUR FINANCIAL INSTR 2009 - CHICAGO CLIMATE FUTURES EXCHANGE ;2010.06.15;   29179;   21336;    6706;     196;    7560;   22262;   29092;   29164;      87;      15
SULFUR FINANCIAL INSTR 2009 - CHICAGO CLIMATE FUTURES EXCHANGE ;2010.06.08;   30120;   21583;    6742;     268;    8180;   23077;   30031;   30087;      89;      33
SULFUR FINANCIAL INSTR 2009 - CHICAGO CLIMATE FUTURES EXCHANGE ;2010.06.01;   30681;   21911;    6736;     298;    8378;   23619;   30587;   30653;      94;      28
SULFUR FINANCIAL INSTR 2009 - CHICAGO CLIMATE FUTURES EXCHANGE ;2010.05.25;   31239;   21975;    6825;     311;    8741;   23966;   31027;   31102;     212;     137
SULFUR FINANCIAL INSTR 2009 - CHICAGO CLIMATE FUTURES EXCHANGE ;2010.05.18;   31301;   22192;    7067;      65;    8968;   24154;   31224;   31285;      77;      16
SULFUR FINANCIAL INSTR 2009 - CHICAGO CLIMATE FUTURES EXCHANGE ;2010.05.11;   30126;   22191;    7064;      62;    7792;   22992;   30046;   30119;      80;       7
SULFUR FINANCIAL INSTR 2009 - CHICAGO CLIMATE FUTURES EXCHANGE ;2010.05.04;   31779;   22821;    7206;     187;    8679;   24361;   31688;   31755;      91;      24
SULFUR FINANCIAL INSTR 2009 - CHICAGO CLIMATE FUTURES EXCHANGE ;2010.04.27;   33694;   22967;    7326;     414;   10223;   25921;   33603;   33661;      91;      33
SULFUR FINANCIAL INSTR 2009 - CHICAGO CLIMATE FUTURES EXCHANGE ;2010.04.20;   30681;   22265;    7133;     373;    7925;   23135;   30563;   30641;     118;      40
SULFUR FINANCIAL INSTR 2009 - CHICAGO CLIMATE FUTURES EXCHANGE ;2010.04.13;   25362;   20715;    6894;     175;    4390;   18270;   25280;   25339;      82;      23
SULFUR FINANCIAL INSTR 2009 - CHICAGO CLIMATE FUTURES EXCHANGE ;2010.04.06;   25245;   19869;    6881;     391;    4956;   17968;   25216;   25240;      29;       5
SULFUR FINANCIAL INSTR 2009 - CHICAGO CLIMATE FUTURES EXCHANGE ;2010.03.30;   26183;   18288;    5387;    1962;    5549;   18482;   25798;   25831;     385;     352
SULFUR FINANCIAL INSTR 2009 - CHICAGO CLIMATE FUTURES EXCHANGE ;2010.03.23;   25181;   18282;    5514;    2054;    4780;   17600;   25116;   25168;      65;      13
SULFUR FINANCIAL INSTR 2009 - CHICAGO CLIMATE FUTURES EXCHANGE ;2010.03.16;   25189;   18601;    5493;    1849;    4318;   17489;   24768;   24831;     421;     358
SULFUR FINANCIAL INSTR 2009 - CHICAGO CLIMATE FUTURES EXCHANGE ;2010.03.09;   24968;   17767;    4882;    2337;    4745;   17675;   24849;   24893;     119;      75
SULFUR FINANCIAL INSTR 2009 - CHICAGO CLIMATE FUTURES EXCHANGE ;2010.03.02;   25356;   16847;    4863;    2877;    5578;   17607;   25302;   25347;      54;       9
SULFUR FINANCIAL INSTR 2009 - CHICAGO CLIMATE FUTURES EXCHANGE ;2010.02.23;   24223;   16058;    5118;    2512;    5525;   16511;   24094;   24140;     129;      83
SULFUR FINANCIAL INSTR 2009 - CHICAGO CLIMATE FUTURES EXCHANGE ;2010.02.16;   18953;   15518;    7160;     722;    2632;   11023;   18872;   18905;      81;      48
SULFUR FINANCIAL INSTR 2009 - CHICAGO CLIMATE FUTURES EXCHANGE ;2010.02.09;   18625;   15384;    6954;     739;    2399;   10846;   18522;   18539;     103;      86
SULFUR FINANCIAL INSTR 2009 - CHICAGO CLIMATE FUTURES EXCHANGE ;2010.02.02;   17460;   14340;    7660;     735;    2305;    8935;   17380;   17330;      80;     130
SULFUR FINANCIAL INSTR 2009 - CHICAGO CLIMATE FUTURES EXCHANGE ;2010.01.26;   13742;   11347;    7205;     799;    1596;    5707;   13742;   13711;       0;      31
SULFUR FINANCIAL INSTR 2009 - CHICAGO CLIMATE FUTURES EXCHANGE ;2010.01.19;   13057;   10989;    7304;     580;    1483;    5150;   13052;   13034;       5;      23
SULFUR FINANCIAL INSTR 2009 - CHICAGO CLIMATE FUTURES EXCHANGE ;2010.12.28;   18112;   13188;       0;       0;    4840;   18103;   18028;   18103;      84;       9
SULFUR FINANCIAL INSTR 2009 - CHICAGO CLIMATE FUTURES EXCHANGE ;2010.12.21;   19693;   14353;       0;       0;    5239;   19641;   19592;   19641;     101;      52
SULFUR FINANCIAL INSTR 2009 - CHICAGO CLIMATE FUTURES EXCHANGE ;2010.12.14;   24442;   18465;      39;       0;    5905;   24403;   24370;   24442;      72;       0
SULFUR FINANCIAL INSTR 2009 - CHICAGO CLIMATE FUTURES EXCHANGE ;2010.12.07;   24561;   18612;      39;      56;    5848;   24448;   24517;   24544;      44;      17
SULFUR FINANCIAL INSTR 2009 - CHICAGO CLIMATE FUTURES EXCHANGE ;2010.11.30;   25801;   18736;      35;      66;    6985;   25695;   25787;   25796;      14;       5
SULFUR FINANCIAL INSTR 2009 - CHICAGO CLIMATE FUTURES EXCHANGE ;2010.11.23;   25772;   18794;      36;      50;    6912;   25676;   25756;   25762;      16;      10
SULFUR FINANCIAL INSTR 2009 - CHICAGO CLIMATE FUTURES EXCHANGE ;2010.11.16;   25546;   18674;      38;      38;    6811;   25461;   25523;   25537;      23;       9
SULFUR FINANCIAL INSTR 2009 - CHICAGO CLIMATE FUTURES EXCHANGE ;2010.11.09;   25518;   18602;      42;      41;    6845;   25430;   25487;   25513;      31;       5
SULFUR FINANCIAL INSTR 2009 - CHICAGO CLIMATE FUTURES EXCHANGE ;2010.11.02;   25216;   18545;      40;      22;    6637;   25149;   25203;   25211;      13;       5
SULFUR FINANCIAL INSTR 2009 - CHICAGO CLIMATE FUTURES EXCHANGE ;2010.10.26;   24946;   17943;      39;       4;    6987;   24903;   24934;   24946;      12;      -0
SULFUR FINANCIAL INSTR 2009 - CHICAGO CLIMATE FUTURES EXCHANGE ;2010.10.19;   25699;   18206;      37;       6;    7466;   25636;   25678;   25679;      21;      20
SULFUR FINANCIAL INSTR 2009 - CHICAGO CLIMATE FUTURES EXCHANGE ;2010.10.12;   25676;   18128;      39;       4;    7529;   25627;   25661;   25670;      15;       6
SULFUR FINANCIAL INSTR 2009 - CHICAGO CLIMATE FUTURES EXCHANGE ;2010.10.05;   24098;   16741;      33;       8;    7332;   24052;   24082;   24093;      16;       5
SULFUR FINANCIAL INSTR 2009 - CHICAGO CLIMATE FUTURES EXCHANGE ;2010.09.28;   23600;   16203;      30;      14;    7322;   23534;   23539;   23578;      61;      22
SULFUR FINANCIAL INSTR 2009 - CHICAGO CLIMATE FUTURES EXCHANGE ;2010.09.21;   23131;   15656;      28;      16;    7430;   23082;   23102;   23126;      29;       5
SULFUR FINANCIAL INSTR 2009 - CHICAGO CLIMATE FUTURES EXCHANGE ;2010.09.14;   22844;   15378;      37;      14;    7421;   22787;   22813;   22839;      31;       5
SULFUR FINANCIAL INSTR 2009 - CHICAGO CLIMATE FUTURES EXCHANGE ;2010.09.07;   22195;   14575;      43;      16;    7566;   22131;   22157;   22190;      38;       5
SULFUR FINANCIAL INSTR 2009 - CHICAGO CLIMATE FUTURES EXCHANGE ;2010.08.31;   22174;   14796;      35;      25;    7276;   22090;   22097;   22149;      77;      25
SULFUR FINANCIAL INSTR 2009 - CHICAGO CLIMATE FUTURES EXCHANGE ;2010.08.24;   23235;   15037;      30;      50;    8098;   23124;   23186;   23205;      49;      30
SULFUR FINANCIAL INSTR 2009 - CHICAGO CLIMATE FUTURES EXCHANGE ;2010.08.17;   23437;   15088;      36;      86;    8226;   23315;   23400;   23437;      37;       0
SULFUR FINANCIAL INSTR 2009 - CHICAGO CLIMATE FUTURES EXCHANGE ;2010.08.10;   23630;   15064;      31;     100;    8427;   23500;   23591;   23630;      39;       0
SULFUR FINANCIAL INSTR 2009 - CHICAGO CLIMATE FUTURES EXCHANGE ;2010.08.03;   23902;   14901;      24;     150;    8822;   23725;   23872;   23898;      30;       4
SULFUR FINANCIAL INSTR 2009 - CHICAGO CLIMATE FUTURES EXCHANGE ;2010.07.27;   24065;   14935;     166;     141;    8918;   23737;   23993;   24043;      72;      22
SULFUR FINANCIAL INSTR 2009 - CHICAGO CLIMATE FUTURES EXCHANGE ;2010.07.20;   22929;   14429;     156;     156;    8051;   22372;   22636;   22685;     293;     244
SULFUR FINANCIAL INSTR 2009 - CHICAGO CLIMATE FUTURES EXCHANGE ;2010.07.13;   20768;   13920;     164;      80;    6457;   20254;   20457;   20499;     311;     269
SULFUR FINANCIAL INSTR 2009 - CHICAGO CLIMATE FUTURES EXCHANGE ;2010.07.06;   20572;   13747;     179;      39;    6499;   20116;   20285;   20334;     287;     238
SULFUR FINANCIAL INSTR 2009 - CHICAGO CLIMATE FUTURES EXCHANGE ;2010.06.29;   21863;   14066;     157;     108;    7601;   21543;   21775;   21808;      88;      55
SULFUR FINANCIAL INSTR 2009 - CHICAGO CLIMATE FUTURES EXCHANGE ;2010.06.22;   21447;   14512;     175;     112;    6738;   21119;   21362;   21406;      85;      41
SULFUR FINANCIAL INSTR 2009 - CHICAGO CLIMATE FUTURES EXCHANGE ;2010.06.15;   29179;   21336;    6706;     196;    7560;   22262;   29092;   29164;      87;      15
SULFUR FINANCIAL INSTR 2009 - CHICAGO CLIMATE FUTURES EXCHANGE ;2010.06.08;   30120;   21583;    6742;     268;    8180;   23077;   30031;   30087;      89;      33
SULFUR FINANCIAL INSTR 2009 - CHICAGO CLIMATE FUTURES EXCHANGE ;2010.06.01;   30681;   21911;    6736;     298;    8378;   23619;   30587;   30653;      94;      28
SULFUR FINANCIAL INSTR 2009 - CHICAGO CLIMATE FUTURES EXCHANGE ;2010.05.25;   31239;   21975;    6825;     311;    8741;   23966;   31027;   31102;     212;     137
SULFUR FINANCIAL INSTR 2009 - CHICAGO CLIMATE FUTURES EXCHANGE ;2010.05.18;   31301;   22192;    7067;      65;    8968;   24154;   31224;   31285;      77;      16
SULFUR FINANCIAL INSTR 2009 - CHICAGO CLIMATE FUTURES EXCHANGE ;2010.05.11;   30126;   22191;    7064;      62;    7792;   22992;   30046;   30119;      80;       7
SULFUR FINANCIAL INSTR 2009 - CHICAGO CLIMATE FUTURES EXCHANGE ;2010.05.04;   31779;   22821;    7206;     187;    8679;   24361;   31688;   31755;      91;      24
SULFUR FINANCIAL INSTR 2009 - CHICAGO CLIMATE FUTURES EXCHANGE ;2010.04.27;   33694;   22967;    7326;     414;   10223;   25921;   33603;   33661;      91;      33
SULFUR FINANCIAL INSTR 2009 - CHICAGO CLIMATE FUTURES EXCHANGE ;2010.04.20;   30681;   22265;    7133;     373;    7925;   23135;   30563;   30641;     118;      40
SULFUR FINANCIAL INSTR 2009 - CHICAGO CLIMATE FUTURES EXCHANGE ;2010.04.13;   25362;   20715;    6894;     175;    4390;   18270;   25280;   25339;      82;      23
SULFUR FINANCIAL INSTR 2009 - CHICAGO CLIMATE FUTURES EXCHANGE ;2010.04.06;   25245;   19869;    6881;     391;    4956;   17968;   25216;   25240;      29;       5
SULFUR FINANCIAL INSTR 2009 - CHICAGO CLIMATE FUTURES EXCHANGE ;2010.03.30;   26183;   18288;    5387;    1962;    5549;   18482;   25798;   25831;     385;     352
SULFUR FINANCIAL INSTR 2009 - CHICAGO CLIMATE FUTURES EXCHANGE ;2010.03.23;   25181;   18282;    5514;    2054;    4780;   17600;   25116;   25168;      65;      13
SULFUR FINANCIAL INSTR 2009 - CHICAGO CLIMATE FUTURES EXCHANGE ;2010.03.16;   25189;   18601;    5493;    1849;    4318;   17489;   24768;   24831;     421;     358
SULFUR FINANCIAL INSTR 2009 - CHICAGO CLIMATE FUTURES EXCHANGE ;2010.03.09;   24968;   17767;    4882;    2337;    4745;   17675;   24849;   24893;     119;      75
SULFUR FINANCIAL INSTR 2009 - CHICAGO CLIMATE FUTURES EXCHANGE ;2010.03.02;   25356;   16847;    4863;    2877;    5578;   17607;   25302;   25347;      54;       9
SULFUR FINANCIAL INSTR 2009 - CHICAGO CLIMATE FUTURES EXCHANGE ;2010.02.23;   24223;   16058;    5118;    2512;    5525;   16511;   24094;   24140;     129;      83
SULFUR FINANCIAL INSTR 2009 - CHICAGO CLIMATE FUTURES EXCHANGE ;2010.02.16;   18953;   15518;    7160;     722;    2632;   11023;   18872;   18905;      81;      48
SULFUR FINANCIAL INSTR 2009 - CHICAGO CLIMATE FUTURES EXCHANGE ;2010.02.09;   18625;   15384;    6954;     739;    2399;   10846;   18522;   18539;     103;      86
SULFUR FINANCIAL INSTR 2009 - CHICAGO CLIMATE FUTURES EXCHANGE ;2010.02.02;   17460;   14340;    7660;     735;    2305;    8935;   17380;   17330;      80;     130
SULFUR FINANCIAL INSTR 2009 - CHICAGO CLIMATE FUTURES EXCHANGE ;2010.01.26;   13742;   11347;    7205;     799;    1596;    5707;   13742;   13711;       0;      31
SULFUR FINANCIAL INSTR 2009 - CHICAGO CLIMATE FUTURES EXCHANGE ;2010.01.19;   13057;   10989;    7304;     580;    1483;    5150;   13052;   13034;       5;      23
