NYISO ZONE G LBMP SWAP - NEW YORK MERCANTILE EXCHANGE ;2007.03.27;   15056;     852;       0;       0;   14161;   14865;   15013;   14865;      43;     191
NYISO ZONE G LBMP SWAP - NEW YORK MERCANTILE EXCHANGE ;2007.03.20;   15056;     852;       0;       0;   14161;   14865;   15013;   14865;      43;     191
NYISO ZONE G LBMP SWAP - NEW YORK MERCANTILE EXCHANGE ;2007.03.13;   15056;     852;       0;       0;   14161;   14865;   15013;   14865;      43;     191
NYISO ZONE G LBMP SWAP - NEW YORK MERCANTILE EXCHANGE ;2007.03.06;   15056;     852;       0;       0;   14161;   14865;   15013;   14865;      43;     191
NYISO ZONE G LBMP SWAP - NEW YORK MERCANTILE EXCHANGE ;2007.02.27;   15960;     932;       0;       0;   15028;   15749;   15960;   15749;       0;     211
NYISO ZONE G LBMP SWAP - NEW YORK MERCANTILE EXCHANGE ;2007.02.20;   16234;     932;       0;       0;   15239;   16023;   16171;   16023;      63;     211
NYISO ZONE G LBMP SWAP - NEW YORK MERCANTILE EXCHANGE ;2007.02.13;   16234;     932;       0;       0;   15239;   16001;   16171;   16001;      63;     233
NYISO ZONE G LBMP SWAP - NEW YORK MERCANTILE EXCHANGE ;2006.12.26;   17728;    1180;       0;       0;   16505;   17728;   17685;   17728;      43;       0
NYISO ZONE G LBMP SWAP - NEW YORK MERCANTILE EXCHANGE ;2006.12.19;   17728;    1180;       0;       0;   16505;   17728;   17685;   17728;      43;       0
NYISO ZONE G LBMP SWAP - NEW YORK MERCANTILE EXCHANGE ;2006.12.12;   17728;    1180;       0;       0;   16505;   17728;   17685;   17728;      43;       0
NYISO ZONE G LBMP SWAP - NEW YORK MERCANTILE EXCHANGE ;2006.12.05;   17728;    1268;       0;       0;   16417;   17728;   17685;   17728;      43;       0
NYISO ZONE G LBMP SWAP - NEW YORK MERCANTILE EXCHANGE ;2006.11.28;   18463;    1348;       0;       0;   17072;   18463;   18420;   18463;      43;       0
NYISO ZONE G LBMP SWAP - NEW YORK MERCANTILE EXCHANGE ;2006.11.21;   18463;    1348;       0;       0;   17072;   18463;   18420;   18463;      43;       0
NYISO ZONE G LBMP SWAP - NEW YORK MERCANTILE EXCHANGE ;2006.11.14;   18463;    1348;       0;       0;   17072;   18463;   18420;   18463;      43;       0
NYISO ZONE G LBMP SWAP - NEW YORK MERCANTILE EXCHANGE ;2006.11.07;   18375;    1348;       0;       0;   16984;   18375;   18332;   18375;      43;       0
NYISO ZONE G LBMP SWAP - NEW YORK MERCANTILE EXCHANGE ;2006.10.31;   19101;    1524;       0;       0;   17534;   19101;   19058;   19101;      43;       0
NYISO ZONE G LBMP SWAP - NEW YORK MERCANTILE EXCHANGE ;2006.10.24;   19013;    1524;       0;       0;   17446;   19013;   18970;   19013;      43;       0
NYISO ZONE G LBMP SWAP - NEW YORK MERCANTILE EXCHANGE ;2006.10.17;   19013;    1524;       0;       0;   17446;   19013;   18970;   19013;      43;       0
NYISO ZONE G LBMP SWAP - NEW YORK MERCANTILE EXCHANGE ;2006.10.10;   19141;    1524;       0;       0;   17574;   19141;   19098;   19141;      43;       0
NYISO ZONE G LBMP SWAP - NEW YORK MERCANTILE EXCHANGE ;2006.10.03;   19227;    1524;       0;       0;   17660;   19227;   19184;   19227;      43;       0
NYISO ZONE G LBMP SWAP - NEW YORK MERCANTILE EXCHANGE ;2006.09.26;   19355;    1684;      80;       0;   17628;   19275;   19312;   19355;      43;       0
NYISO ZONE G LBMP SWAP - NEW YORK MERCANTILE EXCHANGE ;2006.09.19;   18845;    1684;      80;       0;   17118;   18765;   18802;   18845;      43;       0
NYISO ZONE G LBMP SWAP - NEW YORK MERCANTILE EXCHANGE ;2006.09.12;   18845;    1684;      80;       0;   17161;   18765;   18845;   18845;       0;       0
NYISO ZONE G LBMP SWAP - NEW YORK MERCANTILE EXCHANGE ;2006.09.05;   18845;    1684;      80;       0;   17161;   18765;   18845;   18845;       0;       0
NYISO ZONE G LBMP SWAP - NEW YORK MERCANTILE EXCHANGE ;2006.08.29;   20202;    1845;     172;      69;   18288;   19961;   20202;   20202;       0;       0
NYISO ZONE G LBMP SWAP - NEW YORK MERCANTILE EXCHANGE ;2006.08.22;   20202;    1845;     172;      69;   18288;   19961;   20202;   20202;       0;       0
NYISO ZONE G LBMP SWAP - NEW YORK MERCANTILE EXCHANGE ;2006.08.15;   20248;    1845;     172;      69;   18288;   19961;   20202;   20202;      46;      46
NYISO ZONE G LBMP SWAP - NEW YORK MERCANTILE EXCHANGE ;2006.08.08;   16374;    1845;     172;      69;   14460;   16133;   16374;   16374;       0;       0
NYISO ZONE G LBMP SWAP - NEW YORK MERCANTILE EXCHANGE ;2006.08.01;   17634;    2065;     252;     129;   15440;   17093;   17634;   17474;       0;     160
NYISO ZONE G LBMP SWAP - NEW YORK MERCANTILE EXCHANGE ;2006.07.25;   17425;    2065;     252;     129;   15231;   17044;   17425;   17425;       0;       0
NYISO ZONE G LBMP SWAP - NEW YORK MERCANTILE EXCHANGE ;2006.07.18;   17425;    2065;     252;     129;   15231;   17044;   17425;   17425;       0;       0
NYISO ZONE G LBMP SWAP - NEW YORK MERCANTILE EXCHANGE ;2006.07.11;   16022;    2065;     252;     129;   13828;   15641;   16022;   16022;       0;       0
NYISO ZONE G LBMP SWAP - NEW YORK MERCANTILE EXCHANGE ;2006.07.03;   16946;    2285;     340;     129;   14488;   16477;   16902;   16946;      44;       0
NYISO ZONE G LBMP SWAP - NEW YORK MERCANTILE EXCHANGE ;2006.06.27;   16866;    2205;     340;     129;   14532;   16397;   16866;   16866;       0;       0
NYISO ZONE G LBMP SWAP - NEW YORK MERCANTILE EXCHANGE ;2006.06.20;   17419;    2377;     512;       0;   15042;   16907;   17419;   17419;       0;       0
NYISO ZONE G LBMP SWAP - NEW YORK MERCANTILE EXCHANGE ;2006.06.13;   15172;    3053;     512;       0;   12119;   14660;   15172;   15172;       0;       0
NYISO ZONE G LBMP SWAP - NEW YORK MERCANTILE EXCHANGE ;2006.06.06;   15132;    3053;     598;       0;   11993;   14448;   15046;   15046;      86;      86
NYISO ZONE G LBMP SWAP - NEW YORK MERCANTILE EXCHANGE ;2006.05.30;   16091;    2966;     644;     308;   12643;   15053;   15917;   16005;     174;      86
NYISO ZONE G LBMP SWAP - NEW YORK MERCANTILE EXCHANGE ;2006.05.23;   16109;    2966;     644;     308;   12835;   15157;   16109;   16109;       0;       0
NYISO ZONE G LBMP SWAP - NEW YORK MERCANTILE EXCHANGE ;2006.05.16;   15383;    2966;     600;     308;   12109;   14475;   15383;   15383;       0;       0
NYISO ZONE G LBMP SWAP - NEW YORK MERCANTILE EXCHANGE ;2006.05.09;   15361;    2966;     600;     308;   12087;   14453;   15361;   15361;       0;       0
NYISO ZONE G LBMP SWAP - NEW YORK MERCANTILE EXCHANGE ;2006.05.02;   15301;    2966;     600;     308;   12027;   14393;   15301;   15301;       0;       0
NYISO ZONE G LBMP SWAP - NEW YORK MERCANTILE EXCHANGE ;2006.04.25;   16431;    3326;     760;     308;   12797;   15363;   16431;   16431;       0;       0
NYISO ZONE G LBMP SWAP - NEW YORK MERCANTILE EXCHANGE ;2006.04.18;   15281;    2614;    1024;       0;   12532;   14257;   15146;   15281;     135;       0
NYISO ZONE G LBMP SWAP - NEW YORK MERCANTILE EXCHANGE ;2006.04.11;   14474;    2614;     980;       0;   11670;   13494;   14284;   14474;     190;       0
NYISO ZONE G LBMP SWAP - NEW YORK MERCANTILE EXCHANGE ;2006.04.04;   14210;    2614;     804;       0;   11406;   13406;   14020;   14210;     190;       0
NYISO ZONE G LBMP SWAP - NEW YORK MERCANTILE EXCHANGE ;2006.03.28;   14791;    4156;     808;    1323;    9099;   12660;   14578;   14791;     213;       0
NYISO ZONE G LBMP SWAP - NEW YORK MERCANTILE EXCHANGE ;2006.03.21;   13907;    4325;     808;    1323;    8046;   11138;   13694;   13269;     213;     638
NYISO ZONE G LBMP SWAP - NEW YORK MERCANTILE EXCHANGE ;2006.03.14;   13203;    3775;     768;    1323;    7892;   11112;   12990;   13203;     213;       0
NYISO ZONE G LBMP SWAP - NEW YORK MERCANTILE EXCHANGE ;2006.03.07;   12935;    3571;     728;    1367;    7784;   10541;   12722;   12636;     213;     299
NYISO ZONE G LBMP SWAP - NEW YORK MERCANTILE EXCHANGE ;2006.02.28;   13935;    3311;     968;    1707;    8664;   11260;   13682;   13935;     253;       0
NYISO ZONE G LBMP SWAP - NEW YORK MERCANTILE EXCHANGE ;2006.02.21;   13868;    2801;     968;    1707;    8641;   10727;   13149;   13402;     719;     466
NYISO ZONE G LBMP SWAP - NEW YORK MERCANTILE EXCHANGE ;2006.02.14;   12552;    2122;    2500;     430;    9281;    9156;   11833;   12086;     719;     466
NYISO ZONE G LBMP SWAP - NEW YORK MERCANTILE EXCHANGE ;2006.02.07;   11721;    2122;    1432;     579;    8299;    9242;   11000;   11253;     721;     468
NYISO ZONE G LBMP SWAP - NEW YORK MERCANTILE EXCHANGE ;2006.01.31;   12040;    2904;    1644;     912;    7463;    9018;   11279;   11574;     761;     466
NYISO ZONE G LBMP SWAP - NEW YORK MERCANTILE EXCHANGE ;2006.01.24;   13315;    4179;    1644;     912;    7463;   10293;   12554;   12849;     761;     466
NYISO ZONE G LBMP SWAP - NEW YORK MERCANTILE EXCHANGE ;2006.01.17;   13747;    4263;    1644;     920;    7849;   10757;   13032;   13321;     715;     426
NYISO ZONE G LBMP SWAP - NEW YORK MERCANTILE EXCHANGE ;2006.01.10;   13656;    4029;    2278;    1077;    7789;    9835;   12895;   13190;     761;     466
NYISO ZONE G LBMP SWAP - NEW YORK MERCANTILE EXCHANGE ;2006.01.03;   14136;    4285;    2786;     990;    8566;   10360;   13841;   14136;     295;       0
NYISO ZONE G LBMP SWAP - NEW YORK MERCANTILE EXCHANGE ;2005.12.27;   13767;    4326;    2786;     949;    8238;   10032;   13513;   13767;     254;       0
NYISO ZONE G LBMP SWAP - NEW YORK MERCANTILE EXCHANGE ;2005.12.20;   13767;    4572;    2786;     703;    8238;   10278;   13513;   13767;     254;       0
NYISO ZONE G LBMP SWAP - NEW YORK MERCANTILE EXCHANGE ;2005.12.13;   13646;    2172;    4890;     592;   10542;    8078;   13306;   13560;     340;      86
NYISO ZONE G LBMP SWAP - NEW YORK MERCANTILE EXCHANGE ;2005.12.06;   12992;    1744;    4052;     592;   10316;    8262;   12652;   12906;     340;      86
NYISO ZONE G LBMP SWAP - NEW YORK MERCANTILE EXCHANGE ;2005.11.29;   12836;    1677;    5453;     846;    9973;    6451;   12496;   12750;     340;      86
NYISO ZONE G LBMP SWAP - NEW YORK MERCANTILE EXCHANGE ;2005.11.22;   12582;    1677;    5199;     932;    9973;    6451;   12582;   12582;       0;       0
NYISO ZONE G LBMP SWAP - NEW YORK MERCANTILE EXCHANGE ;2005.11.15;   11348;    1677;    4351;     846;    8825;    6151;   11348;   11348;       0;       0
NYISO ZONE G LBMP SWAP - NEW YORK MERCANTILE EXCHANGE ;2005.11.08;   11628;    1677;    4372;     846;    9105;    6320;   11628;   11538;       0;      90
NYISO ZONE G LBMP SWAP - NEW YORK MERCANTILE EXCHANGE ;2005.11.01;   11019;    2745;    3381;    2106;    6168;    5532;   11019;   11019;       0;       0
NYISO ZONE G LBMP SWAP - NEW YORK MERCANTILE EXCHANGE ;2005.10.25;    9407;     743;    3459;    2454;    6210;    3494;    9407;    9407;       0;       0
NYISO ZONE G LBMP SWAP - NEW YORK MERCANTILE EXCHANGE ;2005.10.18;    9243;     743;    3295;    2454;    6046;    3494;    9243;    9243;       0;       0
NYISO ZONE G LBMP SWAP - NEW YORK MERCANTILE EXCHANGE ;2005.10.11;    8798;     684;    2606;    2450;    5664;    3742;    8798;    8798;       0;       0
NYISO ZONE G LBMP SWAP - NEW YORK MERCANTILE EXCHANGE ;2005.10.04;    9348;     684;    2648;    2450;    5706;    3742;    8840;    8840;     508;     508
NYISO ZONE G LBMP SWAP - NEW YORK MERCANTILE EXCHANGE ;2005.09.27;   10822;    1062;    3341;    2576;    6676;    4397;   10314;   10314;     508;     508
NYISO ZONE G LBMP SWAP - NEW YORK MERCANTILE EXCHANGE ;2005.09.20;   10696;     936;    3341;    2576;    6676;    4271;   10188;   10188;     508;     508
NYISO ZONE G LBMP SWAP - NEW YORK MERCANTILE EXCHANGE ;2005.09.13;    9957;     260;    3513;    1791;    6550;    4145;    8601;    9449;    1356;     508
NYISO ZONE G LBMP SWAP - NEW YORK MERCANTILE EXCHANGE ;2005.09.06;   10259;     260;    3979;    1833;    6768;    3897;    8861;    9709;    1398;     550
NYISO ZONE G LBMP SWAP - NEW YORK MERCANTILE EXCHANGE ;2005.08.30;   12194;     582;    4236;    2128;    8212;    4814;   10922;   11178;    1272;    1016
NYISO ZONE G LBMP SWAP - NEW YORK MERCANTILE EXCHANGE ;2005.08.23;   11566;     540;    3354;    2842;    6906;    4814;   10288;   11010;    1278;     556
NYISO ZONE G LBMP SWAP - NEW YORK MERCANTILE EXCHANGE ;2005.08.16;   12257;     540;    3354;    2842;    7605;    5003;   10987;   11199;    1270;    1058
NYISO ZONE G LBMP SWAP - NEW YORK MERCANTILE EXCHANGE ;2005.08.09;   10630;     540;    3478;    2590;    6906;    3970;   10036;   10038;     594;     592
NYISO ZONE G LBMP SWAP - NEW YORK MERCANTILE EXCHANGE ;2005.08.02;   10204;     582;    3562;    2527;    6543;    3565;    9652;    9654;     552;     550
NYISO ZONE G LBMP SWAP - NEW YORK MERCANTILE EXCHANGE ;2005.07.26;   11278;     780;    3914;    2737;    7209;    4077;   10726;   10728;     552;     550
NYISO ZONE G LBMP SWAP - NEW YORK MERCANTILE EXCHANGE ;2005.07.19;   10852;     780;    3788;    2437;    7083;    4077;   10300;   10302;     552;     550
NYISO ZONE G LBMP SWAP - NEW YORK MERCANTILE EXCHANGE ;2005.07.12;    9234;     694;    2770;    2351;    6189;    4113;    9234;    9234;       0;       0
NYISO ZONE G LBMP SWAP - NEW YORK MERCANTILE EXCHANGE ;2005.07.05;    9078;     694;    2426;    2615;    5515;    4037;    8824;    9078;     254;       0
NYISO ZONE G LBMP SWAP - NEW YORK MERCANTILE EXCHANGE ;2005.06.28;    9636;     230;    2410;    2745;    6661;    4227;    9636;    9382;       0;     254
NYISO ZONE G LBMP SWAP - NEW YORK MERCANTILE EXCHANGE ;2005.06.21;    9378;     174;    3782;    1159;    7881;    4273;    9214;    9214;     164;     164
NYISO ZONE G LBMP SWAP - NEW YORK MERCANTILE EXCHANGE ;2005.06.14;    9000;     260;    4126;     815;    7713;    3933;    8788;    8874;     212;     126
NYISO ZONE G LBMP SWAP - NEW YORK MERCANTILE EXCHANGE ;2005.06.07;    8783;     174;    4800;     772;    7793;    3211;    8739;    8783;      44;       0
NYISO ZONE G LBMP SWAP - NEW YORK MERCANTILE EXCHANGE ;2005.05.31;    9155;     216;    5052;     856;    8039;    3247;    9111;    9155;      44;       0
NYISO ZONE G LBMP SWAP - NEW YORK MERCANTILE EXCHANGE ;2005.05.24;    8979;     172;    5302;     856;    7951;    2821;    8979;    8979;       0;       0
NYISO ZONE G LBMP SWAP - NEW YORK MERCANTILE EXCHANGE ;2005.05.17;    8935;     172;    5474;     856;    7907;    2605;    8935;    8935;       0;       0
NYISO ZONE G LBMP SWAP - NEW YORK MERCANTILE EXCHANGE ;2005.05.10;    8935;     172;    5474;     856;    7907;    2605;    8935;    8935;       0;       0
NYISO ZONE G LBMP SWAP - NEW YORK MERCANTILE EXCHANGE ;2005.05.03;    8719;     172;    5474;     856;    7691;    2389;    8719;    8719;       0;       0
NYISO ZONE G LBMP SWAP - NEW YORK MERCANTILE EXCHANGE ;2005.04.26;    9412;     256;    6319;     856;    8300;    2237;    9412;    9412;       0;       0
NYISO ZONE G LBMP SWAP - NEW YORK MERCANTILE EXCHANGE ;2005.03.29;    8994;     348;    5792;     856;    7790;    2346;    8994;    8994;       0;       0
NYISO ZONE G LBMP SWAP - NEW YORK MERCANTILE EXCHANGE ;2005.03.01;    9318;     218;    5614;    1228;    7872;    2476;    9318;    9318;       0;       0
NYISO ZONE G LBMP SWAP - NEW YORK MERCANTILE EXCHANGE ;2005.02.22;    9360;     218;    5614;    1228;    7914;    2518;    9360;    9360;       0;       0
NYISO ZONE G LBMP SWAP - NEW YORK MERCANTILE EXCHANGE ;2005.02.15;    9314;     218;    4598;    1736;    7360;    2980;    9314;    9314;       0;       0
NYISO ZONE G LBMP SWAP - NEW YORK MERCANTILE EXCHANGE ;2005.02.08;    8580;     218;    4736;    1048;    7314;    2796;    8580;    8580;       0;       0
NYISO ZONE G LBMP SWAP - NEW YORK MERCANTILE EXCHANGE ;2005.02.01;    7622;     302;    2514;    1346;    5974;    3594;    7622;    7454;       0;     168
NYISO ZONE G LBMP SWAP - NEW YORK MERCANTILE EXCHANGE ;2005.01.25;    7536;     302;    2686;    1174;    6060;    3676;    7536;    7536;       0;       0
NYISO ZONE G LBMP SWAP - NEW YORK MERCANTILE EXCHANGE ;2005.01.18;    7536;     302;    2686;    1174;    6060;    3676;    7536;    7536;       0;       0
NYISO ZONE G LBMP SWAP - NEW YORK MERCANTILE EXCHANGE ;2005.01.11;    7536;     544;    2928;     932;    6060;    3676;    7536;    7536;       0;       0
NYISO ZONE G LBMP SWAP - NEW YORK MERCANTILE EXCHANGE ;2005.01.04;    6860;     842;    2550;     634;    5384;    3424;    6860;    6608;       0;     252
NYISO ZONE G LBMP SWAP - NEW YORK MERCANTILE EXCHANGE ;2004.12.28;    7654;     888;    2090;    1094;    5649;    4470;    7631;    7654;      23;       0
NYISO ZONE G LBMP SWAP - NEW YORK MERCANTILE EXCHANGE ;2004.12.21;    7654;     888;    2090;    1094;    5649;    4470;    7631;    7654;      23;       0
NYISO ZONE G LBMP SWAP - NEW YORK MERCANTILE EXCHANGE ;2004.12.14;    6779;     800;    2720;     586;    5370;    3473;    6756;    6779;      23;       0
NYISO ZONE G LBMP SWAP - NEW YORK MERCANTILE EXCHANGE ;2004.12.07;    6697;     718;    2720;     586;    5370;    3391;    6674;    6697;      23;       0
NYISO ZONE G LBMP SWAP - NEW YORK MERCANTILE EXCHANGE ;2004.11.30;    7413;     760;    2548;     964;    5599;    3901;    7323;    7413;      90;       0
NYISO ZONE G LBMP SWAP - NEW YORK MERCANTILE EXCHANGE ;2004.11.23;    7413;     760;    2502;    1010;    5599;    3901;    7369;    7413;      44;       0
NYISO ZONE G LBMP SWAP - NEW YORK MERCANTILE EXCHANGE ;2004.11.16;    7367;     714;    2502;    1010;    5599;    3855;    7323;    7367;      44;       0
NYISO ZONE G LBMP SWAP - NEW YORK MERCANTILE EXCHANGE ;2004.11.09;    6823;     630;    1912;    1056;    5093;    3855;    6779;    6823;      44;       0
NYISO ZONE G LBMP SWAP - NEW YORK MERCANTILE EXCHANGE ;2004.11.02;    6695;     630;    1794;    1010;    5011;    3891;    6651;    6695;      44;       0
NYISO ZONE G LBMP SWAP - NEW YORK MERCANTILE EXCHANGE ;2004.10.26;    7237;     714;     824;    1514;    4944;    4899;    7172;    7237;      65;       0
NYISO ZONE G LBMP SWAP - NEW YORK MERCANTILE EXCHANGE ;2004.10.19;    7283;     714;     824;    1514;    4944;    4899;    7172;    7237;     111;      46
NYISO ZONE G LBMP SWAP - NEW YORK MERCANTILE EXCHANGE ;2004.10.12;    7283;     714;     824;    1514;    4944;    4899;    7172;    7237;     111;      46
NYISO ZONE G LBMP SWAP - NEW YORK MERCANTILE EXCHANGE ;2004.10.05;    7283;     668;     824;    1560;    4990;    4899;    7218;    7283;      65;       0
NYISO ZONE G LBMP SWAP - NEW YORK MERCANTILE EXCHANGE ;2004.09.28;    8102;     626;     759;    1791;    5599;    5552;    8016;    8102;      86;       0
NYISO ZONE G LBMP SWAP - NEW YORK MERCANTILE EXCHANGE ;2004.09.21;    7838;     584;     495;    1791;    5377;    5552;    7752;    7838;      86;       0
NYISO ZONE G LBMP SWAP - NEW YORK MERCANTILE EXCHANGE ;2004.09.14;    7838;     584;     495;    1791;    5377;    5552;    7752;    7838;      86;       0
NYISO ZONE G LBMP SWAP - NEW YORK MERCANTILE EXCHANGE ;2004.09.07;    7796;     599;     468;    1818;    5293;    5510;    7710;    7796;      86;       0
NYISO ZONE G LBMP SWAP - NEW YORK MERCANTILE EXCHANGE ;2004.08.31;    8814;     782;     321;    1883;    6041;    6610;    8706;    8814;     108;       0
NYISO ZONE G LBMP SWAP - NEW YORK MERCANTILE EXCHANGE ;2004.08.24;    8814;     782;     321;    1883;    6041;    6610;    8706;    8814;     108;       0
NYISO ZONE G LBMP SWAP - NEW YORK MERCANTILE EXCHANGE ;2004.08.17;    8898;     782;     237;    1967;    5957;    6610;    8706;    8814;     192;      84
NYISO ZONE G LBMP SWAP - NEW YORK MERCANTILE EXCHANGE ;2004.08.10;    8730;     614;     237;    2051;    5957;    6442;    8622;    8730;     108;       0
NYISO ZONE G LBMP SWAP - NEW YORK MERCANTILE EXCHANGE ;2004.08.03;    8818;     572;     237;    2051;    6087;    6530;    8710;    8818;     108;       0
NYISO ZONE G LBMP SWAP - NEW YORK MERCANTILE EXCHANGE ;2004.07.27;   10162;     902;       0;    2288;    6843;    7874;   10033;   10162;     129;       0
NYISO ZONE G LBMP SWAP - NEW YORK MERCANTILE EXCHANGE ;2004.07.20;   10099;     818;       0;    2372;    6780;    7727;    9970;   10099;     129;       0
NYISO ZONE G LBMP SWAP - NEW YORK MERCANTILE EXCHANGE ;2004.07.13;   10099;     989;       0;    2372;    6738;    7727;   10099;   10099;       0;       0
NYISO ZONE G LBMP SWAP - NEW YORK MERCANTILE EXCHANGE ;2004.07.06;    9969;    1285;     210;    2032;    6652;    7727;    9969;    9969;       0;       0
NYISO ZONE G LBMP SWAP - NEW YORK MERCANTILE EXCHANGE ;2004.06.29;   11641;    1302;     223;    2239;    8100;    9179;   11641;   11641;       0;       0
NYISO ZONE G LBMP SWAP - NEW YORK MERCANTILE EXCHANGE ;2004.06.22;   11599;    1302;     223;    2239;    8058;    9137;   11599;   11599;       0;       0
NYISO ZONE G LBMP SWAP - NEW YORK MERCANTILE EXCHANGE ;2004.06.15;   11429;    1272;     145;    2187;    7970;    9097;   11429;   11429;       0;       0
NYISO ZONE G LBMP SWAP - NEW YORK MERCANTILE EXCHANGE ;2004.06.08;   11257;    1314;     317;    1931;    7970;    9009;   11215;   11257;      42;       0
NYISO ZONE G LBMP SWAP - NEW YORK MERCANTILE EXCHANGE ;2004.06.01;   12193;    1352;     115;    2051;    8790;    9867;   12193;   12033;       0;     160
NYISO ZONE G LBMP SWAP - NEW YORK MERCANTILE EXCHANGE ;2004.05.25;   12087;    1478;     285;    1903;    8706;    9899;   12087;   12087;       0;       0
NYISO ZONE G LBMP SWAP - NEW YORK MERCANTILE EXCHANGE ;2004.05.18;   11787;    1432;     587;    1623;    8732;    9577;   11787;   11787;       0;       0
NYISO ZONE G LBMP SWAP - NEW YORK MERCANTILE EXCHANGE ;2004.05.11;   10272;    1434;     899;     823;    8015;    8550;   10272;   10272;       0;       0
NYISO ZONE G LBMP SWAP - NEW YORK MERCANTILE EXCHANGE ;2004.05.04;   10656;    1478;    1409;     779;    8399;    8468;   10656;   10656;       0;       0
NYISO ZONE G LBMP SWAP - NEW YORK MERCANTILE EXCHANGE ;2004.04.27;   11260;    1786;    1453;     779;    8695;    9028;   11260;   11260;       0;       0
NYISO ZONE G LBMP SWAP - NEW YORK MERCANTILE EXCHANGE ;2004.04.20;   11090;    1786;    1369;     819;    8485;    8902;   11090;   11090;       0;       0
NYISO ZONE G LBMP SWAP - NEW YORK MERCANTILE EXCHANGE ;2004.04.12;    9624;    1746;     830;     848;    7030;    7946;    9624;    9624;       0;       0
NYISO ZONE G LBMP SWAP - NEW YORK MERCANTILE EXCHANGE ;2004.04.06;    9114;    1746;     830;     848;    6520;    7436;    9114;    9114;       0;       0
NYISO ZONE G LBMP SWAP - NEW YORK MERCANTILE EXCHANGE ;2004.03.30;    9993;    1924;     678;    1010;    7013;    8259;    9947;    9947;      46;      46
NYISO ZONE G LBMP SWAP - NEW YORK MERCANTILE EXCHANGE ;2004.03.23;    9160;    2092;     206;     950;    6072;    7958;    9114;    9114;      46;      46
NYISO ZONE G LBMP SWAP - NEW YORK MERCANTILE EXCHANGE ;2004.03.16;    8408;    2558;     206;     440;    5298;    7716;    8296;    8362;     112;      46
NYISO ZONE G LBMP SWAP - NEW YORK MERCANTILE EXCHANGE ;2004.03.09;    8023;    2518;     292;     394;    5065;    7291;    7977;    7977;      46;      46
NYISO ZONE G LBMP SWAP - NEW YORK MERCANTILE EXCHANGE ;2004.03.02;    8003;    2854;     292;     354;    4749;    7311;    7957;    7957;      46;      46
NYISO ZONE G LBMP SWAP - NEW YORK MERCANTILE EXCHANGE ;2004.02.24;    8058;    2210;       0;     412;    5390;    7600;    8012;    8012;      46;      46
NYISO ZONE G LBMP SWAP - NEW YORK MERCANTILE EXCHANGE ;2004.01.27;    8044;    2269;       0;     246;    5365;    7634;    7880;    7880;     164;     164
NYISO ZONE G LBMP SWAP - NEW YORK MERCANTILE EXCHANGE ;2004.01.20;    8172;    1706;      17;     539;    5797;    7616;    8042;    8172;     130;       0
NYISO ZONE G LBMP SWAP - NEW YORK MERCANTILE EXCHANGE ;2004.01.13;    8172;    1706;      17;     539;    5797;    7616;    8042;    8172;     130;       0
NYISO ZONE G LBMP SWAP - NEW YORK MERCANTILE EXCHANGE ;2004.01.06;    8201;     678;     197;     539;    6854;    7465;    8071;    8201;     130;       0
NYISO ZONE G LBMP SWAP - NEW YORK MERCANTILE EXCHANGE ;2003.12.30;    9609;     942;     593;     583;    7866;    8433;    9391;    9609;     218;       0
NYISO ZONE G LBMP SWAP - NEW YORK MERCANTILE EXCHANGE ;2003.12.22;    9523;     942;     593;     583;    7866;    8347;    9391;    9523;     132;       0
NYISO ZONE G LBMP SWAP - NEW YORK MERCANTILE EXCHANGE ;2003.12.16;    9499;     983;     487;     583;    7801;    8429;    9367;    9499;     132;       0
NYISO ZONE G LBMP SWAP - NEW YORK MERCANTILE EXCHANGE ;2003.12.09;    9417;     983;     577;     583;    7719;    8257;    9285;    9417;     132;       0
NYISO ZONE G LBMP SWAP - NEW YORK MERCANTILE EXCHANGE ;2003.12.02;    8511;     710;    1112;     130;    7539;    7269;    8379;    8511;     132;       0
NYISO ZONE G LBMP SWAP - NEW YORK MERCANTILE EXCHANGE ;2003.11.25;    9379;     900;    1108;     130;    8179;    8141;    9209;    9379;     170;       0
NYISO ZONE G LBMP SWAP - NEW YORK MERCANTILE EXCHANGE ;2003.11.18;    9503;     770;    1544;     212;    8351;    7747;    9333;    9503;     170;       0
NYISO ZONE G LBMP SWAP - NEW YORK MERCANTILE EXCHANGE ;2003.11.11;    8861;     934;     886;     174;    7671;    7801;    8779;    8861;      82;       0
NYISO ZONE G LBMP SWAP - NEW YORK MERCANTILE EXCHANGE ;2003.11.04;    8354;     890;     760;      44;    7382;    7550;    8316;    8354;      38;       0
NYISO ZONE G LBMP SWAP - NEW YORK MERCANTILE EXCHANGE ;2007.03.27;   15056;     852;       0;       0;   14161;   14865;   15013;   14865;      43;     191
NYISO ZONE G LBMP SWAP - NEW YORK MERCANTILE EXCHANGE ;2007.03.20;   15056;     852;       0;       0;   14161;   14865;   15013;   14865;      43;     191
NYISO ZONE G LBMP SWAP - NEW YORK MERCANTILE EXCHANGE ;2007.03.13;   15056;     852;       0;       0;   14161;   14865;   15013;   14865;      43;     191
NYISO ZONE G LBMP SWAP - NEW YORK MERCANTILE EXCHANGE ;2007.03.06;   15056;     852;       0;       0;   14161;   14865;   15013;   14865;      43;     191
NYISO ZONE G LBMP SWAP - NEW YORK MERCANTILE EXCHANGE ;2007.02.27;   15960;     932;       0;       0;   15028;   15749;   15960;   15749;       0;     211
NYISO ZONE G LBMP SWAP - NEW YORK MERCANTILE EXCHANGE ;2007.02.20;   16234;     932;       0;       0;   15239;   16023;   16171;   16023;      63;     211
NYISO ZONE G LBMP SWAP - NEW YORK MERCANTILE EXCHANGE ;2007.02.13;   16234;     932;       0;       0;   15239;   16001;   16171;   16001;      63;     233
NYISO ZONE G LBMP SWAP - NEW YORK MERCANTILE EXCHANGE ;2006.12.26;   17728;    1180;       0;       0;   16505;   17728;   17685;   17728;      43;       0
NYISO ZONE G LBMP SWAP - NEW YORK MERCANTILE EXCHANGE ;2006.12.19;   17728;    1180;       0;       0;   16505;   17728;   17685;   17728;      43;       0
NYISO ZONE G LBMP SWAP - NEW YORK MERCANTILE EXCHANGE ;2006.12.12;   17728;    1180;       0;       0;   16505;   17728;   17685;   17728;      43;       0
NYISO ZONE G LBMP SWAP - NEW YORK MERCANTILE EXCHANGE ;2006.12.05;   17728;    1268;       0;       0;   16417;   17728;   17685;   17728;      43;       0
NYISO ZONE G LBMP SWAP - NEW YORK MERCANTILE EXCHANGE ;2006.11.28;   18463;    1348;       0;       0;   17072;   18463;   18420;   18463;      43;       0
NYISO ZONE G LBMP SWAP - NEW YORK MERCANTILE EXCHANGE ;2006.11.21;   18463;    1348;       0;       0;   17072;   18463;   18420;   18463;      43;       0
NYISO ZONE G LBMP SWAP - NEW YORK MERCANTILE EXCHANGE ;2006.11.14;   18463;    1348;       0;       0;   17072;   18463;   18420;   18463;      43;       0
NYISO ZONE G LBMP SWAP - NEW YORK MERCANTILE EXCHANGE ;2006.11.07;   18375;    1348;       0;       0;   16984;   18375;   18332;   18375;      43;       0
NYISO ZONE G LBMP SWAP - NEW YORK MERCANTILE EXCHANGE ;2006.10.31;   19101;    1524;       0;       0;   17534;   19101;   19058;   19101;      43;       0
NYISO ZONE G LBMP SWAP - NEW YORK MERCANTILE EXCHANGE ;2006.10.24;   19013;    1524;       0;       0;   17446;   19013;   18970;   19013;      43;       0
NYISO ZONE G LBMP SWAP - NEW YORK MERCANTILE EXCHANGE ;2006.10.17;   19013;    1524;       0;       0;   17446;   19013;   18970;   19013;      43;       0
NYISO ZONE G LBMP SWAP - NEW YORK MERCANTILE EXCHANGE ;2006.10.10;   19141;    1524;       0;       0;   17574;   19141;   19098;   19141;      43;       0
NYISO ZONE G LBMP SWAP - NEW YORK MERCANTILE EXCHANGE ;2006.10.03;   19227;    1524;       0;       0;   17660;   19227;   19184;   19227;      43;       0
NYISO ZONE G LBMP SWAP - NEW YORK MERCANTILE EXCHANGE ;2006.09.26;   19355;    1684;      80;       0;   17628;   19275;   19312;   19355;      43;       0
NYISO ZONE G LBMP SWAP - NEW YORK MERCANTILE EXCHANGE ;2006.09.19;   18845;    1684;      80;       0;   17118;   18765;   18802;   18845;      43;       0
NYISO ZONE G LBMP SWAP - NEW YORK MERCANTILE EXCHANGE ;2006.09.12;   18845;    1684;      80;       0;   17161;   18765;   18845;   18845;       0;       0
NYISO ZONE G LBMP SWAP - NEW YORK MERCANTILE EXCHANGE ;2006.09.05;   18845;    1684;      80;       0;   17161;   18765;   18845;   18845;       0;       0
NYISO ZONE G LBMP SWAP - NEW YORK MERCANTILE EXCHANGE ;2006.08.29;   20202;    1845;     172;      69;   18288;   19961;   20202;   20202;       0;       0
NYISO ZONE G LBMP SWAP - NEW YORK MERCANTILE EXCHANGE ;2006.08.22;   20202;    1845;     172;      69;   18288;   19961;   20202;   20202;       0;       0
NYISO ZONE G LBMP SWAP - NEW YORK MERCANTILE EXCHANGE ;2006.08.15;   20248;    1845;     172;      69;   18288;   19961;   20202;   20202;      46;      46
NYISO ZONE G LBMP SWAP - NEW YORK MERCANTILE EXCHANGE ;2006.08.08;   16374;    1845;     172;      69;   14460;   16133;   16374;   16374;       0;       0
NYISO ZONE G LBMP SWAP - NEW YORK MERCANTILE EXCHANGE ;2006.08.01;   17634;    2065;     252;     129;   15440;   17093;   17634;   17474;       0;     160
NYISO ZONE G LBMP SWAP - NEW YORK MERCANTILE EXCHANGE ;2006.07.25;   17425;    2065;     252;     129;   15231;   17044;   17425;   17425;       0;       0
NYISO ZONE G LBMP SWAP - NEW YORK MERCANTILE EXCHANGE ;2006.07.18;   17425;    2065;     252;     129;   15231;   17044;   17425;   17425;       0;       0
NYISO ZONE G LBMP SWAP - NEW YORK MERCANTILE EXCHANGE ;2006.07.11;   16022;    2065;     252;     129;   13828;   15641;   16022;   16022;       0;       0
NYISO ZONE G LBMP SWAP - NEW YORK MERCANTILE EXCHANGE ;2006.07.03;   16946;    2285;     340;     129;   14488;   16477;   16902;   16946;      44;       0
NYISO ZONE G LBMP SWAP - NEW YORK MERCANTILE EXCHANGE ;2006.06.27;   16866;    2205;     340;     129;   14532;   16397;   16866;   16866;       0;       0
NYISO ZONE G LBMP SWAP - NEW YORK MERCANTILE EXCHANGE ;2006.06.20;   17419;    2377;     512;       0;   15042;   16907;   17419;   17419;       0;       0
NYISO ZONE G LBMP SWAP - NEW YORK MERCANTILE EXCHANGE ;2006.06.13;   15172;    3053;     512;       0;   12119;   14660;   15172;   15172;       0;       0
NYISO ZONE G LBMP SWAP - NEW YORK MERCANTILE EXCHANGE ;2006.06.06;   15132;    3053;     598;       0;   11993;   14448;   15046;   15046;      86;      86
NYISO ZONE G LBMP SWAP - NEW YORK MERCANTILE EXCHANGE ;2006.05.30;   16091;    2966;     644;     308;   12643;   15053;   15917;   16005;     174;      86
NYISO ZONE G LBMP SWAP - NEW YORK MERCANTILE EXCHANGE ;2006.05.23;   16109;    2966;     644;     308;   12835;   15157;   16109;   16109;       0;       0
NYISO ZONE G LBMP SWAP - NEW YORK MERCANTILE EXCHANGE ;2006.05.16;   15383;    2966;     600;     308;   12109;   14475;   15383;   15383;       0;       0
NYISO ZONE G LBMP SWAP - NEW YORK MERCANTILE EXCHANGE ;2006.05.09;   15361;    2966;     600;     308;   12087;   14453;   15361;   15361;       0;       0
NYISO ZONE G LBMP SWAP - NEW YORK MERCANTILE EXCHANGE ;2006.05.02;   15301;    2966;     600;     308;   12027;   14393;   15301;   15301;       0;       0
NYISO ZONE G LBMP SWAP - NEW YORK MERCANTILE EXCHANGE ;2006.04.25;   16431;    3326;     760;     308;   12797;   15363;   16431;   16431;       0;       0
NYISO ZONE G LBMP SWAP - NEW YORK MERCANTILE EXCHANGE ;2006.04.18;   15281;    2614;    1024;       0;   12532;   14257;   15146;   15281;     135;       0
NYISO ZONE G LBMP SWAP - NEW YORK MERCANTILE EXCHANGE ;2006.04.11;   14474;    2614;     980;       0;   11670;   13494;   14284;   14474;     190;       0
NYISO ZONE G LBMP SWAP - NEW YORK MERCANTILE EXCHANGE ;2006.04.04;   14210;    2614;     804;       0;   11406;   13406;   14020;   14210;     190;       0
NYISO ZONE G LBMP SWAP - NEW YORK MERCANTILE EXCHANGE ;2006.03.28;   14791;    4156;     808;    1323;    9099;   12660;   14578;   14791;     213;       0
NYISO ZONE G LBMP SWAP - NEW YORK MERCANTILE EXCHANGE ;2006.03.21;   13907;    4325;     808;    1323;    8046;   11138;   13694;   13269;     213;     638
NYISO ZONE G LBMP SWAP - NEW YORK MERCANTILE EXCHANGE ;2006.03.14;   13203;    3775;     768;    1323;    7892;   11112;   12990;   13203;     213;       0
NYISO ZONE G LBMP SWAP - NEW YORK MERCANTILE EXCHANGE ;2006.03.07;   12935;    3571;     728;    1367;    7784;   10541;   12722;   12636;     213;     299
NYISO ZONE G LBMP SWAP - NEW YORK MERCANTILE EXCHANGE ;2006.02.28;   13935;    3311;     968;    1707;    8664;   11260;   13682;   13935;     253;       0
NYISO ZONE G LBMP SWAP - NEW YORK MERCANTILE EXCHANGE ;2006.02.21;   13868;    2801;     968;    1707;    8641;   10727;   13149;   13402;     719;     466
NYISO ZONE G LBMP SWAP - NEW YORK MERCANTILE EXCHANGE ;2006.02.14;   12552;    2122;    2500;     430;    9281;    9156;   11833;   12086;     719;     466
NYISO ZONE G LBMP SWAP - NEW YORK MERCANTILE EXCHANGE ;2006.02.07;   11721;    2122;    1432;     579;    8299;    9242;   11000;   11253;     721;     468
NYISO ZONE G LBMP SWAP - NEW YORK MERCANTILE EXCHANGE ;2006.01.31;   12040;    2904;    1644;     912;    7463;    9018;   11279;   11574;     761;     466
NYISO ZONE G LBMP SWAP - NEW YORK MERCANTILE EXCHANGE ;2006.01.24;   13315;    4179;    1644;     912;    7463;   10293;   12554;   12849;     761;     466
NYISO ZONE G LBMP SWAP - NEW YORK MERCANTILE EXCHANGE ;2006.01.17;   13747;    4263;    1644;     920;    7849;   10757;   13032;   13321;     715;     426
NYISO ZONE G LBMP SWAP - NEW YORK MERCANTILE EXCHANGE ;2006.01.10;   13656;    4029;    2278;    1077;    7789;    9835;   12895;   13190;     761;     466
NYISO ZONE G LBMP SWAP - NEW YORK MERCANTILE EXCHANGE ;2006.01.03;   14136;    4285;    2786;     990;    8566;   10360;   13841;   14136;     295;       0
NYISO ZONE G LBMP SWAP - NEW YORK MERCANTILE EXCHANGE ;2005.12.27;   13767;    4326;    2786;     949;    8238;   10032;   13513;   13767;     254;       0
NYISO ZONE G LBMP SWAP - NEW YORK MERCANTILE EXCHANGE ;2005.12.20;   13767;    4572;    2786;     703;    8238;   10278;   13513;   13767;     254;       0
NYISO ZONE G LBMP SWAP - NEW YORK MERCANTILE EXCHANGE ;2005.12.13;   13646;    2172;    4890;     592;   10542;    8078;   13306;   13560;     340;      86
NYISO ZONE G LBMP SWAP - NEW YORK MERCANTILE EXCHANGE ;2005.12.06;   12992;    1744;    4052;     592;   10316;    8262;   12652;   12906;     340;      86
NYISO ZONE G LBMP SWAP - NEW YORK MERCANTILE EXCHANGE ;2005.11.29;   12836;    1677;    5453;     846;    9973;    6451;   12496;   12750;     340;      86
NYISO ZONE G LBMP SWAP - NEW YORK MERCANTILE EXCHANGE ;2005.11.22;   12582;    1677;    5199;     932;    9973;    6451;   12582;   12582;       0;       0
NYISO ZONE G LBMP SWAP - NEW YORK MERCANTILE EXCHANGE ;2005.11.15;   11348;    1677;    4351;     846;    8825;    6151;   11348;   11348;       0;       0
NYISO ZONE G LBMP SWAP - NEW YORK MERCANTILE EXCHANGE ;2005.11.08;   11628;    1677;    4372;     846;    9105;    6320;   11628;   11538;       0;      90
NYISO ZONE G LBMP SWAP - NEW YORK MERCANTILE EXCHANGE ;2005.11.01;   11019;    2745;    3381;    2106;    6168;    5532;   11019;   11019;       0;       0
NYISO ZONE G LBMP SWAP - NEW YORK MERCANTILE EXCHANGE ;2005.10.25;    9407;     743;    3459;    2454;    6210;    3494;    9407;    9407;       0;       0
NYISO ZONE G LBMP SWAP - NEW YORK MERCANTILE EXCHANGE ;2005.10.18;    9243;     743;    3295;    2454;    6046;    3494;    9243;    9243;       0;       0
NYISO ZONE G LBMP SWAP - NEW YORK MERCANTILE EXCHANGE ;2005.10.11;    8798;     684;    2606;    2450;    5664;    3742;    8798;    8798;       0;       0
NYISO ZONE G LBMP SWAP - NEW YORK MERCANTILE EXCHANGE ;2005.10.04;    9348;     684;    2648;    2450;    5706;    3742;    8840;    8840;     508;     508
NYISO ZONE G LBMP SWAP - NEW YORK MERCANTILE EXCHANGE ;2005.09.27;   10822;    1062;    3341;    2576;    6676;    4397;   10314;   10314;     508;     508
NYISO ZONE G LBMP SWAP - NEW YORK MERCANTILE EXCHANGE ;2005.09.20;   10696;     936;    3341;    2576;    6676;    4271;   10188;   10188;     508;     508
NYISO ZONE G LBMP SWAP - NEW YORK MERCANTILE EXCHANGE ;2005.09.13;    9957;     260;    3513;    1791;    6550;    4145;    8601;    9449;    1356;     508
NYISO ZONE G LBMP SWAP - NEW YORK MERCANTILE EXCHANGE ;2005.09.06;   10259;     260;    3979;    1833;    6768;    3897;    8861;    9709;    1398;     550
NYISO ZONE G LBMP SWAP - NEW YORK MERCANTILE EXCHANGE ;2005.08.30;   12194;     582;    4236;    2128;    8212;    4814;   10922;   11178;    1272;    1016
NYISO ZONE G LBMP SWAP - NEW YORK MERCANTILE EXCHANGE ;2005.08.23;   11566;     540;    3354;    2842;    6906;    4814;   10288;   11010;    1278;     556
NYISO ZONE G LBMP SWAP - NEW YORK MERCANTILE EXCHANGE ;2005.08.16;   12257;     540;    3354;    2842;    7605;    5003;   10987;   11199;    1270;    1058
NYISO ZONE G LBMP SWAP - NEW YORK MERCANTILE EXCHANGE ;2005.08.09;   10630;     540;    3478;    2590;    6906;    3970;   10036;   10038;     594;     592
NYISO ZONE G LBMP SWAP - NEW YORK MERCANTILE EXCHANGE ;2005.08.02;   10204;     582;    3562;    2527;    6543;    3565;    9652;    9654;     552;     550
NYISO ZONE G LBMP SWAP - NEW YORK MERCANTILE EXCHANGE ;2005.07.26;   11278;     780;    3914;    2737;    7209;    4077;   10726;   10728;     552;     550
NYISO ZONE G LBMP SWAP - NEW YORK MERCANTILE EXCHANGE ;2005.07.19;   10852;     780;    3788;    2437;    7083;    4077;   10300;   10302;     552;     550
NYISO ZONE G LBMP SWAP - NEW YORK MERCANTILE EXCHANGE ;2005.07.12;    9234;     694;    2770;    2351;    6189;    4113;    9234;    9234;       0;       0
NYISO ZONE G LBMP SWAP - NEW YORK MERCANTILE EXCHANGE ;2005.07.05;    9078;     694;    2426;    2615;    5515;    4037;    8824;    9078;     254;       0
NYISO ZONE G LBMP SWAP - NEW YORK MERCANTILE EXCHANGE ;2005.06.28;    9636;     230;    2410;    2745;    6661;    4227;    9636;    9382;       0;     254
NYISO ZONE G LBMP SWAP - NEW YORK MERCANTILE EXCHANGE ;2005.06.21;    9378;     174;    3782;    1159;    7881;    4273;    9214;    9214;     164;     164
NYISO ZONE G LBMP SWAP - NEW YORK MERCANTILE EXCHANGE ;2005.06.14;    9000;     260;    4126;     815;    7713;    3933;    8788;    8874;     212;     126
NYISO ZONE G LBMP SWAP - NEW YORK MERCANTILE EXCHANGE ;2005.06.07;    8783;     174;    4800;     772;    7793;    3211;    8739;    8783;      44;       0
NYISO ZONE G LBMP SWAP - NEW YORK MERCANTILE EXCHANGE ;2005.05.31;    9155;     216;    5052;     856;    8039;    3247;    9111;    9155;      44;       0
NYISO ZONE G LBMP SWAP - NEW YORK MERCANTILE EXCHANGE ;2005.05.24;    8979;     172;    5302;     856;    7951;    2821;    8979;    8979;       0;       0
NYISO ZONE G LBMP SWAP - NEW YORK MERCANTILE EXCHANGE ;2005.05.17;    8935;     172;    5474;     856;    7907;    2605;    8935;    8935;       0;       0
NYISO ZONE G LBMP SWAP - NEW YORK MERCANTILE EXCHANGE ;2005.05.10;    8935;     172;    5474;     856;    7907;    2605;    8935;    8935;       0;       0
NYISO ZONE G LBMP SWAP - NEW YORK MERCANTILE EXCHANGE ;2005.05.03;    8719;     172;    5474;     856;    7691;    2389;    8719;    8719;       0;       0
NYISO ZONE G LBMP SWAP - NEW YORK MERCANTILE EXCHANGE ;2005.04.26;    9412;     256;    6319;     856;    8300;    2237;    9412;    9412;       0;       0
NYISO ZONE G LBMP SWAP - NEW YORK MERCANTILE EXCHANGE ;2005.03.29;    8994;     348;    5792;     856;    7790;    2346;    8994;    8994;       0;       0
NYISO ZONE G LBMP SWAP - NEW YORK MERCANTILE EXCHANGE ;2005.03.01;    9318;     218;    5614;    1228;    7872;    2476;    9318;    9318;       0;       0
NYISO ZONE G LBMP SWAP - NEW YORK MERCANTILE EXCHANGE ;2005.02.22;    9360;     218;    5614;    1228;    7914;    2518;    9360;    9360;       0;       0
NYISO ZONE G LBMP SWAP - NEW YORK MERCANTILE EXCHANGE ;2005.02.15;    9314;     218;    4598;    1736;    7360;    2980;    9314;    9314;       0;       0
NYISO ZONE G LBMP SWAP - NEW YORK MERCANTILE EXCHANGE ;2005.02.08;    8580;     218;    4736;    1048;    7314;    2796;    8580;    8580;       0;       0
NYISO ZONE G LBMP SWAP - NEW YORK MERCANTILE EXCHANGE ;2005.02.01;    7622;     302;    2514;    1346;    5974;    3594;    7622;    7454;       0;     168
NYISO ZONE G LBMP SWAP - NEW YORK MERCANTILE EXCHANGE ;2005.01.25;    7536;     302;    2686;    1174;    6060;    3676;    7536;    7536;       0;       0
NYISO ZONE G LBMP SWAP - NEW YORK MERCANTILE EXCHANGE ;2005.01.18;    7536;     302;    2686;    1174;    6060;    3676;    7536;    7536;       0;       0
NYISO ZONE G LBMP SWAP - NEW YORK MERCANTILE EXCHANGE ;2005.01.11;    7536;     544;    2928;     932;    6060;    3676;    7536;    7536;       0;       0
NYISO ZONE G LBMP SWAP - NEW YORK MERCANTILE EXCHANGE ;2005.01.04;    6860;     842;    2550;     634;    5384;    3424;    6860;    6608;       0;     252
NYISO ZONE G LBMP SWAP - NEW YORK MERCANTILE EXCHANGE ;2004.12.28;    7654;     888;    2090;    1094;    5649;    4470;    7631;    7654;      23;       0
NYISO ZONE G LBMP SWAP - NEW YORK MERCANTILE EXCHANGE ;2004.12.21;    7654;     888;    2090;    1094;    5649;    4470;    7631;    7654;      23;       0
NYISO ZONE G LBMP SWAP - NEW YORK MERCANTILE EXCHANGE ;2004.12.14;    6779;     800;    2720;     586;    5370;    3473;    6756;    6779;      23;       0
NYISO ZONE G LBMP SWAP - NEW YORK MERCANTILE EXCHANGE ;2004.12.07;    6697;     718;    2720;     586;    5370;    3391;    6674;    6697;      23;       0
NYISO ZONE G LBMP SWAP - NEW YORK MERCANTILE EXCHANGE ;2004.11.30;    7413;     760;    2548;     964;    5599;    3901;    7323;    7413;      90;       0
NYISO ZONE G LBMP SWAP - NEW YORK MERCANTILE EXCHANGE ;2004.11.23;    7413;     760;    2502;    1010;    5599;    3901;    7369;    7413;      44;       0
NYISO ZONE G LBMP SWAP - NEW YORK MERCANTILE EXCHANGE ;2004.11.16;    7367;     714;    2502;    1010;    5599;    3855;    7323;    7367;      44;       0
NYISO ZONE G LBMP SWAP - NEW YORK MERCANTILE EXCHANGE ;2004.11.09;    6823;     630;    1912;    1056;    5093;    3855;    6779;    6823;      44;       0
NYISO ZONE G LBMP SWAP - NEW YORK MERCANTILE EXCHANGE ;2004.11.02;    6695;     630;    1794;    1010;    5011;    3891;    6651;    6695;      44;       0
NYISO ZONE G LBMP SWAP - NEW YORK MERCANTILE EXCHANGE ;2004.10.26;    7237;     714;     824;    1514;    4944;    4899;    7172;    7237;      65;       0
NYISO ZONE G LBMP SWAP - NEW YORK MERCANTILE EXCHANGE ;2004.10.19;    7283;     714;     824;    1514;    4944;    4899;    7172;    7237;     111;      46
NYISO ZONE G LBMP SWAP - NEW YORK MERCANTILE EXCHANGE ;2004.10.12;    7283;     714;     824;    1514;    4944;    4899;    7172;    7237;     111;      46
NYISO ZONE G LBMP SWAP - NEW YORK MERCANTILE EXCHANGE ;2004.10.05;    7283;     668;     824;    1560;    4990;    4899;    7218;    7283;      65;       0
NYISO ZONE G LBMP SWAP - NEW YORK MERCANTILE EXCHANGE ;2004.09.28;    8102;     626;     759;    1791;    5599;    5552;    8016;    8102;      86;       0
NYISO ZONE G LBMP SWAP - NEW YORK MERCANTILE EXCHANGE ;2004.09.21;    7838;     584;     495;    1791;    5377;    5552;    7752;    7838;      86;       0
NYISO ZONE G LBMP SWAP - NEW YORK MERCANTILE EXCHANGE ;2004.09.14;    7838;     584;     495;    1791;    5377;    5552;    7752;    7838;      86;       0
NYISO ZONE G LBMP SWAP - NEW YORK MERCANTILE EXCHANGE ;2004.09.07;    7796;     599;     468;    1818;    5293;    5510;    7710;    7796;      86;       0
NYISO ZONE G LBMP SWAP - NEW YORK MERCANTILE EXCHANGE ;2004.08.31;    8814;     782;     321;    1883;    6041;    6610;    8706;    8814;     108;       0
NYISO ZONE G LBMP SWAP - NEW YORK MERCANTILE EXCHANGE ;2004.08.24;    8814;     782;     321;    1883;    6041;    6610;    8706;    8814;     108;       0
NYISO ZONE G LBMP SWAP - NEW YORK MERCANTILE EXCHANGE ;2004.08.17;    8898;     782;     237;    1967;    5957;    6610;    8706;    8814;     192;      84
NYISO ZONE G LBMP SWAP - NEW YORK MERCANTILE EXCHANGE ;2004.08.10;    8730;     614;     237;    2051;    5957;    6442;    8622;    8730;     108;       0
NYISO ZONE G LBMP SWAP - NEW YORK MERCANTILE EXCHANGE ;2004.08.03;    8818;     572;     237;    2051;    6087;    6530;    8710;    8818;     108;       0
NYISO ZONE G LBMP SWAP - NEW YORK MERCANTILE EXCHANGE ;2004.07.27;   10162;     902;       0;    2288;    6843;    7874;   10033;   10162;     129;       0
NYISO ZONE G LBMP SWAP - NEW YORK MERCANTILE EXCHANGE ;2004.07.20;   10099;     818;       0;    2372;    6780;    7727;    9970;   10099;     129;       0
NYISO ZONE G LBMP SWAP - NEW YORK MERCANTILE EXCHANGE ;2004.07.13;   10099;     989;       0;    2372;    6738;    7727;   10099;   10099;       0;       0
NYISO ZONE G LBMP SWAP - NEW YORK MERCANTILE EXCHANGE ;2004.07.06;    9969;    1285;     210;    2032;    6652;    7727;    9969;    9969;       0;       0
NYISO ZONE G LBMP SWAP - NEW YORK MERCANTILE EXCHANGE ;2004.06.29;   11641;    1302;     223;    2239;    8100;    9179;   11641;   11641;       0;       0
NYISO ZONE G LBMP SWAP - NEW YORK MERCANTILE EXCHANGE ;2004.06.22;   11599;    1302;     223;    2239;    8058;    9137;   11599;   11599;       0;       0
NYISO ZONE G LBMP SWAP - NEW YORK MERCANTILE EXCHANGE ;2004.06.15;   11429;    1272;     145;    2187;    7970;    9097;   11429;   11429;       0;       0
NYISO ZONE G LBMP SWAP - NEW YORK MERCANTILE EXCHANGE ;2004.06.08;   11257;    1314;     317;    1931;    7970;    9009;   11215;   11257;      42;       0
NYISO ZONE G LBMP SWAP - NEW YORK MERCANTILE EXCHANGE ;2004.06.01;   12193;    1352;     115;    2051;    8790;    9867;   12193;   12033;       0;     160
NYISO ZONE G LBMP SWAP - NEW YORK MERCANTILE EXCHANGE ;2004.05.25;   12087;    1478;     285;    1903;    8706;    9899;   12087;   12087;       0;       0
NYISO ZONE G LBMP SWAP - NEW YORK MERCANTILE EXCHANGE ;2004.05.18;   11787;    1432;     587;    1623;    8732;    9577;   11787;   11787;       0;       0
NYISO ZONE G LBMP SWAP - NEW YORK MERCANTILE EXCHANGE ;2004.05.11;   10272;    1434;     899;     823;    8015;    8550;   10272;   10272;       0;       0
NYISO ZONE G LBMP SWAP - NEW YORK MERCANTILE EXCHANGE ;2004.05.04;   10656;    1478;    1409;     779;    8399;    8468;   10656;   10656;       0;       0
NYISO ZONE G LBMP SWAP - NEW YORK MERCANTILE EXCHANGE ;2004.04.27;   11260;    1786;    1453;     779;    8695;    9028;   11260;   11260;       0;       0
NYISO ZONE G LBMP SWAP - NEW YORK MERCANTILE EXCHANGE ;2004.04.20;   11090;    1786;    1369;     819;    8485;    8902;   11090;   11090;       0;       0
NYISO ZONE G LBMP SWAP - NEW YORK MERCANTILE EXCHANGE ;2004.04.12;    9624;    1746;     830;     848;    7030;    7946;    9624;    9624;       0;       0
NYISO ZONE G LBMP SWAP - NEW YORK MERCANTILE EXCHANGE ;2004.04.06;    9114;    1746;     830;     848;    6520;    7436;    9114;    9114;       0;       0
NYISO ZONE G LBMP SWAP - NEW YORK MERCANTILE EXCHANGE ;2004.03.30;    9993;    1924;     678;    1010;    7013;    8259;    9947;    9947;      46;      46
NYISO ZONE G LBMP SWAP - NEW YORK MERCANTILE EXCHANGE ;2004.03.23;    9160;    2092;     206;     950;    6072;    7958;    9114;    9114;      46;      46
NYISO ZONE G LBMP SWAP - NEW YORK MERCANTILE EXCHANGE ;2004.03.16;    8408;    2558;     206;     440;    5298;    7716;    8296;    8362;     112;      46
NYISO ZONE G LBMP SWAP - NEW YORK MERCANTILE EXCHANGE ;2004.03.09;    8023;    2518;     292;     394;    5065;    7291;    7977;    7977;      46;      46
NYISO ZONE G LBMP SWAP - NEW YORK MERCANTILE EXCHANGE ;2004.03.02;    8003;    2854;     292;     354;    4749;    7311;    7957;    7957;      46;      46
NYISO ZONE G LBMP SWAP - NEW YORK MERCANTILE EXCHANGE ;2004.02.24;    8058;    2210;       0;     412;    5390;    7600;    8012;    8012;      46;      46
NYISO ZONE G LBMP SWAP - NEW YORK MERCANTILE EXCHANGE ;2004.01.27;    8044;    2269;       0;     246;    5365;    7634;    7880;    7880;     164;     164
NYISO ZONE G LBMP SWAP - NEW YORK MERCANTILE EXCHANGE ;2004.01.20;    8172;    1706;      17;     539;    5797;    7616;    8042;    8172;     130;       0
NYISO ZONE G LBMP SWAP - NEW YORK MERCANTILE EXCHANGE ;2004.01.13;    8172;    1706;      17;     539;    5797;    7616;    8042;    8172;     130;       0
NYISO ZONE G LBMP SWAP - NEW YORK MERCANTILE EXCHANGE ;2004.01.06;    8201;     678;     197;     539;    6854;    7465;    8071;    8201;     130;       0
NYISO ZONE G LBMP SWAP - NEW YORK MERCANTILE EXCHANGE ;2003.12.30;    9609;     942;     593;     583;    7866;    8433;    9391;    9609;     218;       0
NYISO ZONE G LBMP SWAP - NEW YORK MERCANTILE EXCHANGE ;2003.12.22;    9523;     942;     593;     583;    7866;    8347;    9391;    9523;     132;       0
NYISO ZONE G LBMP SWAP - NEW YORK MERCANTILE EXCHANGE ;2003.12.16;    9499;     983;     487;     583;    7801;    8429;    9367;    9499;     132;       0
NYISO ZONE G LBMP SWAP - NEW YORK MERCANTILE EXCHANGE ;2003.12.09;    9417;     983;     577;     583;    7719;    8257;    9285;    9417;     132;       0
NYISO ZONE G LBMP SWAP - NEW YORK MERCANTILE EXCHANGE ;2003.12.02;    8511;     710;    1112;     130;    7539;    7269;    8379;    8511;     132;       0
NYISO ZONE G LBMP SWAP - NEW YORK MERCANTILE EXCHANGE ;2003.11.25;    9379;     900;    1108;     130;    8179;    8141;    9209;    9379;     170;       0
NYISO ZONE G LBMP SWAP - NEW YORK MERCANTILE EXCHANGE ;2003.11.18;    9503;     770;    1544;     212;    8351;    7747;    9333;    9503;     170;       0
NYISO ZONE G LBMP SWAP - NEW YORK MERCANTILE EXCHANGE ;2003.11.11;    8861;     934;     886;     174;    7671;    7801;    8779;    8861;      82;       0
NYISO ZONE G LBMP SWAP - NEW YORK MERCANTILE EXCHANGE ;2003.11.04;    8354;     890;     760;      44;    7382;    7550;    8316;    8354;      38;       0
NYISO ZONE G LBMP SWAP - NEW YORK MERCANTILE EXCHANGE ;2007.03.27;   15056;     852;       0;       0;   14161;   14865;   15013;   14865;      43;     191
NYISO ZONE G LBMP SWAP - NEW YORK MERCANTILE EXCHANGE ;2007.03.20;   15056;     852;       0;       0;   14161;   14865;   15013;   14865;      43;     191
NYISO ZONE G LBMP SWAP - NEW YORK MERCANTILE EXCHANGE ;2007.03.13;   15056;     852;       0;       0;   14161;   14865;   15013;   14865;      43;     191
NYISO ZONE G LBMP SWAP - NEW YORK MERCANTILE EXCHANGE ;2007.03.06;   15056;     852;       0;       0;   14161;   14865;   15013;   14865;      43;     191
NYISO ZONE G LBMP SWAP - NEW YORK MERCANTILE EXCHANGE ;2007.02.27;   15960;     932;       0;       0;   15028;   15749;   15960;   15749;       0;     211
NYISO ZONE G LBMP SWAP - NEW YORK MERCANTILE EXCHANGE ;2007.02.20;   16234;     932;       0;       0;   15239;   16023;   16171;   16023;      63;     211
NYISO ZONE G LBMP SWAP - NEW YORK MERCANTILE EXCHANGE ;2007.02.13;   16234;     932;       0;       0;   15239;   16001;   16171;   16001;      63;     233
NYISO ZONE G LBMP SWAP - NEW YORK MERCANTILE EXCHANGE ;2006.12.26;   17728;    1180;       0;       0;   16505;   17728;   17685;   17728;      43;       0
NYISO ZONE G LBMP SWAP - NEW YORK MERCANTILE EXCHANGE ;2006.12.19;   17728;    1180;       0;       0;   16505;   17728;   17685;   17728;      43;       0
NYISO ZONE G LBMP SWAP - NEW YORK MERCANTILE EXCHANGE ;2006.12.12;   17728;    1180;       0;       0;   16505;   17728;   17685;   17728;      43;       0
NYISO ZONE G LBMP SWAP - NEW YORK MERCANTILE EXCHANGE ;2006.12.05;   17728;    1268;       0;       0;   16417;   17728;   17685;   17728;      43;       0
NYISO ZONE G LBMP SWAP - NEW YORK MERCANTILE EXCHANGE ;2006.11.28;   18463;    1348;       0;       0;   17072;   18463;   18420;   18463;      43;       0
NYISO ZONE G LBMP SWAP - NEW YORK MERCANTILE EXCHANGE ;2006.11.21;   18463;    1348;       0;       0;   17072;   18463;   18420;   18463;      43;       0
NYISO ZONE G LBMP SWAP - NEW YORK MERCANTILE EXCHANGE ;2006.11.14;   18463;    1348;       0;       0;   17072;   18463;   18420;   18463;      43;       0
NYISO ZONE G LBMP SWAP - NEW YORK MERCANTILE EXCHANGE ;2006.11.07;   18375;    1348;       0;       0;   16984;   18375;   18332;   18375;      43;       0
NYISO ZONE G LBMP SWAP - NEW YORK MERCANTILE EXCHANGE ;2006.10.31;   19101;    1524;       0;       0;   17534;   19101;   19058;   19101;      43;       0
NYISO ZONE G LBMP SWAP - NEW YORK MERCANTILE EXCHANGE ;2006.10.24;   19013;    1524;       0;       0;   17446;   19013;   18970;   19013;      43;       0
NYISO ZONE G LBMP SWAP - NEW YORK MERCANTILE EXCHANGE ;2006.10.17;   19013;    1524;       0;       0;   17446;   19013;   18970;   19013;      43;       0
NYISO ZONE G LBMP SWAP - NEW YORK MERCANTILE EXCHANGE ;2006.10.10;   19141;    1524;       0;       0;   17574;   19141;   19098;   19141;      43;       0
NYISO ZONE G LBMP SWAP - NEW YORK MERCANTILE EXCHANGE ;2006.10.03;   19227;    1524;       0;       0;   17660;   19227;   19184;   19227;      43;       0
NYISO ZONE G LBMP SWAP - NEW YORK MERCANTILE EXCHANGE ;2006.09.26;   19355;    1684;      80;       0;   17628;   19275;   19312;   19355;      43;       0
NYISO ZONE G LBMP SWAP - NEW YORK MERCANTILE EXCHANGE ;2006.09.19;   18845;    1684;      80;       0;   17118;   18765;   18802;   18845;      43;       0
NYISO ZONE G LBMP SWAP - NEW YORK MERCANTILE EXCHANGE ;2006.09.12;   18845;    1684;      80;       0;   17161;   18765;   18845;   18845;       0;       0
NYISO ZONE G LBMP SWAP - NEW YORK MERCANTILE EXCHANGE ;2006.09.05;   18845;    1684;      80;       0;   17161;   18765;   18845;   18845;       0;       0
NYISO ZONE G LBMP SWAP - NEW YORK MERCANTILE EXCHANGE ;2006.08.29;   20202;    1845;     172;      69;   18288;   19961;   20202;   20202;       0;       0
NYISO ZONE G LBMP SWAP - NEW YORK MERCANTILE EXCHANGE ;2006.08.22;   20202;    1845;     172;      69;   18288;   19961;   20202;   20202;       0;       0
NYISO ZONE G LBMP SWAP - NEW YORK MERCANTILE EXCHANGE ;2006.08.15;   20248;    1845;     172;      69;   18288;   19961;   20202;   20202;      46;      46
NYISO ZONE G LBMP SWAP - NEW YORK MERCANTILE EXCHANGE ;2006.08.08;   16374;    1845;     172;      69;   14460;   16133;   16374;   16374;       0;       0
NYISO ZONE G LBMP SWAP - NEW YORK MERCANTILE EXCHANGE ;2006.08.01;   17634;    2065;     252;     129;   15440;   17093;   17634;   17474;       0;     160
NYISO ZONE G LBMP SWAP - NEW YORK MERCANTILE EXCHANGE ;2006.07.25;   17425;    2065;     252;     129;   15231;   17044;   17425;   17425;       0;       0
NYISO ZONE G LBMP SWAP - NEW YORK MERCANTILE EXCHANGE ;2006.07.18;   17425;    2065;     252;     129;   15231;   17044;   17425;   17425;       0;       0
NYISO ZONE G LBMP SWAP - NEW YORK MERCANTILE EXCHANGE ;2006.07.11;   16022;    2065;     252;     129;   13828;   15641;   16022;   16022;       0;       0
NYISO ZONE G LBMP SWAP - NEW YORK MERCANTILE EXCHANGE ;2006.07.03;   16946;    2285;     340;     129;   14488;   16477;   16902;   16946;      44;       0
NYISO ZONE G LBMP SWAP - NEW YORK MERCANTILE EXCHANGE ;2006.06.27;   16866;    2205;     340;     129;   14532;   16397;   16866;   16866;       0;       0
NYISO ZONE G LBMP SWAP - NEW YORK MERCANTILE EXCHANGE ;2006.06.20;   17419;    2377;     512;       0;   15042;   16907;   17419;   17419;       0;       0
NYISO ZONE G LBMP SWAP - NEW YORK MERCANTILE EXCHANGE ;2006.06.13;   15172;    3053;     512;       0;   12119;   14660;   15172;   15172;       0;       0
NYISO ZONE G LBMP SWAP - NEW YORK MERCANTILE EXCHANGE ;2006.06.06;   15132;    3053;     598;       0;   11993;   14448;   15046;   15046;      86;      86
NYISO ZONE G LBMP SWAP - NEW YORK MERCANTILE EXCHANGE ;2006.05.30;   16091;    2966;     644;     308;   12643;   15053;   15917;   16005;     174;      86
NYISO ZONE G LBMP SWAP - NEW YORK MERCANTILE EXCHANGE ;2006.05.23;   16109;    2966;     644;     308;   12835;   15157;   16109;   16109;       0;       0
NYISO ZONE G LBMP SWAP - NEW YORK MERCANTILE EXCHANGE ;2006.05.16;   15383;    2966;     600;     308;   12109;   14475;   15383;   15383;       0;       0
NYISO ZONE G LBMP SWAP - NEW YORK MERCANTILE EXCHANGE ;2006.05.09;   15361;    2966;     600;     308;   12087;   14453;   15361;   15361;       0;       0
NYISO ZONE G LBMP SWAP - NEW YORK MERCANTILE EXCHANGE ;2006.05.02;   15301;    2966;     600;     308;   12027;   14393;   15301;   15301;       0;       0
NYISO ZONE G LBMP SWAP - NEW YORK MERCANTILE EXCHANGE ;2006.04.25;   16431;    3326;     760;     308;   12797;   15363;   16431;   16431;       0;       0
NYISO ZONE G LBMP SWAP - NEW YORK MERCANTILE EXCHANGE ;2006.04.18;   15281;    2614;    1024;       0;   12532;   14257;   15146;   15281;     135;       0
NYISO ZONE G LBMP SWAP - NEW YORK MERCANTILE EXCHANGE ;2006.04.11;   14474;    2614;     980;       0;   11670;   13494;   14284;   14474;     190;       0
NYISO ZONE G LBMP SWAP - NEW YORK MERCANTILE EXCHANGE ;2006.04.04;   14210;    2614;     804;       0;   11406;   13406;   14020;   14210;     190;       0
NYISO ZONE G LBMP SWAP - NEW YORK MERCANTILE EXCHANGE ;2006.03.28;   14791;    4156;     808;    1323;    9099;   12660;   14578;   14791;     213;       0
NYISO ZONE G LBMP SWAP - NEW YORK MERCANTILE EXCHANGE ;2006.03.21;   13907;    4325;     808;    1323;    8046;   11138;   13694;   13269;     213;     638
NYISO ZONE G LBMP SWAP - NEW YORK MERCANTILE EXCHANGE ;2006.03.14;   13203;    3775;     768;    1323;    7892;   11112;   12990;   13203;     213;       0
NYISO ZONE G LBMP SWAP - NEW YORK MERCANTILE EXCHANGE ;2006.03.07;   12935;    3571;     728;    1367;    7784;   10541;   12722;   12636;     213;     299
NYISO ZONE G LBMP SWAP - NEW YORK MERCANTILE EXCHANGE ;2006.02.28;   13935;    3311;     968;    1707;    8664;   11260;   13682;   13935;     253;       0
NYISO ZONE G LBMP SWAP - NEW YORK MERCANTILE EXCHANGE ;2006.02.21;   13868;    2801;     968;    1707;    8641;   10727;   13149;   13402;     719;     466
NYISO ZONE G LBMP SWAP - NEW YORK MERCANTILE EXCHANGE ;2006.02.14;   12552;    2122;    2500;     430;    9281;    9156;   11833;   12086;     719;     466
NYISO ZONE G LBMP SWAP - NEW YORK MERCANTILE EXCHANGE ;2006.02.07;   11721;    2122;    1432;     579;    8299;    9242;   11000;   11253;     721;     468
NYISO ZONE G LBMP SWAP - NEW YORK MERCANTILE EXCHANGE ;2006.01.31;   12040;    2904;    1644;     912;    7463;    9018;   11279;   11574;     761;     466
NYISO ZONE G LBMP SWAP - NEW YORK MERCANTILE EXCHANGE ;2006.01.24;   13315;    4179;    1644;     912;    7463;   10293;   12554;   12849;     761;     466
NYISO ZONE G LBMP SWAP - NEW YORK MERCANTILE EXCHANGE ;2006.01.17;   13747;    4263;    1644;     920;    7849;   10757;   13032;   13321;     715;     426
NYISO ZONE G LBMP SWAP - NEW YORK MERCANTILE EXCHANGE ;2006.01.10;   13656;    4029;    2278;    1077;    7789;    9835;   12895;   13190;     761;     466
NYISO ZONE G LBMP SWAP - NEW YORK MERCANTILE EXCHANGE ;2006.01.03;   14136;    4285;    2786;     990;    8566;   10360;   13841;   14136;     295;       0
NYISO ZONE G LBMP SWAP - NEW YORK MERCANTILE EXCHANGE ;2005.12.27;   13767;    4326;    2786;     949;    8238;   10032;   13513;   13767;     254;       0
NYISO ZONE G LBMP SWAP - NEW YORK MERCANTILE EXCHANGE ;2005.12.20;   13767;    4572;    2786;     703;    8238;   10278;   13513;   13767;     254;       0
NYISO ZONE G LBMP SWAP - NEW YORK MERCANTILE EXCHANGE ;2005.12.13;   13646;    2172;    4890;     592;   10542;    8078;   13306;   13560;     340;      86
NYISO ZONE G LBMP SWAP - NEW YORK MERCANTILE EXCHANGE ;2005.12.06;   12992;    1744;    4052;     592;   10316;    8262;   12652;   12906;     340;      86
NYISO ZONE G LBMP SWAP - NEW YORK MERCANTILE EXCHANGE ;2005.11.29;   12836;    1677;    5453;     846;    9973;    6451;   12496;   12750;     340;      86
NYISO ZONE G LBMP SWAP - NEW YORK MERCANTILE EXCHANGE ;2005.11.22;   12582;    1677;    5199;     932;    9973;    6451;   12582;   12582;       0;       0
NYISO ZONE G LBMP SWAP - NEW YORK MERCANTILE EXCHANGE ;2005.11.15;   11348;    1677;    4351;     846;    8825;    6151;   11348;   11348;       0;       0
NYISO ZONE G LBMP SWAP - NEW YORK MERCANTILE EXCHANGE ;2005.11.08;   11628;    1677;    4372;     846;    9105;    6320;   11628;   11538;       0;      90
NYISO ZONE G LBMP SWAP - NEW YORK MERCANTILE EXCHANGE ;2005.11.01;   11019;    2745;    3381;    2106;    6168;    5532;   11019;   11019;       0;       0
NYISO ZONE G LBMP SWAP - NEW YORK MERCANTILE EXCHANGE ;2005.10.25;    9407;     743;    3459;    2454;    6210;    3494;    9407;    9407;       0;       0
NYISO ZONE G LBMP SWAP - NEW YORK MERCANTILE EXCHANGE ;2005.10.18;    9243;     743;    3295;    2454;    6046;    3494;    9243;    9243;       0;       0
NYISO ZONE G LBMP SWAP - NEW YORK MERCANTILE EXCHANGE ;2005.10.11;    8798;     684;    2606;    2450;    5664;    3742;    8798;    8798;       0;       0
NYISO ZONE G LBMP SWAP - NEW YORK MERCANTILE EXCHANGE ;2005.10.04;    9348;     684;    2648;    2450;    5706;    3742;    8840;    8840;     508;     508
NYISO ZONE G LBMP SWAP - NEW YORK MERCANTILE EXCHANGE ;2005.09.27;   10822;    1062;    3341;    2576;    6676;    4397;   10314;   10314;     508;     508
NYISO ZONE G LBMP SWAP - NEW YORK MERCANTILE EXCHANGE ;2005.09.20;   10696;     936;    3341;    2576;    6676;    4271;   10188;   10188;     508;     508
NYISO ZONE G LBMP SWAP - NEW YORK MERCANTILE EXCHANGE ;2005.09.13;    9957;     260;    3513;    1791;    6550;    4145;    8601;    9449;    1356;     508
NYISO ZONE G LBMP SWAP - NEW YORK MERCANTILE EXCHANGE ;2005.09.06;   10259;     260;    3979;    1833;    6768;    3897;    8861;    9709;    1398;     550
NYISO ZONE G LBMP SWAP - NEW YORK MERCANTILE EXCHANGE ;2005.08.30;   12194;     582;    4236;    2128;    8212;    4814;   10922;   11178;    1272;    1016
NYISO ZONE G LBMP SWAP - NEW YORK MERCANTILE EXCHANGE ;2005.08.23;   11566;     540;    3354;    2842;    6906;    4814;   10288;   11010;    1278;     556
NYISO ZONE G LBMP SWAP - NEW YORK MERCANTILE EXCHANGE ;2005.08.16;   12257;     540;    3354;    2842;    7605;    5003;   10987;   11199;    1270;    1058
NYISO ZONE G LBMP SWAP - NEW YORK MERCANTILE EXCHANGE ;2005.08.09;   10630;     540;    3478;    2590;    6906;    3970;   10036;   10038;     594;     592
NYISO ZONE G LBMP SWAP - NEW YORK MERCANTILE EXCHANGE ;2005.08.02;   10204;     582;    3562;    2527;    6543;    3565;    9652;    9654;     552;     550
NYISO ZONE G LBMP SWAP - NEW YORK MERCANTILE EXCHANGE ;2005.07.26;   11278;     780;    3914;    2737;    7209;    4077;   10726;   10728;     552;     550
NYISO ZONE G LBMP SWAP - NEW YORK MERCANTILE EXCHANGE ;2005.07.19;   10852;     780;    3788;    2437;    7083;    4077;   10300;   10302;     552;     550
NYISO ZONE G LBMP SWAP - NEW YORK MERCANTILE EXCHANGE ;2005.07.12;    9234;     694;    2770;    2351;    6189;    4113;    9234;    9234;       0;       0
NYISO ZONE G LBMP SWAP - NEW YORK MERCANTILE EXCHANGE ;2005.07.05;    9078;     694;    2426;    2615;    5515;    4037;    8824;    9078;     254;       0
NYISO ZONE G LBMP SWAP - NEW YORK MERCANTILE EXCHANGE ;2005.06.28;    9636;     230;    2410;    2745;    6661;    4227;    9636;    9382;       0;     254
NYISO ZONE G LBMP SWAP - NEW YORK MERCANTILE EXCHANGE ;2005.06.21;    9378;     174;    3782;    1159;    7881;    4273;    9214;    9214;     164;     164
NYISO ZONE G LBMP SWAP - NEW YORK MERCANTILE EXCHANGE ;2005.06.14;    9000;     260;    4126;     815;    7713;    3933;    8788;    8874;     212;     126
NYISO ZONE G LBMP SWAP - NEW YORK MERCANTILE EXCHANGE ;2005.06.07;    8783;     174;    4800;     772;    7793;    3211;    8739;    8783;      44;       0
NYISO ZONE G LBMP SWAP - NEW YORK MERCANTILE EXCHANGE ;2005.05.31;    9155;     216;    5052;     856;    8039;    3247;    9111;    9155;      44;       0
NYISO ZONE G LBMP SWAP - NEW YORK MERCANTILE EXCHANGE ;2005.05.24;    8979;     172;    5302;     856;    7951;    2821;    8979;    8979;       0;       0
NYISO ZONE G LBMP SWAP - NEW YORK MERCANTILE EXCHANGE ;2005.05.17;    8935;     172;    5474;     856;    7907;    2605;    8935;    8935;       0;       0
NYISO ZONE G LBMP SWAP - NEW YORK MERCANTILE EXCHANGE ;2005.05.10;    8935;     172;    5474;     856;    7907;    2605;    8935;    8935;       0;       0
NYISO ZONE G LBMP SWAP - NEW YORK MERCANTILE EXCHANGE ;2005.05.03;    8719;     172;    5474;     856;    7691;    2389;    8719;    8719;       0;       0
NYISO ZONE G LBMP SWAP - NEW YORK MERCANTILE EXCHANGE ;2005.04.26;    9412;     256;    6319;     856;    8300;    2237;    9412;    9412;       0;       0
NYISO ZONE G LBMP SWAP - NEW YORK MERCANTILE EXCHANGE ;2005.03.29;    8994;     348;    5792;     856;    7790;    2346;    8994;    8994;       0;       0
NYISO ZONE G LBMP SWAP - NEW YORK MERCANTILE EXCHANGE ;2005.03.01;    9318;     218;    5614;    1228;    7872;    2476;    9318;    9318;       0;       0
NYISO ZONE G LBMP SWAP - NEW YORK MERCANTILE EXCHANGE ;2005.02.22;    9360;     218;    5614;    1228;    7914;    2518;    9360;    9360;       0;       0
NYISO ZONE G LBMP SWAP - NEW YORK MERCANTILE EXCHANGE ;2005.02.15;    9314;     218;    4598;    1736;    7360;    2980;    9314;    9314;       0;       0
NYISO ZONE G LBMP SWAP - NEW YORK MERCANTILE EXCHANGE ;2005.02.08;    8580;     218;    4736;    1048;    7314;    2796;    8580;    8580;       0;       0
NYISO ZONE G LBMP SWAP - NEW YORK MERCANTILE EXCHANGE ;2005.02.01;    7622;     302;    2514;    1346;    5974;    3594;    7622;    7454;       0;     168
NYISO ZONE G LBMP SWAP - NEW YORK MERCANTILE EXCHANGE ;2005.01.25;    7536;     302;    2686;    1174;    6060;    3676;    7536;    7536;       0;       0
NYISO ZONE G LBMP SWAP - NEW YORK MERCANTILE EXCHANGE ;2005.01.18;    7536;     302;    2686;    1174;    6060;    3676;    7536;    7536;       0;       0
NYISO ZONE G LBMP SWAP - NEW YORK MERCANTILE EXCHANGE ;2005.01.11;    7536;     544;    2928;     932;    6060;    3676;    7536;    7536;       0;       0
NYISO ZONE G LBMP SWAP - NEW YORK MERCANTILE EXCHANGE ;2005.01.04;    6860;     842;    2550;     634;    5384;    3424;    6860;    6608;       0;     252
NYISO ZONE G LBMP SWAP - NEW YORK MERCANTILE EXCHANGE ;2004.12.28;    7654;     888;    2090;    1094;    5649;    4470;    7631;    7654;      23;       0
NYISO ZONE G LBMP SWAP - NEW YORK MERCANTILE EXCHANGE ;2004.12.21;    7654;     888;    2090;    1094;    5649;    4470;    7631;    7654;      23;       0
NYISO ZONE G LBMP SWAP - NEW YORK MERCANTILE EXCHANGE ;2004.12.14;    6779;     800;    2720;     586;    5370;    3473;    6756;    6779;      23;       0
NYISO ZONE G LBMP SWAP - NEW YORK MERCANTILE EXCHANGE ;2004.12.07;    6697;     718;    2720;     586;    5370;    3391;    6674;    6697;      23;       0
NYISO ZONE G LBMP SWAP - NEW YORK MERCANTILE EXCHANGE ;2004.11.30;    7413;     760;    2548;     964;    5599;    3901;    7323;    7413;      90;       0
NYISO ZONE G LBMP SWAP - NEW YORK MERCANTILE EXCHANGE ;2004.11.23;    7413;     760;    2502;    1010;    5599;    3901;    7369;    7413;      44;       0
NYISO ZONE G LBMP SWAP - NEW YORK MERCANTILE EXCHANGE ;2004.11.16;    7367;     714;    2502;    1010;    5599;    3855;    7323;    7367;      44;       0
NYISO ZONE G LBMP SWAP - NEW YORK MERCANTILE EXCHANGE ;2004.11.09;    6823;     630;    1912;    1056;    5093;    3855;    6779;    6823;      44;       0
NYISO ZONE G LBMP SWAP - NEW YORK MERCANTILE EXCHANGE ;2004.11.02;    6695;     630;    1794;    1010;    5011;    3891;    6651;    6695;      44;       0
NYISO ZONE G LBMP SWAP - NEW YORK MERCANTILE EXCHANGE ;2004.10.26;    7237;     714;     824;    1514;    4944;    4899;    7172;    7237;      65;       0
NYISO ZONE G LBMP SWAP - NEW YORK MERCANTILE EXCHANGE ;2004.10.19;    7283;     714;     824;    1514;    4944;    4899;    7172;    7237;     111;      46
NYISO ZONE G LBMP SWAP - NEW YORK MERCANTILE EXCHANGE ;2004.10.12;    7283;     714;     824;    1514;    4944;    4899;    7172;    7237;     111;      46
NYISO ZONE G LBMP SWAP - NEW YORK MERCANTILE EXCHANGE ;2004.10.05;    7283;     668;     824;    1560;    4990;    4899;    7218;    7283;      65;       0
NYISO ZONE G LBMP SWAP - NEW YORK MERCANTILE EXCHANGE ;2004.09.28;    8102;     626;     759;    1791;    5599;    5552;    8016;    8102;      86;       0
NYISO ZONE G LBMP SWAP - NEW YORK MERCANTILE EXCHANGE ;2004.09.21;    7838;     584;     495;    1791;    5377;    5552;    7752;    7838;      86;       0
NYISO ZONE G LBMP SWAP - NEW YORK MERCANTILE EXCHANGE ;2004.09.14;    7838;     584;     495;    1791;    5377;    5552;    7752;    7838;      86;       0
NYISO ZONE G LBMP SWAP - NEW YORK MERCANTILE EXCHANGE ;2004.09.07;    7796;     599;     468;    1818;    5293;    5510;    7710;    7796;      86;       0
NYISO ZONE G LBMP SWAP - NEW YORK MERCANTILE EXCHANGE ;2004.08.31;    8814;     782;     321;    1883;    6041;    6610;    8706;    8814;     108;       0
NYISO ZONE G LBMP SWAP - NEW YORK MERCANTILE EXCHANGE ;2004.08.24;    8814;     782;     321;    1883;    6041;    6610;    8706;    8814;     108;       0
NYISO ZONE G LBMP SWAP - NEW YORK MERCANTILE EXCHANGE ;2004.08.17;    8898;     782;     237;    1967;    5957;    6610;    8706;    8814;     192;      84
NYISO ZONE G LBMP SWAP - NEW YORK MERCANTILE EXCHANGE ;2004.08.10;    8730;     614;     237;    2051;    5957;    6442;    8622;    8730;     108;       0
NYISO ZONE G LBMP SWAP - NEW YORK MERCANTILE EXCHANGE ;2004.08.03;    8818;     572;     237;    2051;    6087;    6530;    8710;    8818;     108;       0
NYISO ZONE G LBMP SWAP - NEW YORK MERCANTILE EXCHANGE ;2004.07.27;   10162;     902;       0;    2288;    6843;    7874;   10033;   10162;     129;       0
NYISO ZONE G LBMP SWAP - NEW YORK MERCANTILE EXCHANGE ;2004.07.20;   10099;     818;       0;    2372;    6780;    7727;    9970;   10099;     129;       0
NYISO ZONE G LBMP SWAP - NEW YORK MERCANTILE EXCHANGE ;2004.07.13;   10099;     989;       0;    2372;    6738;    7727;   10099;   10099;       0;       0
NYISO ZONE G LBMP SWAP - NEW YORK MERCANTILE EXCHANGE ;2004.07.06;    9969;    1285;     210;    2032;    6652;    7727;    9969;    9969;       0;       0
NYISO ZONE G LBMP SWAP - NEW YORK MERCANTILE EXCHANGE ;2004.06.29;   11641;    1302;     223;    2239;    8100;    9179;   11641;   11641;       0;       0
NYISO ZONE G LBMP SWAP - NEW YORK MERCANTILE EXCHANGE ;2004.06.22;   11599;    1302;     223;    2239;    8058;    9137;   11599;   11599;       0;       0
NYISO ZONE G LBMP SWAP - NEW YORK MERCANTILE EXCHANGE ;2004.06.15;   11429;    1272;     145;    2187;    7970;    9097;   11429;   11429;       0;       0
NYISO ZONE G LBMP SWAP - NEW YORK MERCANTILE EXCHANGE ;2004.06.08;   11257;    1314;     317;    1931;    7970;    9009;   11215;   11257;      42;       0
NYISO ZONE G LBMP SWAP - NEW YORK MERCANTILE EXCHANGE ;2004.06.01;   12193;    1352;     115;    2051;    8790;    9867;   12193;   12033;       0;     160
NYISO ZONE G LBMP SWAP - NEW YORK MERCANTILE EXCHANGE ;2004.05.25;   12087;    1478;     285;    1903;    8706;    9899;   12087;   12087;       0;       0
NYISO ZONE G LBMP SWAP - NEW YORK MERCANTILE EXCHANGE ;2004.05.18;   11787;    1432;     587;    1623;    8732;    9577;   11787;   11787;       0;       0
NYISO ZONE G LBMP SWAP - NEW YORK MERCANTILE EXCHANGE ;2004.05.11;   10272;    1434;     899;     823;    8015;    8550;   10272;   10272;       0;       0
NYISO ZONE G LBMP SWAP - NEW YORK MERCANTILE EXCHANGE ;2004.05.04;   10656;    1478;    1409;     779;    8399;    8468;   10656;   10656;       0;       0
NYISO ZONE G LBMP SWAP - NEW YORK MERCANTILE EXCHANGE ;2004.04.27;   11260;    1786;    1453;     779;    8695;    9028;   11260;   11260;       0;       0
NYISO ZONE G LBMP SWAP - NEW YORK MERCANTILE EXCHANGE ;2004.04.20;   11090;    1786;    1369;     819;    8485;    8902;   11090;   11090;       0;       0
NYISO ZONE G LBMP SWAP - NEW YORK MERCANTILE EXCHANGE ;2004.04.12;    9624;    1746;     830;     848;    7030;    7946;    9624;    9624;       0;       0
NYISO ZONE G LBMP SWAP - NEW YORK MERCANTILE EXCHANGE ;2004.04.06;    9114;    1746;     830;     848;    6520;    7436;    9114;    9114;       0;       0
NYISO ZONE G LBMP SWAP - NEW YORK MERCANTILE EXCHANGE ;2004.03.30;    9993;    1924;     678;    1010;    7013;    8259;    9947;    9947;      46;      46
NYISO ZONE G LBMP SWAP - NEW YORK MERCANTILE EXCHANGE ;2004.03.23;    9160;    2092;     206;     950;    6072;    7958;    9114;    9114;      46;      46
NYISO ZONE G LBMP SWAP - NEW YORK MERCANTILE EXCHANGE ;2004.03.16;    8408;    2558;     206;     440;    5298;    7716;    8296;    8362;     112;      46
NYISO ZONE G LBMP SWAP - NEW YORK MERCANTILE EXCHANGE ;2004.03.09;    8023;    2518;     292;     394;    5065;    7291;    7977;    7977;      46;      46
NYISO ZONE G LBMP SWAP - NEW YORK MERCANTILE EXCHANGE ;2004.03.02;    8003;    2854;     292;     354;    4749;    7311;    7957;    7957;      46;      46
NYISO ZONE G LBMP SWAP - NEW YORK MERCANTILE EXCHANGE ;2004.02.24;    8058;    2210;       0;     412;    5390;    7600;    8012;    8012;      46;      46
NYISO ZONE G LBMP SWAP - NEW YORK MERCANTILE EXCHANGE ;2004.01.27;    8044;    2269;       0;     246;    5365;    7634;    7880;    7880;     164;     164
NYISO ZONE G LBMP SWAP - NEW YORK MERCANTILE EXCHANGE ;2004.01.20;    8172;    1706;      17;     539;    5797;    7616;    8042;    8172;     130;       0
NYISO ZONE G LBMP SWAP - NEW YORK MERCANTILE EXCHANGE ;2004.01.13;    8172;    1706;      17;     539;    5797;    7616;    8042;    8172;     130;       0
NYISO ZONE G LBMP SWAP - NEW YORK MERCANTILE EXCHANGE ;2004.01.06;    8201;     678;     197;     539;    6854;    7465;    8071;    8201;     130;       0
NYISO ZONE G LBMP SWAP - NEW YORK MERCANTILE EXCHANGE ;2003.12.30;    9609;     942;     593;     583;    7866;    8433;    9391;    9609;     218;       0
NYISO ZONE G LBMP SWAP - NEW YORK MERCANTILE EXCHANGE ;2003.12.22;    9523;     942;     593;     583;    7866;    8347;    9391;    9523;     132;       0
NYISO ZONE G LBMP SWAP - NEW YORK MERCANTILE EXCHANGE ;2003.12.16;    9499;     983;     487;     583;    7801;    8429;    9367;    9499;     132;       0
NYISO ZONE G LBMP SWAP - NEW YORK MERCANTILE EXCHANGE ;2003.12.09;    9417;     983;     577;     583;    7719;    8257;    9285;    9417;     132;       0
NYISO ZONE G LBMP SWAP - NEW YORK MERCANTILE EXCHANGE ;2003.12.02;    8511;     710;    1112;     130;    7539;    7269;    8379;    8511;     132;       0
NYISO ZONE G LBMP SWAP - NEW YORK MERCANTILE EXCHANGE ;2003.11.25;    9379;     900;    1108;     130;    8179;    8141;    9209;    9379;     170;       0
NYISO ZONE G LBMP SWAP - NEW YORK MERCANTILE EXCHANGE ;2003.11.18;    9503;     770;    1544;     212;    8351;    7747;    9333;    9503;     170;       0
NYISO ZONE G LBMP SWAP - NEW YORK MERCANTILE EXCHANGE ;2003.11.11;    8861;     934;     886;     174;    7671;    7801;    8779;    8861;      82;       0
NYISO ZONE G LBMP SWAP - NEW YORK MERCANTILE EXCHANGE ;2003.11.04;    8354;     890;     760;      44;    7382;    7550;    8316;    8354;      38;       0
