BFP MILK;SUGAR AND COCOA EXCHANG ;01 ;052 ;     359;       0;     124;      52;      85;     146;     137;     321
BFP MILK;SUGAR AND COCOA EXCHANG ;01 ;052 ;     353;       1;     119;      51;      85;     145;     136;     315
BFP MILK;SUGAR AND COCOA EXCHANG ;01 ;052 ;     358;       1;     119;      53;      85;     148;     139;     319
BFP MILK;COCOA AND SUGAR EXCHANG ;01 ;052 ;     374;       2;      86;      33;      85;     118;     119;     238
BFP MILK;COCOA AND SUGAR EXCHANG ;01 ;052 ;     340;       4;     102;      33;      91;     137;     127;     271
BFP MILK;COCOA AND SUGAR EXCHANG ;01 ;052 ;     336;       4;     102;      31;      91;     134;     126;     268
BFP MILK; SUGAR & COCOA EXCHANGE ;01 ;052 ;     654;       0;     157;     116;     245;     251;     361;     525
BFP MILK; SUGAR & COCOA EXCHANGE ;01 ;052 ;     601;       0;     148;     107;     188;     203;     295;     457
BFP MILK; SUGAR & COCOA EXCHANGE ;01 ;052 ;     782;     139;     295;     135;     320;     236;     593;     666
BFP MILK; SUGAR & COCOA EXCHANGE ;01 ;052 ;     981;     146;     275;     149;     286;     323;     581;     747
BFP MILK; SUGAR & COCOA EXCHANGE ;01 ;052 ;     978;     145;     273;     152;     282;     318;     579;     743
BFP MILK; SUGAR & COCOA EXCHANGE ;01 ;052 ;     972;     145;     270;     150;     279;     318;     574;     738
BFP MILK; SUGAR & COCOA EXCHANGE ;01 ;052 ;     995;     138;     292;     147;     284;     324;     570;     763
BFP MILK; SUGAR & COCOA EXCHANGE ;01 ;052 ;    1230;     254;     316;     181;     276;     479;     711;     976
BFP MILK; SUGAR & COCOA EXCHANGE ;01 ;052 ;    1168;     248;     298;     162;     243;     477;     653;     937
BFP MILK;SUGAR AND COCOA EXCHANG ;01 ;052 ;     359;       0;     124;      52;      85;     146;     137;     321
BFP MILK;SUGAR AND COCOA EXCHANG ;01 ;052 ;     353;       1;     119;      51;      85;     145;     136;     315
BFP MILK;SUGAR AND COCOA EXCHANG ;01 ;052 ;     358;       1;     119;      53;      85;     148;     139;     319
BFP MILK;COCOA AND SUGAR EXCHANG ;01 ;052 ;     374;       2;      86;      33;      85;     118;     119;     238
BFP MILK;COCOA AND SUGAR EXCHANG ;01 ;052 ;     340;       4;     102;      33;      91;     137;     127;     271
BFP MILK;COCOA AND SUGAR EXCHANG ;01 ;052 ;     336;       4;     102;      31;      91;     134;     126;     268
BFP MILK; SUGAR & COCOA EXCHANGE ;01 ;052 ;     654;       0;     157;     116;     245;     251;     361;     525
BFP MILK; SUGAR & COCOA EXCHANGE ;01 ;052 ;     601;       0;     148;     107;     188;     203;     295;     457
BFP MILK; SUGAR & COCOA EXCHANGE ;01 ;052 ;     782;     139;     295;     135;     320;     236;     593;     666
BFP MILK; SUGAR & COCOA EXCHANGE ;01 ;052 ;     981;     146;     275;     149;     286;     323;     581;     747
BFP MILK; SUGAR & COCOA EXCHANGE ;01 ;052 ;     978;     145;     273;     152;     282;     318;     579;     743
BFP MILK; SUGAR & COCOA EXCHANGE ;01 ;052 ;     972;     145;     270;     150;     279;     318;     574;     738
BFP MILK; SUGAR & COCOA EXCHANGE ;01 ;052 ;     995;     138;     292;     147;     284;     324;     570;     763
BFP MILK; SUGAR & COCOA EXCHANGE ;01 ;052 ;    1230;     254;     316;     181;     276;     479;     711;     976
BFP MILK; SUGAR & COCOA EXCHANGE ;01 ;052 ;    1168;     248;     298;     162;     243;     477;     653;     937
BFP MILK;SUGAR AND COCOA EXCHANG ;01 ;052 ;     359;       0;     124;      52;      85;     146;     137;     321
BFP MILK;SUGAR AND COCOA EXCHANG ;01 ;052 ;     353;       1;     119;      51;      85;     145;     136;     315
BFP MILK;SUGAR AND COCOA EXCHANG ;01 ;052 ;     358;       1;     119;      53;      85;     148;     139;     319
BFP MILK;COCOA AND SUGAR EXCHANG ;01 ;052 ;     374;       2;      86;      33;      85;     118;     119;     238
BFP MILK;COCOA AND SUGAR EXCHANG ;01 ;052 ;     340;       4;     102;      33;      91;     137;     127;     271
BFP MILK;COCOA AND SUGAR EXCHANG ;01 ;052 ;     336;       4;     102;      31;      91;     134;     126;     268
BFP MILK; SUGAR & COCOA EXCHANGE ;01 ;052 ;     654;       0;     157;     116;     245;     251;     361;     525
BFP MILK; SUGAR & COCOA EXCHANGE ;01 ;052 ;     601;       0;     148;     107;     188;     203;     295;     457
BFP MILK; SUGAR & COCOA EXCHANGE ;01 ;052 ;     782;     139;     295;     135;     320;     236;     593;     666
BFP MILK; SUGAR & COCOA EXCHANGE ;01 ;052 ;     981;     146;     275;     149;     286;     323;     581;     747
BFP MILK; SUGAR & COCOA EXCHANGE ;01 ;052 ;     978;     145;     273;     152;     282;     318;     579;     743
BFP MILK; SUGAR & COCOA EXCHANGE ;01 ;052 ;     972;     145;     270;     150;     279;     318;     574;     738
BFP MILK; SUGAR & COCOA EXCHANGE ;01 ;052 ;     995;     138;     292;     147;     284;     324;     570;     763
BFP MILK; SUGAR & COCOA EXCHANGE ;01 ;052 ;    1230;     254;     316;     181;     276;     479;     711;     976
BFP MILK; SUGAR & COCOA EXCHANGE ;01 ;052 ;    1168;     248;     298;     162;     243;     477;     653;     937
