DIAMMONIUM PHOSPHATE - CHICAGO BOARD OF TRADE ;1996.03.12;     282;       0;       0;       0;      59;     166;      59;     166;     223;     116
DIAMMONIUM PHOSPHATE - CHICAGO BOARD OF TRADE ;1996.03.05;     260;       0;       0;       0;      59;     166;      59;     166;     201;      94
DIAMMONIUM PHOSPHATE - CHICAGO BOARD OF TRADE ;1996.02.27;     250;       0;       0;       0;      54;     173;      54;     173;     196;      77
DIAMMONIUM PHOSPHATE - CHICAGO BOARD OF TRADE ;1996.02.20;     286;      55;       0;       0;      25;     201;      80;     201;     206;      85
DIAMMONIUM PHOSPHATE - CHICAGO BOARD OF TRADE ;1996.02.13;     242;      80;       0;       0;       0;     202;      80;     202;     162;      40
DIAMMONIUM PHOSPHATE - CHICAGO BOARD OF TRADE ;1996.02.06;     240;      85;       0;       0;       0;     195;      85;     195;     155;      45
DIAMMONIUM PHOSPHATE - CHICAGO BOARD OF TRADE ;1996.01.30;     258;      85;       0;       0;      26;     195;     111;     195;     147;      63
DIAMMONIUM PHOSPHATE - CHICAGO BOARD OF TRADE ;1996.01.23;     233;      85;       0;       0;       0;     195;      85;     195;     148;      38
DIAMMONIUM PHOSPHATE - CHICAGO BOARD OF TRADE ;1996.01.16;     245;      95;       0;       0;       0;     206;      95;     206;     150;      39
DIAMMONIUM PHOSPHATE - CHICAGO BOARD OF TRADE ;1996.01.09;     249;      95;       0;       0;       0;     206;      95;     206;     154;      43
DIAMMONIUM PHOSPHATE - CHICAGO BOARD OF TRADE ;1996.01.02;     252;      95;       0;       0;       0;     206;      95;     206;     157;      46
DIAMMONIUM PHOSPHATE - CHICAGO BOARD OF TRADE ;1995.12.26;     252;      95;       0;       0;       0;     206;      95;     206;     157;      46
DIAMMONIUM PHOSPHATE - CHICAGO BOARD OF TRADE ;1995.12.19;     252;      95;       0;       0;       0;     206;      95;     206;     157;      46
DIAMMONIUM PHOSPHATE - CHICAGO BOARD OF TRADE ;1995.12.12;     263;      95;       0;       0;       0;     208;      95;     208;     168;      55
DIAMMONIUM PHOSPHATE - CHICAGO BOARD OF TRADE ;1995.12.05;     257;      95;       0;       0;       0;     207;      95;     207;     162;      50
DIAMMONIUM PHOSPHATE - CHICAGO BOARD OF TRADE ;1995.11.28;     297;      95;       0;       0;       0;     234;      95;     234;     202;      63
DIAMMONIUM PHOSPHATE - CHICAGO BOARD OF TRADE ;1995.11.21;     270;      95;       0;       0;       0;     217;      95;     217;     175;      53
DIAMMONIUM PHOSPHATE - CHICAGO BOARD OF TRADE ;1995.11.14;     270;     106;       0;       0;      25;     175;     131;     175;     139;      95
DIAMMONIUM PHOSPHATE - CHICAGO BOARD OF TRADE ;1995.11.07;     256;     110;       0;       0;       0;     150;     110;     150;     146;     106
DIAMMONIUM PHOSPHATE - CHICAGO BOARD OF TRADE ;1995.10.31;     251;      83;       0;       0;      32;     181;     115;     181;     136;      70
DIAMMONIUM PHOSPHATE - CHICAGO BOARD OF TRADE ;1995.10.24;     286;      83;       0;       0;      25;     208;     108;     208;     178;      78
DIAMMONIUM PHOSPHATE - CHICAGO BOARD OF TRADE ;1995.10.17;     269;      81;       0;       0;      25;     150;     106;     150;     163;     119
DIAMMONIUM PHOSPHATE - CHICAGO BOARD OF TRADE ;1995.10.10;     249;      81;       0;       0;      25;     123;     106;     123;     143;     126
DIAMMONIUM PHOSPHATE - CHICAGO BOARD OF TRADE ;1995.10.03;     241;      70;       0;       0;      25;     150;      95;     150;     146;      91
DIAMMONIUM PHOSPHATE - CHICAGO BOARD OF TRADE ;1995.09.26;     225;      70;       0;       0;      25;     146;      95;     146;     130;      79
DIAMMONIUM PHOSPHATE - CHICAGO BOARD OF TRADE ;1995.09.19;     228;      35;       0;       0;      25;     117;      60;     117;     168;     111
DIAMMONIUM PHOSPHATE - CHICAGO BOARD OF TRADE ;1996.03.12;     282;       0;       0;       0;      59;     166;      59;     166;     223;     116
DIAMMONIUM PHOSPHATE - CHICAGO BOARD OF TRADE ;1996.03.05;     260;       0;       0;       0;      59;     166;      59;     166;     201;      94
DIAMMONIUM PHOSPHATE - CHICAGO BOARD OF TRADE ;1996.02.27;     250;       0;       0;       0;      54;     173;      54;     173;     196;      77
DIAMMONIUM PHOSPHATE - CHICAGO BOARD OF TRADE ;1996.02.20;     286;      55;       0;       0;      25;     201;      80;     201;     206;      85
DIAMMONIUM PHOSPHATE - CHICAGO BOARD OF TRADE ;1996.02.13;     242;      80;       0;       0;       0;     202;      80;     202;     162;      40
DIAMMONIUM PHOSPHATE - CHICAGO BOARD OF TRADE ;1996.02.06;     240;      85;       0;       0;       0;     195;      85;     195;     155;      45
DIAMMONIUM PHOSPHATE - CHICAGO BOARD OF TRADE ;1996.01.30;     258;      85;       0;       0;      26;     195;     111;     195;     147;      63
DIAMMONIUM PHOSPHATE - CHICAGO BOARD OF TRADE ;1996.01.23;     233;      85;       0;       0;       0;     195;      85;     195;     148;      38
DIAMMONIUM PHOSPHATE - CHICAGO BOARD OF TRADE ;1996.01.16;     245;      95;       0;       0;       0;     206;      95;     206;     150;      39
DIAMMONIUM PHOSPHATE - CHICAGO BOARD OF TRADE ;1996.01.09;     249;      95;       0;       0;       0;     206;      95;     206;     154;      43
DIAMMONIUM PHOSPHATE - CHICAGO BOARD OF TRADE ;1996.01.02;     252;      95;       0;       0;       0;     206;      95;     206;     157;      46
DIAMMONIUM PHOSPHATE - CHICAGO BOARD OF TRADE ;1995.12.26;     252;      95;       0;       0;       0;     206;      95;     206;     157;      46
DIAMMONIUM PHOSPHATE - CHICAGO BOARD OF TRADE ;1995.12.19;     252;      95;       0;       0;       0;     206;      95;     206;     157;      46
DIAMMONIUM PHOSPHATE - CHICAGO BOARD OF TRADE ;1995.12.12;     263;      95;       0;       0;       0;     208;      95;     208;     168;      55
DIAMMONIUM PHOSPHATE - CHICAGO BOARD OF TRADE ;1995.12.05;     257;      95;       0;       0;       0;     207;      95;     207;     162;      50
DIAMMONIUM PHOSPHATE - CHICAGO BOARD OF TRADE ;1995.11.28;     297;      95;       0;       0;       0;     234;      95;     234;     202;      63
DIAMMONIUM PHOSPHATE - CHICAGO BOARD OF TRADE ;1995.11.21;     270;      95;       0;       0;       0;     217;      95;     217;     175;      53
DIAMMONIUM PHOSPHATE - CHICAGO BOARD OF TRADE ;1995.11.14;     270;     106;       0;       0;      25;     175;     131;     175;     139;      95
DIAMMONIUM PHOSPHATE - CHICAGO BOARD OF TRADE ;1995.11.07;     256;     110;       0;       0;       0;     150;     110;     150;     146;     106
DIAMMONIUM PHOSPHATE - CHICAGO BOARD OF TRADE ;1995.10.31;     251;      83;       0;       0;      32;     181;     115;     181;     136;      70
DIAMMONIUM PHOSPHATE - CHICAGO BOARD OF TRADE ;1995.10.24;     286;      83;       0;       0;      25;     208;     108;     208;     178;      78
DIAMMONIUM PHOSPHATE - CHICAGO BOARD OF TRADE ;1995.10.17;     269;      81;       0;       0;      25;     150;     106;     150;     163;     119
DIAMMONIUM PHOSPHATE - CHICAGO BOARD OF TRADE ;1995.10.10;     249;      81;       0;       0;      25;     123;     106;     123;     143;     126
DIAMMONIUM PHOSPHATE - CHICAGO BOARD OF TRADE ;1995.10.03;     241;      70;       0;       0;      25;     150;      95;     150;     146;      91
DIAMMONIUM PHOSPHATE - CHICAGO BOARD OF TRADE ;1995.09.26;     225;      70;       0;       0;      25;     146;      95;     146;     130;      79
DIAMMONIUM PHOSPHATE - CHICAGO BOARD OF TRADE ;1995.09.19;     228;      35;       0;       0;      25;     117;      60;     117;     168;     111
DIAMMONIUM PHOSPHATE - CHICAGO BOARD OF TRADE ;1996.03.12;     282;       0;       0;       0;      59;     166;      59;     166;     223;     116
DIAMMONIUM PHOSPHATE - CHICAGO BOARD OF TRADE ;1996.03.05;     260;       0;       0;       0;      59;     166;      59;     166;     201;      94
DIAMMONIUM PHOSPHATE - CHICAGO BOARD OF TRADE ;1996.02.27;     250;       0;       0;       0;      54;     173;      54;     173;     196;      77
DIAMMONIUM PHOSPHATE - CHICAGO BOARD OF TRADE ;1996.02.20;     286;      55;       0;       0;      25;     201;      80;     201;     206;      85
DIAMMONIUM PHOSPHATE - CHICAGO BOARD OF TRADE ;1996.02.13;     242;      80;       0;       0;       0;     202;      80;     202;     162;      40
DIAMMONIUM PHOSPHATE - CHICAGO BOARD OF TRADE ;1996.02.06;     240;      85;       0;       0;       0;     195;      85;     195;     155;      45
DIAMMONIUM PHOSPHATE - CHICAGO BOARD OF TRADE ;1996.01.30;     258;      85;       0;       0;      26;     195;     111;     195;     147;      63
DIAMMONIUM PHOSPHATE - CHICAGO BOARD OF TRADE ;1996.01.23;     233;      85;       0;       0;       0;     195;      85;     195;     148;      38
DIAMMONIUM PHOSPHATE - CHICAGO BOARD OF TRADE ;1996.01.16;     245;      95;       0;       0;       0;     206;      95;     206;     150;      39
DIAMMONIUM PHOSPHATE - CHICAGO BOARD OF TRADE ;1996.01.09;     249;      95;       0;       0;       0;     206;      95;     206;     154;      43
DIAMMONIUM PHOSPHATE - CHICAGO BOARD OF TRADE ;1996.01.02;     252;      95;       0;       0;       0;     206;      95;     206;     157;      46
DIAMMONIUM PHOSPHATE - CHICAGO BOARD OF TRADE ;1995.12.26;     252;      95;       0;       0;       0;     206;      95;     206;     157;      46
DIAMMONIUM PHOSPHATE - CHICAGO BOARD OF TRADE ;1995.12.19;     252;      95;       0;       0;       0;     206;      95;     206;     157;      46
DIAMMONIUM PHOSPHATE - CHICAGO BOARD OF TRADE ;1995.12.12;     263;      95;       0;       0;       0;     208;      95;     208;     168;      55
DIAMMONIUM PHOSPHATE - CHICAGO BOARD OF TRADE ;1995.12.05;     257;      95;       0;       0;       0;     207;      95;     207;     162;      50
DIAMMONIUM PHOSPHATE - CHICAGO BOARD OF TRADE ;1995.11.28;     297;      95;       0;       0;       0;     234;      95;     234;     202;      63
DIAMMONIUM PHOSPHATE - CHICAGO BOARD OF TRADE ;1995.11.21;     270;      95;       0;       0;       0;     217;      95;     217;     175;      53
DIAMMONIUM PHOSPHATE - CHICAGO BOARD OF TRADE ;1995.11.14;     270;     106;       0;       0;      25;     175;     131;     175;     139;      95
DIAMMONIUM PHOSPHATE - CHICAGO BOARD OF TRADE ;1995.11.07;     256;     110;       0;       0;       0;     150;     110;     150;     146;     106
DIAMMONIUM PHOSPHATE - CHICAGO BOARD OF TRADE ;1995.10.31;     251;      83;       0;       0;      32;     181;     115;     181;     136;      70
DIAMMONIUM PHOSPHATE - CHICAGO BOARD OF TRADE ;1995.10.24;     286;      83;       0;       0;      25;     208;     108;     208;     178;      78
DIAMMONIUM PHOSPHATE - CHICAGO BOARD OF TRADE ;1995.10.17;     269;      81;       0;       0;      25;     150;     106;     150;     163;     119
DIAMMONIUM PHOSPHATE - CHICAGO BOARD OF TRADE ;1995.10.10;     249;      81;       0;       0;      25;     123;     106;     123;     143;     126
DIAMMONIUM PHOSPHATE - CHICAGO BOARD OF TRADE ;1995.10.03;     241;      70;       0;       0;      25;     150;      95;     150;     146;      91
DIAMMONIUM PHOSPHATE - CHICAGO BOARD OF TRADE ;1995.09.26;     225;      70;       0;       0;      25;     146;      95;     146;     130;      79
DIAMMONIUM PHOSPHATE - CHICAGO BOARD OF TRADE ;1995.09.19;     228;      35;       0;       0;      25;     117;      60;     117;     168;     111
