SUGAR NO. 11 - CSCE SUGAR NO. 11 ;1995.04.04;  188701;   13597;    9028;   17533;  104495;  117215;  135625;  143777;   53076;   44924
SUGAR NO. 11 - CSCE SUGAR NO. 11 ;1995.03.28;  190942;   13016;    8507;   16516;  106053;  120621;  135585;  145644;   55357;   45298
SUGAR NO. 11 - CSCE SUGAR NO. 11 ;1995.03.21;  193134;   11660;    9795;   17010;  113244;  120612;  141914;  147417;   51220;   45717
SUGAR NO. 11 - CSCE SUGAR NO. 11 ;1995.04.04;  188701;   13597;    9028;   17533;  104495;  117215;  135625;  143777;   53076;   44924
SUGAR NO. 11 - CSCE SUGAR NO. 11 ;1995.03.28;  190942;   13016;    8507;   16516;  106053;  120621;  135585;  145644;   55357;   45298
SUGAR NO. 11 - CSCE SUGAR NO. 11 ;1995.03.21;  193134;   11660;    9795;   17010;  113244;  120612;  141914;  147417;   51220;   45717
SUGAR NO. 11 - CSCE SUGAR NO. 11 ;1995.04.04;  188701;   13597;    9028;   17533;  104495;  117215;  135625;  143777;   53076;   44924
SUGAR NO. 11 - CSCE SUGAR NO. 11 ;1995.03.28;  190942;   13016;    8507;   16516;  106053;  120621;  135585;  145644;   55357;   45298
SUGAR NO. 11 - CSCE SUGAR NO. 11 ;1995.03.21;  193134;   11660;    9795;   17010;  113244;  120612;  141914;  147417;   51220;   45717
