Custom HTML

Guide - Vertical
<tr><th width=5% !!!Current!!!>!!!StartTime!!!</th>
<td !!!Current!!! nowrap>
<a !!!ToolTip!!! href="javascript:load('!!!ProgID!!!')">!!!Title!!![35]</a>&nbsp;!!!RecordImage!!!</td></tr>

Scheduled
<table width=300><tr><td width=5% nowrap>!!!StartTime!!!-!!!EndTime!!!</td>
<td nowrap> !!!DetailLink!!! !!!Title!!!</a></td></tr>
<tr><td colspan=2>!!!RecordFreq!!!<br>!!!KeepUntil!!!</td></tr></table> 