/* XPM */
static char * editor_step_i_xpm[] = {
"9 8 21 1",
" 	c None",
".	c #6E6F6E",
"+	c #8E8F8E",
"@	c #676867",
"#	c #535353",
"$	c #ADAEAD",
"%	c #6D6E6D",
"&	c #131413",
"*	c #878787",
"=	c #343534",
"-	c #080808",
";	c #CACACA",
">	c #141414",
",	c #000000",
"'	c #707170",
")	c #151515",
"!	c #353635",
"~	c #111111",
"{	c #BABABA",
"]	c #949494",
"^	c #E6E6E6",
"   .+ @#$",
"  %&* =-;",
" .>,* =-;",
"'),,* =-;",
"'),,* =-;",
" .>,* =-;",
"  %&* !~;",
"   .{ ];^"};
