/* XPM */
static char * editor_play_i_xpm[] = {
"7 8 17 1",
" 	c None",
".	c #4F4F4F",
"+	c #545554",
"@	c #AEAEAE",
"#	c #707170",
"$	c #181818",
"%	c #000000",
"&	c #0B0B0B",
"*	c #CBCBCB",
"=	c #6F706F",
"-	c #171717",
";	c #161716",
">	c #070707",
",	c #141414",
"'	c #A4A4A4",
")	c #CACACA",
"!	c #E7E7E7",
"    .+@",
"  #$%&*",
" =-%%&*",
"#;%%%&*",
"#;%%%&*",
" =-%%&*",
"  #$>,*",
"    ')!"};
